##TITLE=1H_IBDPCOO102
 CDCl3, 8 sc, 
 5.2.2019
##JCAMPDX= 6.0         $$ Bruker NMR JCAMP-DX V2.0
##DATA TYPE= NMR FID
##DATA CLASS= NTUPLES
##ORIGIN= UXNMR, Bruker Analytische Messtechnik GmbH
##OWNER= root
$$ XWIN-NMR		Version 3.5
$$ Tue Feb  5 16:09:47 2019 Russian Standard Time (UT+4h)  she@DPX200
##.OBSERVE FREQUENCY= 200.1313
##.OBSERVE NUCLEUS= ^1H
##.DELAY= (6, 6)
##.ACQUISITION MODE= SIMULTANEOUS
##.ACQUISITION SCHEME= undefined
##.AVERAGES= 8
##.DIGITISER RES= 18
##SPECTROMETER/DATA SYSTEM= spect
##.PULSE SEQUENCE= zg30
##.SOLVENT NAME= CDCl3
##.SHIFT REFERENCE= (INTERNAL, CDCl3, 0, 15.7039)
##AUDIT TRAIL= $$ (NUMBER, WHEN, WHO, WHERE, WHAT)
$$ ##TITLE= Audit trail, XWIN-NMR		Version 3.5
$$ ##JCAMPDX= 5.01
$$ ##ORIGIN= Bruker BioSpin GmbH
$$ ##OWNER= she
$$ F:/spectra/data/she/nmr/H-F/1/audita.txt
$$ ##AUDIT TRAIL=  $$ (NUMBER, WHEN, WHO, WHERE, WHAT)
(   1,<2019-02-05 16:08:48.32 +0400>,<she>,<DPX200>,
      <created by zg, POWCHK disabled, PULCHK disabled
       configuration hash MD5:
       00 E9 B6 7A A2 85 ED C7 34 08 36 98 17 FE 4E 26
       data hash MD5: 16K
       4C 53 3E F6 30 3F BE 6D 14 F2 FA 61 7E 16 DB FC>)
$$ ##END=
$$ 
$$ hash MD5
$$ E0 E2 48 63 B4 97 4C EF 07 60 80 1D 0C 38 9C 39
##$RELAX= 
##$RELAX= 
##$RELAX= 
##$RELAX= 
##$RELAX= 
##$RELAX= 
$$ Bruker specific parameters
$$ --------------------------
##$DU= <F:/spectra>
##$EXPNO= 1
##$NAME= <H-F>
##$PROCNO= 1
##$TYPE= <nmr>
##$USER= <she>
##$AMP= (0..31)
100 100 100 100 100 100 100 100 100 100 100 100 100 100 100 100 100 100 
100 100 100 100 100 100 100 100 100 100 100 100 100 100 
##$AQSEQ= 0
##$AQ_mod= 1
##$AUNM= <au_zg>
##$AUTOPOS= <>
##$BF1= 200.13
##$BF2= 200.13
##$BF3= 200.13
##$BF4= 200.13
##$BF5= 200.13
##$BF6= 200.13
##$BF7= 200.13
##$BF8= 200.13
##$BYTORDA= 1
##$CFDGTYP= 0
##$CFRGTYP= 5
##$CHEMSTR= <none>
##$CNST= (0..31)
1 1 145 1 1 1 1 1 1 1 1 1 1 1 1 1 1 1 1 1 1 1 1 1 1 1 1 1 1 1 1 1 
##$CPDPRG= <>
##$CPDPRG1= <>
##$CPDPRG2= <>
##$CPDPRG3= <>
##$CPDPRG4= <mlev>
##$CPDPRG5= <mlev>
##$CPDPRG6= <mlev>
##$CPDPRG7= <mlev>
##$CPDPRG8= <mlev>
##$CPDPRGB= <>
##$CPDPRGT= <>
##$D= (0..31)
0 1.2 0 0 0 0 0 0 0 0 0 0.03 0 0 0 0 0 0 0 0 0 0 0 0 0 0 0 0 0 0 0 0 
##$DATE= 1549368527
##$DBL= (0..7)
120 120 120 120 120 120 120 120 
##$DBP= (0..7)
150 150 150 150 150 150 150 150 
##$DBP07= 0
##$DBPNAM0= <>
##$DBPNAM1= <>
##$DBPNAM2= <>
##$DBPNAM3= <>
##$DBPNAM4= <>
##$DBPNAM5= <>
##$DBPNAM6= <>
##$DBPNAM7= <>
##$DBPOAL= (0..7)
0.5 0.5 0.5 0.5 0.5 0.5 0.5 0.5 
##$DBPOFFS= (0..7)
0 0 0 0 0 0 0 0 
##$DE= 6
##$DECBNUC= <off>
##$DECIM= 32
##$DECNUC= <off>
##$DECSTAT= 4
##$DIGMOD= 1
##$DIGTYP= 9
##$DL= (0..7)
0 120 120 120 120 120 120 120 
##$DP= (0..7)
150 150 150 150 150 150 150 150 
##$DP07= 0
##$DPNAME0= <>
##$DPNAME1= <>
##$DPNAME2= <>
##$DPNAME3= <>
##$DPNAME4= <>
##$DPNAME5= <>
##$DPNAME6= <>
##$DPNAME7= <>
##$DPOAL= (0..7)
0.5 0.5 0.5 0.5 0.5 0.5 0.5 0.5 
##$DPOFFS= (0..7)
0 0 0 0 0 0 0 0 
##$DQDMODE= 0
##$DR= 18
##$DS= 0
##$DSLIST= <SSSSSSSSSSSSSSS>
##$DSPFIRM= 0
$$ [...]
##$SUBNAM2= <"">
##$SUBNAM3= <"">
##$SUBNAM4= <"">
##$SUBNAM5= <"">
##$SUBNAM6= <"">
##$SUBNAM7= <"">
##$SUBNAM8= <"">
##$SUBNAM9= <"">
##$SW= 20.0189088683792
##$SWIBOX= (0..15)
0 0 2 0 0 0 0 0 0 0 0 0 0 0 0 0 
##$SW_h= 4006.41025641026
##$TD= 16384
##$TD0= 1
##$TE= 0
##$TE2= 300
##$TE3= 300
##$TEG= 300
##$TL= (0..7)
0 120 120 120 120 120 120 120 
##$TP= (0..7)
150 150 150 150 150 150 150 150 
##$TP07= 0
##$TPNAME0= <>
##$TPNAME1= <>
##$TPNAME2= <>
##$TPNAME3= <>
##$TPNAME4= <>
##$TPNAME5= <>
##$TPNAME6= <>
##$TPNAME7= <>
##$TPOAL= (0..7)
0.5 0.5 0.5 0.5 0.5 0.5 0.5 0.5 
##$TPOFFS= (0..7)
0 0 0 0 0 0 0 0 
##$TUNHIN= 0
##$TUNHOUT= 0
##$TUNXOUT= 0
##$USERA1= <user>
##$USERA2= <user>
##$USERA3= <user>
##$USERA4= <user>
##$USERA5= <user>
##$V9= 5
##$VALIST= <valist>
##$VCLIST= <CCCCCCCCCCCCCCC>
##$VD= 0
##$VDLIST= <DDDDDDDDDDDDDDD>
##$VPLIST= <PPPPPPPPPPPPPPP>
##$VTLIST= <TTTTTTTTTTTTTTT>
##$WBST= 1024
##$WBSW= 4
##$XGAIN= (0..3)
0 0 0 0 
##$XL= 0
##$YL= 0
##$YMAX_a= 35194
##$YMIN_a= -29107
##$ZGOPTNS= <>
##$ZL1= 120
##$ZL2= 120
##$ZL3= 120
##$ZL4= 120
##$ABSF1= 10
##$ABSF2= 0
##$ABSG= 5
##$ABSL= 3
##$ALPHA= 0
##$AQORDER= 0
##$ASSFAC= 0
##$ASSFACI= 0
##$ASSFACX= 0
##$ASSWID= 0
##$AUNMP= <proc_1d>
##$AZFE= 0.1
##$AZFW= 0.1
##$BCFW= 1
##$BC_mod= 2
##$BYTORDP= 1
##$COROFFS= 0
##$CY= 11.3945322036743
##$DATMOD= 1
##$DC= 2
##$DFILT= <>
##$DTYPP= 0
##$F1P= 18.9103706918063
##$F2P= -1.10871071338519
##$FCOR= 0.5
##$FTSIZE= 0
##$FT_mod= 4
##$GAMMA= 1
##$GB= 0.15
##$INTBC= 1
##$INTSCL= 1
##$ISEN= 128
##$LB= 0.24
##$LEV0= 0
##$LPBIN= 0
##$MAXI= 10000
##$MC2= 0
##$MEAN= 0
##$ME_mod= 0
##$MI= 1.114404
##$NCOEF= 0
##$NC_proc= 0
##$NLEV= 6
##$NOISF1= 3.799351
##$NOISF2= 2.8
##$NSP= 1
##$NTH_PI= 0
##$NZP= 0
##$OFFSET= 15.70392
##$PC= 1
##$PHC0= -9118.869
##$PHC1= 12.60004
##$PH_mod= 1
##$PKNL= yes
##$PPARMOD= 0
##$PSCAL= 0
##$PSIGN= 0
##$REVERSE= no
##$SF= 200.130013532006
##$SI= 16384
##$SIGF1= 3
##$SIGF2= 2
##$SINO= 400
##$SIOLD= 16384
##$SREGLST= <1H.CDCl3>
##$SSB= 0
##$STSI= 0
##$STSR= 0
##$SW_p= 3612.71676300578
##$SYMM= 0
##$S_DEV= 0
##$TDeff= 0
##$TDoff= 0
##$TI= <>
##$TILT= no
##$TM1= 0
##$TM2= 0
##$TOPLEV= 0
##$USERP1= <user>
##$USERP2= <user>
##$USERP3= <user>
##$USERP4= <user>
##$USERP5= <user>
##$WDW= 1
##$XDIM= 8192
##$YMAX_p= 0
##$YMIN_p= 0
$$ End of Bruker specific parameters
$$ ---------------------------------
##NTUPLES= NMR FID
##VAR_NAME=  TIME,          FID/REAL,        FID/IMAG
##SYMBOL=    X,             R,               I
##VAR_TYPE=  INDEPENDENT,   DEPENDENT,       DEPENDENT
##VAR_FORM=  AFFN,          ASDF,            ASDF
##VAR_DIM=   8192,          8192,            8192
##UNITS=     SECONDS,       ARBITRARY UNITS, ARBITRARY UNITS
##FACTOR=    0.0002496,     1,               1
##FIRST=     0,             0,               0
##LAST=      2.0444736,     0,               0
##MIN=       0,             -29107,          0
##MAX=       2.0444736,     35194,           0
$$ Real data points
##PAGE= N=1
##DATA TABLE= (X++(R..R)), XYDATA
0@%%%%%%%%%%%%%%%%%%%%%%%%%mJ2j6J6j6J6j6J6j8K6l2L2l2L9m7M8n3O1o6P4
45D0q2R0r9J07j19J32j45J60j76J94k15K38k65K99l38L84m42N14o06P34r26J234
67G13j810L240j3025j8225L7566J4566k1812M670K9311j1868k8950O413R512k3622
81a3321q133K3346l76k5540P000K3439j0871j5204K2747J7204j9607r596J7888
94H976m91j7667Q142J8783q082j0090J2658K538j9260j716J6346m842j6893N548
108f050R128j4520j1553J2322Q248o646M062J3732k0m911P399M218q589j902N879
123A0797p721j4402J270O653o045m372R753O311n331k42P141N08k575M937L404
138A0086o040l396L779j711p291O18O283j029n191J231L791j346k260K021J573
$$ y = [0, 0, 0, 0, 0, 0, 0, 0, 0, 0, 0, 0, 0, 0, 0, 0, 0, 0, 0, 0, 0, 0, 0, 0, 0, 0, -4, 8, -8, 8, -8, 8, -8, 8, -10, 16, -16, 16, -16, 23, -24, 24, -29, 32, -34, 40, -42, 48, -51, 56, -63, 69, -76, 84, -92, 102, -113, 125, -140, 159, -179, 205, -237, 277, -329, 405, -521, 713, -1097, 2143, -10882, -29107, 8459, 23025, 1213, 5883, 35194, 23326, -5624, 789, 10301, -13321, -21454, 1892, 1516, -24024, -17024, 6415, -4456, -19660, 3087, 20291, 684, -8912, 8976, 8485, -9182, -1040, 17743, 9661, -429, 12229, 14767, -4493, -6209, 10137, 5295, -11598, -6050, 3078, -11442, -22995, -10673, -2425, -9071, -5009, 8723, 8703, 3792, 11191, 15409, 6820, 4918, 10797, 3076, -11326, -10056, -3403, -9448, -13820, -4067, 2244, -3087, -3329, 3812, 4320, 1745, 6682, 10086, 4046, 650, 4429, 2718, -4573, -3955, 2328, 1299, -3892, -2661, 1130, -216, -2476, -455, 1118]
153A118k543k524j13k85k73K898M649J688o80Q13Q41l026l479J673K358l692m003
170d580K317J456m912j251P045L311l856J096N547k046n076L461L599n824l458
185c171M985j641r331J275R230j550n647O619O675o999m702P204J579p416J840
200a050P342n018p282O049M539q172j849J0111M04r672J892Q042m847o369P337
215A457M813q110k173P942j445q057M136P566n362n157O669J675q910l65Q413
230C092j943o998M868O279n927l946P146K235o514P51N982l452n709M288L151
245C303o197j585O697k03o470J837N649k846l466M788K495m651j41M801j815m684
261b488L019L541m635l231M153J062m844k16M197p24k889K417K698k122o50L344
$$ y = [1118, -1425, -3949, -4062, -4347, -4620, -1722, 2927, 4615, 3935, 4748, 5589, 2563, -916, 757, 3115, -577, -4580, -2263, -807, -5719, -6970, 75, 3386, -470, 626, 6173, 4127, -949, 2512, 6111, 287, -3171, 1814, 173, -9158, -7883, 1347, -203, -5850, 769, 7444, 445, -4257, 2947, 4526, -2890, -1050, 6292, 1274, -6008, 41, 4580, -3592, -5441, 4670, 5074, -4598, -2706, 5336, 489, -5880, 1457, 6270, -1840, -4013, 3929, 2484, -5573, -1437, 6129, 767, -4390, 2279, 3954, -4956, -5321, 3092, 1149, -5849, -981, 5298, -629, -4575, 2571, 4806, -1708, -957, 5025, 1573, -4136, 152, 3303, -2894, -4479, 2218, 2015, -4455, -2618, 3031, 185, -3281, 1507, 4002, -649, -790, 4011, 2196, -2488, 531, 4072, -563, -3794, 359, 1421, -3423, -3639, 558, -166, -3055, -638, 2060, -62, -712, 2632]
277B632L73k632P73K047k050k279J458K74k875m87K131o03k050J415K343p61q44
294a135J830J088j152p9J299k84j059O85P72j218j146O62L55j245r63M03M87k41
312i41m14O9N73P01J93k05K80R17M83m05l66K92J83p70j083m43n1m58n75J99O44
333a177J87J35Q60P84n2JO76L09n37k62K86j79p06l12r4n42m82J93J76k92k9O56
355d01N46j26k13K28M78J22l75l88K73M98k48q34k25N28J23p62n09N23P97ol96
376c67L82Q53J73m25kL32j16k44J18j22o01o0M50m65j008J62P18m54p56N28P29
397a75l12j28P90L43l48K84N55k79l37L65q2q33j02K42q34p46P95O44q31j23J535
418D23P34q32k4J092K01o96j72j4n29k84J6n39m58N65M86n37k95O03K64k81O9
$$ y = [2632, 3005, 373, 1146, 3193, 1143, -1136, 322, 596, -2279, -2766, -635, -1238, -3288, -1873, 470, -291, -1135, 695, 1783, 631, 552, 1851, 1567, 508, 1193, 1965, 747, -399, 263, 618, -627, -1590, -1187, -700, -941, -1355, -1286, -713, -12, 181, -24, 256, 1173, 1656, 1251, 885, 1177, 1360, 590, -493, -936, -987, -1445, -2020, -1821, -1177, -990, -855, 5, 789, 737, 738, 1414, 1723, 1186, 924, 1210, 1031, 325, 13, -81, -623, -1105, -912, -736, -1028, -1057, -401, 145, 19, -194, 34, 512, 634, 259, -129, 144, 642, 394, -440, -665, -137, -14, -776, -1285, -762, 35, 29, -367, 15, 868, 1041, 616, 614, 946, 830, 586, 704, 582, -19, -79, 371, -94, -1102, -940, -222, -676, -1432, -904, -175, -487, -615, 175, 518, 170, 454, 1009, 730, 393, 758, 676, -157, -259, -17, -851, -1597, -802, -158, -989, -1112, 423, 1157, 325, 301, 1393, 1594, 898, 726, 712, 183, -101, -85, -624, -1082, -517, -31, -568, -863, -260, 4, -277, -208]
439b08R4l30K0L55l58m14P88Q50l62k71O71J67n68L7L42m72m87J90l47r12J55
460a060Q04q4j15R73L91q58j2R88k73j022L51O40j016j063M30N08j42M69P12k33
480C88k05M92l03j018L51J089m60j131J28K45n89J26R81K90J42R61L4j363j80
499b2J170k57j206L21M81j283r01P70J79m10J202J209j153r23J223J40j584M90
517e54K000o55j717Q83Q87j615l70K232M40j712K45J061j493j256J600O55j670
534a039K19J776j081j840J735K061j162o59J770j53k314L2J299j119q09J830J79
551G25k603j28K367l00j589J680J999j482j364J218J35j311Q75J416j355j171
567h88J227p0j984O31K302o02j544J096N53j936j91K177R3j332J032R39j846p65
$$ y = [-208, -114, -444, -424, -69, -427, -841, -53, 797, 435, 164, 835, 1002, 434, 471, 813, 341, -146, 44, -303, -1215, -1060, -256, -340, -455, 518, 909, 51, 39, 1027, 754, -268, 83, 723, -293, -1356, -926, -418, -560, -91, 621, 388, 183, 675, 372, -646, -295, 794, 334, -797, -669, -424, -1013, -887, 94, 384, 526, 1487, 1521, 158, -22, 1148, 891, -315, 6, 487, -796, -1697, -927, -748, -1158, 44, 1253, 100, -823, 400, 540, -1044, -554, 1446, 791, -926, -43, 844, -771, -1141, 1091, 1531, -181, 64, 1125, -368, -1624, -24, 631, -1039, -820, 956, -125, -1965, -230, 1831, 669, 10, 1780, 1627, -687, -655, 644, -475, -1284, 546, 725, -1878, -2006, 361, 61, -1528, 152, 2151, 669, -695, 523, 658, -653, 222, 1638, 283, -888, 339, 269, -1715, -1084, 1218, 616, -928, 168, 721, -1215, -1406, 771, 864, -468, 564, 1503, -343, -1108]
585a108J867J56j516J006J258k142j605J859O46j897N90K283j105j999J492J179
601I64j806L83L004o61l032R90K044k262j712K908J296k939p74J997j066j972
617b638K229K103j991o81K519n30l096J251L274j098j948J869O88l160q45K550
633D96l0j785J435J493k375j603J980O98j458J115K203j259j931J085O31j568
649h73M22K261l81j753M01K73j716J4K126j20j536R03R03k093j054K247J077j304
667b03L79J394j168j378J232O64j327M84J744j262k256R84J315j491n07K114K48
684I66j932K59J432r70p80J932P28j970l39J551o79j540J232J454j212q18J197
701E11j49j436O39J435p31q15R88l8j450L31J393n40p47J185L17j652j71J557
$$ y = [-1108, 759, 915, -601, 405, 1663, -479, -2084, -225, 421, -1476, -886, 1397, 292, -1707, -215, 964, -842, -459, 2545, 1884, -1148, -158, 1886, -376, -2088, 820, 2116, -823, -1597, 400, -666, -2638, -409, 1694, -297, -978, 1541, 1011, -2085, -834, 2440, 1342, -606, 1263, 1951, -1209, -2054, 496, 466, -1319, 116, 1609, -766, -2369, -389, 309, -1149, -34, 2169, 910, -1021, 64, 695, -873, -451, 1810, 1429, -324, 77, 350, -1366, -1352, 774, 654, -882, 21, 924, -1169, -2223, 24, 1101, -203, 176, 1570, 402, -976, 256, 920, -407, 77, 1821, 559, -1697, -713, 602, -889, -1396, 718, 966, -966, -707, 725, -245, -1025, 907, 1635, -335, -674, 877, 198, -1342, -110, 1344, 132, -686, 511, 362, -1074, -435, 1000, 269, -546, 442, 404, -1046, -715, 678, 138, -609, 576, 893, -759, -930, 627]
719F27r5r57Q30O26j412o18J120j66r24J176J255j351j031J270K59j503L83J612
737A101o76j277R22M51j622N4K034j83j713P83J409j362j143J689Q62j506j39
754c16J255q68j546R64J168j094l49J569rj590L04J235p25p63J253M46j447j92
772g05J346k50j096P12R69r16o85P87J09q02M39Q85o93p78O29K38r57l0J043J41
792C86m45L30K65n52r0N25l14n67M93M60o85l77O68K35n33L1L68l03k52M03M2
813H8l28K97M48m21m23L63O4n11K04O56j58l46M72J96o60k12M31k17n03L55L20
834A15m93k8P71q0p35K90O56m63n23N84M06m71k0M96l59n50M46K92p63j48R50
855C73J04q12R8O96l26o17L14K37m57J06O30j49m32N39M37o97m49O27J40p07M5
$$ y = [627, 532, -425, 405, 1031, -381, -999, 121, -45, -969, 207, 1462, 111, -920, 350, 609, -894, -511, 1101, 425, -852, 70, 521, -1101, -1047, 987, 804, -909, -126, 1283, -79, -1222, 467, 1329, -177, -316, 939, 71, -1475, -511, 657, -437, -786, 783, 774, -816, -512, 723, -2, -765, 488, 934, -513, -705, 641, 391, -705, 7, 976, 60, -625, 162, 271, -531, -92, 793, 100, -678, -49, 189, -768, -798, 245, 386, -59, 271, 536, -16, -106, 419, 105, -462, 31, 491, -194, -571, 97, 332, -201, -170, 198, -105, -357, 46, 88, -240, 57, 505, 84, -339, 24, 88, -423, -219, 437, 279, -67, 405, 601, -59, -271, 160, -57, -560, -205, 115, -378, -406, 365, 285, -450, -160, 496, 33, -490, 94, 500, 29, 9, 505, 146, -404, 42, 334, -429, -577, 373, 477, -335, -237, 459, 133, -484, -170, 67, -390, -284, 346, 197, -235, 304, 741, 44, -405, 222, 362, -345, -300]
876c00O42j69m81L31K76n37k04N20J4m13K56M59k83k53L82M1n96k6N05j01m28
897c65K90M86j93k93J89K9k63J2J55j98j18M06J59m24j32L94P4m32j00L37J16
918A29j31j2J15jlpj06j05J16J31q8p6J17O6j07j27m4k4j9MK9O6O9N4K9K2kl0
946F5j5L9K1m2k2J8j8k1l7j21r0J32Q8j73j12K76K59k28k52K38K74j85k11J85
970F8J82j02p2N0r2q7J42j3l29o6L65J9l84M2M12j1k96J26K49j83j09L24K1l81
994a25Q9L96k55m52L25L67m53l01N04J33n84PO19j23n43L27M98l89l41N01J55
1015C55n27O8N32l37n33N10M09p01l47P84J77p98J4P65j63n29L93L87n89j99O83
1036C54q9p91L30Q18n17p32O29N32p29l04P82P8p40J89O52m45n16O94M04p95j81
$$ y = [-300, 342, 173, -308, 23, 299, -238, -442, 78, 92, -321, -65, 394, 111, -142, 240, 281, -315, -341, 164, 63, -365, -75, 411, 218, -75, 114, 143, -120, -108, 47, -151, -269, 137, 296, -128, -260, 134, 208, -224, -324, 13, 129, -2, -14, 101, 100, 97, 90, -16, -121, -5, 126, 38, -38, 79, 145, 38, -89, -133, -157, -176, -172, -143, -77, -8, 46, 75, 97, 95, 65, 50, 89, 110, 68, 46, 64, 46, 25, -12, -133, -223, -91, -3, -176, -288, -12, 247, 19, -233, 5, 279, 94, -117, 68, 250, 148, 76, 126, 34, -53, 89, 76, -253, -319, 46, 65, -319, -277, 135, 124, -172, -46, 203, 20, -89, 235, 256, -125, -36, 360, 105, -347, -22, 345, -108, -409, 95, 228, -356, -349, 270, 147, -396, -69, 429, 40, -301, 200, 355, -172, -104, 428, 91, -442, 68, 477, -224, -571, 213, 390, -408, -394, 371, 208, -321, 72, 459, -130, -329, 354, 265, -526, -196, 622, 105, -627, 2, 534, -195, -499, 283, 361, -379, -190, 462, 17, -499, 195, 599, -196, -377]
1057c77Q04j20q49L41P89n12o10O74L04r09k17R43L1p69L45P70m87o11O54L78
1077E72p61j16Q62j57j006K46Q43m55p23O38N93p18l78O78J42o40K48P35m00o58
1097d55N62M71p89l47R19K84r01p7P71k09p63L44O10n74m45O82J85p93Q2R60j70
1118C47p80M68P14p04n85Q68L71r49j67R10k46j035M00Q68n67n34Q51L09j006
1137d67l7J076l05r77P09R28r79p93J074M78j123m3J193k65j101N76P38j012n17
1156h47J269K13j423J09J398m63j255Q89J139j008p13J200K32j346J54J300n98
1173B50j145R28Q58j289n56J435J91j415K68J351o62j173R87Q31j238m68J356
1190E09M4j343M37J294p13r76J074O41j360l71J370o7j334L97J149p14r24R23
$$ y = [-377, 427, 307, -542, -201, 588, 76, -534, 140, 444, -465, -682, 261, 292, -477, -132, 638, 151, -460, 194, 572, -189, -305, 557, 400, -606, -360, 483, 28, -695, -57, 536, -182, -560, 118, 260, -380, -132, 603, 203, -455, 107, 578, -211, -558, 361, 645, -256, -333, 438, 229, -534, -190, 420, -154, -599, 83, 268, -525, -443, 517, 347, -433, 35, 749, 45, -540, 328, 699, -250, -417, 493, 247, -788, -388, 480, -87, -621, 230, 539, -467, -504, 572, 267, -710, -1, 927, -52, -845, 229, 707, -416, -459, 734, 469, -632, -56, 682, -330, -847, 422, 635, -788, -679, 719, 256, -999, -110, 1029, 21, -692, 508, 740, -606, -452, 848, 250, -895, 33, 891, -398, -954, 481, 672, -743, -475, 876, 214, -959, 28, 859, -379, -847, 509, 553, -790, -353, 941, 228, -748, 326, 967, -393, -764, 606, 539, -795, -398, 751, 37, -887, 36]
1208C6N67j006q6J135k61j030N86Q81q86o80J061M19j149j73J036j53q87M80P49
1227F39o52m66P65J03r65Q8R37k73p57N67O81o47m97O99K37p35j6P29k14o62L67
1248g2M78n44l75O37J90o35M1O95j54o21L31N61m63n04M96L13n89j99N55Q7m78
1269b50J31M72k89m18L85L02n34j96O58J78o56l8O10j10o22J83M98k72l42M06
1289I6J78n26o2N61j15n49K71N78l66m44N20L52n59j79N55l9o28J52N30l57m11
1310d42N01K84n72j20O10r5n80K96N65m11m21N92K84o65j03O40j01o20K60M65
1330C67m53l13N53J19o63N3O53k23o13M33N72m70l41N72J71n96J2N17k38m70L96
1351C8L51n60k06O06O2o34R6N79k33m98L60L56m59j82N18N0m86J28M45k31l47
$$ y = [36, 603, -403, -489, 646, 385, -645, -59, 822, -64, -744, 317, 736, -413, -586, 450, 297, -590, -110, 639, -13, -479, 286, 389, -576, -488, 449, 176, -581, -14, 667, 20, -477, 222, 459, -276, -292, 437, 223, -439, -72, 406, -138, -513, 124, 314, -321, -280, 415, 261, -360, -29, 532, 69, -435, 61, 374, -215, -414, 141, 228, -250, -119, 353, 64, -354, 31, 333, -201, -397, 261, 439, -217, -255, 355, 245, -377, -194, 304, 32, -310, 96, 274, -252, -314, 247, 132, -417, -146, 432, 66, -378, 142, 494, -65, -244, 311, 272, -356, -204, 326, -31, -442, 59, 343, -229, -349, 261, 166, -414, -118, 447, 36, -385, 207, 491, -174, -277, 363, 262, -358, -98, 367, -86, -399, 154, 273, -390, -337, 316, 93, -520, -87, 485, 15, -326, 246, 417, -179, -167, 350, 112, -358, 38, 389, -171, -377, 229, 291, -343, -247, 332, 99, -399, -39, 317, -142, -324, 194, 244, -242, -114, 331, 100, -247]
1372b47L45K31m25j13M14q5m29J61L92k76l01L39K28l54q0L60j3l01J30K34k56
1393d6j57K86R7l24J0L39l7k78J02K08j69j58J46M3k18K5J90r1j62J63J54j72
1415d9q2K23M8j61K6J58m9j59O1Q7j45q6J00K8q3MJ18l7q0P1N9j12n3J34L2r7
1441d4RJ36J0j01j5O0j2m4K2ll4J9M3o0r3K6O4m7q0Q9J14ml1K8M7o2j1jm8l1M2
1472a2L3m7j4O0J5o3k8O3mm3L3N7l1m0K1Ln8l7M8J9jM5N9pj0N1l2p5l8K9no3r
1505h1P0%l7Pk%K0J9j5K3O7J3o2l4K9J2n8k1P2J4mJ8J2k3m5j8n8m0PM0MNN2N4
1539D0J4%L4J0l1j7L0k0m5k9ql7m0JORM4N0J9j5M2L1n4m5QL0l1l2K2M0R%pj2m
1574A2nk5n0JN5Qm2qM9Qj9K3N3kJ5Jj7l5k9ol3k9J3L3lkN4L9jnJ9qo2k6J6k1j6
$$ y = [-247, 98, 329, -96, -209, 205, 120, -309, -148, 244, -32, -333, 6, 234, -120, -200, 160, 147, -154, -24, 210, -46, -203, 83, 180, -144, -134, 205, 168, -110, -8, 200, 31, -127, 19, 62, -156, -131, 59, -32, -194, -31, 123, -49, -131, 92, 140, -21, 5, 163, 114, -45, 16, 103, -42, -128, -28, 0, -83, -79, 39, 2, -78, -7, 52, -60, -113, 21, 53, -44, -35, 101, 111, 10, -5, 55, 43, -1, 21, 18, -16, 3, 46, -14, -107, -81, -17, -64, -144, -55, 59, 55, 24, 52, 99, 37, 26, 25, -23, -54, -12, 21, -26, -40, 20, 35, -28, -56, 7, 3, -40, -7, 50, 19, -21, 0, 3, -55, -92, -44, -25, -26, 19, 78, 71, 61, 112, 80, 5, -33, -4, -9, -72, -81, -11, -11, -48, -41, -43, -43, -23, -4, -19, 4, 71, 84, 22, -12, 17, 29, -29, -50, 22, 36, 32, 50, 62, 39, -6, -24, -82, -122, -115, -75, -71, -66, -14, 40, 54, 54, 88, 98, 67, 50, 80, 60, 15, -14, -22, -59, -99, -98, -92, -83, -39, 11, 30, 15, 57, 88, 34, -11, -3, 27, -4, -36, -14, 26, 35, 35, 28, 16, 12, 7, -18, -68, -67, -12, -4, -46, -54, -5, 3, -16, 7, 60, 58, 73, 74, 57, 22, -7, -13, -46, -75, -62, -29, -32, -34, 20, 59, 58, 53, 72, 64, 2, -24, -8, -29, -45]
1611d5K0Rk2PJ9p%N0L2l5j9L1ko2j4L7J8l1nJ6oKK3jm0J7J9l1m7L0P0j4k4L3L0
1646E8k9j4K6jl0LOm9m5K9K0l9OP2k1l1K0O3k2j8O0J3o4k0K7k1k5K6L0l4l9K4
1678a9Om6J8N6Qm5MM5k2k7N1K7l2jJ2k9m0M1K3l4j9L8J0o3%K5Rj3K3nk2rJ1K0
1712Ak3L2L3j0n5L2J6j3j6K5Nm5k0L5j2j6K1L8k0j7J3%k2%M5rj4L%j1lL1K7Kl6
1747A7Qok7qJ2kj1qMk3lL4K7NjJ9Ql9j3J3MqJJ4k4rnJ7J0j3L0kl3j0K4qk3J3L6
1786B0k3pK6Jj3RK9om1LKj7qK3Qk9PJ9kk6K1L7l0j8NOk4ML6j1qK7K6n0%K8J1l3
1824BjK0j5m1J6K4k4j2L3J2l4J0L3rk5L6K1l1l0M0Mn0NL5ml8J3K8m9nL4J1m0J9
1858a2L5k2k8L2L3k3k0K0J5l9rK6ll0J6J5l2mL3J6m0J4L0mk4%K1Kk2K1J7m1RK0
$$ y = [-45, -25, -16, -38, -31, -12, -19, -19, 31, 63, 28, 9, 40, 38, -24, -38, -1, 17, -14, -19, -3, -9, -7, 16, 15, -25, -8, 11, -20, -67, -37, 33, 19, -5, 28, 58, 29, 15, 41, 40, 10, 13, 19, -30, -75, -46, -26, -65, -59, 13, -8, -39, -19, 44, 22, 4, 64, 77, 13, -7, 20, -1, -26, 0, 30, -4, -43, -19, -13, -59, -41, 15, 23, -22, -18, 27, 5, -22, 29, 56, 24, 23, 35, 6, -34, 7, 30, -4, -23, 15, 25, -38, -38, -13, -4, -17, 6, 1, -21, -30, -19, 1, -22, 10, 43, 33, -22, 10, 26, 13, -3, 22, 27, -18, -38, -3, -15, -31, -10, 28, 8, -9, 4, 4, -18, -18, 27, 18, 4, 7, 7, -4, -7, 24, 51, 53, 17, 25, 19, -8, -16, -4, -6, -17, -25, -21, -44, -47, -13, 14, 19, 18, 37, 45, 6, -7, 6, 10, 2, 3, 17, -7, -16, -21, -4, 6, -7, 23, 21, -12, -22, 2, -6, -29, -16, 20, -3, -10, 16, 17, 4, 13, 42, 36, -5, -2, 0, -17, -25, -2, 6, -23, -16, 3, 1, -25, -4, 33, 3, -15, -10, -4, -28, -24, 12, 1, -7, 20, 46, -4, -4, 24, 35, 2, 1, 21, 6, -35, -19, 5, -19, -31, 2, 14, -20, -10, 23, 14, -11, 25, 46, 15, -15, 25, 29, -21, -16, 19, 15, -23, -10, 18, -31, -36, -2, 9, -31, -12, 23, 1, -27, 5, 38, 15, -5, 15, 30, -9, -18, 8, 5, -25, -9, 6, -26, -30, 3, 19, -21, -7, 23, 19, -5, -5, 16, 18, -4, 17, 34, -7, 2, 22]
1892B2k1k0K7J4j8j8K3jk0mK9Rl7K3Lk3j6K3Oj6J0J6qj6OK4j4j4L8qj4kJ9j4j4
1927fQJ7l5KPjqNK0qj6J0J1Lj1J0MpKNj0j2J0Prl0J7J1k3rK4J7jj1K8j1QLlpj2
1968aK0j6qOlpkJ2rJ5j0J3%j2j0LJ7Oj1LKNj%ojNj0j0lJ7j3k0jL0Oj7j3J0J4n
2009eNJLp%kj1J4RloJ6jok4OJ8k9KK2mj3mJ3J1NojJ2pJ7pk5K1j1qj2OQj7KmJ7
2052eqJ7qj0J9J0Lj6JJ5Lj9nPllrj1PRj2lPK3nj6K0J0jj2KJ1mj3J4k1OKLk0KR
2094dl8LK3MKnJ9K1okKJ1j2kj0j4j2K0j9k2J8L3j4j5K4L0j4pNJj3Nj1Pk3K5j4
2131dk2J7K1j2l1K0J6j6j9L1Pk7J4L9mk7OK7k9j6K8j1l5nJ7om6M5L5j3jK9J7m3
2165BJ7K3k2j8J3No3j2P0J6o1nO9k8l8K1L9j8j6M3j2m1JM7l1m0O6M8q0n6P6J5
$$ y = [22, 1, -19, 8, 22, 4, -14, 9, 8, -12, -16, 13, 22, -15, 8, 11, -12, -28, -5, 1, -15, -5, 11, 3, -13, -7, 17, 3, -11, 27, 19, 5, 3, 22, 8, -6, 2, 19, -16, -14, -7, -8, -16, -11, 9, 1, -15, -5, 6, 9, -2, 8, 12, 5, 7, 12, 2, -10, 0, 7, -2, -32, -15, -4, -27, -36, -12, 5, 4, -7, 21, 10, 18, 21, 18, 11, -1, 19, 3, -5, 1, -2, -9, -11, 1, -8, 7, -3, 10, 10, -2, -12, -9, 8, 14, 3, 6, 8, 13, 12, 12, 6, 5, 10, 0, -10, -13, 4, -9, -29, -30, 0, 6, -11, -24, -14, 0, -5, 0, 1, 4, -3, -3, -5, -16, -2, 7, 4, -2, 14, 13, 7, -17, -11, 7, -22, -20, 2, -2, -15, -19, -6, 5, 10, 4, 3, 15, 8, 25, 18, -7, 14, 3, -5, -17, -11, -3, -20, -18, -22, -5, -13, 4, -4, -14, 5, 15, 18, 2, 3, 18, 21, 2, -3, 4, 1, -2, -11, -22, -15, -6, -18, -21, -14, 9, 4, -12, 8, 18, 17, 5, 7, 18, 14, 1, 15, -6, 0, 2, 5, -15, -13, -4, -42, -39, -16, -12, -10, -15, 4, 25, 19, 17, 19, 30, 18, 16, 6, -8, -20, 0, -19, -41, -23, 10, -4, -19, 5, 35, 21, 14, 19, 20, 7, 12, 1, 8, -15, 10, -4, -26, -9, 12, 0, -31, -11, 5, -11, -30, 1, 8, -19, -5, 34, 30, 3, 9, 36, 7, -9, 19, 8, -27, -32, -15, -21, -67, -22, 13, 0, -1, 28, 45, 2, 19, 42, 20, 2, 15, 20, -43, -55, 15, 31, -30, -35, 34, 6, -32, -11, 28, 10, -6, 37, 25, -16, -15, 32, 1, -39, 27, 75, -5, -61, 15, 30]
2197C0q3jQ3l3p8N7N0n0j2R4K3p9nN6l5r2P2O8q8o1Q8K3j10RJ20k6o0O2M8r0k3
2228d3J00Lj03J7R8o4j11O9J07o1o2Q5Jj11NQ2l1n4R3N3r4n8J18J2r0L2J12m8
2256E7j16M1O8r8k3J19Nj29J8R3o7o1J26Q3j08m2J03l6j42O0J31m9q4P0N3j19
2282d7m7J24K1r3K9Q6r6r6R9Q0j07k6J45j5j27QJ15op1Q0N2j16o9R6Nr1M2J19
2310I4o4j19O5O5q6j3J10L0j19k3Q5k9n4Q6R3r6o0O0j9j00N2J25l6q2N4K3j15
2337g3o4J48N8p5OP0o0q7O9O7n7k1J08k8j53jJ47k3j00Q3J02j22j08J00L4p0M6
2364dJ29n3j41P4P5j29m7J69M6j74j9J21l4j27R7J26r8q3J04L3j33K1J53k7j36
2389e7O5P6j35p8J64O3j57J6J27p1j40Q5J30q1m0J03kj26J8J31m9j11J09P6j61
$$ y = [30, -53, -54, 29, -4, -82, -25, 25, -25, -37, 57, 80, 1, -4, 52, 17, -75, -3, 65, -23, -84, 4, 27, -83, -74, 46, 20, -40, 22, 70, -20, -43, 57, 60, -43, -26, 72, 8, -103, -34, 73, 12, -50, 35, 36, -75, -70, 12, -19, -73, 20, 73, -21, -79, 39, 51, -39, -7, 105, 57, -59, -18, 50, -48, -71, 48, 53, -76, -58, 35, -32, -93, 33, 116, 8, -34, 69, 33, -109, -49, 82, 33, -51, 19, 72, -47, -94, 30, 51, -42, -13, 73, -23, -119, -20, 60, -47, -73, 72, 57, -70, -62, 53, 47, -24, 56, 108, -8, -77, 19, 24, -67, -25, 94, 30, -89, -24, 41, -45, -58, 52, 82, -37, -60, 25, -4, -58, 28, 121, 25, -35, 25, 6, -94, -42, 83, 47, -35, 19, 42, -73, -137, 11, 69, -6, 0, 70, 10, -77, -8, 59, 2, -19, 89, 61, -92, -93, 54, 31, -69, 14, 116, -6, -114, -14, 20, -50, -4, 125, 72, -69, 5, 80, -49, -96, 73, 119, -55, -74, 47, 13, -114, -17, 109, 11, -72, 32, 65, -68, -47, 106, 79, -57, 8, 84, -51, -129, 35, 98, -59, -43, 84, 13, -127, -42, 88, 7, -33, 70, 68, -58, -40, 91, 42, -69, 40, 116, -45]
2414d5p4J12M6r7J9J14n8j01O7N8r1QJ32lj26K6P8n1r4J01N7r8m4P4j3j09N9J03
2442E0n4n8P1M5r9qJ32j6r8M9P7q8q4R3M9r1k0R5k5r3L9O2l3m7Q2M0j06kR5j8
2472C9q4M1Q0n6r0M9N6n9j5P0kp8K2N7m9m8P8M6o6j7N3Nn8J7M7k1m7K6L2o9%N3
2504A2%l9J8M8k9l1L7L7n0k7O0ko7kM8j3l4K5L1m9J1L6j5k8L2N0n5n1N1K8n5r
2536c2L8K0l0rN0k7l1M2J1n4JN6mn1PN4j9k9L4J1k3l0M1j4k7J5Rl0j2L7J1l0m
2569a9O2k5l2J4M0l7k3K7Kj9j1K3j3jJ1Qj2KK8j0l3J5L0nn0J6J3K4j8%lOMj1P
2604A0j9K2Ok2k2L6kj7oK5J2k7OJ6qj5Pkj5JRjjMJ4Lj5J4J9k7k0J7J9l8j3K4P
2641Aj2J2oLKJ3Rk2NL3j5m2J6L6k2k7OK9j5kJj5oK3J5m5KL3J4n2OM5Lm4jM4j7
$$ y = [-45, -119, -7, 39, -58, -39, 75, 17, -84, -17, 41, -50, -42, 90, 87, -39, -13, 65, 14, -80, 21, 78, -20, -64, 10, -3, -112, -53, 50, -4, -62, 9, 54, -45, -53, 79, 63, -35, 14, 91, 3, -81, 12, 61, -30, -50, 45, 20, -73, -34, 28, -5, -52, 30, 70, -36, -38, 57, 39, -45, -4, 76, 20, -70, -21, 35, -24, -39, 31, 29, -49, -27, 30, -19, -67, 11, 57, -9, -26, 27, 32, -26, -9, 38, 17, -30, -4, 28, -41, -41, 12, 12, -27, -9, 39, 10, -21, 16, 53, 3, -24, 36, 34, -33, -35, 13, 0, -34, -9, 22, -27, -16, 20, 5, -23, 9, 59, 4, -47, 4, 32, -23, -32, 6, 26, -4, -13, 37, 10, -21, 21, 32, -22, -21, 35, 31, -20, -13, 41, 22, -7, 27, 38, 15, -15, 26, 12, -15, 0, 9, -21, -33, 4, 15, -15, -19, 43, 18, -14, 0, 40, 3, -20, 7, 9, -10, -21, 2, -11, -12, -1, 7, -5, -3, 25, 15, -18, -3, 27, 22, -28, -12, 1, 25, 7, 7, 4, 10, 14, 3, 10, -9, 13, 19, -3, -25, 11, 9, -8, -14, 11, 23, -4, 2, 18, 10, -5, 2, 0, -15, -14, -5, -6, -7, -3, 11, 14, -1, 13, 32, 5, -15, 2, 21, -17, -30, -6, 1, -11, 1, -5, -2, 0, 13, 22, 0, 5, 38, 23, -19, -3, 33, 11, -16, -10, 19, 4, 2, 3, -12, -18, 5, 20, -25, -23, 10, 24, -28, -22, 23, 26, -18, -19, 25, 8]
2678Hj5K1jk4MJ8j8k2K4J4k5J0L0J0m9RM1k1l1J0L9l1k4K1k%J2J2k0j7K6J6m5
2711b0j1N4J3n4nL2j9j7K0K6l3J9J7j9l4K6M4l5l5L6J7l0j6M5J0m0J3K6l5m0L6
2742iN0m6j4N9j6o5J7N9k5l5N5K5p0l5N8J8n7QO5k1p0L4K7n7QN9J4q5J6O0k7n8
2774e8N5O3l5m5L7J1o0J8N5k4l7M4Rp3j9P8J4n0LN5m3n8N3L5l5QM8k3p3K6N9l3
2806Ej5M9Np6k4O6j1n4M4O3n0o5L4L2m0L0O2k9l7J9K8p4qR3K9p6l9O0k2o8M6O2
2838C9k5l3K7jp1K4J00k1o0L9N4o5n2L3N3l3k4N6j9p2LN7j5k5M6L2o3l1N7K1n8
2869b7J2N8j0q3K6L7k2k7N6K9n4m3M3Ol0L0M5l9n6M3K6n1JR5Lp5lL9l4m3O9J9
2901D0l9k0K7j4o9M8Q6l0n6N7K1q7k9Q5j1n5M9L1o6m7P0L4m5K1Q0l8q6K0N3n4
$$ y = [8, -7, 14, 13, -11, -7, 11, -7, -29, -5, 9, -16, -6, 24, 34, -15, -6, 35, 14, -17, -7, 32, 1, -23, -2, -4, -4, 8, 20, 0, -17, 9, 25, -20, -31, 23, 36, -18, -23, 9, -10, -27, -7, 19, -14, 5, 22, 3, -31, -5, 39, 4, -31, 5, 22, -8, -24, 21, 31, -9, 4, 30, -5, -45, -9, 41, -5, -19, 40, 24, -41, -24, 35, 10, -25, 30, 55, -15, -50, 8, 26, -31, -23, 42, 21, -49, -15, 12, -45, -37, 22, 36, -49, -33, 27, 0, -58, -3, 60, 25, -20, 17, 28, -32, -14, 41, 17, -20, 24, 33, -40, -59, 19, 33, -17, -14, 41, -2, -60, -7, 28, -7, 1, 49, 26, -47, -21, 38, 5, -10, 39, 44, -32, -56, 10, -1, -55, -11, 52, 2, -63, -29, 3, -37, -7, 55, 26, -11, 8, 36, -38, -46, 47, 76, 0, -39, 21, -1, -69, -23, 39, 14, -19, 8, 7, -64, -40, 60, 39, -21, 18, 72, 7, -45, -12, 41, 8, -16, 40, 21, -51, -48, 9, -6, -31, 15, 47, -16, -47, 10, 31, -27, -15, 43, 33, -50, -24, 13, -9, -36, 20, 49, -5, -48, -5, 1, -29, 1, 46, 7, -49, -6, 20, -31, -30, 65, 68, -7, -10, 29, -5, -48, 21, 40, 1, -19, 8, -6, -75, -27, 59, 29, -27, 30, 51, -36, -65, 20, 9, -46, 3, 34, -32, -79, -9, 25, -20, 1, 81, 43, -43, -23, 30, -24]
2931b4k1R4J8j03j5O9j1o6P2O6o5m5N2kr0L7J05k9j01O2N3p4l9R6K9o2kL5m5o6
2961g2N7M1n5j4P8j0q5K1R2k1m9M8K5o3l3M8Jk8K8L2m9l9N0M0n4NN7qp0J3L1l3
2993a6j6M2K3l4pK4ql5L7K8m2rK1j0l5kO2j3k8J3J9j0k4K5J0Nj0J3l5l1K9J9k0
3026a5QL5Nk9k2J7J8omKj8j1J4lMjJ6Jj8nOJ5j7QJ3j2j7qL1lk6J7K7j9j6RJ2j1
3064cmK6l8qK6Mj6qM7Jl1lJ3JqNPj2nJ5j4j1K2Oj1k1K5K4l9nK0J0l1PK0k0PK2
3102B0kk2J2J0j5j0LLj9J4J0Lk6R%J0j0jOQMKkKJ0Oj0j9J7Lmj8J1Klj3nLKJ1j8
3143a6qK8Mnj9J5PLrmR%j1lMJPlk1J7kNoJNkJ4KpJ1jqJ3j1lj2J9lj5JJ3pQnmL
3189Ej1K5k8jJ3J7j7j4QRlj3K2j9RL%pKJ1j6PoJ7qj3NLpRJ0j4OKqrJ4J0j4nJ7
$$ y = [-24, -45, 49, 67, -36, -51, 18, 7, -59, 13, 79, 14, -31, 21, 19, -71, -34, 71, 42, -59, 3, 56, -18, -57, 39, 68, 6, 4, 39, -6, -72, -15, 26, -29, -43, 35, 25, -60, -39, 53, 32, -17, 31, 56, -7, -40, 8, 9, -19, 9, 41, -8, -47, 3, 43, -11, -6, 51, 43, -27, -14, 17, -16, -32, 10, 33, -1, -8, 16, 8, -27, 10, 38, -4, -13, 8, -2, -37, -39, 23, 10, -18, -5, 14, 4, -20, 5, 15, 20, 10, 23, -12, -43, -14, 5, -15, -7, 28, 33, 4, -18, -1, 17, 11, 7, 9, -9, -20, -6, -9, -5, -6, 10, 11, -7, -12, -6, 9, -8, 0, 13, 1, -16, -24, 7, 4, -22, -5, 22, 3, -13, -4, 8, -3, -7, 19, -19, -27, -1, 3, -13, -21, 26, 27, -4, -7, 6, 7, -1, 4, 11, -1, -6, 9, -5, -16, 6, 12, 1, -20, 5, 29, -10, -15, 5, 15, -16, -9, 11, -9, -2, 20, 18, -4, 8, 18, 3, -7, -4, -1, -20, -6, 4, 7, -19, -10, -10, 0, -10, -11, -5, 3, 7, 9, 7, 9, 19, 25, 15, -4, 13, 16, 12, -6, 5, 7, 4, -9, -14, -11, -9, 2, -16, -24, 4, 8, 3, -16, -1, 6, 9, 0, -4, 5, 5, -6, -9, -5, -4, 3, 0, -21, -4, -6, -1, -7, -6, -1, -3, 11, 13, 6, 17, 16, 8, 21, 10, 7, -5, 14, 11, -4, -3, 10, 3, 11, 6, 2, 5, -6, 19, -9, -10, 3, 20, 3, -11, -3, 6, 3, -10, 12, -7, 2, 5, 5, -2, 0, 11, -5, 2, -4, 13, 5, -8, -3, 0, -7, 2, 12, -2, 4, 6, -2, -11, 3, 13, -1, -6, 11]
3230A1Ppj2K4j3j2KMj5jOmrJ0MKk2L1Qj4nNQqpPqJ5PrrPMj2j9K2J9k2j8J6J4r
3272bQPKj0J3Ql3pK3kk5NK3j8j1OK1j9kJ6Nj6KOmj2J7K2l3qK9Mk1mK3k0j3LJ8
3311Aj3rK5J3k6nK2qrK0K7l9k3L0Nk4mM5j1k5nK5k0pK5Ok8qK5j6k7J9K9j5rL3
3347A9Om7J3L0ll6K6K2m3j7L2jj6jM7k8k5K9J7l2nL1Km7NK3%k0L3K7l3j2J3%l5
3382b6J4M1rn6J1M4l7j7M4J3l1KK7j5k6K8L5l0k9K9J5o1QM6Nm1K4J8k1l4K8K5
3414B4m0jL4j5k8J7K9j9j6M9jl5j5M1J1m7NL9j9m6K9K0l1nK9Pl5NL3k8k6L3K3
3447B1k5k1L8pk5J2L5j4l0K9Rl8lM8pm8K8K7m9k0M4L3m0mN1j4l9J5L0l7rK6Om6
3481b4KM9j5m7L1K4m1l2N4J8m0MM1om9K2L7l8j4N3J6o0kM9rn1K6M5l7l3L0J3l8
$$ y = [11, 18, 11, -1, 23, 10, -2, 0, 4, -11, -12, -6, -10, -19, -9, -5, -3, -25, 6, 14, 0, -5, 0, 8, 0, -7, 0, -8, 7, 14, 5, -4, 3, 7, -5, -24, -2, 17, -5, -23, -7, 7, -2, 6, 13, 15, 5, 18, 26, -7, -14, 9, 7, -18, -13, 10, -8, -19, -13, 8, -11, -13, 3, 8, -8, -6, 0, -4, -16, 1, 23, -10, -18, 11, 15, -6, -10, 13, -7, -20, -17, 1, -12, -21, 4, 17, -9, -14, 8, 0, -9, 11, 38, -1, -24, 6, 11, -13, -17, 28, 17, -8, -13, 12, -8, -15, 10, 16, -12, -20, 5, -11, -38, -19, 10, -5, -14, 19, 25, -22, -9, 21, 18, -18, 8, 30, -13, -30, 2, 1, -15, -16, 31, 3, -22, 7, 24, -8, -13, 18, 20, -27, -22, 1, 1, -19, 14, 41, 8, -4, 9, 9, -26, -12, 29, 20, -36, -25, 19, -18, -35, 9, 22, -9, -7, 20, 5, -21, 7, 42, 12, -17, 12, 27, -34, -26, 20, 25, -16, 8, 26, 5, -29, -1, 24, -16, -17, 17, 2, -26, -9, 20, 1, -15, 34, 33, -2, -17, 24, 35, -12, -7, 32, 13, -33, -4, 16, -15, -20, 9, 16, -19, -14, 19, -9, -35, -2, 21, -4, -25, 13, 6, -19, -7, 28, 14, -16, 13, 22, -16, -19, 29, 22, -26, 2, 29, -20, -40, 4, 37, -3, -7, 44, 30, -9, 6, 36, -1, -10, 16, 22, -24, -22, 27, 12, -35, -4, 20, -21, -53, 1, 19, -21, -17, 24, 18, -31, -9, 28, -10, -24, 29, 45, -15, -17, 32, 23, -28, -2, 43, 6, -27, 3, 16, -22]
3514b2JN1k0m1K5L5m2j6L8K7m4K0K1k3l3J7L3k3k3L4qk9J5K4k5j7L5J2l8mM9j1
3546A8m3K1L6k3j8L4ll0J1J8ql3J7J6k0j3K4K1l2oK3J1k4PPLj3J4Kj3lJ9ok8J7
3581CJ1j5j2J9nqj1L3rk5J0OMqJJ8qKJ0%j4lJ2oj4PJ3j3rJ4JrQlLKpK3j9nJ0O
3623A3ok0L8k0nLMJj8LJ7k1MJNj6MJ0j0J3kJ2pNJ0Mk2J6mj9J0rJ2qJ1%j2qLK3
3663A5j7j2K3Mj7kJ9j0rKJ1j2RJ4rpLPj7j1LMnj1J5Jj0J5Jr%J5J3j2nJ2lk2KP
3703eJ4j9J6mlkJ1qlOj4kjJ7j3NJ3Lj4J1pPmj0KMLjqllMJqONMjLNk0KJ1jMmJM
3751DJ0qJ2j8mjJRj7kkJ2rRjRLNoj1QRj4LJKmloQrMQplJ2Lj9J2j0P%kJ5pkJ2n
3799Hj4NK9k4kKpoL%PJ0qJooJ7pJ0j8J8j6MNMj6lJ8j4J1j5J7oj1lJ9j3MJJ2rr
$$ y = [-22, -21, 30, 10, -31, -6, 29, -13, -29, 9, 36, -8, 12, 33, 10, -23, -6, 27, 4, -19, 15, 7, -22, -7, 17, -8, -25, 10, 22, -16, -20, 29, 18, -25, -4, 32, 9, -9, 25, 22, -8, 3, 21, 13, -20, -3, 13, -7, -20, 4, 25, -7, -13, 10, 21, -3, 4, 11, 14, 1, 15, 17, 4, 1, 20, 14, -14, 3, 14, -1, -13, 6, 1, -7, -18, 15, 6, -19, -9, -3, 1, -7, -6, 12, 4, 6, 16, 16, 2, -1, 11, 5, -9, -2, 11, -2, -11, 3, 4, -5, 3, 0, 3, 5, -2, 21, 2, -3, 7, 13, 7, -13, 25, 5, 0, 3, 7, 8, -10, -7, 10, -11, -7, -6, -1, -17, -13, -3, -13, 0, -2, 10, 3, 8, 18, 22, 0, 16, 12, -7, 3, -6, 6, -2, 9, 9, -3, -11, -8, 15, -2, -14, 9, 13, -4, -6, 13, 3, -6, -4, 7, -5, 4, 18, 9, 2, 5, 12, -5, -16, -13, -9, -14, -25, -10, -9, -19, -4, -3, -12, -12, 3, 16, 4, -1, 11, 8, -14, -12, -5, 9, -10, 6, 2, -1, -3, 8, 0, -3, 3, -11, -13, -14, 3, -10, -5, 8, 11, -3, 8, 1, 8, 4, -6, -4, 0, 3, 2, -6, -9, -12, -8, -7, -15, -9, -4, 0, -1, 2, 7, -13, -11, 0, -1, 3, -1, 0, 4, 14, 6, 18, 0, -4, -5, -4, 5, -12, -14, -16, -4, -13, -4, -5, 4, 7, 12, 6, -5, 3, 12, -2, 1, 2, 4, 0, -3, -9, -1, -10, -6, 2, -5, -8, 4, 7, -12, 0, -10, -3, -3, -5, 10, 3, 1, 13, 8, -6, -1, 28, 4, 2, 4, -3, -9, -6, -6, 1, 11, 3, 4, -2, -8, 9, 2, 12, -6, 12, -4, 0, 5, 9, -7, -10, 8, -6, 5, -10, 7, 1, -10, -13, 6, -7, -3, -2, 10, 1, -8]
3841hRknJ0K2nk0MQ%k1J4J6l0JJ7j9KJ8pnMqJ6k0KOK4j3rRrqJ0KKj4Pk%oJ4nj2
3885a1KOj5J0J1%Nk0K1j9J4%mJ0q%Nj1MQk1J1kJ7k2MpJ1lpJ8j6OJ3j6qKJ9p%l
3926cQrnJ0Lj2QMrqKJ7j3j4K2MqkJ1jNqlMmPMj6PjRj7KjNj6J7Lj7J1KJqMJ3j1
3972cpJ4pPj5J4Pj5R%oj2KJ5rLONnqRLnRKj0kRojpP%j1PMjrJ1qnJ1Kp%QJ2k0m
4021gLJ1qMOmqMOj8mK1ljoJ0pLKk%JOKj7RL%JKJmj0QknjJ8k0%NlrpK2kmJ0lOj2
4072cnJ1jJJq%j0J7j3LOONn%M%j3NoJ4JOj7J4p%kkMmj0ONjo%J1j6J2jOj2OlMr
4120fJ6j0J6pj0P%rP%j0PjLrJ1rJ0pNRj3QPqKkJ6k3OJPj3MJ2j8J1j4pNLmNqLQ
4166AjMLKjj9J0LJ9j8J8j7KlLj7KJ4njkQjj2J9mMlMkj0LlJ2j4OpoJ0mj5J1J1p
$$ y = [-8, 1, -1, -6, 4, 26, 21, 1, 5, 13, 13, -8, 6, 22, -8, -7, 10, -9, -7, 11, 4, -1, 3, -5, 11, -9, -7, -1, 23, 10, 1, 10, 1, -7, 3, 5, 7, -7, 0, -2, -2, -8, 6, 1, -11, -9, -3, -18, -8, 3, 3, 8, -12, 9, -10, 4, 4, 0, 10, 2, 2, 7, -4, 0, 8, -13, -2, -4, 13, -9, -5, -12, -1, -4, -11, 7, -9, -3, 10, -6, -14, -12, 7, 0, 0, -3, 5, -4, -9, 1, 4, -8, 0, 4, -5, -13, -11, 6, -7, -21, 1, 5, -3, -5, 6, 5, 10, 2, -1, 3, -1, 6, 10, -6, 1, 0, 9, -8, -6, -7, -2, -18, -1, 2, -15, -4, -2, -1, -9, -5, 8, -3, -10, 4, -3, 4, -11, 3, 10, -5, 4, 4, -2, -14, -12, 3, -6, -3, 3, 8, 3, -5, 4, 7, 2, 11, 13, 3, 1, 10, 4, 3, -4, 3, 3, -8, -1, 3, 2, -7, 4, -4, -9, 2, 4, -3, -3, 5, 17, -3, -7, -4, 7, -1, 3, 9, 5, -3, 1, 7, -11, -15, 6, 3, 2, -4, 6, -1, 2, 4, 2, 2, 3, 9, 11, -6, 3, 6, 6, 7, 9, 10, 6, -4, 4, 2, -3, -4, 14, -6, -6, -1, -4, -13, -20, 2, 0, -4, 6, 3, 9, -3, -8, 3, 2, 3, 4, -4, -4, -14, 3, -10, -7, -1, 5, 10, 5, 5, 9, 9, -4, 1, -5, 9, 10, 16, -1, 13, 6, 6, 4, 2, 6, 2, -8, -2, 3, 2, -4, -4, 7, -9, 3, 2, 8, -4, 2, -1, 3, -6, 10, 0, 16, 9, -1, 6, 6, -3, 4, 4, -6, 1, 0, 3, -6, 5, -4, 6, -1, 4, 13, 0, 8, 15, 7, 9, 7, 23, 0, 6, 7, 14, 1, 5, 17, -1, 10, -4, -11, -6, -3, -7, -2, -10, -7, 1, 0, 4, 7, 9, 8, -11, -1, 2, 21, 3, 21, 4, 6, 3, 6, -11, -9, 5, 0, -1, -3, 5, 4, -8, 11, 7, 11, 8, 12, 10, 0, 3, 0, 12, -2, 4, -3, -9, 1, -3, -18, -7, 4, -3]
4210cRj7NKjjLJ0j1oJ7Mj0Q%koNrKJ6j0QqnJ6j9KJRMpNqj0PJmmkJ5J5j6Mj7J4
4256FlmKqOkqQMQj0J4j3jNJ5j3PrMMpNrOrJ7j1okLQpK%Qj3J2qN%Nj3JNrPpNnK
4307cOj4K0rNjj2LpJ3RlJj0J7j2%nMKPmpJ1j2J0nmJ0jlPkj5J8j8J1j1J3jmj0R
4350ClnPnj%Mkpj0J7mJ1j8NjJ2pR%kPomRj0JJ5j8Ll%NPj1NqQj1OKMJpLj1NJ5r
4399ArK0j4oJ0knNl%j4J9JJl%J2oj0PMnOmkONj0%Lnj%pNj5J8Nmj1mJ8qJ0j7Rj
4446ajNnnj0K1q%kJ%j0J5JmJo%QmJ4rMjoJ7k0J1Kj4jQLj4JJ8j9RJjQmpPlrJ5r
4494cj4J4KoLNlj0J0Jj3J1J0pj0LLkLMmrJJ5OnpJ5j1pJ5lmj2J3qqR%on%J5Lk0
4539a6J9pLnOqlJ7Ok5QJ1KqlK%lKojLOJpKJ3Pj1Kkj0%J1%jMMj3j4J1LNk4J1Jq
$$ y = [-3, 6, -11, -6, -4, -5, -6, -3, 7, -4, -10, 7, 11, 1, 9, 9, 7, 1, 6, -3, -1, 15, 5, 13, 5, 0, 16, -3, -1, 0, 9, 13, 6, 11, 3, -7, 0, 1, -3, -7, -9, 6, 21, 5, 9, -8, 6, 3, -1, 1, -7, -1, -3, -11, -3, 1, 9, -1, 13, 0, -1, 4, 19, 6, 13, 4, 8, 12, 5, 10, 1, 7, -2, 15, 4, -2, -4, -1, 7, 0, 2, 2, 10, -3, 9, 1, 6, 6, 11, -2, -1, 4, -5, 2, -5, 0, -5, -3, 3, -11, 9, 0, 5, 4, -8, -5, -12, 1, 10, 7, 8, -2, 15, 3, 3, -2, 2, 4, 11, 7, 0, 11, -1, 9, 4, 0, 10, 9, 6, 13, 11, -4, 14, -4, 7, -4, 9, 8, 4, -6, 3, 0, -5, 2, -3, -4, -4, 0, -2, -9, -19, -2, -6, 5, -13, -8, -9, 3, -4, 5, 5, 3, 10, 4, 0, 9, -1, 0, 15, -3, 0, -3, -3, 2, 9, -2, 3, -5, 3, -8, -2, 0, 4, 5, -2, 1, -10, -5, 10, 1, -8, 12, -2, -8, 2, 0, -5, 0, -3, -3, -17, 2, 3, 4, 1, 1, 13, 7, -3, 4, 8, 3, 9, 5, 3, 9, 14, 4, 4, 7, 2, 1, 1, -6, -1, -16, 2, 7, 3, -8, -12, 6, -2, 8, -9, 0, -1, -2, 3, -2, -7, -17, 4, -4, -4, -6, -5, -5, -15, 0, 1, -3, -2, -8, -8, 0, -4, 10, 1, 5, 4, -2, 15, -5, 6, 8, -6, -7, 1, 4, -10, -9, 9, -10, -1, 0, -1, 7, 3, -4, 3, 0, -9, 6, -3, -17, -3, -1, -7, -4, 1, -2, -12, -2, -1, -14, -3, 7, 0, -10, -7, -4, -6, -3, 1, -3, -12, -11, 4, 10, 5, -2, 13, 2, -5, 10, 7, 3, -9, 4, -4, -12, -3, -3, -9, -14, -14, 1, 4, -16, 3, -4, -1, -6, 0, -8, -11, 6, 12, -13, -5, 6, 8, 0, -3, -1, -1, -4, -2, -8, -9, -6, 0, 1, -6, -4, 9, 16, 5, 7, 5, -5, -5, 6, 6, 5, 9, 13, 0, -14, -3, 0, 5, -19, -8, -7, -15]
4586a5J4kKj4J8%lrJ3Oj6PkplmJ6Kj5J4pj3J1J5mj3PJ8oj6J4j6jJ1J1kqkK0k8
4626gMRqMrJ6j3mJ4Lj0oLMpOpJ4k2J7%rQJ0jk7K4j0Pj6K0mj5KOJ2mjjN%kJ2rl
4671EjLoNJ6j8KLpmpMJ5k2RkljKOmKRJj8PRmqpJ1kOqM%OmJ3j5NJ3j5kJ1mRk3J6
4720Gk%pMnj6J8OnmOokkkj1RJ3oNllMoMJ0j6OnkJ2j1J0LmpJ2poJ2M%mmK1j6jM
4768GKj4J5j1QnOj2j8J9J0j3MRLj6LQKpKLojNlJqJ4ooKNjljlRmJMmL%mPqOPKo
4819Gmj3J0njlKL%lNoOKmkOJ0j3Jl%OmRnrLk%jR%omJ7jlQpjj1K2mlnlJ2kjrLn
4872bPKlj1NPj1PJ1j1mJj1NJ3KkpJjMlnJpJ2MrNpJoJ1QoOo%jjQKm%qJ4j4KnPK
4923Cj9K0j3J2j5kj0K1j0J7k5J0J6n%OQmj4NJ2qmmJ2ll%j0KJ9MqrKRj4MO%oJ1
$$ y = [-15, -1, -3, -1, -15, 3, 3, 0, -9, 4, 10, -6, 1, -1, -8, -11, -15, 1, 3, -12, 2, -5, -18, -7, 8, 4, -9, -2, 16, 10, -6, 8, -8, -9, 2, 13, 11, 3, 1, 21, -7, -3, 6, -2, 2, -7, 9, -4, -8, 6, 9, -1, -7, -4, 0, -7, -1, -8, 6, -16, 1, 1, -8, 0, 10, 9, -18, 6, -4, 3, -13, 7, 3, -12, -10, -4, 8, 4, 3, 2, 7, 7, 5, 17, 8, 5, 4, 7, 1, 6, 22, 4, 6, 9, 2, -2, -9, -5, 10, -12, -3, -5, -8, -9, -7, -1, -5, -3, 6, 7, -11, -4, 5, 1, -7, -14, -3, -5, 1, -7, -3, -3, 3, -1, 12, -3, 2, 15, 0, -2, 9, 5, 14, -9, 7, 5, 5, -2, 2, -3, -19, -1, 5, 0, -4, 2, -4, -6, -8, -10, -21, -12, 1, -5, 0, -3, -6, -2, -8, -4, 6, -10, -4, -9, -11, 1, -10, 0, 3, -1, -8, 4, -3, -9, 3, 7, 7, 3, -1, 20, 4, 3, 7, 9, -5, 10, -1, 7, 2, 8, -4, -22, -3, 7, -6, -2, 7, 10, -6, -3, 5, 7, 0, 2, 5, -1, -2, 3, 0, 1, -7, 7, 1, -5, -3, 2, 1, -2, -3, -6, 3, -1, 0, 4, 0, 3, 3, -1, 6, -2, 4, 11, 13, 7, 3, -10, 0, -5, -6, -9, -7, -4, -4, -7, -2, -8, -2, 0, -4, -6, 0, 10, -3, -2, -5, -5, 1, -3, 6, 1, -8, -5, -7, -7, -8, 1, 1, -5, -9, 8, 7, 4, 12, 5, 4, -7, 15, 11, 8, 3, 0, 12, 10, 9, 0, 3, -2, 5, 7, 4, -7, -2, 5, -6, 1, 12, 1, -3, -2, -13, -8, 5, 7, 5, -2, -1, -2, 2, -1, -6, -5, -12, 0, 4, -5, 0, -7, -6, -12, -1, 7, 1, 7, 1, 1, 0, -1, 7, 9, 5, 5, -3, 11, -3, -1, -6, 1, 3, -16, 4, -9, 3, -12, -14, -24, -3, -13, 4, -21, -11, 5, 0, 0, 6, 14, 10, -4, 1, 13, 5, 1, -3, 9, 6, 3, 3, -7, -5, 14, 18, 10, 1, 3, 12, -2, 2, 8, 8, 2, 13]
4965A3jlrNJ1k2MPj4J0kKJj3J0Qj1oJ6j0KKJ4j4jRj2rRJ4%j2J7j3M%Kljj5J6K
5007Gq%PJlKmOj0J3Lj4%PkJjoqnQKj4K2JqKJ1Qk3lJ1RqNNj0MNkj8OQLj9J9Jj2
5055aqK0Nj2JQj0Mk%OmJ%k2JJ7j1%MJ7k7J0J2Lj2kJ0lj8PJ1oJPKk1%J3pQrJ5j1
5099cqK4%j4NNOk2KMnmK8Jl3J4J4j1j4RJ0qoNKnqJ0%j0J4Qk1kJ7mqPMjoKLm%J8
5145A5j1k0K0KmmJ0mnnMRqj1K5j1j2KK1rqJ4%j6mJ1nj0J0Lj1%NJ0j4oK1jkPkj4
5187hnK7mk1J4Koj2LOPj5K2%j0j2J6j5%J4JonQOk1K0Mrj4%RnlLJ5j8KRk2J5J6
5229HQj7j1QjnLPJ1k7J3pKjJ4jj3qJ8j0r%K9j3kPKj1mJ0jPj1J2j0qJ5k1LPJ1j
5271Cj5ROj1j0K0J0j6qJ9pj0%J9j3LNJjrNOj0%LJoNJJ5l0RLkNn%rJ0%Kj7J9q%
$$ y = [13, 12, 9, 0, 5, 16, -6, -2, 5, -9, 1, -1, 1, 2, -11, -1, 7, -4, -10, 6, -4, -2, 0, 14, 0, -1, 8, -4, -13, -4, 10, 10, -2, 15, 2, 6, 6, 8, 5, 4, -11, 5, 7, -1, -1, 6, 7, 4, 6, 2, 8, -2, 11, 14, 0, 0, 7, 5, 6, 5, -1, -9, -14, -6, -4, -18, 4, 5, -3, -1, 10, 18, -5, -8, 3, 12, 4, 9, 14, 4, 8, 13, 11, -7, -1, 7, 10, -9, 10, 11, -1, -9, 11, 16, 4, 5, 13, 3, 7, 5, 5, 11, 7, 8, 8, -14, -13, 4, -7, -7, -3, 14, -13, -3, 9, 12, 0, -2, 8, 5, -13, -6, 5, -1, 0, 7, 9, -12, -12, 1, -6, 2, -7, 8, -3, -11, 13, 13, -1, 4, 9, 15, -7, -5, -1, -6, -10, 18, 19, -14, 0, 14, 3, -11, -2, 8, 0, -6, -1, 1, -4, -12, -2, -2, -12, 2, 10, -11, -13, 4, 0, -8, -1, 3, 2, -4, -2, 1, -3, -3, 15, 4, -16, 4, 6, 2, -2, 8, 4, -1, -6, -2, 7, -1, -12, 13, 2, -10, -8, 13, 4, -4, 10, 10, -6, -10, 1, -4, -14, -4, -1, -12, -12, -7, 3, -11, -17, 4, 3, 1, 8, 6, -8, -13, 14, 10, -11, 3, 5, -1, -13, -10, -4, 3, -12, 10, 10, 0, -12, 4, -11, -11, 3, 4, -2, -7, 1, 7, -14, 6, 10, 1, -13, -13, -4, -9, -12, -9, 6, -12, -10, -1, -23, -8, 8, 16, -1, -12, -4, -5, -10, -7, 0, 11, -16, -3, -10, -8, -9, 5, 4, -9, -17, 1, -9, -18, -18, 11, -2, -4, 3, 5, -6, -10, 0, -1, 6, -5, 7, -3, -11, 4, -17, -14, -7, 4, 3, -12, -3, 3, -8, -18, 2, 12, -4, -12, 7, 0, -10, -10, 9, -4, -1, 4, 5, 4, -5, 0, 6, -4, -4, -1, 0, -6, -1, 0, 15, -15, -6, -3, -5, 0, -5, -5, -14, -4, -4, -2, -19, 0, -8, -8]
5316hmJ0j2JJ2%j2MOj2pJ8Ok0KJ8KrJMLj2J0Qjj1RqoMQLj1LqJ5j1J8k3Rj1J4l
5359aj8RMRj5J0OpnK%J1j2Rlj4NOmKJ3j0NoNpP%LJj0J6j0pRlmLJ0npKjjolJ5j4
5407a1PNrJJ6j1mRj6J8j4kJOPKOj5J5J0j6qjPJ4k2J6ppQmkRpLJlj1POpJJ1nj0
5452fMpPmOMj0JJRj1nQJNj5J5j8J7K%nLmJoJ1kMj5J3Qj1J0j2Qj2K2k0JkNOkj4
5497iK0j0OjLj3QnPknqRKJkj0J3Jmm%Rj8J5J0k5J0nJ9nj2J4jj5MK5j5jj0J4rJ
5540BJj2JqJ7rkJ4Noj3J0opJ3Pj5M%Mkj3K7j2lqJ6moKK1j6oRPj1%PMj5NloRK%
5586Dj9J9Kpj0lJ7KrJ2j1LmJ5rpJ1mljPjj6J7J4j8oPrPj7K3prRO%j1J3Kj3NKP
5630A0j3LJ1j0KOjnj4K1Kj3JJlj3J8j0kRKoj0OJ2Nj6J4%j6LNLmMKlj0MJ2nNRp
$$ y = [-8, -12, -2, -14, -13, -1, -1, -13, -9, -3, -15, -22, -4, 2, -18, -16, 2, 4, -5, -4, 0, 3, -9, 1, 9, 8, -3, 6, -2, -8, -4, 4, 7, -4, -1, -9, 6, -5, 13, -10, -1, -12, 2, -1, -19, -10, -6, 3, -12, -2, 4, -3, -8, -6, -6, 5, -7, 2, -1, -15, -10, -4, -8, -6, 7, -3, 2, -4, 1, -6, 1, 1, 4, 5, -5, 11, 1, -6, 3, 0, -4, -1, 9, 4, -3, -1, -2, -3, -9, -12, 3, -11, -4, 1, -8, -7, 9, -2, -6, 3, -13, 5, -9, -11, -10, -4, 3, 5, 11, -4, 11, 21, 5, -3, -4, 3, 17, -5, 11, 4, -3, 5, 1, -1, 8, 1, 4, 5, 2, -9, -2, 4, -3, -2, 9, 4, -6, -2, -9, -2, -6, 0, 4, -6, -5, -4, 5, -6, -11, -3, -2, 3, -12, 3, -15, 2, 4, 4, -1, 2, -2, -1, -7, 4, 2, 6, -9, 4, 12, 1, 11, -1, 7, -5, 17, -3, -2, -4, 1, 7, 5, -9, 11, 1, 7, 6, 9, -4, 4, -1, 6, 4, -1, -9, 0, 2, 3, 1, -9, 4, 5, 1, -3, -3, 6, -12, 3, 13, -12, -2, -7, 12, 7, -5, 9, 8, -7, -3, 22, 7, 6, -4, 10, 1, 2, 3, -9, -8, -16, 1, -8, -10, 4, 9, 3, -10, 0, -6, -13, 0, 7, -8, -4, -4, 0, -2, -15, 12, 0, -3, -11, 5, 1, -5, -3, 18, 2, -4, 5, 12, 1, 1, 8, 12, -3, 2, -1, -7, 2, 4, 4, -15, 4, 6, -1, -11, -14, 3, 5, -4, 8, -3, 0, -4, 11, 2, -5, 6, 2, -1, -2, 5, 4, -12, 5, 19, 1, -5, 2, -7, 0, -17, 6, -1, -10, -1, 5, 5, -6, 7, 9, -4, 1, 3, 10, -3, 0, 11, 1, 3, 9, 8, 3, -11, 10, 12, -1, 0, 1, -2, -15, 3, -7, -9, 0, 2, -4, -14, -8, 4, 9, -7, 7, 7, -9, -6, -1, 2, -2, 2, 4, 1, -9, -5, 7, 2, 7, 16, 9]
5674Ij8J1LMqR%j3NNJj3jJ2jj6RJ4k1nJ6jmQlpL%JrlJ1pklJ9rpK2mqKJ%Kj1Ro
5722dRkJ0j1RPj2rJJ6j0pNJ0qj0jRj2NjJ1ljkjJLJnMjnJQKp%moKjJ0Kj5LJ7k0
5770a2OJ1%j9J6RrkmJ2kj3J1j4LjN%j7J6J5j2nMNj5PjJ1j2NonPQLnqJ0mpJ9kj3
5814ekRlj1J8%jOoj2J3k0K1%k0NJ4JnpJ4j3nJ1Mj5kJ2j3QJ3pj6%J6%nKJ0j3nJ0
5856AkmRllkJ1rmjPjJ1J0mqj6J0JjrJ3Jmj0%J6rlJ1pj4J3jkpJ0kj2MJPJPoJkJ5
5904A4j1qJ1j0Qj0NJ1pNj3POj0QJj8RJ4j4KNlj2LJ1rQjmNNolnKLnMJrJ5qMKrM
5951bPJnQnJmjmQQj2pJ1KpJnQKQrpJLj2MOlJnkRLj2NrMJRmOpKOo%J2pKj4J1Jj
6005AJpJ3oNKjj0KLokJ1nklKMoQnMrjPlnPlpJ3qLkmNMLj4J7kmLnMqP%J2j2Llr
$$ y = [9, -9, 2, 5, 9, 1, 10, 10, -3, 2, 7, 8, -5, -6, 6, 5, -11, -2, 12, -9, -14, 2, 1, -3, 5, 2, -5, -2, -2, -1, -10, -13, -2, -9, -11, -14, 5, -4, -11, 11, 7, -1, 1, 2, 2, 4, -7, 2, -4, 5, 3, 13, 2, 11, 18, 6, -3, -2, 14, 4, -3, 2, 12, 4, -6, -7, 2, -10, -5, -6, 5, 2, 1, -1, -2, -1, 2, 3, -2, 2, 1, -4, -3, 5, 7, 0, 0, -4, -10, -8, -9, 1, 3, -12, -9, 8, -12, -6, 5, 5, -14, 2, 11, 2, 0, -4, 8, 6, -7, 4, -10, -7, -8, -3, -3, -20, -4, 11, -1, -6, -2, 3, -12, -5, -6, 5, -7, -2, -8, -13, -6, 2, 5, 0, -8, 2, -2, -9, 10, 8, -5, -7, 2, -1, -12, 6, 6, 5, 11, 5, -7, 6, -14, 7, 7, -13, -8, 6, 7, 2, -5, 9, -4, -9, 2, 6, -9, -11, 1, -12, -4, 9, 2, -14, -14, 2, 2, -3, -1, 9, -4, -9, 1, -1, -5, 4, 1, -2, -4, 7, -2, -6, -7, 0, -1, 10, 20, 16, 8, -8, 2, 3, 2, -7, 6, 7, 3, -7, -7, 9, 0, -3, 8, 1, -13, 0, -1, -3, -10, 0, -2, -14, -10, -9, -2, -1, 6, 0, 1, -1, 14, 3, -5, 6, -4, 4, -6, -1, 10, 3, 8, -5, 2, 8, -2, 6, 7, -11, -2, 12, -2, 0, 5, 2, -10, -7, 4, -5, 3, 2, -2, 3, 8, 2, -1, -6, -4, -1, -6, -2, -1, -10, 5, -3, 1, 3, -6, -2, 5, 6, 1, 9, 4, 5, 1, 0, -4, 4, 12, 0, -7, 4, 6, -1, 0, -5, 3, 5, 13, 4, -3, -2, 1, -11, -7, -1, -4, -3, -8, -10, -1, 2, -10, -5, -14, -10, -9, 0, -4, 2, -5, -3, 3, -3, -3, 9, 2, 4, -10, 1, 2, 1, 2, -5, 8, 2, 7, 9, 8, -2, 0, 3, -3, -5, 6, 1, -1, -4, -2, 2, -4, 4, -1, 3, -6, -7, 0, -3, -8, -1, -4, -11, 2, -6, -3, -5, -9, -4, 0, 3, -11, 6, 4, 0, 3, -2, 2, -6, 1, 1, 13, 1, 4, 1, -8]
6058hR%OoJOj1N%j6J1J5qJLK%j3R%j2KLqKQjoNQonKPqOJ5j4pJNjmOQmj1J6j5J0
6108HJLmpJj1J1%PkpJ2mj5jJ0lkOrLjjNJ%N%nkJPJj2mRJKnnJ1nPlJ0j5jOJNj1
6159akJjKLj0RqJ2mrMJ0q%J0Qj4j1J1jOpMJj6J3Nj2OJnKoJ2lLqPqOlKN%Jr%nM
6209cOj0J4j8RJ0lj0LOLNrJ1j3LlLjkKMk%j3jJ3mlNoJ1Jj8J4jNj9J1PnLPj0pl
6255h%MJ0pJJ1pj1J3j4J1rPOnjJj1PKNkqLmNJ1j4LnJ5j1KJ8k1lJ2j0J0JJkm%o
6300dJ9j4KoJ6j0J3j1jKkOj1lJ3Jmj3RMM%rNj0J1oJrK0okNOj7KJ0j1QLkj3JlJ9
6345A3rknQnJKKJJLp%MjrkNMj4ONppMJ6mlPllolJ7j6J6jJj0J2qkPKqjJ0KpMjM
6397A3j6J2qJ0oLj1J%MqRnmKkJ2oj0O%lkJ5j%klqj0J4Oj0J2mkj5J6J2qLj4J4o
$$ y = [-8, 1, 1, 7, 1, 2, 8, -3, 2, 2, -14, -3, 12, 4, 5, 8, 10, 10, -3, 6, 6, -6, -4, -1, -9, -7, 1, 0, -6, -1, 7, 1, -4, -2, 5, -3, 3, 18, 4, -3, -2, 3, 2, -2, 4, 12, 8, -3, 13, -2, 8, 9, 12, 8, 1, 2, -9, 2, 2, 9, 7, 0, 12, 8, -7, -8, 2, -1, -3, 3, -6, -3, -4, -5, 0, 1, 1, 6, 6, 1, -1, 0, 7, 8, -4, -8, 1, 2, 4, -1, -6, 5, 0, 7, 4, 14, -1, -2, 4, 5, 10, -1, -3, -2, -3, -1, 2, -8, 1, -7, 5, 1, -8, -4, 6, -2, -2, 8, 16, 2, -9, 2, 1, 7, 0, 4, 5, -11, 2, 7, -5, 1, 2, -3, -1, -7, 5, 2, 5, -3, 4, -4, 2, -1, 1, 6, 6, 7, -2, -2, -7, -3, 3, -7, 7, -11, -2, 8, 5, -5, -2, 4, 7, 12, 3, 14, 1, 4, 1, 4, 3, 1, 3, 7, 5, 5, -8, -9, 4, 0, -3, 2, -4, 7, 8, -10, 4, 3, 8, -11, 0, 7, 2, 5, 12, 2, -5, -8, -8, -4, 6, -1, 0, 11, 4, -7, 6, -8, 3, -6, 1, 7, 2, 1, 2, -9, -2, 0, 5, 3, -5, -2, -6, -1, 10, -4, -1, -6, 9, -2, 0, 18, -3, -6, 6, -4, 6, 7, 8, 6, 2, 2, -4, 15, 1, 3, -3, 13, 3, 16, 5, 4, 6, 4, 10, -1, -4, 9, 10, 6, -7, 2, 6, 10, 10, 1, 6, -4, 7, 1, 2, -7, 13, 7, 5, 10, 16, -1, 1, 11, 0, 8, 11, 9, -4, -3, -6, 13, 4, 2, -3, 5, 0, 1, 3, 5, 6, 7, 10, 3, 3, 7, 6, -3, -5, 0, 4, -10, -4, 1, -6, -13, -9, 7, 3, 0, 7, 4, 1, -5, -8, 9, -7, 9, 8, 9, -1, 11, 3, 1, 8, 10, 2, 1, 11, 13, 6, 10, 9, 13, -3, 9, 1, 11, 5, 8, -3, -2, -2, 2, -6, 3, -2, -6, -4, -6, 6, 0, -10, -4, -4, -7, -9, 6, 5, 5, 3, 0, -8, -18, -4, 2, -8, 4, 0, -2, -17, -1, 11, 3, 6, -8, 6, 0]
6441@j0J4Kk1K5Lj9NkMQpjjJ4j3KoJLkOj2PNmJJj1J3kKkkmlMPKj3K0j2NmKpQo
6489@LNRMj7Rj5KKQPl0J7j0J1kk%oLJ2pKj1j0J7Nj4QpNKJojLQn%lQOj7J7j2J4
6535A3j2J1LrklMKOj6J3j2RjkrjQkKkjooPJnnJ0J2qpOnqJ0k%RkNnpJ7j2LqNOo
6585bmJ3j%j5J9jj1J0nLnNlJLlmLOKj0J4j2lpMMqR%kOj6MOlQpjQJ2j1MqQj1J0
6633IkoLllqR%MqPrPlMjpJ1j0lQolJ0j3NlMJ2JKnrOqRj0J2olQ%%kMkQlmNj3KM
6686AnJ%J0rJ1j6J2qmKPloNJllPrOKJj0J2qkJ1j1J6j4OPrpJ6j6QnKJ3j6LMLLN
6733A1kj1mQrJ3plmPKlMqmJ0mjq%PpMjJ3j1MjNpJj1J4lRMj3OpQlJ4j3JlJ3qlJ0
6782Ij0J2pj0QJ3j2j2J6Qj7jQOj7J2qJ1j5Jm%J9omKojKLL%Jj0lRqROOnoK%J3j2
$$ y = [0, -10, 4, 6, -15, 10, 13, -6, -1, -3, 1, 9, 2, 1, 0, 14, 1, 3, -3, -2, 1, -1, 5, -7, 0, 5, 1, 2, 3, -8, 5, 3, 5, 3, 1, -3, -6, -2, 5, 7, -6, 14, 2, 7, 3, 5, -2, 6, 0, 3, 8, 17, 21, 4, 13, -2, 0, 2, 10, 17, -13, 4, -6, 5, 3, 1, 1, -5, -2, 10, 3, 5, -6, -16, 1, 6, -8, 0, -7, -2, 0, 1, -5, -6, -3, 5, 0, 0, -3, 5, 11, -6, 11, -1, 13, 1, 12, 15, 6, 4, 1, 5, 7, 13, -3, 10, -2, 7, 6, 4, -5, -6, 2, 0, 2, 0, -1, -7, -13, -6, -5, -10, -15, -5, 7, -1, -8, -2, -7, -15, -5, -7, -7, 2, 0, 5, 0, -7, 10, -2, 1, -7, -2, 4, -2, -6, 7, 6, 6, -9, 10, 9, -2, 8, 3, 6, 1, 6, 3, 4, 7, 4, 0, 3, 9, 11, 1, 15, 3, 0, -7, -3, 1, -7, 2, 2, 0, 6, -10, -6, 0, -3, 5, -2, -3, 5, 17, 6, 10, 2, 10, -1, 9, 7, 1, 4, 1, -2, -10, -1, -1, 3, -5, 2, -7, 0, -3, 1, 0, -7, 4, -6, -9, -1, -7, -10, 0, -13, -8, -11, -7, 5, 6, 8, 3, -6, 0, -8, 1, -9, 3, -3, -6, 2, 2, 2, 0, 4, 2, 10, 7, 3, 8, -5, -3, 1, -4, -3, -3, 7, -2, 9, -7, 5, -3, -7, -5, 2, -1, -7, -2, -1, -4, -7, 0, -9, -3, -1, 0, -10, 2, -6, -8, 3, -8, 8, -6, 0, 7, -2, -9, 7, -9, -1, -6, -4, 9, -7, -4, 0, 3, 6, 11, 9, -2, -6, 2, -7, 6, -1, -4, -8, -1, 1, -2, 2, -6, -10, 0, -4, -5, -13, -13, -6, -13, -9, -10, 3, -8, -4, -5, 0, -7, -6, -17, -3, -6, 3, 7, -6, 0, -7, 1, -2, 12, -1, 0, -3, 10, 2, -1, 9, -1, 11, 4, -6, 2, 15, 3, -9, 7, 15, -2, -3, 5, 11, -6, 6, -2, 9, -6, -5, -9, -9, 10, 4, 0, 2, -4, -5, -3, 0, 3, 3, 4, -6, -9, 0, -8, 1, 7, 13, 8, 2, 4, 4, 17, 5]
6828ElLK%qPj0J1rKPj1J7k5PKoPJMpoMRk3PLPoR%j0NjnNQ%nKPj0J4qmkKJ1j1K
6878@j0MNLj1J1KjLlMqj0QJkKoll%J2JJj0JOnJ0qNJj%Nj0JJ1j5J3%kJoLjjRj3
6927fORjj6%J7j0JNlj2J2KnlM%OrKLlKojPoJ1nKkLj0J1j3LkJ4njLNj2NMKj5Mk
6976ePlLPj0PmJjj4jJ8moQKojolJJMlrJ5PrmPlKLPqlkJ3kpkQQj3KmjRoQNrOlp
7031@Okj3mJ6pLJ2j7oK0j3RqKmPjoKnJ0J0j3Q%%qOpKjJ1koLJJJp%J1noMjMpj6
7080a6KJ5j0J1nnRLr%%MpRMknLOk2J5Llm%J2Nj1JKKj2qJ8kPlmKnJ5j2LnQj4J5
7127A0olLqPlJNj3KJ2lLj3OLrPjqMOLpKLjlOj4K0jmLknPj2jJ1MKpj0JmJ0jqJ0
7177DJMj5OOj3J3mJ1%rKj7QQj4J0pJ0j7%PJ5jqNMnQjj8J0%Qjjj0PqJ3j4J0j0Q
$$ y = [5, 2, 5, 7, 7, -1, 6, -4, 7, -2, 0, 7, -4, 13, -12, -5, -3, -9, -2, -1, 3, -4, -10, -6, 3, -20, -13, -10, -3, -9, 0, 0, -10, -5, -6, -11, -6, 2, 2, -3, -1, 6, -4, 10, 2, -2, -4, -2, 9, -2, 0, -10, -6, -1, 2, -9, 2, 4, 3, 6, 3, 7, -1, -11, -3, -2, -4, -2, -8, -11, -14, -14, -2, -1, 0, -10, -9, -3, -8, 2, -6, -1, 0, -1, -1, 4, -6, -5, 6, -9, 4, 4, 2, 3, -3, 0, -1, -2, 7, -6, 0, 9, 8, -8, -8, 9, -1, 0, 5, 2, -10, 2, 4, -1, -4, 0, 0, 6, -3, -1, 2, -1, 1, -5, -6, 1, -5, 6, 1, 3, 1, 4, -6, 5, -8, -5, -7, 7, 2, 1, 4, 9, -3, 2, 6, 8, -7, -3, -5, 2, -1, 2, 9, -1, 6, 2, 3, 2, -12, -13, 5, 1, -5, 3, 5, -1, -2, -8, -11, -10, -9, -5, -8, -17, -2, 5, -4, -8, -1, -4, -2, 1, 8, 0, -3, -5, 8, 6, -1, -3, 5, 13, 0, 2, -2, -3, 6, 0, 8, 13, 4, 10, 7, 0, 6, 4, -9, -13, 3, -4, -1, 11, -6, -12, 8, -5, 4, -4, -2, -6, 1, 0, -6, -4, -9, 1, 11, -2, 6, 6, 6, -2, 4, -3, -1, -2, 9, 7, 1, 4, 5, 6, 7, 0, 0, 11, 6, 0, 4, 3, 7, 0, -16, -14, 1, -9, 2, -3, -8, 1, 4, -5, -5, -5, -1, -8, 1, 5, 3, -2, 1, 7, -15, 0, 3, 0, -4, -4, 8, 13, 2, 3, 5, 7, -5, -13, 5, 3, 10, 7, 3, 5, 0, 15, 3, 6, 1, 9, -5, 10, 4, 1, 4, -4, 3, 0, 1, 6, -7, -5, 7, 4, 7, -6, 0, 3, -6, 1, 0, -8, -4, 2, 5, -2, 0, 3, 2, -1, 5, -9, 11, 10, 6, 9, 7, 2, 9, -3, -4, 7, 11, 13, 6, -4, -3, -7, 3, 2, -6, 4, 5, 9, -6, 0, 6, -7, 6, 2, 13, 13, 4, 6, -11, -3, 5, -9, 1, -6, 4, -13, -13, -6, 9, 8, 0, 5, 9, 4, 12, 11, -7, 3, 3, 11, 10, 9, -1, 6, -2, 11, -3, 7, -3, 5]
7221Ej2J9kj4J7j3jNJ0j3mkLlJ4j1JkLqRlKKLpPKjrJ5rKKqOnMJ0k0jJ5k%JmKO
7269A1r%oOnJOJkorORQkmj2MlJ4j0lmmJ8kmJnOpRpRjkPj1J5Mj4jMj0J1J0jj3O
7318Ij2ljOJ3j2nRnoK3j8MJj4J5Kj9QKJ4j1jlLJ0j5NJj0J1KpJ1o%JmMkKJ2j4Q
7362HqPqOJj2J0j1LOj1J3Lj1J3j2kLlqQJNKlrKkRJ0j3OjKLKoJ8k2PJMmrJ4oJ0
7409A6jj0JJklnNKj3ORkKPj6%JQKkllPj3J6n%j1J0LokJ1PmqrQjJ4k0MJ2j3QLr
7457BkMPj3NkLK%rJ8j6mQmNj3RJrJ5JjrkMLnJ0%j2J1NlnRppJ0JoPj0OLpjOrNO
7508A0%Jj6PJJM%mLmrNKNKrloJ5opQjJ7j3nLjMoJ5qlKlKOloJ1ppJ3j2oJ1KqJ2
7558Ij2OLj5J9rrkJ0J0qkj5K0j2%nmLJ4qOPOj7J1JjkkJ1poJQjmJKlJnJOjj1Ro
$$ y = [5, -7, 12, 10, -4, 13, 0, -1, 4, 14, 1, -3, -5, -2, -5, 9, -2, -1, -3, 0, -8, 1, -2, 0, 2, 5, -2, 5, 7, 6, -3, 12, 3, 5, 7, -1, 5, 0, 4, 14, -6, -7, 8, 6, 6, 7, 3, 5, 11, 2, 2, -4, 2, -3, -2, 4, 5, 3, -3, -12, -6, 3, 11, 9, 5, -7, -3, -6, 8, -2, -5, -9, -13, 5, 3, -1, 0, -5, 1, -6, 3, -4, 5, 4, 2, 9, -2, 13, 17, 3, 2, 6, -4, 7, 17, 16, 3, 9, -3, -6, -7, -1, 12, 0, -5, 4, -1, -7, 16, -2, 2, 3, -11, 4, 6, -13, -5, -3, 11, 0, -1, -4, -1, 9, -6, -1, 0, -10, 1, 3, -4, 7, 1, 1, 2, -2, 2, 0, 2, 14, 0, 8, 0, 7, -1, 5, 6, -6, 4, -7, -4, 2, -9, 4, 7, -4, 9, -3, -5, -2, -5, -13, -5, -4, 1, 3, 0, -9, -7, -9, 0, 10, -3, 3, 2, 4, 7, 9, 3, 21, -1, 6, 7, 11, 7, -2, 12, 6, 16, 15, 5, 6, 7, 5, 2, -3, 2, 4, -9, -3, 6, 4, 6, 13, -3, -3, -2, 6, 8, 6, 3, 0, 7, -6, 10, 5, 5, -6, 4, 7, 1, -1, 10, 17, 13, 5, -4, 4, 3, 17, -3, 1, 13, 0, 8, 11, 2, 0, 4, 11, -2, 3, 1, 4, 6, 6, -3, 15, -1, -5, 3, -1, 4, -9, 0, 1, -8, 7, 8, 7, -2, -4, 0, 3, -2, 8, 8, -4, 7, 12, 9, 4, 13, 6, -1, 9, 10, 4, 11, 1, 7, 10, 3, 2, 8, -1, 4, 10, 10, 11, -5, 2, 3, 4, 8, 8, 4, 7, 3, -6, -1, 1, 6, 8, -1, -4, -10, 5, -1, -8, 0, -1, 16, 3, -2, 1, 0, 4, -2, 13, 5, 2, 4, 1, 3, 9, 6, 0, 11, 4, -3, 10, -2, -8, 3, 5, -3, 9, -3, 3, 6, -9, 10, 1, -8, -10, 0, 10, 2, 0, -15, 5, -7, -7, -12, -16, -13, 1, -7, -1, 6, 12, -5, 6, 7, 6, 4, 2, 13, 6, 0, 1, 9, 8, 4, 5, 7, 4, 5, 0, 1, 7, 6, -5, 4, -2]
7606bMJj0NkkJ0qOkPj1LkOnlrK0olNoJLlO%qJ7j0NpNLqNLrkNJ2nj1LNp%%KjLj
7659BkLk3J4Rj3LLkJMnMkP%Nj0OrMRMqmOj8MJ7jpRnRpJj0J3nnOpPklkLmNlpNN
7712DLolOjjmNKLj8OMP%j0K1j3nJ1rKKqM%JJkLmJRrJ1j0JjjLj1OKjLl%NqpOOM
7765GooqJ5JKJ0j4LnMrP%LNrO%Rj8RJ2j5NpQLpMj5OKk%jOrJjOkj0NNklJ2qjPJ
7817Fl%JoP%MkpkJ6mpNQj5KRrLMmKNrRrKkmJ0kpNnPnjJ0nqMLpKpJ4lj0J0k0Pj
7870iJ6omNPqoKMOj1JJ6qoOOooORj4J5rJL%k0J4oQj8J5mmNOqJJMkJnjLj3J2%M
7920CmQoJMMKmjqOoJ0kjmjMLJnkqJ1Oj0JOomlQJLj3Nj0jJ3kjOj1jJ5j5J2Nj0R
7970HjJoMllMLPnLQj2lnMlkJ5j5J5rn%KkJ2lq%l%LKj1J4Jk0J3kl%%QplMNK%mN
$$ y = [-2, 2, 3, -7, -2, -4, -6, 4, -4, 2, 0, 7, -4, -1, -3, 3, -2, -5, -14, 6, 0, -3, 2, -4, -3, 0, -3, 3, 3, -5, 12, 2, 7, 0, 5, 8, 0, 5, 8, -1, -3, 2, 14, 9, -2, 1, 6, -1, -1, -1, 1, 0, 3, 2, 0, 3, -20, -6, 3, -10, -7, -4, -6, -5, -1, -6, -2, -4, 3, 3, 8, -2, 4, -5, -1, 8, 12, 4, 0, 6, -12, -8, 9, 8, 1, 10, 5, 14, 7, 8, -2, 11, 6, 1, 7, 0, 7, 5, 2, 0, 3, -1, 4, 1, -6, -1, 4, 7, 1, -2, 4, 3, 2, -2, 3, 5, 8, -10, -4, 0, 7, 7, -3, 18, 5, 0, 11, 2, 4, 6, -2, 2, 2, 3, 4, 2, 5, 1, 2, 11, 2, 13, 3, 4, 3, 2, 5, -6, 0, 2, 1, 4, 1, 1, 6, -2, -9, -3, 3, 7, 1, -5, -13, 2, 3, 5, 15, 1, 4, -1, 3, -6, 1, 1, 4, 9, 0, 6, 6, 15, -3, 6, 18, 3, 8, 1, 9, 12, 5, 9, -6, 0, 2, 0, 0, -1, 5, -4, -3, -4, 2, 0, -10, -5, 0, -2, -5, 7, -1, -2, 5, 6, 3, 3, 4, -2, 5, 5, 9, 7, 0, -2, 14, 10, 3, 8, 16, 1, 3, 12, 3, 6, 10, 6, 8, 13, 4, 13, 4, 6, 4, 0, 10, 8, 1, 6, 1, 8, 3, 2, 12, 7, -1, 3, 6, -1, 1, -6, 8, 5, -5, 5, -15, -8, -9, 7, 1, -3, 2, 9, 1, -5, -3, 1, 7, -4, -3, 13, 5, -1, 5, 11, 5, -1, 5, 14, 0, 15, 6, 7, 10, 10, -10, 4, -2, 6, -12, 3, -1, -5, 0, 6, -2, -1, 0, 4, 2, 3, -2, -3, 0, -13, -1, -1, 3, -1, 7, 1, 2, 6, 10, 12, 8, 7, -1, 5, -1, 9, 7, 6, 2, 1, 5, 8, 9, 4, 2, -6, 5, 11, 1, 2, 8, 2, -2, -5, 3, 4, 7, -6, -1, -11, -12, 1, -1, -2, 4, -7, -8, 7, -8, 4, 9, -1, 8, 7, 8, 2, 6, 3, 0, 4, 7, 14, 9, 12, 20, 8, 5, 0, 4, 1, -1, 14, -1, 14, 5, 0, 0, 2, 0, 12, 9, 1, 1, -2, -2, 1, 3, -8, 6, 7, -13, 0, -2, -5, -5, -5, 3, -4, -7, -3, 2, 4, 4, 0, 5]
8022EnoJ8j1nJ6olOklkKJmPoNknLJ0mrjoJ2knmlLjlLNqMJJJmJ1nJ1okMJ3k1K2
8073B0j8jLkpOjOjJJMLj3KJ0j3OjoJ8pLj7%kJJ9Jj8lKKRnnnJ2%M%Mj5OnJ0npJ1
8122GJk%LKlKOj1j%NklqKlJ1j2J0oj5J2Pj3PNj0%RqPqRkpQNlNj4J3JrJ0jmoKj
8172cJ3j5QJ2j6JLlKLPj1jL%LnNj1
$$ y = [5, 0, -6, 12, 1, -4, 12, 6, 3, 9, 7, 4, 2, 4, 5, 1, 8, 2, 7, 5, 0, 3, 13, 9, 0, -1, -7, 5, 3, -2, -6, -9, -6, -7, -10, -7, -2, -10, -6, -5, -4, -3, -7, 4, -1, 10, 4, 2, 6, 19, -2, 20, 2, 1, 4, 2, -5, 1, 0, 6, 5, 6, 7, 11, 14, 1, 3, 13, 0, 6, 5, -1, 17, 10, 13, -4, -4, -6, -5, 14, 15, -3, -6, -4, -2, 7, 2, -3, -8, 4, 4, 8, 8, 12, -3, 3, -2, 8, 3, -4, 7, 8, 6, 6, 9, 11, 8, 10, 16, 5, 4, 4, 9, 7, 4, -4, -2, -5, 6, -6, 4, -2, -17, -5, 2, -11, -4, 1, -9, -9, 0, -8, -1, -9, 0, -2, -9, -1, 4, 1, 6, -8, 5, 6, -3, 7, 6, 2, -4, -2, -3, 10, -5, 3, 15, -1, 0, 3, 0, 2, 5, 12, 1, 0, 3, 3, 6, 1, 6, -5]
8191e
$$ Imaginary data points
##PAGE= N=2
##DATA TABLE= (X++(I..I)), XYDATA
0@%%%%%%%%%%%%%%%%%%%mJ2j6J6j6J6j6K4l2L2l3M1m8N6o4P2q0Q8j04J13j21J36
41G2j52J69j89K12k33K57k86L14l45L81m20M63n11N63o22O91p68Q56r61J086j236
62f59J424j667J990k447L147m377P145k4725j194K5575k8138N249L0682L57k4890
77a2528J5876K2082j2300j0446K1610j786k9691k035K1299j2083k0123J6705J7425
90A4005k0878j2281J9618N693j7383N235J8394q432j5253J0495P022j3864J135
103f494K1760J171j5511M590J0772j3934j4711Q986N519j3577m961R062j412o745
117a5485Q300J0094k286K274J1512m14r566L572Q079p486j0027L308J021j1048
131h152n304O135J875k180N483N976l423k097N521P30o165L30N792j987o515R54
$$ y = [0, 0, 0, 0, 0, 0, 0, 0, 0, 0, 0, 0, 0, 0, 0, 0, 0, 0, 0, 0, -4, 8, -8, 8, -8, 8, -8, 16, -16, 16, -17, 24, -24, 32, -32, 40, -40, 48, -56, 57, -64, 72, -80, 89, -100, 112, -121, 136, -150, 164, -181, 200, -220, 243, -268, 295, -327, 364, -404, 452, -509, 577, -659, 765, -902, 1088, -1359, 1788, -2589, 4556, -20169, -21363, 4212, -23926, -18677, 12005, 12362, -12528, 3348, 25430, 13130, 2684, 24294, 22508, -7183, -9218, 12081, -2, -20125, -3420, 14005, -6873, -19154, 464, 6157, -11226, -5991, 12403, 3971, -11282, -787, 6235, -7629, -6494, 15266, 16437, 926, 5516, 16288, 2354, -12357, -3371, 2148, -11429, -16390, -7328, -8740, -15485, -7185, 2909, 623, 2897, 14409, 13995, 4429, 8001, 16080, 8594, -1433, 1875, 2896, -8152, -13456, -7321, -5446, -7626, -2143, 3833, 410, -1687, 3834, 4564, -1601, -1271, 4521, 2534, -3981, -3027]
147c027M956l82k033K387K039k663k901J18j3j071Q14J938q24k446K62K086qJ05
165f63M518M491k096l818J339N05o010l559M278J040o193j160N551L9l222N009
181D9O291l458l206N048L9q300K98Q267k380q344L532O025o718n144Q226M459
197D684o233R36P746l670p907M985N463p600l551Q970Q93j0188P65R186l108p044
213e673O226N459q119l879P941L79p895L217Q354m416o155O228L449p950j153
228c987Q568j090q156K964O260n803n253O823L582o372k08O798j778n649M125
243H24M477n444k682O067J05p208N60N809k590m646L917L183m528j016N201m08
259A621m351K973M559l592l308M360J925m887j130M018r42m296R54K335k502j587
$$ y = [-3027, 1929, 1547, -486, 1901, 3940, 1277, -1624, -1506, -1519, -2590, -1776, 162, -662, -3108, -2846, -760, -768, -663, 3855, 8346, 6250, 2432, 3771, 4276, -1734, -5293, -1015, 25, -6168, -7328, -1777, -1738, -4960, 49, 6340, 2882, -324, 4724, 4763, -3537, -3239, 5028, 2648, -5696, -2164, 3861, -2857, -8001, 225, 4684, -1549, -613, 7133, 3463, -4444, 541, 6004, -1596, -5147, 3823, 4716, -5472, -4707, 4479, 1371, -5673, 553, 6012, -2107, -5986, 1955, 2334, -5561, -2344, 6010, 1594, -4561, 1667, 5116, -2834, -3987, 4581, 3491, -4665, -1701, 4559, -1244, -6497, 326, 3908, -2464, -2672, 4126, 2348, -3301, 824, 5301, -143, -2825, 3242, 3347, -3861, -3301, 2508, -82, -4728, -811, 2372, -2156, -3172, 2029, 1621, -2730, 243, 4802, 1210, -2098, 2262, 4187, -700, -1830, 2188, 1246, -3050, -2096, 239, -2263, -3850]
275c850L122J075k343R94L198p32j596K146J348k380p93J963p45k795L91J681
291F84j524j824J265J096j200j73J708L87p46R13J196q02q49J004P05j037q18
308a5N94M23p14q92l20N0j22n11o22J04Q62N88o8K37J026R02l2l29K73L96l35
329A495p42k51qo16p86r6Q5m86j99P38O55p6K50Q65L59l32o7J67l59n05Rk2n75
352d97m00K78J22m64l56K66N33J94r3J17P08P49k8n59M5O13J7q44n66L63L69n16
374E1q11O7N82q3n70L1N68J95n0L26K15k86M7M89k80q58J68P27m78r59K97N81
396c1n83n58M70K44m49J73P40J02j5P96N03l24J05N02n58q15L82K04j365q84P96
417e65J83j249k24J278N14m72K44P06N6nK63k74m73K87K01p96n11N73L69l14M7
$$ y = [-3850, -728, 347, -1996, -1002, 2196, 1464, -132, 2014, 3362, 982, 189, 2152, 1407, -1388, -997, 684, -840, -2664, -1399, -303, -1503, -1676, 32, 419, -327, 586, 1782, 980, 131, 1135, 1840, 803, -15, 579, 1002, 288, -604, -924, -874, -996, -1507, -2129, -2025, -1163, -575, -643, -406, 620, 1522, 1490, 1161, 1434, 1830, 1495, 753, 502, 494, -122, -908, -1004, -919, -1405, -1604, -866, -211, -287, -37, 828, 1187, 855, 788, 955, 596, 91, 100, 78, -497, -897, -619, -497, -961, -1317, -1051, -518, -324, -417, -300, 408, 1157, 1129, 570, 615, 1228, 1245, 401, -165, 198, 567, 51, -760, -693, -111, -194, -764, -733, -165, 30, -20, 306, 521, 235, 282, 771, 491, -367, -199, 528, 50, -909, -612, -31, -614, -1172, -702, -458, -907, -734, 6, 108, 93, 889, 1392, 1068, 1173, 1675, 1117, 302, 684, 888, -477, -1361, -565, -382, -1631, -1855, -577, -63, -535, -291, 415, 471, 466, 729, 455, -18, 269, 470, -326, -837, -264, 105, -209, -162]
438a62L30j06jK95k92n29M14M84o83n92O41M67k98K67Q09l9l41K55j45q91j45
459b62M85n12p96L23J94p97P0J289L06o42N96R39p49j007N22N69m95k08K91l80
479b64m03N56L20l67O75J287l89j305n5K75p70m06N56q3m98L83J04q76L27J790
499H57M07r34L23P09j102j053P49L40q00L40O86j281j049J356Q52j099M42J950
517A693o14k051N59J179j292n78K084N18j904j4J506p67j073J603Q73j905o16
534g99J345j004k029J399K105j308j188J737N39j771M26K100l83j062J288J45
550A540k646n34K286k28k060J035J836j547j582J575J038j001N94J463j173j458
566h62J161M82j665L76K177o77k079O76R35j593l56K156J97j825L90J091j450
$$ y = [-162, 168, 62, 61, 356, 64, -465, -51, 433, -250, -842, -201, 266, -32, 235, 1044, 1005, 664, 919, 774, -117, -262, 223, -289, -1085, -762, -568, -1365, -1295, -6, 300, -342, 254, 1193, 444, -563, -41, 528, 33, -175, 116, -264, -667, -111, 209, -158, 517, 1804, 1415, 110, 55, 330, -440, -846, -290, -373, -871, -488, -384, -1260, -933, 857, 1264, 330, 653, 1362, 260, -793, -44, 296, -504, -164, 522, -759, -1808, -452, 400, -699, -257, 1693, 1079, -972, -413, 766, -526, -1104, 980, 1498, -406, -420, 1086, 319, -754, 849, 1722, -183, -799, 546, -458, -2487, -1088, 1017, -291, -1479, 258, 797, -974, -548, 1552, 1169, 107, 1395, 1540, -1106, -1640, 646, 418, -1642, -607, 1229, -318, -1900, -325, 713, -288, 306, 1769, 596, -862, 299, 781, -884, -508, 1669, 992, -1087, -411, 524, -1069, -1425, 731, 928, -897, -507, 584, -866]
583h66p23K133P30j495N38J400j630j531J996J138k003k23J864j164k439J196
599a079J658j516k17K577m11k982R67K786j382j661K743J515l162j305K247k97
615D81k075J592J956k329j664K103M2k696J169L553r14k525J565J337k482o38
631a525L075N05k239N39J318k266j790K137J194j688K37J795j345k166J237J487
647E05j095J77K132l77k107L28J030j001kK044r0k014K62R75j715j058K222J129
665A345j818m27J296q02j314J424J340j024P4J599r30k132J063J767j287j002
681h28J690J78k248j22J703n42r67J614Q22j957n49J824j02j488J034J513j331
698B44j255J127L08j292N11J553o82j177Q10L27j269K05J456m51j156P87M68j441
$$ y = [-866, -1589, 544, 1274, -221, 317, 1717, 87, -1444, 552, 1690, -313, -536, 1328, 164, -2275, -1079, 579, -937, -1154, 1423, 1012, -1970, -1003, 1783, 401, -1260, 1483, 2998, -164, -1469, 778, 481, -1594, -2, 1954, -375, -2039, 64, 106, -2590, -1421, 2132, 1218, -1307, 258, 1595, -887, -1525, 1550, 2055, -184, 355, 1673, -593, -2383, -246, 948, -740, -503, 1292, -53, -2219, -982, 505, -590, -413, 1719, 1342, -765, -437, 593, -408, -410, 1634, 1544, -470, -208, 767, -948, -2006, 216, 1345, -473, -900, 396, -406, -1720, -296, 1044, 20, 94, 1693, 763, -1369, -306, 1461, 174, -828, 862, 1040, -1208, -1330, 373, -169, -1136, 478, 1300, -657, -1206, 618, 516, -972, 62, 1575, 244, -1011, 116, 424, -868, -357, 1196, 514, -663, 147, 474, -795, -590, 866, 415, -741, 46, 514, -927]
716i27j57J772J87j209M57P43j216o68J286K55j020O75J027j382j222J353P47
733G01j278K00J666n35j534P13P86j350k45J798j93j985M26J579r95j136J714
750C32J161j530n18J353m10j464R22J360j082q14J233P5j649J44J497m20r14J062
768C38O21j393l45J381n8j256M62J027q46q21R30M98o95K60Q58o27r44N55M11
787C56q78j66R96R2p80P3L62m13p1O41Nm70M53N37o28m84O27K44o82j73M08j65
809a16k69M17K51l13J44L65m59n23L34K08m55R2O31j23m59L42L39n15j70N96K6
830C43m61K68L67m97k86N21j14q32J59P15l07n17O30N53m83j83M77j88n77L78
850c4M15o03j87Q87J64q91k3P41k38p11K96M15l97q2N27j52n60L52M56o27m06
$$ y = [-927, -1084, 688, 875, -334, 123, 866, -350, -1018, 268, 523, -497, 178, 1205, -177, -1399, -46, 701, -577, -377, 1289, 754, -780, -67, 719, -631, -876, 922, 729, -1256, -830, 749, -246, -1382, 332, 1493, -37, -555, 798, 388, -1076, -154, 1206, 124, -690, 543, 618, -1031, -887, 610, 190, -724, 338, 959, -434, -779, 602, 544, -712, -250, 777, -69, -890, 40, 538, -157, 103, 961, 334, -610, -55, 356, -522, -688, 308, 400, -380, -307, 55, -358, -429, 212, 217, -253, 200, 737, 109, -375, 252, 496, -186, -359, 49, -116, -385, 32, 283, -30, 114, 479, 20, -503, -169, 39, -416, -324, 307, 184, -275, 67, 406, -109, -279, 317, 343, -118, 150, 517, 20, -266, 255, 141, -691, -532, 183, -124, -641, -11, 542, 59, -124, 353, 165, -412, -34, 381, -222, -409, 478, 642, -249, -272, 469, 231, -480, -184, 231, -166, -248, 279, 127, -433, -81, 375, -252, -658]
871f58P43L76n96oP30j19o34J74K94n15l00N34J35m39J54M87k61l63L25J40m96
892b95k2N38l1m51J93M70k53m14J85J75k23J5K75q2j11L06J00m63j94L81P1m32
914b62p9M07J39k23n8J08j3p6j0o1k8J54J60p1p0J18P3j25j04%K8mj5poMk3m8
942i2l3j2rL2R3P6QL9N5Pk7m5r1k3J07O8j72j36K03J32k61k96K28K57k15k13K09
969a11K62j04o9J09J1m7J28M7k65n3L14nm14n2L64o2l77O0K91j40j42K90J23l20
993a62P9L97j67m08K91M20l91l50M56K07n89q8N99p7o21K17N05l50m40M62K99
1014B89m88j8N72j86n22M24M86o25m00P18K26q43j03P78o7o54K69M82m89k64O69
1035B54Q4p11K31P79m35q04N54O15o77m44P62J94p75O3P13l16n82N88M57p65k91
$$ y = [-658, 85, 461, -135, -141, 589, 470, -164, 10, 304, -211, -511, 23, 158, -281, -127, 360, 99, -264, 61, 201, -295, -317, 221, 190, -261, -68, 402, 149, -265, -80, 95, -128, -113, 162, 80, -31, 275, 375, -88, -282, 99, 170, -262, -341, 66, 205, -18, -76, 32, 19, -57, -67, -128, -156, -2, 158, 87, 17, 135, 208, 83, -21, -21, 7, 3, -12, -19, -25, -21, -44, -92, -125, -137, -146, -114, -21, 55, 63, 102, 157, 164, 137, 92, 1, -22, 85, 153, -19, -155, 48, 180, -81, -377, -149, 108, -107, -320, -111, 151, 47, -22, 87, 98, 51, 179, 226, -39, -92, 222, 217, -197, -249, 115, 53, -324, -264, 27, -113, -255, 35, 158, -162, -83, 314, 147, -261, 30, 450, 59, -291, 165, 372, -217, -305, 294, 217, -404, -187, 318, -32, -472, -10, 289, -199, -217, 355, 169, -353, 71, 557, -68, -468, 250, 476, -367, -470, 308, 241, -413, -144, 338, -151, -415, 254, 338, -373, -142, 637, 202, -602, -48, 567, -110, -554, 208, 402, -373, -310, 403, 87, -495, 93, 550, -215, -506]
1056e06Q27N4p88K58Q43m27p17N64M30q28k79R00J03q95J23P41m21o71O03N50
1076D64o51j74Q59j8r23K19R08l69q30N18O07p17n53O84K83o60Q0P07l27o98M74
1097a17N79o46l86Q98L37q99j64Q42l5p76K98O91m97n63N62K70q10r1Q65j46q87
1118f75L28P92n28n77Q69N59q78k62R34r4j024L03R30n25p48O63M22r59j76J093
1138D47j08j018N23R62q61q92J038O58j096k35J189r3j138M61R50p76o27J151
1156E35L22j420j18J370l48j374O79J216r28r24J171N18j240J6J378l68j257P52
1174b0R76j170p47J359L94j452O1J433m71j259Q36J018j163o78J289K24j383J80
1192e73J342n54j124R26Q62j190m51J412J85j371K24J201o29j117P69P24r90l24
$$ y = [-506, 321, 375, -413, -155, 688, 261, -456, 108, 538, -290, -569, 331, 434, -461, -338, 403, -18, -689, -86, 464, -187, -361, 498, 480, -443, -224, 684, 315, -515, 3, 610, -107, -660, 24, 307, -353, -273, 434, 107, -591, -117, 462, -184, -570, 328, 665, -234, -398, 444, 409, -367, -69, 622, 125, -438, 124, 394, -416, -507, 358, 212, -675, -347, 445, -83, -660, 209, 768, -110, -372, 562, 468, -556, -253, 677, 152, -596, 67, 489, -470, -646, 447, 339, -679, -156, 806, -55, -947, 91, 749, -347, -582, 607, 514, -624, -163, 787, 11, -616, 535, 857, -563, -681, 689, 341, -1033, -354, 862, -66, -990, 181, 699, -541, -525, 853, 485, -772, -20, 956, -214, -961, 398, 792, -660, -599, 834, 363, -896, -60, 958, -205, -883, 406, 630, -753, -573, 769, 215, -909, 17, 879, -311, -762, 650, 835, -536, -312, 889, 260, -857, -88, 636, -354, -678]
1210f78J090o8j068M65J017p23p70R91N26j141l27J100Or48L42Q23n56o21P12
1229A72K75q75NR65k12q89L90P18o36n94O97M11o86o1P85r3o84K87N40n05m74
1250d64N63K51o52r1O91q1o46K72O11l81n16M97M05n46k70N67J26n39J7M66k41
1271C9m60L40L86m39k25O20J70o61j23O14k4o14J71N87k04m32L55K45m84j45N11
1292B27m0n90J88N69l35m96M80M17n24k52N88R7o03J16N83k61m72M11L19n80k42
1313d00N83J3o12K04N72l43m94N14L59o08j92O89K8o19K01N62l41m04N01J96o38
1334b29q4O28j74o55L27O05m54m41N28K94n63n0N98j25m91L27M04m97l17N86J49
1355C66o40RO01j61n49L09M06m16k69M64R6n18M8M71j65l85L30L10l56j39M15
$$ y = [-678, 412, 344, -724, -259, 758, 35, -735, 256, 782, -359, -686, 414, 420, -528, -186, 637, 81, -540, 172, 447, -428, -423, 542, 330, -559, -169, 549, -87, -681, 16, 427, -259, -320, 465, 372, -312, -25, 515, 10, -464, 99, 350, -302, -393, 298, 217, -429, -157, 454, 73, -443, 54, 459, -87, -357, 210, 336, -203, -186, 280, 39, -421, -81, 305, -134, -359, 261, 431, -230, -353, 261, 237, -377, -206, 381, 177, -255, 100, 345, -139, -284, 227, 187, -403, -215, 354, 19, -477, 3, 420, -104, -356, 232, 329, -274, -158, 425, 164, -308, 103, 422, -158, -400, 183, 196, -416, -212, 360, 17, -477, 37, 396, -212, -404, 285, 313, -306, -105, 457, 116, -288, 213, 409, -229, -313, 315, 141, -514, -187, 418, -36, -477, 51, 345, -218, -268, 330, 205, -286, 41, 445, -52, -369, 217, 366, -274, -265, 336, 175, -374, -65, 341, -75, -344, 120, 216, -302, -254, 217, 52, -333, -3, 307, -49, -188, 227]
1376B27M5m59J04L98k45l73K80K62l44j61L65N2l10P9K87j91k10K58J08l21l6
1397a85L38j5l09P6K73j09j89J94J07j84j8J73q5k13R2J28j97j25J86J07j72J5
1419a12K08jj43N8J16p7j18J21N6j09j8R6l8j20M5O1q6m6J23N6j17k2J13oj19
1444g9rQ3K6l7M0M7j7J8M4n3j11K8O0p1q6N9Q1m5q4M2N0l6j0N3J2OM7M6n5n0L0
1475B9jq4k7Q9Mk5L2N6j1n2J8Nn7k4L1Pl1RK7j0l3L9J6l6J2R8K7o1jN4l1r4l5
1508f0n%j1K1OJ2N5K5n3m4N4J3n1k0P3L1j2j1K9j0j1J7pm1K3J7k2n8rpk7n3M1
1541i5M0J4L2Q4M6j4Kqk8n6j8j2k4pJ5j1k4K5L8k5l7N4M6k5k9K9K1k6j6mlRJ9
1574A2K2j4K2L5k7o2l3J0kn0RM7K9jK3K8JNJ4j5l4rKm4l6K6K0k8lM8NqJ0N6kj9
$$ y = [227, 272, -187, -83, 315, 70, -303, -23, 239, -105, -266, 99, 151, -159, -80, 207, 16, -194, 64, 172, -149, -185, 153, 138, -171, -95, 178, 69, -120, 74, 181, -3, -21, 152, 67, -146, -54, 74, -123, -248, -62, 45, -127, -112, 96, 95, -48, 10, 126, 49, -69, 52, 108, -1, -19, 77, 39, -81, -36, 25, -61, -107, 16, 72, -45, -67, 46, 40, -79, -88, -5, 21, -16, 24, 71, 54, 72, 116, 63, -48, -20, 40, -31, -117, -58, 23, -22, -106, -64, -14, -50, -60, -7, 5, 11, 58, 104, 49, -1, 29, 28, -56, -83, 6, 10, -15, 17, 73, 62, 10, 28, 33, -24, -48, -17, -10, -41, -32, -5, -15, -48, -9, 7, -29, -17, 81, 108, 47, 46, 100, 69, -25, -60, -65, -65, -76, -55, -49, -37, 18, 43, -10, -54, 0, 13, -38, -58, 15, 46, 34, 23, 52, 42, 31, 48, 41, 0, 23, 40, 18, -40, -49, -56, -83, -136, -95, -55, -41, -9, 75, 121, 107, 109, 101, 73, 17, -1, -13, -37, -44, -29, -40, -64, -39, -1, -26, -63, -9, 37, 12, -17, 12, 33, 7, -9, -13, -16, -7, 12, 34, 20, 42, 77, 50, -12, -45, -35, -37, -87, -78, -31, -2, -3, 20, 48, 49, 54, 68, 53, 19, 10, 12, -32, -68, -42, -22, -50, -53, -5, 0, -8, 2, 58, 56, 37]
1610C7j0j0n2k7Jj1J0N3K9l1mM2J7l9pM0J9n0j9K7j4JL0ok5LK7l2l9L1M2l6n2
1643e5LM6l6%N0L0oJ7J0k6m3L5K8n3l9K9k5n1J0N0Kj5L7K6n5rO8J1k1J2M6n4k8
1676fK1Jm0J7M3j7m7l2N2j1l0L3M4k4j9K4k2k0M9L1k9k3L5rm4j6M9Rl4OJ2k7j9
1709d3K9KqJK3j3m1L8M0k0qM0Om4rJ9Ok7L0Lk4k5K0J7k7QL2pm0nJ9j0j8L6L2j3
1745A9k9NJ1oK1J6Nj7k2j2k0j2J3J3nj4J3J8qj4L0K2Mj5Nrl1J5L1pj0J4jl3pL6
1781A9Lj3rJ8l5j8RK3j2j2M7mj8%K4j0j9K3Om8JL0k8rRL4j4j2J3Qj8j0L9j4l2
1816b9J0L5m3JL9K4k6oM9k4l4J3K1k6j7L1j6n0OM0pl1K5L7k6k8L6J6l5PL7ll4
1849hlL2k8k5K7J3l4pL9m0j3K3L4j7k7L7K3l5J6K0J2l8J7J2j6l5K3K0m9OL3ll0
$$ y = [37, 27, 17, -35, -62, -61, -72, -62, -9, 20, -11, -15, 27, 44, 5, -2, 38, 57, 7, -12, 15, 1, 2, 32, 26, 1, 4, 31, -1, -40, -9, 33, -3, -55, -52, -6, -42, -42, 8, 38, 32, 49, 59, 33, -10, 25, 53, 0, -39, -10, -35, -86, -76, -26, -24, -39, -2, 24, -31, -40, 28, 39, 18, 30, 76, 22, -6, 15, 16, -24, -7, 36, 19, -28, -60, -8, -19, -49, -16, 28, 4, -15, 9, -13, -33, 16, 47, 18, -5, 30, 21, -23, -39, 10, 19, -15, -9, 3, -24, -43, -14, -12, -20, -19, 4, -9, -50, -12, 28, 8, 0, 40, 46, 2, -7, 12, 18, -9, 21, 24, 0, -25, -5, 12, -15, -7, 25, 18, -22, -27, -8, -18, -36, 0, 32, 19, -10, -5, 6, 0, 21, 37, 42, 25, 3, -9, -29, -41, -28, -15, -20, -34, -21, -3, -11, -25, 5, 27, 31, 16, 21, 12, -19, -4, 27, 20, 10, 24, 23, -10, -17, 19, 22, 9, 0, 18, -17, -35, -26, -3, -15, -27, 20, 16, -2, -2, 22, 12, -7, 16, 22, -26, -25, 5, -23, -32, -23, 11, -3, -15, -2, 6, -12, -22, 17, 3, -29, -19, 16, -27, -26, 13, 37, 11, 5, 54, 30, -4, 9, 30, 4, -13, 18, 2, -48, -42, -2, -9, -40, -15, 22, -4, -32, 4, 20, -15, -8, 29, 26, -8, -11, 21, -7, -32, -5, 8, -26, -33, 6, -34, -47, -24, 10, -7, -34, 3, 26, -9, 7, 27, 39, 1, 18, 30, 14, -21, 2, 22, -27, -21, 12, 9, -21]
1882b1J3J7j4j6K0J5k2lK1rk1J9K3j9l9K7Qj7jL5mk7OJ3mj8K7Jok8L8ql6J5J6
1917Aj8qK9J3k5j1L7Pj1JJ1j6j9K0rj1jJ9pl4K0JmpOJ4Jj8J5qJ1kK0j7qJ6Oj8
1955dj7K3mj8LJ0pjJ6PqJ2KJ7k9KNLj1qPj1jJ2j2Mj1J2KrmJ0Q%j0mJ6j5J5lpJ3
1997EKqpmJ5ok1NJ4Lj7J8JqOJ0qmMJ1JpoJ0JlJ1Qk5%Njqj6J0%q%p%J3J5j0qJ2
2042bJ4oj3RPj0j4Rn%kj0%OJ3j5JJ2K4nj4J7OKj4PmLj0j5oLJ7j7KrQPjMkOm%J9
2087A8j6kNj2J2%j5pJ0Nk6j4K3J2npK7%J2LJqJ5Rj2k5J2Kk9l3M0J5j2l0K9Pj4
2124a0J9Rj0mJ7mk9%L0j8j6K2Mj3k9K4Qk5qK6Jk2jM2j1mL5Ml1LK6l8l1K0K8l1
2160a7m6L8K4j2ML2Mj1J5J2m7j2O6qo7j4N3l0n3L7N5j9l2L0J1o7J9O3j6n9M8M1
$$ y = [-21, -8, 9, -5, -21, -1, 14, -8, -11, 10, 1, -20, -1, 22, 3, -36, -9, -1, -18, -19, 16, 12, -15, -9, 4, 0, -18, 9, 10, 4, -24, 14, 6, -30, -15, 1, -17, -25, 4, 17, -8, -19, 18, 25, 14, 15, 26, 10, -9, 11, 2, -9, -10, 9, 2, -32, -12, -11, -15, -22, -16, -2, -1, -19, -4, -12, -1, -3, 17, 0, -8, 8, 14, -4, -21, 2, -2, -20, -17, -7, -14, -15, 1, 8, 0, 12, 14, 31, 2, 4, 9, 12, 1, -7, 0, -11, -12, 0, -12, -8, -19, -7, -5, -14, -18, -8, 0, 0, -10, -14, 2, -13, 2, -1, -8, 5, 7, -1, -8, -12, 3, -3, -24, -19, -5, -2, -19, -1, 0, -8, -2, 8, 0, -4, 0, 11, 12, 5, -1, 9, 10, 7, 18, 26, 1, 1, 6, 5, -3, -19, -9, -9, -17, -17, -24, -24, -11, 4, -6, -14, -2, 12, 6, -7, 2, 9, -1, -15, -6, -11, -11, -13, -23, -23, -17, -4, -19, -18, -6, 18, 13, -1, 16, 22, 24, 10, 17, 13, 16, 6, -9, -15, -12, 5, -12, -10, -19, -11, -4, -5, -1, -3, 3, -1, -1, 18, 2, 0, 5, -7, 5, 5, -10, -17, -7, -2, -28, -42, -19, -7, -12, -19, 8, 8, 20, 23, 24, 16, 31, 40, 28, 3, 15, 17, -12, -45, -5, 10, -2, -32, -3, 4, -10, 9, 18, 8, 4, 21, 17, -12, -12, 18, 0, -16, 6, 10, -3, -32, -8, 0, -25, -33, -7, -6, -28, -29, 13, 2, -2, 33, 37, 6, 9, 35, -3, -34, -14, 14, -17, -63, -25, -1, -13, -9, 23, 27, 16, 31, 43, -4, -16, 50, 42, -25, -39, 14, -16, -69, -32, 23, 4, -28, 2, 13, -54, -35, 28, 12, -47, 1, 42]
2192D2m9m3Q3L4p5kO5k9r2L1O0m9m2P8L2r3pR8j0o0P4P7q1q0O7K7j14j7J11j5
2222B1r4L3P0n8l3R3L2r9MQ9m7j16Q7J05o5q1P5K9j04KJ06j8p0N0N0j07o2J18
2250A0K7r8K1J28m9r7O4Q0o8l3R2lj24j1R0m6o6J07O9j06p7J01Rj12M9J50n5j33
2278h1N9O6r5n2J38L3j07J2Q7o5q3R7Q2r4p1J02Jj31QJ49pq8O6M9j03n1J03M7
2306G1q1J6R2o3j31M9J14o8n2J01J4j18k9R2No8O4O8q1p7P6K0o9M9J17l4j30L7
2334a6M5r9l6J35O1j08l5P8l6r1P8R7m9n6J06j7j40K0J68l4j18M9R2j17j17J18
2360b2Q3q1LJ11o0j50O9J15q7n3J52N1j85l5J33lj29P1J06j03j10J20N0j20J4
2385f0J57k9j46M8J05r6o8J48O3j46m8J40m6j36O4J34p0q5Q4L1j20J7J41k4j09
$$ y = [42, -7, -50, 33, 67, -8, -10, 55, 26, -66, -35, 25, -24, -66, 12, 44, -49, -56, 42, 32, -28, 46, 123, 42, -38, 29, 56, -58, -75, 36, 21, -73, -40, 30, -28, -61, 32, 64, -35, -31, 58, 11, -105, -18, 87, 22, -59, 16, 45, -59, -57, 49, 31, -39, 11, 61, -46, -108, 10, 37, -61, -40, 88, 39, -58, 6, 86, 18, -15, 77, 74, -50, -61, 29, -17, -83, 24, 93, -13, -90, 11, 20, -92, -43, 107, 52, -81, -22, 44, -51, -103, 35, 68, -39, -27, 60, -5, -88, 9, 91, -3, -74, 28, 29, -102, -94, 55, 48, -40, 26, 75, -28, -79, 24, 71, -10, 6, 98, 35, -96, -47, 67, -1, -53, 48, 62, -56, -85, 7, 12, -56, 8, 76, -5, -82, -6, 14, -55, -6, 111, 77, -53, -16, 29, -70, -106, 29, 90, -18, -53, 25, -11, -102, -24, 73, 24, -32, 74, 57, -83, -63, 105, 71, -47, 2, 94, -23, -140, -22, 61, -20, -17, 94, 34, -116, -47, 68, -19, -72, 80, 131, -54, -89, 44, 41, -88, -17, 89, -14, -124, -4, 46, -74, -60, 97, 68, -78, -30, 75, -21, -89, 59, 122, -24, -72, 68, 22, -114, -50, 84, 14, -71, 13, 44, -76, -59, 82, 58, -51]
2410e1P7R1j49p3J48N4j33PR4n0j14N7P2q1qJ10j5j17%J37m3q7J05Q7j06o9R0
2437C3Kq9L3R0n9q2N7L7r1rJ24Mr7K7Q8o5o9J07O9r8m0P5j1j01K9P4m0n8P1K1
2467C2r4mR2Nq4L7Q4m9q6N3O7o7j4O3pn6%O7l9n3P5K9q3l3P6J4n2J0O5pn5J3N0
2500D9m2k7M9L4p9kM5k9m5L7N9n8k0O3J2p2%O0Jo2L0Oj9k8L2Mk3J1O0l4n4M8N4
2533F0o3l8N0K5m8%K6j7%K6Km7RM6j0m9J9M9k7n3L6K3j7JK6j1k9J5J9k4l3M1%
2566Gl8nL2pk9L3L6l2qK3J1j9j9J9%rOOj4j3L4j3k0J6L7ll7RK0j2j7PKjJJ1mj5
2604eJ6J1j7j8K2K3l8j5K1J1j1j0J4Mj0lJ4pj3J9j1nnPKj5J7K4k5pL0K1m4KQJ2
2640A9j7k0K1nrJ5j6KPN4k4n0J6L3rm2K5K1j0j9jKrK4J0m3J5K4Nl9j7O3j6m0J
$$ y = [-51, 26, 117, -32, -105, 43, 97, -36, -29, 65, 15, -99, -42, 30, -51, -59, 51, 36, -81, -81, 56, 13, -74, 31, 118, 12, -57, 33, 35, -54, -21, 69, 10, -72, -15, 22, -69, -78, 46, 50, -47, -20, 68, 3, -66, 41, 110, 12, -28, 47, 36, -65, -36, 38, -2, -60, 11, 32, -62, -66, 26, 31, -53, -16, 68, 19, -67, -14, 53, -14, -28, 35, 28, -28, -28, 39, 0, -53, 22, 51, -32, -65, 11, 25, -27, -17, 48, 41, -14, -1, 49, 7, -20, 29, 63, -16, -18, 27, -2, -47, -10, 49, -9, -29, 34, 46, -26, -26, 34, 35, -27, 3, 9, -10, -38, -6, -2, -25, -14, 46, 12, -42, 6, 60, -3, -41, 9, 34, -14, -14, 12, -5, -5, 21, 23, -24, -15, 31, 21, -28, -9, 40, 13, -40, -4, 19, 2, 3, 29, 18, -11, 4, 23, -1, -34, 7, 7, -31, -36, -4, -11, -40, -7, 29, -3, -11, 12, 23, 4, -15, 4, 4, -5, 1, 7, -7, -20, 14, 1, -19, -3, 34, 31, -6, 3, 23, 11, -6, 1, 3, 2, 3, 14, 10, -5, 11, 22, 5, -13, 9, 32, -6, -21, 0, 11, 0, -10, 4, 8, -2, -5, 9, 2, -11, 8, -3, -8, -13, -6, -4, -19, -2, 22, -3, -10, 20, 41, -3, -1, 7, 19, 2, -18, 3, -2, -11, 4, -12, -10, -3, 51, 27, -23, -7, 26, 17, -25, 0, 21, 11, -8, -9, -7, -16, 8, 18, -25, -10, 14, 19, -20, -37, 26, 10, -30, -29]
2675b9L3mj4L3J0k2%J0ml0J7K9k9oK3Ll2KM5j1k9J1K5k1k4J7Mj7PJ1rk7K6K1k6
2710gj1N2mn1nM2ol2J8J7k9NQkl9M4M4m1l6K9M0n3j6N8J3l9PJ2j7k2L6L4m6k3
2744b0L9%o3OO2lm6K9L9n9m2O5L3n1PM8qp3K1M6m2j5O2Jr2kP8k5n6N1O4m3o3M3
2778iK9m2J1N4%n3L1K5p2nO8K6q2nN2k9n2L5N7l8l0M5j3o3K6O6k4l2M4L9q9k8
2810e8R3J1o2J3O2p0m9L1M6m3MN0k6n2L0L1l1k0Q9M9j08l7O8Pm8K7O0l5m5J3J5
2841A5o9J1J01k4q4K9O4n3o2N9P2l8k9M2j4n9J3N4mm1K8K5p0l4M4N2l9QM8l4o8
2872e7K6O6j5m0N0J9o6l5N6J9l3L5K9m0o2L9M7o2j1Q1J3r3j4O0nl2M5M1n4k7K0
2903@po6M3Q6m8o4N4K7o5j5J05K0q3J3M2o5m7O5M6n2j9P5l1p9K2R2l5l6Q2J6j05
$$ y = [-29, 4, 0, -14, 19, 29, 7, 7, 17, 13, -17, 0, 29, 0, -6, 17, 20, -12, -10, 35, 24, -5, 6, 31, 10, -14, 3, 7, -10, -3, 8, -1, -28, -2, 19, -7, -18, 34, 30, -21, -26, 16, 10, -22, -4, 13, -16, -11, -3, -5, -44, 0, 44, 3, -33, -4, 36, -17, -33, 25, 38, -1, 6, 18, 1, -21, 15, 49, 3, -20, 19, 19, -44, -38, 24, 21, -25, 4, 43, -16, -58, 7, 40, -11, -4, 44, 36, -37, -16, 30, -12, -27, 35, 36, -56, -58, 20, -5, -61, -10, 54, 11, -52, -9, 20, -22, -11, 43, 43, -10, 21, 46, -26, -31, 37, 63, -19, -24, 28, -1, -53, -18, 39, 1, -29, 16, 3, -60, -34, 32, 8, -24, 20, 59, -30, -58, 35, 46, -16, -3, 59, -11, -60, -29, 17, -26, -22, 28, 2, -50, -20, 11, -20, -40, 49, 98, -10, -47, 21, 28, -20, 7, 67, 32, -13, 0, 15, -54, -43, 58, 34, -50, -21, 43, -10, -72, -13, 59, 21, -8, 34, 20, -39, -26, 28, 24, -17, 11, 36, -34, -68, -24, 28, -11, -3, 45, 11, -57, -31, 35, 20, -20, 30, 49, -17, -52, 4, 23, -10, 25, 54, 14, -48, -9, 38, -24, -35, 46, 59, -34, -48, 12, 7, -25, 20, 61, 7, -20, 0, -7, -73, -30, 56, 8, -56, -2, 25, -40, -55, 50, 70, -13, 0, 42, -23, -70, -5, 41, -11, -30, 45, 14, -65, -43, 49, 14, -22, 60, 76, -29]
2934b9k9P8On8K2P7o6n1M9L3o8K4Q2l8r7K7O6o0l2R0M5p8l3P7k5n0M9M0n4k9N6
2965B4k3q5L1J02l2n0M0M0o1j6O3Nl3J4K8n4m0M3M9o5MN9l1m5J7M1k1k5L7K2n7
2996a9j8K5mj3L5K4l2j4L4Mn3RN6rn0nK0Nk9L1L3j9%kqk3L2J9k2qOLj4k6L4J3
3032A5j1J4Oj6j3OPLj2kpj5KJ1J6mj0K3mk3pK7j0j5RK9k5j5J1J2%pRJpNJ6l0O
3071eK6j1k6RJ2kj1J1L3l0kjOj7J1K7k3k7K2%rpK4Mk8OJ3mrJ6%j9mK4j1j1J0J8
3109A5Jk0J2J2k6%J9ok1J5KkmRlqORlk0K3J7j9qMJ8j5j9J3j7K5j3k0OJ4Lj8kM
3148a7J4Kj0MPjOrJ5lKroJ2Loj4JNNjj5J0MlNOJ1rmRkpj5RJ0Lj6LMJ0j2%j3J9
3193GPj9j6J4Onj6J5%qJ8%j4J3Qj2PPkj1KJ5pokkJlQKpMJ1k9RQJ6k1KK1nj4jJ9
$$ y = [-29, -58, 20, 26, -32, -10, 67, 1, -50, -1, 32, -36, -12, 70, 32, -65, -38, 28, -32, -64, 26, 71, -7, -40, 37, 12, -38, 11, 51, -3, -32, 24, 1, -84, -53, 49, 17, -33, 7, 47, -14, -30, 33, 38, 5, 19, 47, -7, -47, -4, 45, -20, -16, 43, 12, -33, -16, 25, 4, -21, 16, 38, -19, -37, -12, -16, -29, 6, 30, -2, -16, 18, 22, -31, -22, 34, 25, -25, -30, -10, -5, -34, -3, 30, 11, 11, 9, 1, -22, 10, 29, 7, -1, 5, 8, -6, -32, 2, 15, 4, 18, 24, 8, -5, 1, 8, 11, -1, -3, -10, -25, -23, -12, 4, 0, -10, 13, 9, -14, -21, 6, -4, -19, -10, 19, -6, -21, -10, 2, 2, -5, 4, 5, -2, 3, 19, -11, -5, 21, 10, -16, -7, 5, 3, -8, 3, 36, 6, 4, 3, 9, -8, 3, 30, 7, -20, 2, 2, -7, -14, 10, 14, -14, -8, 5, 1, -8, 8, 8, -11, -15, 9, -2, -13, -3, 15, 16, -4, 8, 20, -6, -6, 13, 7, -14, 1, 3, 1, -3, 6, 3, -5, 1, 10, 7, -13, 10, 27, 8, 0, 4, 22, 7, -12, 1, -16, 9, -4, -24, -18, -4, -1, -19, -21, -17, -3, -1, -11, -7, 0, -1, 5, -4, 11, 8, 10, 1, -5, 7, 10, 4, -10, -9, -4, 1, 0, -15, -5, -1, -4, 1, 7, 18, 9, 5, 14, 12, 5, -10, -1, 9, 12, -4, -1, 3, 13, 1, 1, -12, 7, 14, -5, -21, -7, -1, -6, -22, -7, -7, -15, 3, 3, -11, 2, 10, -2, 5, 12, 10, -1, 1, 16, 9, 3, 1, -1, 0, -3, 5, 7, 0, 4, 15, -14, -5, 3, 19, -2, 0, 21, 16, 2, 1, 20]
3237B0qk1J0PLj6Okk7K6J0k0mJ8K1l4%K0Oj0mPj3J1J2mj9J3J7j1l6J9Pj8mK6m
3274DnJ2oOj1K7%k2oK3j3k4K4Jpk2J2J1k1pK9kj8%J6j7nK9Jk7K2K4ol0jM8l1j8
3312a0J4J6j6j9J6mqJ6J6l3rL5J3k5j0L0ll0oK2oqK1J4l1lK0ml4K5K2k0l0J3K0
3347Dl2lN4km0J7L1k2k0K7J9l4qM8l0m9L6M1l0j3K7J0n5MK9Kk3J1K2l5j0L6Lk3
3381hJ1M9k3m6J7K2k3l3M9%m7OL1j3j7K3K0l0j5L7Lm6J4M9j4k8J6K8l4k8M2K8
3413D0m2%K5j7l4J9K8k8j6M6lm3QL9Ok5qM2k0m2K4J7k2lJ5Lm0J6K7k4k4L9L2m1
3447fj9L1Ql0J2K2qk9L1Pj4nL5km4K2J5l2l3M9Rk2l0M5Qn6K6K9j1l6M4J1n0K2
3481aL2on4J9L5l3m7M8M2n5j0M7qn0J6L8k1k8M5K5n4ON4ko2K5M6l8k7L2K1m0j0
$$ y = [20, 12, -9, 1, 8, 11, -5, 1, -1, -28, -2, 8, -12, -16, 2, 23, -11, -11, 9, 15, 5, 1, 8, -5, 6, 18, 14, -5, 8, 25, 14, -22, -3, 4, -14, -18, 8, 4, -1, 11, 5, 11, 0, 27, 27, 5, -1, 22, 9, -15, 9, 10, 3, -19, -7, 4, -17, -24, 5, 3, -15, -15, 1, -16, -21, 8, 9, -18, 4, 28, 22, -8, -9, 39, 8, -10, 4, 20, 4, -15, 1, -3, -11, 5, 21, -12, -21, 14, 27, 2, -8, 22, 19, -11, -17, 5, -1, -9, 12, 26, -5, -8, 12, 8, -26, -1, 21, 1, -29, -16, 4, -28, -31, 23, 21, -19, -2, 29, 7, -13, 14, 33, -1, -9, 39, 9, -40, -4, 37, 7, -6, 21, 31, -24, -20, 9, 11, -12, -1, 21, -14, -24, 12, 15, -8, 3, 52, 29, -17, 0, 22, -1, -34, 15, 15, -32, -26, 5, -8, -25, -2, 18, -12, -27, 10, 13, -33, -19, 30, 16, -12, 4, 32, -2, -30, 12, 40, -2, -2, 23, 6, -28, -9, 19, -9, -25, 21, 18, -25, -17, 22, 28, 3, -5, 37, 17, -25, -1, 16, -6, -9, 6, 9, -31, -15, 12, -12, -36, 3, 35, -6, -25, 6, 14, -16, -4, 18, 10, -19, 12, 19, 5, 0, 35, 33, -11, 11, 26, -6, -39, 10, 19, -3, -33, 12, 20, -36, -10, 19, 8, -28, 16, 27, -23, -1, 31, 25, -29, -10, 25, -8, -55, -7, 35, -20, -30, 17, 9, -41, -25, 13, -8, -36, 9, 34, -20, -14, 40, 38, -24, 1, 47, 9, -18, 14, 35, -5, -15]
3514a5M0ln0J8L1m1j3M2J2m6LM8j6l9L7K0k3k4L2Qm7J7K2j2k7L2Lk6rL0Pl9J8
3547a0K9j9k5K4J8j2nJ9Nk0KJ7j6k1L1Ol5j7M7j0k3OJ3kk5K4K1j9j0K0qk2J7J4
3581A4k0rL0rj4rK6jj2lJ2jj5J4Kj6NRQk5J4J9roMJ0kpkjMj5J0Kj8KJ9rpJ7mk1
3623a4PJ1Lj6lJ2Nj1J9Ppk5J8Nj5nLmJJ0j0pkK5mjmK3nl%J0j6pJ3jj0KJ8k2mJ2
3665HPj4j1J3pj2JMOKNRj6LK7j8oKJ1pj1%JrkJ7j0jJ6Oj4oK5%j9J0LjqrJ6%j0
3708AQplJ2qj1J6j5J1nj3QMj1J0NrQJ0lj1Nl%mjM%oK1rmj3J3jrPpJ4kJ2j0MRk0
3753cJ2kJ1mJpknJj0NPj4jPjMmQpOlKnnQMj1J0LlljPjj0J2Lj7PR%j6J2OkjKJN
3803A5qJ0j3mNjqRRj0j2J4j5JlJJ0mj3K3mkMpkJ2j2J1lkmJ1pj2Nj2J2J0mkj1J1
$$ y = [-15, 25, 22, -28, -10, 21, -20, -33, 9, 21, -25, -22, 26, 10, -29, 8, 28, 5, -19, 13, 21, -26, -9, 13, 1, -26, 6, 9, -17, -26, 4, 11, -28, -10, 19, 0, -25, -1, 17, 5, 0, 19, 24, 4, 6, 23, 7, -14, 17, 23, -12, -29, 18, 8, -15, -9, 4, 2, -23, 1, 22, 3, -7, 13, 5, -17, 0, 14, -6, -15, 15, 6, -8, -17, 9, 8, -4, -7, 5, 4, -11, 3, 5, -11, -6, 3, 11, -14, 0, 19, 10, 4, 8, 18, 16, 9, 7, 6, 10, -5, 5, 7, -11, -9, 10, 1, -6, 11, 7, -14, -7, 4, 7, -9, -12, 0, 5, -6, 13, 20, 13, -12, 6, 11, -4, -9, -6, -10, -9, 1, -9, -16, -18, 7, 3, 2, -2, 21, 16, 13, 13, 23, 7, 0, 13, 12, 2, 4, 22, 0, -4, 8, 15, 1, -10, 3, -4, -16, -15, -11, -5, -3, 2, 11, -5, -2, 25, 7, 1, 3, 14, 7, -4, -4, -3, -12, -14, 3, -7, -8, 8, 14, 0, -6, 19, 19, 0, 10, 13, 12, 4, -5, 11, 11, 1, 9, 2, -1, 11, 3, -8, 8, -7, 4, -1, -14, -6, -2, -13, -3, 2, -7, 1, 11, 8, -3, 2, -1, -1, -5, -6, -2, -2, -8, 13, 4, 0, -13, 0, -1, -10, -3, -10, 4, 2, 14, 4, 8, 17, -3, 9, 7, 18, 14, 15, 8, 6, 1, 2, -8, -3, 4, -10, -11, -4, -5, -1, -5, 3, -4, 2, -1, 1, -4, -9, -1, 3, -8, 2, 5, 2, -1, -2, 5, 4, -6, 6, 9, -8, -1, 8, 8, -8, 4, 10, 8, 7, 9, 10, 15, 7, 17, 4, 0, 5, 4, -4, 5, 14, 4, -8, 6, -9, -8, -11, -10, 0, -4, -17, 6, 2, 0, 4, -3, -5, 7, -5, 6, 3, 1, -3, 8, 1, -11, -6, -18, -6, 4, 0, -2, -13, -2]
3845bKqJ1LOrKNjnJ2j0j5K6j2j0KPjk3PKMrJ1nJM%KJ6j9J7j3%LRjqKJpNLj0KP
3892DKj1JJ1Pj0j7K5Omj6J5KpoJ4j0j0J5pmmonJ0OJ1k4LJ1oLNPj4JOJnJJ2j1J
3935CnJ4oj2RjolQJMpRNk1RJ6nj6J3Oj2JPnj6kJ0qjKJ0qlJ1jj2%KJPLJ9k7KJ2
3981GNj6J2QmpJjk2J6J1nk3K1OqnONNqlJ0j0pJ2npR%j2MKQrP%n%LMj2J0NPj4J5
4028A6lpjQjrnRJj1J0J3k0LOKj9ROMkjKj1kLKKnK1j3okjqkJ6Lj8jJ5Mj0KJMOr
4076APj7J6NMj4PN%j6kJ4j1mJ2pJkJ2j2OpPqpJ1J3nqMKnlJqJJ3j1rOJ3or%Rj3
4122a4QNpPP%MojQjo%J4lmoJ0j7MJ2j3%PnlnNOLj3J5j6LJ2j0m%JkJj2J2lQj4J
4169a2NQmKLrK5j6pJ9llj1J7mj4PMj8P%OmmLJJMoLKkJoM%JqPpOqkJ0olPKlMLp
$$ y = [-2, 0, -8, 3, 6, 12, 3, 5, 10, 9, 4, 16, 6, -9, 17, 5, -5, -3, 4, 3, -20, -13, -11, -7, -16, -5, -10, -9, -5, -5, -3, 13, -6, 11, -2, -2, 1, 10, 9, 1, 3, 4, -3, 2, 5, -5, -3, 4, 6, -5, -4, 7, 14, 4, -13, 12, 18, 14, -2, 13, 15, 8, 2, 16, 6, -4, 11, 4, 0, -4, -10, -15, -5, 1, 12, -12, -9, 2, -4, -1, 4, 11, -3, -2, 4, 5, 0, 1, 13, 2, 3, -2, 12, 6, -6, 3, 2, -4, -7, 1, 2, 6, -1, 8, 13, -8, 1, 17, 12, -4, 9, 15, 3, 4, 11, 6, -10, -12, -2, -10, -11, -9, 1, -7, -10, 1, 0, -12, -12, -10, -9, -2, 1, 20, -7, -5, 7, 12, -4, 8, 16, 12, 5, 6, 5, -17, -1, 10, 5, -18, 3, 9, 1, -4, 2, 7, 12, 4, 1, 11, 1, -6, 6, 1, -6, 3, 3, -9, -5, -3, 5, -4, 3, 3, -2, -2, 1, 5, -7, 3, 8, 15, 1, 16, 13, 6, 5, 13, 12, 3, -2, 7, 8, -3, 7, 20, 0, 3, 9, 11, -8, 1, 7, 11, 9, 8, 10, -1, -3, 0, 2, 4, -1, 20, 7, 1, -1, -2, -10, -12, 4, 7, -11, -12, 3, 7, -3, -1, 0, 4, 10, 1, 8, -9, 7, 12, 16, 2, 9, 14, 14, -2, -4, 10, -1, -5, 7, 0, 1, -1, 11, -1, 5, -2, 5, -3, -10, 1, 14, 9, 1, 5, 7, 2, -1, 0, -8, -7, 6, -5, -14, -8, 5, -1, -10, -10, -1, -14, -6, -1, -8, -1, 6, 6, 10, 4, 3, 11, 10, 4, 4, 18, 15, 11, 5, 15, -2, 2, 14, 1, 1, 8, 3, 0, -5, 0, 6, 9, -4, 11, -5, -2, 10, 0, -4, -4, -3, -5, -4, -16, -4, -7, 1, -13, -12, -7, 1, -3, -1, 2, -7, 18, 2, -5, 14, 11, 8, -3, 14, 10, -4, 3, 7, -11, -4, -4, 2, -2, -6, -3, -2, -1, 3, -3, 0, 2, 0, 1, -5, -1, -1, 0, -8, -1, -8, -2, -10, -12, -2, -8, -11, -4, -2, -5, -1, 2, -5]
4221eJ5j5J7pJ1qmLMj0OllJ6j7R%omKOj1JoM%%PJj1J1pQopJ0j0%KQkKkJrjJJ5
4269Fk0J2j0J2KjPklJJ0j0J2j8K0j3%Qk0lJ0KqjMmJ0m%pkJ1J2oooLK%kj0OJlP
4314akoLPj0J3%j3K1k1MJ0jMj5J0OjQj0qOJj2nLPpQLNplj0K0j5MQNj1lNpQj1J2
4360BKj3J5JqkLnJoJ0oKJ4lk0PJ2oQnKrNNj0KOJmj3K0nj1kLqJ7mlPLpKn%Qjnk
4410ejoJRKkoKj%LLJMOj1J1j0kLljJ%j1J0J0j1JqRpRjmpJ6Jj6M%MP%oj1J0JjQ
4460Ej2O%oJ0MmpJ1JKoMLj8MLJJNjj7LJ5Lj1nKJ0j7MQkjPorQoK1k1PJ6l0OJ1M
4507Fj6J2Kj7J7mRj7RNrLJMrkOJ0okmQkj2J0m%KJ0j8jPj0nJ4kKj2J0LKj2J6mm
4552dnJ8Kj8LJ4rj4J8kqjOKj9J3KKQj1J3rlJ0kJrQrkJ1rknMlQ%pJlJ2j0MnJ5o
$$ y = [-5, 10, -5, 12, 5, 16, 8, 4, 7, 11, 1, 7, 4, 1, 17, 0, 9, 9, 3, -1, 1, 7, -4, -3, -9, -5, -5, -5, 2, 3, -8, 3, -4, 4, -2, -9, 1, -9, -9, -7, 1, -1, 1, -1, 0, -9, -10, -9, 6, -14, -2, -12, 0, 2, 1, 8, 6, 3, 4, 14, 4, 16, -2, 18, 5, 5, 13, -7, -10, 0, 2, -6, -7, -3, -7, 3, -1, -1, -8, -10, 1, 13, 7, 1, -5, -2, 0, 0, -2, -12, -6, -5, -8, -1, -3, -9, -6, 1, -9, 4, 4, -9, 12, -9, -5, 5, 4, 8, -7, 3, 9, 8, 16, 6, -2, 4, 5, -7, -12, -9, -2, -9, -1, 2, 7, 0, -3, -13, 7, -8, -4, 4, 9, -2, -5, 0, -7, 1, -10, 2, 4, -9, 6, 7, -1, -3, 0, -5, -4, -10, 0, -6, -4, 10, 7, -13, -6, 6, 0, 8, 3, 5, -4, 1, 6, -4, -2, 4, 5, 1, -12, 8, 3, -8, -10, -7, -15, 2, -2, -5, 2, 5, -2, 0, -5, -5, 3, 2, -3, -5, -6, -12, -11, -2, 0, -2, -8, -6, -7, -7, -4, -1, 0, 4, 10, -1, 10, 0, -2, 1, -2, -3, -2, -2, -13, -3, 7, -4, -3, -11, -2, -9, 0, -1, -5, -12, 4, 5, -11, -7, -7, -3, 4, 4, -2, -13, -3, -2, -3, 5, -7, -1, -1, -7, 3, 7, 3, -4, 7, 8, 10, 4, 8, 11, -7, -3, 0, 1, 2, 7, 6, -11, -8, 7, 10, -1, -6, -4, 6, -11, -7, 1, -1, -2, 5, -1, -10, -2, -8, 13, -8, -1, 15, -15, -9, 2, 6, -10, 2, 4, -13, 4, 0, 9, -8, 1, 6, -3, 0, 1, 5, -4, -6, 0, 10, 4, 2, -2, 6, 4, -8, 2, -2, -2, 0, 10, -8, -9, -2, -12, -17, -3, -5, -3, -15, -5, -2, 0, -12, 4, 0, -4, -9, 9, 11, -7, -4, 10, 1, -13, 5, 3, -5, -6, 0, 2, -17, -4, -2, 0, 8, -3, 10, 1, -2, 8, 6, 7, -2, 6, -3, -5, 6, -3, -5, -10, -6, -9, -1, -1, -8, -7, -10, 2, -8, -4, -9, 6, 0]
4599@oKoPJJJ8k2OLpkLJl%J0mj4LK0j7lJ3Nqj1J0LoK%lnNlJ1Mj3Mlj2K3omPnJ
4647@oKJ1mj5K3rj1J2LqjlNk%Qmlj6J9KlJjJlJ6oj5KRjnoJ7oj2KKj2J7Jj2LMn
4694iqJ1lJ0ooJ1JqJ3kNj1J0j0kKJLj4NRj1JJ7Kj7MJ0j4JPnOnPoKk%rMKqMpJ3
4741bNjoJ9j7LmOJmLj6K2j2J0rlMQqLJ1rj3J2J%pNmLP%moKOLj5mJ3Jj5J0kMj0
4788iRlqJ0ojRKlqNJ2%j7LKJ1rNjoNLqmQMqjLJ0rjNpMJ4rj0QpLj1J9j5NkJpNm
4839iLkjJJ2LMqoL%JpkNLjjJ0j5mQN%k0J1J4k1J0J3lqJ0kPk4OmjKJRoKqQj1J2
4887a%j8QPJ1nlN%kkJrJ5njmpQMlnoJ0Pj1NK%jPrNPlllM%j2j3J6Lj3J7j3jNPo
4937emJ3KjomkJ5jmqPOj5RjPJj4MnkPQ%j7J0Oj2lJ0pj0J3J2%j5%OmkJ2qrJLPq
$$ y = [0, -6, -4, -10, -3, -2, -1, 17, -5, 1, 4, -3, -5, -2, -1, -4, -4, 6, 2, -12, -9, 11, -6, -9, 4, 9, 1, -10, 0, 3, -3, -1, -1, -4, -9, -4, -7, 4, 8, -5, -1, -4, -16, 7, 1, -3, 4, -1, 0, -6, -4, 7, 3, -12, 11, 2, -9, 3, 6, -2, -3, -6, -1, -3, -3, 5, 1, -2, -18, 1, 3, 0, 1, 0, 1, -2, 14, 8, -7, -5, 4, 3, -2, -8, 9, 3, -9, -7, -5, -17, 0, 1, -11, -8, -4, -9, -17, -6, -9, 1, -5, -11, 0, 1, -7, 6, 4, 9, -2, 8, -2, -4, -2, -1, 2, -12, -7, 2, -9, -8, 9, 11, -6, -2, 8, -6, -5, 2, -3, 3, -2, 5, -1, 1, -1, -1, -10, -6, -4, -12, -8, -15, -2, 3, 2, -4, 15, -2, 1, -3, 3, 4, 0, 3, -13, 9, -3, 7, -2, -5, -1, 7, -1, 2, 13, 4, -9, 3, 4, 4, -3, 2, -2, 1, 8, 8, 4, -2, 0, 6, 9, -6, -10, 3, 4, -11, -1, -3, 1, -9, 0, -3, -11, -1, -7, -8, 1, 3, 0, -8, -3, 9, 9, -8, -5, -3, 8, -1, 4, 3, -3, 2, 5, -3, -7, 1, 5, -3, -4, -1, 9, 0, -1, 4, -3, 1, 15, 6, -4, 4, -3, 0, -11, 8, -7, -2, -4, -3, -10, -5, -9, -6, -8, -9, -8, 4, 7, 11, 3, -3, 0, 0, 1, -6, -8, -3, 0, -1, -2, 8, -7, -11, -3, 2, 2, -18, -7, 7, -14, -4, 9, 6, -2, 8, 6, 13, -11, -5, -9, -10, -8, -7, 2, -4, -2, -10, -2, -13, -1, -1, -19, -11, -4, 7, 2, -1, 4, 4, 2, 0, 1, -8, 7, 2, 1, -3, -10, -2, 2, -1, -6, -12, -2, 5, -6, -1, 1, 1, 0, 7, -2, 3, 10, 7, 4, 1, 5, 5, -7, -20, -4, -1, -14, 3, -10, -11, -6, 1, -5, -9, 4, 6, 5, -1, -5, -7, 8, 7, 3, -5, 2, 8, -7, 2, 1, 8, 9, -5, -1, -6, -8, -1, 7, 7, -10, 0, 6, -6, -9, 1, -6, -16, -3, 9, 9, -6, -6, 0, -4, -6, 6, -2, -11, -10, -7, 0, -8]
4985hNMrjJ8pKoNkmJnJ3j2J1KpKJo%PnJnRnj0OlK2j9lJ5nmjLj1qK2mj1J2Ppj0
5033a0K0j3%jPlj1J6j4LqJ4KrPJ4j0j6J1Qj1%jJ6j5KnQj1OJ3pqMj3J0PNj3JNj
5075amj0OK0j7nNjjkK3j5noJ6j3LK0qm%Pnj1J4Lpj8J8jrJ0KmoQJj6PPj1j1MJ8
5119AKj8LJ1j9J6J3k1jJ3Kj6QPpkmJ6Kj1RJm%J6j6mj2K2lj5J6Rj7k0K9Jj8QJ2
5159Inj5NJ0q%RJj7J3J1j1oJ0%j2j7J5LmpK9j0j3%K1j1qJ2J0j1jK0l0nOK2j1n
5198aPoqmJ3MjpRk1nK0Qj2lJ2kkj7K5j6JmJ4j3lK4j5klJ9j0oLoqLK9lk5J9Nrm
5242aMPj4J1nj5RJJ1j3rNK0j6pJ5%j2PJ4j8KpK0j6lJ1l%qJ2noJ1kj5%K2%j9PK1
5284A6k2lJ2Qj6J2Lnj1OOj3JJ0jqj2J6%mJ%Oj1NMq%NJ3j1oPLqJOrLLkj1RkqJ6
$$ y = [-8, -3, 1, -8, -9, 9, 2, 4, -2, 3, 1, -3, -2, -7, 6, -6, 5, 7, 0, 2, 3, -3, -3, 4, -1, 0, -5, 4, -1, -11, -5, -8, 14, -5, -8, 7, 2, -2, -3, 0, -11, -19, 3, -1, -12, 0, 7, 0, -10, 10, -3, -3, -4, 3, 0, -11, 5, -9, -6, -14, 0, 2, -7, 0, 14, 4, -12, -1, 7, -4, -4, -5, 11, -4, -2, -7, 1, -10, -4, 9, 2, -6, -2, -15, -5, 2, 7, -6, -5, 0, -1, -5, -15, -9, 11, -6, -11, -6, -7, -8, -10, 13, -2, -7, -13, 3, -10, -7, 13, 5, 1, 1, 8, 3, -8, 6, 9, 2, -16, 2, 1, -8, 2, 4, 0, -6, 2, 3, -13, -6, 1, -10, -21, -17, 1, 3, -15, -12, -1, -20, -4, 9, -12, -13, 0, 2, -14, -6, 1, -6, -8, -12, 4, 6, -5, 4, 5, 1, 1, 17, 1, -3, -15, 7, 4, -11, 5, 14, -3, -23, 6, 7, -11, -3, 9, 4, -11, -6, 4, -4, -4, 5, 6, -11, 2, 13, 2, -4, 6, 6, -6, -23, -8, -5, -9, -16, 13, 3, -10, -10, 11, 0, -8, 4, 14, 3, 2, 22, -8, -13, -7, 15, 4, -1, 6, 0, -8, -12, 1, 5, 4, -3, 6, -15, -20, 0, 8, -4, -7, 5, 3, 1, -16, 9, -7, -6, -10, 4, -9, -12, 12, -3, -5, -8, 11, 1, -5, -2, -8, -16, -13, 16, 13, -12, 7, 12, 3, -1, 3, 10, -4, 7, 2, -13, -4, -3, 8, -5, -14, -9, 11, -5, -12, 3, 3, -9, -2, 12, -6, -4, -11, 9, -7, -10, 1, -2, -2, -10, 2, -3, -9, 2, 0, -15, -15, 7, 7, -12, -5, 16, -6, -9, 3, 11, -5, 7, 10, 5, -6, 0, 6, -7, -6, 4, 3, -5, -17, -1, -1, -5, -4, -4, 2, -9, -4, 0, -8, -8, -3, 10, -1, -7, 0, 3, -5, -4, 2, -7, -4, -1, -3, -14, -5, -7, -15, 1]
5330AqJ0kj5J6k%JLj4%%J2nMJJj6J4%LrPmqMNlJOKJj1PKmkQkj2J2kqoPJ6k0MJ4
5379Ij1kQjmqJ9k3J0Kj%OjJj4J3%jqJOlj0jRrJ5mMj8J9pRpjRrJ2rLj4J1lKkjM
5427@oKNRj1%LNj1MNLj0JmJnRlm%JJ0jJjklnJ6j7J0npJ2llP%mJqPLKj5NJ3j1k
5477fnMLONrJNlQj7J0kJ2mpLJljj3JJ5j1N%JRj0NMojPKq%%KlOjKqOj0j1J0J0j1
5527gP%lmLJ4q%mPnokNJ0kjjnLLmj5J2JpQqJ8pljPpjJ6j3J2lmomJ1j5QjMNj4J3
5577FnpKRn%QqlkM%pJ2Kkj2J3mk1RJ5Lk5J6%j3J3Mj0KJJ9j4Lj1J4Mj6J2jpPmm
5622cJPj2MKPppMOlrPNkkNJk%jQk3kJ3kjNnnJRPj4MJ4j6J0q%kLPqj1J8JkjlJk
5674cKokO%KmoRMk6J6J6j4nONNj1KLj0J1%j9QPLjlJ6j7%mJ7j2lJ4mj3JMRkqNQ
$$ y = [1, -7, 3, 1, -14, 2, 0, 0, 1, 4, -10, -10, -10, 2, -3, 1, 2, 3, -13, 1, 1, 4, -5, 2, -2, -10, -6, -1, -4, -3, 3, 5, 6, -5, 2, 4, 0, -2, 6, 4, -8, 4, 2, -6, -12, -5, 11, -9, -5, 9, -2, -4, 4, 3, -1, -9, 10, -13, -3, -1, -2, -2, 4, 3, 4, -10, 3, 3, 2, -6, -5, 1, -2, -12, -13, -4, -13, 2, -2, 2, -16, 3, -4, 5, -2, -3, 6, -3, 9, 0, 3, -11, 0, -3, -1, -3, -4, 0, -6, -4, 1, 10, -1, -1, 2, 7, -4, 0, 5, 8, -2, -1, -5, -4, -9, 0, -3, -7, -7, -6, 4, 3, 4, 3, 1, -2, -7, 9, -8, 2, -3, -10, 2, -1, -4, 3, 3, -1, 0, -8, -1, 2, 4, -11, -6, 7, -4, -6, -11, -7, -4, 2, 7, -2, -1, 4, 1, 9, -8, 2, 0, 12, 8, 1, 4, 5, 2, 1, -12, -11, 4, -7, -2, -2, -1, 8, -2, 3, 7, 1, 0, 7, 9, 1, 1, 1, 3, 0, 6, 5, 7, -1, 5, -5, -16, -6, 4, -7, 0, 0, -3, -7, -4, 10, 2, 2, -2, 5, 0, -6, -8, -3, 7, 5, 4, 3, -2, 1, 4, 0, -15, -3, -2, -9, -1, -9, 9, 2, -1, -2, 5, -2, -3, 13, 0, 12, 9, 5, -1, -5, 6, -9, -1, -2, 2, 7, -7, 6, 1, -6, -4, 5, 0, 0, 8, 0, -3, -5, -1, -1, -8, 4, 6, 4, -8, 5, 1, -20, -11, 4, 7, -18, -2, -2, -15, -2, 2, -8, -6, -5, 14, 0, 3, -8, 6, 10, -6, 6, 5, -2, 5, 1, -3, -2, 5, -7, -3, -1, 6, -1, -8, -4, 2, -1, -10, -3, 2, 0, -2, 3, 4, 2, 2, 1, 9, -14, -16, -3, -5, -6, -1, -6, -11, -10, -1, 6, -8, -4, 10, -6, 4, -4, -4, -6, -3, 4, -4, -15, 3, 4, 2, 1, -2, -1, -3, -1, -7, -9, -3, -3, -1, -5, -11, -2, 2, -24, -8, 8, -6, -11, -5, 0, 5, -6, -4, -1, -11, 0, 0, -19, -11, -4, -1, -2, -5, 11, -6, -6, -10, 7, -5, -8, 6, 2, -11, -10, -6, 3, 1, -7, -2, 6]
5721Fj1J4j1moJ6Lj4%J2qJ%J0j6lJ4krkJ1j6JJ3jooJ7mMk%qmRRj0Qj0QnkRMk0
5766a1J3J2j7nJ3rNmPnj8J3K1k6J9p%joK2j5j1jJ6oj0J2JqjJ8j8jPkOlOLj0mK1
5808A6k2%PJ0jj6MJ0k2J7j3nLQJOjjJj4J7Nj2j5J0QMoMoJOmkrPMoJ1lq%KRQj8
5854e%QqPQ%j4jMKoLMPj1J1j2qJ7nQj2LPrlJ3poJ4qllPkkmJ1Jk2J4j1J3ProJ0
5901BoJJ1mjPppO%%nkJ2jj0KRpnMnL%Qj2QpRMrJJP%oJpJmNNqJ0kmPrlRrmJ7j3
5955gQkj2QO%l%%MOj6QjJ3j5pQlOj0J2Mlll%kJ4j8OKMJlKKjj0jJOpJ0onPlR%J
6006Gm%Ronj0MNJLk%j2J2r%J3oOqNJj6J6mJ3rnmJJ3pj0QOJlnoQ%Lj0QNLlj0lR
6056Cj1MPoJ3j2J1j2%pLJnlKRNqJNnKkJmMJ%O%j4J1oQMqjN%jkMolNnJ0%JkrJ1
$$ y = [6, -5, 9, -2, -6, -12, 4, 7, -7, -7, 5, -3, -2, -2, 8, -8, -11, 3, 1, -8, -10, 1, -15, -14, -1, -2, -8, -14, 3, -1, 3, 1, 1, -7, -11, -2, 7, -3, 5, -5, 3, -2, -4, 5, 9, -11, 2, 14, -3, -8, 5, -4, 1, -3, 4, -1, -19, -6, 15, -11, 8, 1, 1, 0, -6, 16, 1, -10, -11, 5, -1, -11, 1, 2, -6, -7, 11, -7, -8, -1, -3, 3, 0, 6, 9, -1, -5, 16, -6, -6, 1, 11, 10, -6, -2, 8, -14, 3, -10, -15, -12, -4, -3, 3, 2, 1, 2, -12, 5, 10, -2, -17, -7, 1, 5, -1, 3, -3, -2, 4, 0, -2, -11, -4, 0, -6, 5, 2, -6, -6, -4, 5, 13, -5, -5, 3, -5, 2, 10, 10, -4, -5, -1, 1, -5, -2, 2, 9, -2, 9, -3, -11, 6, 1, 9, -3, 0, 7, -2, -5, 8, 1, -5, 9, 1, -2, -5, 2, 0, -2, -6, 5, 6, -16, -2, -13, 0, 7, -2, -8, 2, -4, -3, 8, 4, 3, 10, 3, -4, 2, 2, 2, -3, -5, 7, 6, -4, -2, 7, 0, -5, -1, -6, -3, -3, 5, -7, 1, -6, 3, 7, -2, -1, 0, 7, 7, 1, 2, -5, -4, -8, -3, 2, -6, 4, 2, -2, 5, -4, -7, 2, -7, -11, 6, -7, 1, -1, -13, -5, 1, 1, -2, -2, -2, 2, 8, -8, 0, -1, 12, -3, -10, -2, -5, 1, -9, 3, 7, 4, 1, -2, -2, -4, 10, -8, -2, 0, 4, 5, 2, 4, 6, 5, -5, -6, -5, 1, -6, 4, -2, -7, 0, -3, 6, 6, 7, 3, 3, 12, 6, 1, -9, -5, 0, 1, 4, 2, 2, -10, 2, -7, -7, 6, 0, 6, -2, 3, 4, -12, 4, 0, 13, 4, -1, -5, -4, 9, 2, -8, 0, 6, 7, 4, -1, -7, 1, 1, 4, -6, 2, 7, 10, 7, -3, -6, 3, -8, -4, 3, -3, 10, -2, 9, -3, -3, -10, -7, -6, -11, -14, -12, -3, 2, -6, -5, 0, -5, -3, -5, -4, -8, -4, -3, -3, 3, 3, -11, 0, -6, 2, 6, -2, -3, 2, 2, 1, -1, 3, -3, -6, -1, -6, 4, 4, 5, 3, -6, 5]
6108E%qQoMoNRqopJ1mMLLj2J3jj2KMlOj1J0JmPj8LRLoJ1ooOj3J0J4j1jQj2OoJ1
6156IpqRoOpJ2lnkjqPNoPqONkJ1qJljjjpMJLrJRLopPj3MJ8lj%j3OJ2%jj8OKLn
6210cJMNrOnK%JlKkMj6lK1j1JMRj4mK1Lj0Pj3jJ0jmpkPOqJ2jj7MP%nmNLj1MJ0
6259Ekj3PM%nQ%oMj1NqJ4NoLnOmoJ2lmJKPmJlnj0J6ojknMONoJ1qJOj0rJ0j3Q%
6310dmkK2kjpj4J1j7J0R%j0J5%j1LLkJKmkOnRmj0Q%JlOo%jJJ6j4nN%kmLRj2MJ
6359apLO%KJjj0J4Oj7jOj4LN%PJ%Mjnkj1J1oj2PK0Jk6K3j4kOpJ2j4J8j5J7p%j
6404aj1J0Lj4KLjnJ7qoJ2lk%Rj2JNLMmLj2Oj0J1%Jj1J2j2OlKk%oOm%LLqQj8J4
6451ijK%L%jKJ1j1nRmrRloJPqJ0N%lkMqJ5j5RqJ1jjn%rJ4loMLj2OmNJrNJ0j0O
$$ y = [5, 5, -3, 5, -1, 3, -3, 2, 11, 3, -3, -10, 1, -3, 1, 4, 7, -5, 8, 7, -5, -3, 1, -2, 4, -7, 3, 4, 0, 7, -11, -8, 1, 4, -2, 9, 3, -3, 3, -10, 0, 14, 3, 2, 10, -2, 4, -2, 9, 2, -6, 3, -3, 3, -4, 8, 5, 0, -2, -3, -11, -4, 1, -5, 2, -6, 0, 5, 3, 14, 6, 7, 4, 3, 2, 1, -6, -2, -1, 2, -7, -6, 3, 6, 0, -7, 0, -13, -9, 9, 6, 5, 5, -8, -2, 10, 10, 9, -9, -3, -1, 2, -3, -2, 2, 7, -2, 4, -1, 1, 1, 2, -1, 1, -1, 3, -13, -16, 5, -6, -5, -1, 8, -6, -10, 11, 14, 4, 11, -2, -3, 7, 6, 2, -5, -7, 0, 6, -2, 10, 9, -8, -4, 3, 3, -2, -6, -1, 2, -9, -5, 5, 3, -10, -3, 1, 1, -4, 4, 4, -2, 2, -9, -4, -12, 2, 7, 1, 4, -1, 5, 1, -5, 7, 4, 0, 1, 3, 10, 6, 7, 4, -1, -11, 5, -1, -2, -4, -9, -5, 1, 6, 0, 11, 3, 4, 10, 0, -9, 1, -12, -4, -4, -8, -10, 12, 10, 9, 2, -12, -1, -18, -8, 1, 1, -9, 6, 6, -5, -2, 1, -1, 0, 2, -2, -4, 2, -3, 6, 2, -8, 0, 0, 1, -2, 4, -2, -2, -3, -2, 14, 0, -5, 0, 0, -2, -6, -3, 6, -6, -2, -1, -8, -5, 1, 1, 3, 4, 3, -7, 7, 13, -4, -5, 1, -13, -10, -5, -5, 2, 3, 3, 7, 6, 1, -1, -12, -1, -7, -19, -12, 8, 9, -17, 6, -8, -10, -4, -11, 1, -13, 5, -10, 7, 0, 0, -1, -12, -2, 1, -13, -11, -8, -9, -14, 3, -5, -11, 1, -2, -4, -4, 5, -7, -6, -1, 2, 6, 2, 5, -7, -1, -11, 0, 0, 1, -10, 2, -10, -4, -7, -5, -7, -7, -13, -7, -11, -11, -8, -5, -13, -5, -23, -9, -10, -8, -8, -5, -5, -6, -4, 7, -4, -9, 0, -4, -13, -4, -7, -13, -12, -5, -13, -3, 2, 2, -1, -3, 1, -7, 8, -7, 2, -6, 5, 4, 3, -2, -2, -11, 3, 0, -6, -2, 1, -11, -5, -9, -4, -3, -12, -7, 3, -7, -1]
6502aJ2k3J2rPOj3P%NlnKJmpJ2oJMJ0j4J1qmMMNlqlJqJ6%j3OKOrQkj2jMLKj0J6
6551AlmK1j5Nj2rJ6LoQj8J3qJ0j1KLPqPpLJ3j8NlPmlRkMqKQlNqjkkj1J1J0j1N
6598AlqJMnJ1npmJ2%kKlP%rqK0lLJj5Oj%LPpnR%nR%j5J1oRlrJ3okPrj0LJ0n%K
6650dRpPj4MNnMPnkQj1Lk%jkJ0qNjK%Mj0jLRrpJ0Lknj0QkjoK0j9JJ5qj1J1oRj9
6700b1JJ1MkMnJ0plOLj2LlJ2Kj2JNoJ3pJ0lpMoJ2j2KJ3pJJj1NpLrJ4rLJ2j1jk
6746hjJ6j6KnKKMRrjK%J0j0J3j2%lMJ0j4lPLJrjKokJ1Mj1PpNmMjLKoMmMJ0j8J3
6795Cj7OJ1j1QNkmPj0J0nj3J2L%kN%jjomJ1j1KQMLj2J5JrpNNj0NPprlM%P%q%J0
6844EnQJmMj0OOq%%NmJ%OqlPoLoRkj0J4roQjlpJ4rjpOOrONnoPpJ2Pj1lKJ4nlj
$$ y = [-1, 11, -12, 0, -9, -2, 4, -9, -2, -2, 3, 0, -5, -3, -2, -6, -13, -1, -7, -6, -2, 8, -6, 5, -3, -7, -3, 1, 6, 3, -5, -8, -7, -15, 1, 1, -12, -6, -4, 2, -7, 1, -1, -13, -14, -10, -7, -5, -15, 1, -2, -6, 15, 0, 5, -7, -16, 0, 3, -3, 5, -13, 0, -8, 2, -9, -7, -4, 3, -5, 2, -5, -2, 11, -7, -2, -5, 2, -2, -5, 4, 2, 6, -2, 0, 8, 5, 10, 2, 1, -1, -3, -14, -3, 7, -4, 1, -2, -10, -9, -5, -10, 1, -4, -11, -15, -3, -3, -5, -3, -6, 1, 1, -8, -16, 4, 1, 4, 5, -10, -4, -5, -5, -2, 5, -2, -7, 2, 2, -3, 6, 6, -9, 2, -4, 5, 2, -7, 6, 0, -2, 5, -4, -14, -11, -1, -6, -6, -4, 5, -2, 5, -9, -5, 0, -5, -1, 6, 1, -1, 7, -4, -1, -3, -3, -4, -6, 4, -4, 1, 0, 2, 2, 6, -4, -5, -2, 7, -2, -9, 1, 4, 2, -3, -13, -5, -7, -8, -14, 6, -13, -12, 3, -5, -16, -5, -11, -2, -21, -20, -9, -5, -7, -3, -8, 2, -5, -8, -2, 1, -11, -8, -11, 1, 3, -9, -8, -3, -9, 4, -3, 7, 4, -3, 1, -5, 7, -5, -3, 10, 3, 4, 5, -6, -1, -8, -5, -14, 0, -9, -6, 6, -5, -6, -8, -9, 7, -9, -7, -12, -10, -8, -4, 5, -4, -5, -3, -3, 7, -3, 10, -2, -2, -5, -1, 9, -5, -8, -1, 2, 3, -6, -7, -5, -11, -13, -2, 2, -9, -2, -9, -4, -8, -4, -5, -2, 0, -6, -2, -6, -2, 8, -10, 3, -14, -8, 3, -8, 0, 5, 3, -1, 6, -4, 6, 1, -12, 0, 3, 3, 1, 6, 6, 5, 4, -2, -6, 5, -6, -4, 4, 8, 11, -1, 14, 15, 6, -1, 4, 9, -1, 4, 11, 4, -5, -8, -4, -4, 3, 3, -5, -5, 5, 0, 8, 9, 5, 9, -1, 5, 11, 3, 3, 3, 8, 4, 5, 5, 11, 3, 0, 7, 1, 4, -2, 7, 5, -5, 9, 0, -6, 2, 1, -2, -9, 5, -4, -5, -12, -6, 0, -9, -3, 2, -3, -9, -2, -9, 3, 10, -1, -4, -2, 12, 7, 4, 3]
6898CNj5jJ1nmJ4m%oJ3%j0Op%NPj4mNj0J7nj2pMJ8KJj5Q%oMjJ2k0J5oJ8j5kMJ
6943D%rJ0MrlQKPk2J0Lk%oolJ1Lj2Qj0J6Lj1KloJ2LpNJonKN%Qj8QMKj7NKLrNM
6993dlKJJqQmLJ%KPlnLpkKOpQK%opOPNj1kqOlJ2jj8J8Nj6RpPm%lP%PnqJ1rPj2
7047a0N%kJ2JjLnoRj3NJ2j6lQj4K3qjMm%mJ8k2RNj3NL%MOqL%oJj4J5mLLpOMnJ
7096BRn%j1J7o%KlNj0LpOKLlPNj1j4QpLMRoj2J2JokKNnJlJ4j1LkKKoJ0j7kJ8m
7145BnNmJ2mnqLP%j4J8j1OJKmJ1k3JJ0oOpjP%mJ4j0j6J7KmJjpJ1qN%mQ%J0rpL
7193@JJ0pNnKj0nQkOqPmMj1jJNnQj2J6Lj4PjMnj0LLOqJ9pnMkjj2J8j7J6j4J4J
7240Enj5J3J5j1MmqLJ0rlKKRj1JkLrJ2j1J0MMj3pOJNLnlKNJno%%RpOQprlJ9k0
$$ y = [3, 8, -7, -8, 3, -2, -6, 8, 4, 4, -2, 11, 11, 1, 7, 0, 0, 5, 12, -2, -6, -1, -11, 6, 1, -11, -18, -14, 4, 6, 7, -8, 0, 0, -6, -2, -3, 9, -11, 4, -2, 16, 1, -1, 3, 4, 4, -5, 5, 9, 0, -3, 5, 7, 14, -8, 2, 5, 3, 3, -3, -9, -12, -1, 2, -10, -2, -12, 4, 7, -4, -2, -5, -11, 1, 4, -3, 2, 3, -3, -8, -6, -1, -1, 7, -11, -3, 1, 3, -14, -9, -7, -4, -13, -8, -4, -7, -5, -4, -3, -11, -3, -7, -4, -3, -3, -1, 6, 3, -2, 1, -6, -8, -6, 0, -7, 1, 3, 3, -3, -10, -4, 3, 8, -3, -5, -13, -7, -10, 2, 1, -17, 1, 6, -10, -1, -8, -1, -5, -5, -8, -1, -1, 6, 1, -7, 4, -5, 2, -10, -5, -5, -7, 5, 6, 5, 8, 3, -3, 6, -7, -2, 10, -6, -9, -1, -15, 8, 0, -1, 3, -1, -1, -5, 13, -9, 0, 5, -8, -3, 0, 0, 4, 10, 2, 5, 5, -1, 0, -14, 1, -3, 0, 3, -4, 2, 6, 1, 2, 11, 6, 6, -5, 12, 6, 6, 8, 5, 10, 0, 3, -4, 2, 4, 7, 4, 11, 16, 5, -9, -1, -8, -5, -1, 8, 2, -10, 2, 3, -3, -5, -3, 2, -3, -2, -5, 9, -2, 1, -1, 1, 3, -3, 7, -10, -12, 6, 2, -3, 2, -2, 10, 6, 1, -7, -4, 3, 3, -11, 7, -4, 2, 3, 5, 1, 12, -11, -10, 0, -6, 0, -7, -8, -1, -1, -5, 9, -1, -17, 0, 2, -2, -1, -2, -9, 2, -6, -1, -1, -5, 3, 3, 13, 4, -3, 0, 1, 11, 4, 9, 4, 6, -4, -9, -1, -3, 3, -5, 2, -2, 2, -9, -10, -9, -4, -9, -1, -13, 3, 6, -8, -1, -2, 2, -3, -13, -10, -7, -1, -9, 10, 3, -2, 2, 0, -1, -13, 5, -12, 4, -10, 4, 5, 0, -15, -2, 13, 2, 6, 2, -6, -3, 7, -2, -5, -3, -1, 8, -3, -2, -4, -1, -10, 2, -9, 1, 5, 9, -4, -11, -5, -4, 1, 4, -1, -4, -2, 3, 4, -1, -7, -7, -7, 2, -5, 1, 9, 2, -7, -10, 9, -11]
7289a1J0mRmM%opJ1j2QnQn%J0r%lPqJ4j6jnJ2oRlk2J9MmQOJj2nRnoJ4q%J5rpL
7337blKKKN%jj4PloJ4q%LNpMMpJLLkrN%klJ8mj2jjNRj1OjJ0jr%mL%rJ7j6JJ2j2
7389gJ8pj2Qj2KJ0rRKnmlJ%RJ4j6j0OQjlj2J4jmkLQj0PJnQoJ4j1PpJ%jPpMj%J1
7438A6j7MOj0JJ4j6J1j0pJ1j0O%QoJ0j9PkMoJpRMj9J6KNj5K1j4j%LkLjKqJ5pQ
7482A0j9K0kj5Q%MKJ3j2oRj7Rj3J2pQnjOj2J2rK1j1%nrJ1%kLpJJ0nmqRNmPknJ6
7528A6k5QJPOorQjlnMJrQnLJ2j9QOolLJ1j1oOOj1NMnPj5J0lm%OLklnJ4%rnNkO
7579B%K%oLKNj1jJ0qoJ4kj3J4pJPPj6Om%olNRkpk%Lj2J6jqLJ8k1KJ5rKKLoJ8j3
7628ENrJ1j1Nj2J4Kj4J3kkJ0k1NKk0L4roNpO%oKj1NJJ0j0JJ0rKMjPmkjj2OK1j4
$$ y = [-11, -1, -5, 4, 0, 4, 4, -2, -9, 2, -10, -2, -7, 1, -4, -4, 6, -3, -3, -6, 1, -7, 7, -9, -10, -15, -3, -9, 0, -3, -25, -6, -2, -6, 2, 8, 9, -3, -8, 1, -4, -10, 4, -4, -4, 11, 2, -5, -2, -5, -3, -1, 1, 6, 6, 5, -9, -2, -5, -11, 3, -5, -5, -2, 3, -4, 0, 4, -3, -2, 1, 4, 2, -7, -2, -2, -4, -7, 11, 7, -5, -6, -7, -2, 7, -4, 2, 1, 11, 10, 1, 1, -3, 0, 0, -9, 8, -8, -7, 5, -7, 11, 4, -8, 0, -12, -10, 0, -9, 0, 2, -3, -7, -10, -9, -9, 0, 14, -2, -12, -6, 2, 1, -2, -14, 0, -1, -5, -7, -4, 4, -6, 1, 2, -3, 5, -1, 13, 2, 9, 2, 3, 3, 2, 9, 2, 6, 5, 5, 16, -1, 3, 9, -1, 0, 14, -2, 9, -1, -8, 3, -7, -1, -1, 7, 1, 11, -8, -1, -3, 1, -5, -4, -11, -2, 2, -17, -1, 1, 6, -9, 12, -2, -3, -3, 0, -2, 1, 0, 2, -6, 9, 2, 10, -9, 11, 9, -6, 2, 2, 6, 8, 21, 9, 3, 12, -5, 4, -9, 3, -4, 4, -1, -2, 4, -8, 4, -5, 16, 5, 5, 0, -9, 2, 2, 0, 3, -4, -3, 7, 2, -2, -10, -1, 4, 0, 7, 5, 0, 16, -9, -1, 0, 7, 13, 7, -2, 6, 5, 2, -3, 1, 2, -7, 1, -4, -1, 11, -8, 0, 6, 0, -3, 0, 11, 0, -6, 0, 6, -5, 0, 4, -1, 6, -9, 1, -2, -6, -6, 0, 3, 1, -2, -7, 7, 7, -2, -7, -2, -4, 2, 2, 4, 4, -2, 1, 3, 8, -3, -4, 6, -2, -8, 6, 4, -9, 5, -2, -1, 6, 13, -3, 3, -1, -1, -7, -10, -5, 4, 2, -5, -7, -7, -4, -16, 0, -1, -9, -6, 12, -9, -7, 8, -1, 1, 3, 6, 0, 18, 5, 10, 1, 12, 1, 6, -6, 8, 10, -4, 9, 7, 5, 15, -6, -1, 1, -19, 15, 6, 0, 5, -2, 4, 4, -2, 0, -11, -6, -5, 5, -5, -4, 6, -3, -1, 3, 2, 9, 5, 3, 2, -10, -4, 17, 3]
7673CmlJ0%ljKPj0LQk2J4k%kQp%OjrkkR%KrJlrRQJ0j1pJ3llmRoLnNplJ2nLLJM
7726A0pJOoKnlJ1j7J1jrJ3j3OOnj0QJjNJMj7J0k%NqNqJ2rlJ3plLKJ1lj2ONJj2
7773cNj2J5lnLL%JMnj2MPRnJnjj2KMPmMoqJ6JkRj3KlkNLlqJ0KOoKqOQkJj5PM%
7826HrJ1pkKkKJ2k1J4k%klqMrQKkLlLLnmJ%%oJ0%Rj2jJ2qMJNpjJMLlp%MMpJMp
7880cK1j8Jj%lMPj4RopR%mJlLOj6PNkmMrQJ0j5JJ0m%MJ1j0KmrNjJ4KpLk0QMJr
7930ipMJ2qOMolMJ2j5lJ1Lj3%j%KlJ2pJ0Kqj1jMoJ7LNj4J2mJoK%OpqmRjK0k3K
7978eMqPj4MLjQj0j0J6JRj0%qJ6nOm%okJ3qNJMj2JnJ2k%RloMO%rNk2J2J3j0%m
8026eKjJ1j0LLQj4kkkJ4qRrJ4ommPpJJ1oJj1J2Ll%j0QKrNJ0j3J3oj0RpMPrJ7q
$$ y = [3, -1, -4, 6, 6, 3, 2, 4, 11, 1, 4, 12, -10, 4, 2, 2, 0, 8, 1, 1, 7, 6, -3, -5, -7, 2, 2, 4, -5, -4, -7, -16, -7, 1, 11, 0, -7, 6, 3, 0, -4, 5, -1, 2, -3, 2, -5, -8, 4, -1, 2, 5, 6, 10, 3, 4, 10, 4, 6, 1, -2, 9, -8, 3, 2, -7, 6, -7, -1, 5, 0, -10, -2, -1, -2, 3, 4, 8, -9, 1, -1, -1, 4, -4, 1, -7, 5, -4, -7, 6, -1, -4, -1, 1, 12, 9, -3, 3, 8, 9, -3, 2, -10, 5, 2, -3, 0, 3, 3, 4, 8, 3, -9, -5, 2, 11, 6, 7, 2, 1, -11, -9, -5, 2, -2, 2, -4, -12, 4, 5, 3, 12, -1, 1, -2, -4, 1, 4, 1, -7, 3, 5, 11, 5, 7, -1, 5, 13, 11, 12, -3, 4, 8, 8, -1, 10, 3, 1, 3, 1, 3, 15, -6, 8, 6, 6, 4, 1, -7, -3, -12, -4, -2, -4, -1, -4, -1, 2, -3, -7, -6, -6, -6, -12, -2, -2, 7, -5, -6, 6, -2, 2, 3, 8, 1, 0, 1, 5, 8, 5, -2, -2, 2, 6, -1, 0, 4, -3, 18, 0, 1, 0, 0, -3, 1, 8, -6, 3, -3, -10, -1, -1, -5, -4, -7, -4, 2, -14, -7, -2, -4, -8, -4, -13, -5, 5, -10, -9, 1, -3, -3, 1, 12, 2, 4, 0, -9, -4, -5, 9, 11, 4, 7, -13, -5, -1, 0, -9, -16, -12, 0, -8, -2, 2, -4, -7, -3, 9, -6, -9, 2, 5, -8, -8, -9, -9, -7, -10, 2, -5, 5, 7, -1, -12, -13, -9, -15, 2, 5, 10, -4, 8, 4, 5, -1, 1, 1, 7, 0, -8, -12, -3, -4, 16, -7, -5, -1, -9, -2, -16, -12, -9, -10, -2, -12, -22, -6, -5, 4, -6, -6, -14, 2, -3, 3, -1, -1, -7, -9, 4, -4, 1, 2, 6, -6, -5, -10, 2, 0, 0, 9, 6, 0, 4, 10, 10, 1, 6, -16, -4, 9, -1, -1, -5, -3, -4, 7, -3, 0, 3, 11, -3, -5, -7, -9, 5, -3, 6, -3, 11, 5, 1, -3, 4, -3, -2, 9, 3, 4, -7, 5, 8, 5, 5, -5, 3, 5, -4, 1, 11, -2, 11, 5, -5, 4, -3, 1, 8, -1, 16, 8]
8073HrjRjnJ3j0j1JQomNj2K1Jj0nkJ0Qnj1LJMpOLlMrLJ2jJoJ0KrllJ3j4kOK%m
8122AjMpOnNOr%j2J4jkqPlKPqP%Lj0MoNLqRLNj9J1Lj4J4oPpJ4Jk2PNpJ3j3M%M
8172Fj2QpJ1nmOj0%%J6j5MkMLmMk
$$ y = [8, -1, -2, 7, 6, 1, 14, 4, -7, -6, 2, -4, -8, -3, -15, 6, 7, -3, -8, -10, 0, 8, 3, -8, -5, -4, 0, -7, -1, 2, -1, 3, -6, -3, 9, 8, 9, 3, 13, 15, 6, 3, 0, 13, -1, -3, 3, 5, 5, 1, 0, 4, -3, 3, -2, 3, 9, 0, 0, -12, 2, 1, -1, -9, -2, -5, -3, 4, -4, 3, 3, 6, -4, 0, -6, -1, 2, -6, 3, 6, 11, -8, 3, 6, -8, 6, 0, 7, 0, 14, 15, -7, 0, 5, -2, 11, -2, 2, 2, 6, -6, 2, -5, 6, 1, -3, 3, -7, -7, -7, 9, -6, -2, -4, 0, 3, -1, 3, 1]
8191A
##END NTUPLES=NMR FID
##END=
