##TITLE=1H_IBDPCO1202
 CDCl3, 8 sc, 
 12.2.2019
##JCAMPDX= 6.0         $$ Bruker NMR JCAMP-DX V2.0
##DATA TYPE= NMR FID
##DATA CLASS= NTUPLES
##ORIGIN= UXNMR, Bruker Analytische Messtechnik GmbH
##OWNER= root
$$ XWIN-NMR		Version 3.5
$$ Wed Feb 13 13:54:31 2019 Russian Standard Time (UT+4h)  she@DPX200
##.OBSERVE FREQUENCY= 200.1313
##.OBSERVE NUCLEUS= ^1H
##.DELAY= (6, 6)
##.ACQUISITION MODE= SIMULTANEOUS
##.ACQUISITION SCHEME= undefined
##.AVERAGES= 8
##.DIGITISER RES= 18
##SPECTROMETER/DATA SYSTEM= spect
##.PULSE SEQUENCE= zg30
##.SOLVENT NAME= CDCl3
##.SHIFT REFERENCE= (INTERNAL, CDCl3, 0, 15.7039)
##AUDIT TRAIL= $$ (NUMBER, WHEN, WHO, WHERE, WHAT)
$$ ##TITLE= Audit trail, XWIN-NMR		Version 3.5
$$ ##JCAMPDX= 5.01
$$ ##ORIGIN= Bruker BioSpin GmbH
$$ ##OWNER= she
$$ F:/spectra/data/she/nmr/H-F/1/audita.txt
$$ ##AUDIT TRAIL=  $$ (NUMBER, WHEN, WHO, WHERE, WHAT)
(   1,<2019-02-13 13:52:22.70 +0400>,<she>,<DPX200>,
      <created by zg, POWCHK disabled, PULCHK disabled
       configuration hash MD5:
       00 E9 B6 7A A2 85 ED C7 34 08 36 98 17 FE 4E 26
       data hash MD5: 16K
       77 F4 97 57 D4 68 53 AB 4E AC 6B C5 1D D0 66 12>)
$$ ##END=
$$ 
$$ hash MD5
$$ 4A 0C B3 49 D0 8A 2C 24 19 09 04 A7 83 B9 5F 63
##$RELAX= 
##$RELAX= 
##$RELAX= 
##$RELAX= 
##$RELAX= 
##$RELAX= 
$$ Bruker specific parameters
$$ --------------------------
##$DU= <F:/spectra>
##$EXPNO= 1
##$NAME= <H-F>
##$PROCNO= 1
##$TYPE= <nmr>
##$USER= <she>
##$AMP= (0..31)
100 100 100 100 100 100 100 100 100 100 100 100 100 100 100 100 100 100 
100 100 100 100 100 100 100 100 100 100 100 100 100 100 
##$AQSEQ= 0
##$AQ_mod= 1
##$AUNM= <au_zg>
##$AUTOPOS= <>
##$BF1= 200.13
##$BF2= 200.13
##$BF3= 200.13
##$BF4= 200.13
##$BF5= 200.13
##$BF6= 200.13
##$BF7= 200.13
##$BF8= 200.13
##$BYTORDA= 1
##$CFDGTYP= 0
##$CFRGTYP= 5
##$CHEMSTR= <none>
##$CNST= (0..31)
1 1 145 1 1 1 1 1 1 1 1 1 1 1 1 1 1 1 1 1 1 1 1 1 1 1 1 1 1 1 1 1 
##$CPDPRG= <>
##$CPDPRG1= <>
##$CPDPRG2= <>
##$CPDPRG3= <>
##$CPDPRG4= <mlev>
##$CPDPRG5= <mlev>
##$CPDPRG6= <mlev>
##$CPDPRG7= <mlev>
##$CPDPRG8= <mlev>
##$CPDPRGB= <>
##$CPDPRGT= <>
##$D= (0..31)
0 1.2 0 0 0 0 0 0 0 0 0 0.03 0 0 0 0 0 0 0 0 0 0 0 0 0 0 0 0 0 0 0 0 
##$DATE= 1550051542
##$DBL= (0..7)
120 120 120 120 120 120 120 120 
##$DBP= (0..7)
150 150 150 150 150 150 150 150 
##$DBP07= 0
##$DBPNAM0= <>
##$DBPNAM1= <>
##$DBPNAM2= <>
##$DBPNAM3= <>
##$DBPNAM4= <>
##$DBPNAM5= <>
##$DBPNAM6= <>
##$DBPNAM7= <>
##$DBPOAL= (0..7)
0.5 0.5 0.5 0.5 0.5 0.5 0.5 0.5 
##$DBPOFFS= (0..7)
0 0 0 0 0 0 0 0 
##$DE= 6
##$DECBNUC= <off>
##$DECIM= 32
##$DECNUC= <off>
##$DECSTAT= 4
##$DIGMOD= 1
##$DIGTYP= 9
##$DL= (0..7)
0 120 120 120 120 120 120 120 
##$DP= (0..7)
150 150 150 150 150 150 150 150 
##$DP07= 0
##$DPNAME0= <>
##$DPNAME1= <>
##$DPNAME2= <>
##$DPNAME3= <>
##$DPNAME4= <>
##$DPNAME5= <>
##$DPNAME6= <>
##$DPNAME7= <>
##$DPOAL= (0..7)
0.5 0.5 0.5 0.5 0.5 0.5 0.5 0.5 
##$DPOFFS= (0..7)
0 0 0 0 0 0 0 0 
##$DQDMODE= 0
##$DR= 18
##$DS= 0
##$DSLIST= <SSSSSSSSSSSSSSS>
##$DSPFIRM= 0
$$ [...]
##$SUBNAM2= <"">
##$SUBNAM3= <"">
##$SUBNAM4= <"">
##$SUBNAM5= <"">
##$SUBNAM6= <"">
##$SUBNAM7= <"">
##$SUBNAM8= <"">
##$SUBNAM9= <"">
##$SW= 20.0189088683792
##$SWIBOX= (0..15)
0 0 2 0 0 0 0 0 0 0 0 0 0 0 0 0 
##$SW_h= 4006.41025641026
##$TD= 16384
##$TD0= 1
##$TE= 0
##$TE2= 300
##$TE3= 300
##$TEG= 300
##$TL= (0..7)
0 120 120 120 120 120 120 120 
##$TP= (0..7)
150 150 150 150 150 150 150 150 
##$TP07= 0
##$TPNAME0= <>
##$TPNAME1= <>
##$TPNAME2= <>
##$TPNAME3= <>
##$TPNAME4= <>
##$TPNAME5= <>
##$TPNAME6= <>
##$TPNAME7= <>
##$TPOAL= (0..7)
0.5 0.5 0.5 0.5 0.5 0.5 0.5 0.5 
##$TPOFFS= (0..7)
0 0 0 0 0 0 0 0 
##$TUNHIN= 0
##$TUNHOUT= 0
##$TUNXOUT= 0
##$USERA1= <user>
##$USERA2= <user>
##$USERA3= <user>
##$USERA4= <user>
##$USERA5= <user>
##$V9= 5
##$VALIST= <valist>
##$VCLIST= <CCCCCCCCCCCCCCC>
##$VD= 0
##$VDLIST= <DDDDDDDDDDDDDDD>
##$VPLIST= <PPPPPPPPPPPPPPP>
##$VTLIST= <TTTTTTTTTTTTTTT>
##$WBST= 1024
##$WBSW= 4
##$XGAIN= (0..3)
0 0 0 0 
##$XL= 0
##$YL= 0
##$YMAX_a= 710830
##$YMIN_a= -590342
##$ZGOPTNS= <>
##$ZL1= 120
##$ZL2= 120
##$ZL3= 120
##$ZL4= 120
##$ABSF1= 10
##$ABSF2= 0
##$ABSG= 5
##$ABSL= 3
##$ALPHA= 0
##$AQORDER= 0
##$ASSFAC= 0
##$ASSFACI= 0
##$ASSFACX= 0
##$ASSWID= 0
##$AUNMP= <proc_1d>
##$AZFE= 0.1
##$AZFW= 0.1
##$BCFW= 1
##$BC_mod= 2
##$BYTORDP= 1
##$COROFFS= 0
##$CY= 11.3945322036743
##$DATMOD= 1
##$DC= 2
##$DFILT= <>
##$DTYPP= 0
##$F1P= 18.9103706918063
##$F2P= -1.10871071338519
##$FCOR= 0.5
##$FTSIZE= 0
##$FT_mod= 4
##$GAMMA= 1
##$GB= 0.15
##$INTBC= 1
##$INTSCL= 1
##$ISEN= 128
##$LB= 0.24
##$LEV0= 0
##$LPBIN= 0
##$MAXI= 10000
##$MC2= 0
##$MEAN= 0
##$ME_mod= 0
##$MI= 1.114404
##$NCOEF= 0
##$NC_proc= 0
##$NLEV= 6
##$NOISF1= 3.799351
##$NOISF2= 2.8
##$NSP= 1
##$NTH_PI= 0
##$NZP= 0
##$OFFSET= 15.70392
##$PC= 1
##$PHC0= -9047.633
##$PHC1= 11.40014
##$PH_mod= 1
##$PKNL= yes
##$PPARMOD= 0
##$PSCAL= 0
##$PSIGN= 0
##$REVERSE= no
##$SF= 200.130013532006
##$SI= 16384
##$SIGF1= 3
##$SIGF2= 2
##$SINO= 400
##$SIOLD= 16384
##$SREGLST= <1H.CDCl3>
##$SSB= 0
##$STSI= 0
##$STSR= 0
##$SW_p= 3612.71676300578
##$SYMM= 0
##$S_DEV= 0
##$TDeff= 0
##$TDoff= 0
##$TI= <>
##$TILT= no
##$TM1= 0
##$TM2= 0
##$TOPLEV= 0
##$USERP1= <user>
##$USERP2= <user>
##$USERP3= <user>
##$USERP4= <user>
##$USERP5= <user>
##$WDW= 1
##$XDIM= 8192
##$YMAX_p= 0
##$YMIN_p= 0
$$ End of Bruker specific parameters
$$ ---------------------------------
##NTUPLES= NMR FID
##VAR_NAME=  TIME,          FID/REAL,        FID/IMAG
##SYMBOL=    X,             R,               I
##VAR_TYPE=  INDEPENDENT,   DEPENDENT,       DEPENDENT
##VAR_FORM=  AFFN,          ASDF,            ASDF
##VAR_DIM=   8192,          8192,            8192
##UNITS=     SECONDS,       ARBITRARY UNITS, ARBITRARY UNITS
##FACTOR=    0.0002496,     1,               1
##FIRST=     0,             0,               0
##LAST=      2.0444736,     0,               0
##MIN=       0,             -590342,         0
##MAX=       2.0444736,     710830,          0
$$ Real data points
##PAGE= N=1
##DATA TABLE= (X++(R..R)), XYDATA
$$ [...]
2171B752k537j991K957N22m365p8M379k47l276K165K958l617l023L497J991l356
2187a269O4M450l55n078J013L816k775l495L498K593m570j442M963R82m452J697
2203c60N182l341m773K870K622n017j102O317J468n569N79M447k884m982M244
2218b99M653m087k590M823J17o504P3O282j781m960L419M252m661k991O627K442
2234D815n135j55N531k664p227K145N309l564k747O342K412p254j970N608q94
2249E52n490L568O729m168m901M715K426n976n36O963j12o547J130N174l887m602
2265d962N877M346o162l007M818l39o573K437P610q07m623L765L191o812l761
2280e002N744J826n051Q20N781k628o537K540N197l347k775N929K074o575j770
$$ y = [2752, 215, -1776, 1181, 1703, -2662, -2740, 1639, 1392, -1884, 281, 3239, -378, -3401, 96, 2087, -1269, -1205, 3245, 2890, -2188, -1175, 2641, -134, -3629, -131, 2462, -2108, -3550, 1413, 2395, -2057, -360, 4822, 1481, -3292, -422, 2200, -2817, -3919, 2398, 3866, -1703, -1124, 3323, 439, -4543, -299, 4354, 267, -2323, 2500, 2617, -3887, -3814, 2468, 687, -4273, -854, 3398, -1263, -4254, 2373, 4815, -320, -475, 5056, 2392, -4835, -2690, 2619, -945, -3692, 2650, 5062, -2192, -4162, 1446, 552, -4938, -1370, 5359, 1191, -3710, 1005, 3431, -2545, -3081, 3882, 3770, -2777, -1647, 3527, -360, -4962, 915, 5261, -901, -3908, 910, 571, -6002, -3565, 4045, 3238, -1385, 2380, 5571, -1241, -5002, 742, 2568, -2483, -1663, 4118, 1490, -5047, -2507, 2690, -657, -3432, 2497, 4571, -2004, -3774]
2295c774N870L18m765K496N459m260o548L004L351l872p54P268J479p121m78M491
2311B164k755m610M707N855l774l843M583R49o522m87O708l24n777J563M107m588
2327b044m338O050M421m454r24N241j290p273J891O894j625l946M594K466p689
2342b026l976N375J442m961K371O395l372o169L640M545m705j647P100J193p165
2357a960n30N916k515n078N032M890n560m016M476M28o566J106Q145q84n769L412
2373E27L443o020l526P208L392n751M0N585l230o792L189N273l914k740N424J184
2389C292p307l74O732k86m869L588M612n385m645M807K193m985O02O075j368n936
2405c254J865L644m111k411N801K671n383r37M510j700m753L184N059k883l576
$$ y = [-3774, 2096, 2414, -2351, 145, 5604, 1344, -5204, -2200, 1151, -2721, -3475, 3793, 5272, -1849, -2327, 2164, -591, -5201, -494, 5361, 1587, -2256, 2327, 3276, -3246, -3733, 2975, 2651, -3126, -1563, 2544, -2044, -6382, -332, 4089, -365, -1289, 3952, 2662, -4611, -2720, 4174, 2549, -1397, 3197, 5663, -2026, -6002, -627, 815, -4146, -1775, 4620, 1248, -4921, -1281, 3264, -1441, -3088, 4012, 5205, -1960, -2490, 3426, 911, -4167, 865, 5755, 195, -3821, 655, 1083, -5483, -4377, 3768, 2884, -2885, 527, 3970, -2050, -5576, 1632, 5024, -727, -687, 4898, 1668, -5124, -1935, 3338, -576, -3316, 2108, 3292, -4015, -4389, 2343, 2057, -2812, 776, 5388, 3, -4642, 165, 2358, -2627, -2025, 4050, 2682, -3254, -1389, 2255, -1856, -4267, 1534, 4205, -1178, -2115, 2395, 695, -4058, -874, 4185, 1302, -2274]
2420b274L309J279n151o21M971L60l884J037L182k972l042L746K756k606n25L600
2436C165n89m682N03L316j737k062K655J656l121j897K766O02k139P33L090r64
2452A295k786Q09J868j486j011K850R58k763j177K211m23j886J126K054j069k096
2468a526J105Q62j700o89K281Q46j392j46J536m16k087R32J727j129j054J236
2484C86P10k147q27K100M68j284L26J748j146j569R22J532j524n93J790l6k420
2501a564K06K262p12j404J397J594j655j142J669N54j811pJ946p72j964J298J373
2518A268j838r42K137P29k267k84K115q45k046J421J864j497r19K038M32k223
2534h57L95K034q72j828J462J423k535p37J928o3k263O96J960p55j346J666J089
$$ y = [-2274, 1035, 2314, -2837, -3458, 1513, 1873, -2011, -974, 2208, -764, -3806, -60, 2696, 90, -435, 3165, 2576, -2106, -1603, 1713, -24, -2086, 569, 2225, -896, -2793, -27, 575, -1564, -831, 2259, 1295, -1491, -682, 1186, -300, -1311, 1539, 2497, -266, -1443, 768, 345, -1541, -415, 1639, 570, -1526, -421, 441, -1259, -1948, 333, 1179, -213, -359, 1177, 761, -1326, -394, 1333, 204, -850, 386, 1096, -1051, -1878, 222, 690, -594, -268, 1480, 334, -1235, -313, 1219, -305, -898, 892, 856, -1564, -1358, 904, 192, -1212, 185, 1779, 124, -1018, 651, 1205, -606, -613, 1333, 561, -1403, -105, 1268, -570, -1512, 625, 1354, -913, -1197, 918, 73, -1973, -552, 1312, -185, -1104, 934, 1366, -857, -462, 1572, 700, -1128, 334, 1757, -778, -1515, 413, 350, -1913, -1217, 743, -12, -1358, 308, 1397]
2551A397j607o81K238k26k208M45J931j227j360J740J076k018k86J799k40k039
2567a266O95J606j041j246J201J150j960j30J528k78j327R70J402r26j085J476
2583G69M07j455k62J497o64j159O92Q63p07q66J226K47j599L48Q51n38r28Q88
2601c90J006o18k7P16L91j061K13K28k00p43M80O23p51l98Q21l59p02J12K55J96
2621b08l86N58L66Jn7K34r3n29r2Q5J77k04N85J41q2l55K79n57l17k77k0M62N9
2644b30j15L33K79q0k69k0N9j60j61M76J52j56R5L18K08o58k55L82l31k49L09
2665g3L98l54p4L24n8r31j11M94R5l87P24R00n11K2L26r4j135j42R71k38r70J021
2687A97J46n82m07P37K34j024K34O34k6j115J043Q05n84k03P07p3j582J6Q48L33
$$ y = [1397, -210, -891, 1347, 1121, -1087, -642, 1289, 62, -1298, 442, 1518, -500, -786, 1013, 773, -1266, -571, 1035, -6, -1252, -51, 1099, -861, -991, 537, 259, -1068, -98, 1304, 378, -707, 769, 1176, -279, -541, 956, 292, -867, -175, 688, -19, -885, 341, 588, -1011, -663, 188, -350, -1278, -390, 616, -2, -29, 687, 1078, 17, 230, 458, 258, -485, -5, 618, -133, -531, 290, -69, -771, -659, -404, -208, -594, -36, 330, 331, 274, 508, 415, -114, -206, -121, 56, -148, 437, 578, 496, 141, 420, -137, -454, -731, -751, -289, -230, -345, -12, 267, 187, -82, -102, -43, -203, -364, 112, 264, 108, 203, 521, 729, 71, -184, 198, -133, -382, -73, 325, -29, -103, 221, 163, -768, -879, -385, -290, -677, 47, 947, 436, 458, 784, 690, -445, -587, 384, 146, -824, 197, 343, -239, -646, 91, 325, -699, -465, 169, 143, -972, 71, 876, 292, 89, 796, 723, -859, -843, 5, 338]
2707C38q77O64J052p26j268L77M87j058J65J647l01j100P42J067q08j052J105
2724D54N82j288q81J108K19j434N66J616k20j367N66R16j529l78J685P04j046
2741B73j76J068o29k052M54J686q34j115J599Q09k019m74J901L04j547N95J790
2758A633j084k182J715J446j335o36J743K55k791k19J615m48j719J874K048k004
2774h9j544J806L55j632L84K702m72k196P32J562j921j589K668J109k434m13J693
2791G21q62k163J110K778j084j559J682P44k648o04K642N16j826Q16K022j865
2807D20k479J730J580j730k26K309l15k805J4K259p51j416J807J537k267j404
2823a737J549O60k055R16K828r66k150O09J351j938o04K541J148k345m98J549
$$ y = [338, -539, 125, 1177, 451, -817, -440, 47, -1011, -846, 801, 500, -600, 142, 1209, 401, -651, 454, 1036, -252, -1133, -25, 194, -1240, -674, 942, 722, -645, -79, 837, -692, -1070, 615, 1319, 273, 97, 1165, 536, -1516, -1062, 624, -210, -1325, 274, 1083, -936, -1410, 491, 795, -752, -157, 1633, 549, -1633, 82, 1528, 193, -443, 1300, 1555, -1236, -1455, 160, -288, -2007, -133, 1915, -89, -1633, 173, 528, -1104, -720, 1982, 1510, -686, 46, 1608, -313, -1902, 766, 1875, -559, -972, 721, -141, -2304, -1194, 1584, 500, -1059, 623, 1367, -1281, -1885, 757, 1273, -553, 263, 2285, 420, -2059, -329, 1251, -479, -705, 1604, 1289, -1516, -1502, 757, 6, -1410, 397, 1934, -333, -1737, -188, 472, -1583, -667, 2161, 1195, -955, -346, 1005, -933, -1537, 1004, 2152, -193, -691, 858]
2839H58p91k274J370K562j102j525J502M25k569m42K520P37j989Q43J755j625
2855B55k447J765K225j517o05K158m49l126n17K762k76j962J612K084k138k204
2871b380K267J493k344J31L321n66l551O53K395j707j594K711J994k787j396K121
2887G61j73l156R86L665j059k605J506J463k894j159L760J430l162K63K661j649
2903F38l144K063K744j867j771K567M45m176K27L456k1k483J737K729k985k566
2919b407K616J335l186N02L135n16l816J370K586j965j576L149J594k861j421
2934a461K752q77k929J698L046j779k382J908J069k787k23L414L69k652N72J922
2950A660k226j924K269J843j900n13K482p61k459Q30K237r56j596J924P75k728
$$ y = [858, 67, -2207, -837, 1725, 623, -902, 600, 1025, -1544, -1986, 534, 1271, -718, 125, 1880, 255, -2192, -427, 1798, 281, -324, 1834, 1385, -1741, -2258, 504, 228, -1734, -122, 1962, -176, -2380, -113, 1380, -964, -833, 2488, 1922, -1629, -976, 1419, -288, -1882, 829, 2823, 36, -1360, 761, 588, -2568, -1582, 2083, 1024, -1581, -75, 1388, -1506, -2665, 1095, 2525, -637, -374, 2287, 638, -2506, -443, 2301, 434, -1337, 1230, 1675, -2501, -2274, 1182, 1161, -1322, 415, 3144, 159, -2407, 209, 1544, -1642, -1140, 1995, 1479, -2337, -967, 1619, -346, -1922, 1227, 2821, -40, -1461, 1291, 414, -2515, -817, 2229, 450, -1932, -24, 1045, -1742, -1965, 1449, 1818, -834, -262, 1660, -566, -2490, -221, 1622, -278, -791, 1691, 930, -1529, -699, 1538, 582, -1014, 910, 1685, -1043]
2966a043j288K286J56j614J148K195j117k068J366J009j430k34K310k19k369m3
2982i55J397r36j269J712J285j226p23J415j9j338L71J533l86j597M64O67r90
2999e95j083J643J095j004k19J040k66j504L56J204k47j007P51O36j186r33J129
3016a90R09j098P9J101J20j857M26J082n99q15R27O74r96p73J212P33j121K57
3034G1J211l62j487L39Q29j084o55J453K68j352l80J645k47j531J363J155q79
3051C57r74J074N25j813p0J744j01j439N32J095j034j346J627O56j239l36J471
3068G29m16j572O01J362r08q57J385R68j512n46J596l2j473O15J082p57j221J178
3086B22N15j303j87J381L4j547P36R79j162n70J021N54r45l58J202l78p67L97
$$ y = [-1043, -2331, -45, 111, -1503, -355, 1840, 723, -1345, 21, 1030, -400, -634, 1676, 1457, -912, -955, 442, -494, -1763, -51, 1234, 8, -715, 700, 681, -657, -286, 1247, 861, -736, -272, 395, -595, -1678, -35, 1060, 56, -163, 877, 611, -893, -537, 667, 420, -587, 164, 800, -386, -1319, -190, 719, -379, -300, 801, 921, -936, -510, 572, -27, -842, 85, 759, -237, -1010, 202, 935, -186, 71, 1282, 920, -567, -228, 601, -483, -1138, 315, 583, -769, -1149, 496, 249, -1282, 81, 1236, 357, -617, 457, 982, -831, -901, 843, 742, -697, -165, 930, -104, -1450, 177, 833, -406, -742, 729, 313, -1259, -658, 704, -204, -1061, 324, 1292, -220, -766, 830, 798, -675, -60, 1022, 265, -956, 222, 737, -566, -753, 628, 662, -885, -149, 830, -332, -902, 119, 673, -272, -630, 572, 194, -573, -176]
3104a76J058l62j107Q50O76j313j18J153m39j101N40O36m70q42R78M33q82j03
3122e89J076k86o05N57O11m88m94Q54j81p48k0N26l20n05L54M46o73p9M72J47
3142E5k35J06O00l88Q7j36M11l70l62L20L11n28K27R8q5k17J54L1k22j29J66n
3164a11K7kJ2P8o0P5K03k7l17K63R8n25J07Q1P3J30k00K48j5j27L7o9K67J9j70
3189I5k5n8k99j82M06j22l05K66P5k38K30M62J92m27K07J97r5k39J80J9k42l56
3211b59J99K71n63O7N92p18N3K96R8l52p2O34L70p22P5N25k55m37O95J61n87k39
3233a68M55q7q09L57N01k16r05P91K52k90J4N75j53k59M4O60q02j54J68K54l74
3254a46l3L19J65p09J23O26k11n55M33L19m18l96M57J17l82J63O52k18o85L02
$$ y = [-176, 882, 520, -587, 263, 939, -374, -492, 661, 222, -879, -339, 297, -173, -1015, -37, 396, -486, -589, 487, 201, -404, 153, 764, 276, -218, 636, 455, -293, -313, 213, -107, -612, -258, 188, -485, -564, -92, 55, -180, -74, 526, 138, 225, 89, 500, 130, -232, 88, 399, -129, 98, 196, 111, -106, 48, 79, -143, -272, -106, -111, -84, -86, -74, 4, -56, 19, 222, 195, -122, 141, 239, -286, -179, -98, -25, 105, -95, 153, 138, 11, 48, -21, 246, 265, 95, 70, 12, -287, -469, -63, -185, -490, -224, -149, -387, -157, 305, 497, 70, 277, 474, 379, 140, 320, 339, 97, -259, -60, 211, -352, -285, 307, -411, -358, -62, 36, -316, -388, 246, 616, -106, -31, 494, 239, -198, 497, 658, 71, -168, 287, 200, -609, -252, 249, 33, -872, -81, 171, -119, -105, 470, 317, 58, 102, 762, -40, -194, -26, 228, -146, -179, 140, 305, -404, -281, 345, 134, -421, 12, 331, -87, -483, -26, 91, -291, -128, 524, 306, -379, -77]
3274g7L79o07k20P74J62q49jP64k20o06M66P77n84k74M99q3n56k23O01k83o08
3295g69L02J37j75j15N92N65l36j18M94j21o94L36K09J34r49N11M16n58p71Q03
3315a07M73r12J77O10k50q77P21N97l66l1M42K37r13k75J075k47o36O69K41o18
3335A0p77L10M20p01LJ184j27r26M19P71j92p32Q66N09j014p50J021J38r48K95
3355b21P66n4j070O35K03j010k01J000O75r35J96N83l84j055N17P03m14m41J082
3374E75J03j192J25R22j98o72N71K45o61n50N45O37n78J43P93j42r60l70O17k22
3394b69k91N59Q54q64m91N93O8r24M50R66l4p11K63N52p87n80P21K89q00p4M80
3415c0k12p74P84R58k39o65N76J20j128k98J136K19n72M61N56p97j033O26P12
$$ y = [-77, 302, -305, -525, 249, 411, -438, -439, 325, 105, -501, -35, 742, 158, -116, 383, 300, -256, -479, 122, -161, -769, -467, -330, -505, -620, -28, 537, 201, 83, 577, 456, -238, 98, 307, 441, -508, 3, 419, -139, -910, -107, 366, -546, -369, 241, -9, -886, -165, 432, 66, 35, 477, 714, -199, -474, 601, 354, -282, 387, 628, 10, -767, -457, -37, -738, -735, 449, 322, -604, -185, 586, 394, -338, 528, 1037, 23, -727, 294, 432, -516, -221, 545, 491, -579, 56, 259, -751, -952, 48, 723, -212, -16, 567, 183, -872, -355, 348, -66, -507, 575, 678, -514, -389, 533, 335, -337, 234, 479, -182, -732, -187, 450, -128, 15, 808, 666, -294, -664, -47, -269, -560, -1, 853, -11, -502, 91, 159, -765, -315, 651, 617, -94, 169, 721, -66, -646, 75, 364, -436, -510, -30, -242, -1016, -232, 726, 487, -178, 398, 518, -610, -908, 228, 447, -125, 336, 892, 95, -938, -312, 400]
3434D00n74k54J074J8j218j46J202n76n08L85Q02p13q08J004J36o65K74J274k81
3453H26j173L13M48p83n67J338M46r72k10R27m03j147N66R80n65o81R35O38j462
3472e46q9J303j81q97R8J030o13q47P99O79p91n70J215j00j537M29P28k30l24
3491d44O92N40r99m80P32L82r77L65R92l45q77M70M38r01r7J159o6r69j36O50
3511A29j38p63O78Q50n14p73N99K30p11K8P95j71l40J45N88o42o90Q28J79m07
3531a00j44Q84n57m90J70O70k6m63K48K21o84k39N18J77j98Q6L33l48l67L07J65
3552A63k35k00P01K7n89N3J27L2j40Q9K29j36n76M06o6R1m47M46J07l61J59J71
3574E1P5l38J09N26r6k82J95L8j92k48J95J62o39L08K69m36k91J18O82m64O2N42
$$ y = [400, -174, -428, 646, 664, -554, -700, 502, -74, -582, -197, 605, -108, -916, 88, 224, -441, -167, 1107, 826, -347, -34, 414, -369, -936, 402, 848, -124, -334, 593, 190, -957, -391, 589, 24, -657, 278, 916, -546, -635, 668, 487, -410, -312, 718, 105, -742, 57, 736, -55, -625, 590, 490, -1047, -618, 110, -120, -444, 248, 788, -211, -691, 41, 423, -554, -189, 803, 458, -419, 51, 489, -412, -509, 650, 584, -385, -521, 129, -9, -772, -94, 756, 242, -531, 68, 298, -413, -385, 410, 239, -101, 44, 632, -10, -700, 128, 307, -100, -244, 640, 83, -407, -237, 433, 407, -56, 192, 413, -271, -510, 8, 185, -13, 73, 406, 58, -309, -2, 163, -72, -272, 429, 456, -133, -80, 47, 79, -61, 28, 257, 121, -455, -49, -115, -24, -471, -25, 82, -279, -120, 51, 126, -212, -103, 423, 327, 45, 240, 278, 86, -162, 33, 195, -444, -136, 133, -303, -594, -476, 206, -258, -196, 346]
3596C46k22n05L42K07o6k29L26J68j59n33M25K38p53J61M69j47o22M09K06k79
3616b18j93L14M49o39K32N54j96o57N44L65o08j80M43j4n56o1N68l23k65J34O55
3637C48k40n13M45M27n90l0O20n02j49K19K57m55n3K69M84r79L21N00Lm27O7M78
3659E00n25k31M00j65j35J11K20J41k68L36n2m08k24K65L76n90j08M49j34J03
3679F1N7K21k56J35k35M61m40K6J78l0m39M9J22j63l8M92j11q8q5M29Q7j74K3
3702B82j99k09j30P6l5K06q0J30jr4q7J21k2j50l3k7J34K03j32L3k9K5j43K07
3726D6J08l4o3q8J66q0j09k19q4J06j94J66K27J6K28O6n29M86J05k82j75K08n9
3749A2j49K29j60J38k08K1L22k12o2M63m67j00J02O7j51j4N2K7j09q5N70k49K5
$$ y = [346, 124, -381, -39, 168, 102, -127, 199, 367, 208, -325, 100, 338, -415, -254, 215, 68, -554, -145, 61, -218, -411, -97, 352, -287, -55, 499, 303, -354, 190, 555, -53, -233, 210, 196, -360, -421, 147, -176, -441, -307, 348, 108, -405, 40, 467, -123, -153, 467, -35, -184, 35, 292, -163, -216, 53, 537, -442, -121, 379, 382, -45, 22, 500, -25, -256, 144, -21, -156, -45, 175, 316, 48, 384, 332, -76, -300, -35, 341, -249, -357, 92, -42, 61, 118, 339, 83, 218, -17, 444, 4, 30, 208, 178, -261, -212, -90, -253, -291, 201, 90, 2, -83, 346, 433, 259, 282, 83, -126, -256, -180, -215, -9, -89, 41, 40, -54, -141, -20, -42, -192, -225, -252, -118, 85, -47, -14, -43, -18, -161, 46, 154, 120, 57, -31, 135, 55, -54, -273, -357, -251, -445, -279, -52, -36, 192, 258, -271, 215, 320, 38, -137, 71, 12, -137, 92, -68, 70, -138, -117, 205, -7, -69, 394, -73, -173, -71, -4, -155, -169, -117, -90, -199, -284, 286, 37, 62]
3772F2L07q8p1k94J66N0m84K16J58K53n19L24Q8k52J38J49q4m27K3M39k38j30
3794b14K71k7m0OL85j72l69L92J25j55j30P4m0k30J12J62k32l00J33L09lq6r6
3817a25L36m11p3P78n01j6K59n9Ln00K17R8O1L2m9k6k30K16K07p9k03R5l1l85
3841c86R1M01m6j88J54K86k39l12K84K06j84k61M52j19j14O3P7j93p5j21M03l21
3863a42j5K78k38k3J72J14k17J53k7M0J0k55M44k4j62J79O3l53k74K96J72j76
3885A5j19oJ52j05k40K77m6l51L60L70l59j43K09J28r3Q1K07j5n62n2L61k23p3
3908b27Q7J95j35l97O05k6k28Q8L40j51m21M07K21o06j46O46k0l93j36N62k97
3929c2k77M34Q5n31Q7K44J71n04K06N04k45j99J34Q08r24k86N75q1m59M5M64J2
$$ y = [62, 369, 281, 210, -84, 82, 132, -352, -136, 22, 275, -244, 80, 168, -84, 54, 203, 119, -308, -285, 154, -84, -214, 57, 30, -10, -4, 381, 209, -160, 232, 357, 202, 72, 146, 106, -124, -12, 150, -82, -382, -249, 60, 57, -29, -125, 211, -200, -273, 505, 4, -12, 247, 188, 191, -309, -92, 6, 67, 99, 50, 24, -206, 10, 217, 138, -65, 30, -1, -386, -295, 106, 60, -128, 26, 312, 73, -239, 45, 251, 67, -194, 258, 139, 25, 88, 165, -28, -103, -224, 179, -142, -157, 121, -117, -140, 32, 146, -71, 82, 55, 95, 105, -150, 294, 270, 108, 287, 350, -3, -277, 19, 191, 15, -104, -110, 42, -63, -303, -26, -72, -423, -63, 307, -52, -195, 14, 142, 49, 130, 337, 322, -240, -292, 69, -154, -227, -140, 55, -80, -477, 128, 102, -126, -38, 302, 151, -270, 137, 358, -248, -394, 252, 232, -161, -297, 265, -32, -309, 125, 210, -321, -234, 10, 181, -323, -117, 387, 142, -57, 77, 885, -39, -325, 250, 169, -290, -245, 219, 231]
3951B31m96K20L60l71j45N14j21k08j37K32K6m54K79K61j96j97J20L35j50l76
3971b73N55J02m04K14J87j02n11K98L64n17j85K82J82n48L37L64l89l26K44L51
3991B25r1p18O22J54k95l7L56j06j58K9L45l51l15M51M44q83L98O3K1m54M3L21
4013F4J32n92K79J30j06k7M33J92o48J88L46j66p06O19N82q19j95L73K06o16j28
4034d59P40p5l58J8L54l86l8J77R1l70R2L97q6n45L27M79l89q3M31M7m13o7K32
4057A16j93l73M38L61k60l09K60L38l38k81N42o3o29M67K0J32k36L7L54m13k81
4078c11O31j93j86J54L19m68l59L05J04j94k46L55J94l86J67L07j06o17N73L28
4098C71l16J21o7K31p45J42K74j31m4P0J12j12J0L29L2m08M0K32L9n07L16J19
$$ y = [231, -265, -45, 315, -56, -201, 313, 192, -16, -153, 79, 105, -349, -70, 191, -5, -202, -82, 253, 103, -273, 282, 384, -20, 194, 381, 279, -232, 66, 430, -87, -272, 10, 192, -356, -19, 345, -44, -370, -126, 225, 134, -584, 38, 192, -103, -140, 216, 110, -48, -19, 326, -25, -340, 111, 555, -328, 70, 133, 154, -300, -257, 64, 196, -396, -117, 13, -93, -120, 313, 505, -143, 45, 391, 225, -481, 138, 720, -99, -294, 79, 285, -331, -459, 281, 206, -152, -134, 220, -166, -204, -27, 64, -306, -214, 183, 97, -448, -121, 358, -31, -114, 317, 364, -49, -116, 116, -77, -450, -12, 349, 89, -220, 40, 378, 40, -241, 301, 238, -391, 76, 96, 228, -8, 29, 383, -30, -311, 320, 127, -59, 95, 414, -54, -413, -108, -4, -198, -444, -89, 105, -281, -114, 193, 87, -530, 43, 371, 55, 176, 109, 340, -405, -263, 11, -120, -164, -94, 18, -94, -84, 245, 277, -131, -91, 141, 180, -327, -11, 108]
4120A08k30k9mM04j82k03M27m0o0j04K00l65N8q4J26L3j97K44j37m6j11L86L4
4143B28j58O6R2o7m13J61L07k98R5K30q0k62Q9L27k44l04K09J6j11J9O6Oj38J25
4167c9J58j89j04K32K25m5l14J99K84l78o4P6r8k17J92K18K8k36L00L1j61j46
4189d8J28J5l07K58J93n34K02J28K63l11N9m4q7K2p0L55n4l22N7L45k89m4K44
4212A59j93j00J47J20m33J22K2K85m26M39M8p3j14j63L66p3k09L53l92J5R6j71
4234a75M48k87K1R8M6l32K70j20k12m1K20J53k63M73l06L20j59k29M40m12J67
4255A20n5J04j23Pk55J74o8L42k59j72N8j68M87k84L35Jj90nq4Q8o5J81r9R6k36
4280g0P7P9l66N6K47k23o3R6Q1o9L0K40j72L3o7K23o2n9Q6P8k90k8M3k67M32N0
$$ y = [108, -122, -151, -155, 249, 67, -136, 291, 251, 191, 87, 287, -78, -20, -104, 22, 55, -142, 102, -35, -81, -192, 194, 228, 70, 136, 228, 161, -252, -91, 216, -82, 13, 243, 163, -99, -10, 317, 73, -231, -22, -6, -117, -98, -32, -26, -164, -39, 119, -70, -174, 58, 283, 238, -76, 123, 407, 29, -35, 41, -57, -274, -82, 136, 164, -72, 228, 259, 98, -48, 80, 95, -212, 46, 239, -295, -93, 35, 298, -13, 46, 2, -85, -63, -133, 222, 168, -154, -97, 248, -41, -85, 159, -34, -134, 13, 133, -300, -178, -156, 129, -297, 142, 190, 117, 3, -160, 206, 133, -76, 277, -115, -100, -4, -175, 273, -14, 7, 105, 151, -181, 89, -31, -243, -284, -64, 89, -174, 299, -7, 313, 154, -75, 365, -47, 120, 65, 169, 46, 53, -202, -28, -96, 246, -13, -185, -127, -295, 192, -92, 243, 244, 54, 49, -35, 53, -12, 169, 70, 166, -70, 7, 86, -280, -224, 23, -200, -263, -167, -86, -155, -125, 115, -57, -24, -91, 132, 70, 11, 97, 175, -115, -143, -100, -367, 65, 115]
4306A15j52pL8l5L7J21k73K54o3j29J07j21Q1ql3j17J53k1j3o0L15j94J13P3k4
4331A57m1k77Q6Q7k19K81l24L60k11%O9j74k6M48j62j54K82J9k0o6q3M2J60l06
4355g2j8J64k63J9L71o7l51nJ5rK93l2Q8r9j34j07J24J10%J45k24J43q8kl15J89
4381a25M16l23K9j47K48j37k7mp2K14KL3k0p6K17k60R4q6J24k06j7O4J48j90J2
4406h9m9R3N2j32K22Q7l50K12o1l0J18j11J39k53p8L13O9l07L6L31o3qj49M6j66
4431a28j78J70O81p68M4M24k44j22J58J71l22j39K11J79m0lr9P7j61l0L56j79
4453E8k83L00O1J2j12k9K29m02Q9J58k84n2K92K40m83r1L92N03n81l18N78k53
4475B4k37J39K66k99k02M21J00n82L65J5N7Qr0N9P6l23J49K71l66j24N09j24q6
$$ y = [115, -37, -44, -6, -41, -4, 117, -156, 98, 35, -94, 13, -108, -27, -35, -68, -185, -32, -53, -66, -126, 189, -5, 108, 181, 157, 116, -161, -75, 12, -207, 74, -250, 110, -101, -101, -32, -206, -232, 216, 54, -100, 182, 201, 181, 115, 32, 74, 234, -72, -90, 74, -189, -170, 201, 134, -217, -222, -207, -216, 77, 45, 133, 34, -100, -207, -83, 27, 27, 172, -52, 91, 3, 1, -314, -125, 291, -32, -3, -150, 98, -39, -66, -70, -142, 72, 74, 107, 87, 11, 228, -32, 62, -24, 100, -106, -123, -59, 89, -101, -89, -138, -45, 7, -125, 97, 184, -166, 46, -15, -45, 73, -38, 101, -152, -230, 83, 152, -155, -119, 212, 149, 141, -8, 38, -128, -306, -136, 545, -223, -179, 245, 1, -121, 37, 208, -114, -253, -42, 137, 97, 94, -5, 72, -89, -119, 237, 58, -225, 75, 136, 148, 36, 7, 236, -166, -77, 81, -203, -255, 37, 277, -206, -297, 95, 598, 17, -301, 277, 24, -213, -74, 192, -107, -309, 112, 212, -370, -5, 10, 67, 75, -15, 44, 120, -203, -54, 217, -149, -273, 236, 112, 26]
4498B6q3M14j79m41L41K62o6n63L45J47m10j26P20k70n35K26L26k43j62L67J39
4519B35p2k55K86j7m14K58kj14oJ78Ok94m8J38L81n07r2M93m4j91m5N53l17r9
4543A1Q9K42m97J06K03l6m18O34K5l31m06M86k93J43K1L16j01m33J33L71l75l03
4565d13N71K25l93q3K99J6m66N2K98L6k77L02K2l49J19Q1j03k17M7M55m2n67N20
4588A33J33k44p9K92o6j94K34O2k83k31L34L82m99k69N11j10l57k4L98R8l33r7
4610b09L83q6n38O58p5l82L4L79M1n01M15J24j12j62K35J25m50j05L13r3p8l64
4632d48P79k73k85Q7K26j87N9M44k66j70o9K2N9m7J37K07k90p1K91J02n70J24
4654a39L38j09l48K66Q8k68k33M53J56k76J18K71M5m61lM55l09l17N50m7l58j75
$$ y = [26, -57, 357, 178, -263, 78, 340, 274, -289, 56, 203, -207, -333, 387, 117, -418, -192, 134, -109, -271, 96, 235, 163, -92, 194, 177, -237, 21, 19, -95, -101, 77, 83, -211, -259, -121, 260, -247, -339, 154, 110, -81, -126, 427, 110, 11, 100, 342, -155, -49, 154, 118, -300, 334, 359, 28, -378, 108, -185, -42, -21, 295, 194, -239, -106, 265, -110, -413, 158, 383, -10, -93, 206, 222, -244, -192, 106, 142, -135, 167, 189, -160, -41, 40, -63, -280, -233, 222, 180, -387, 133, 266, 22, -57, 235, 169, -25, 209, 271, -12, -243, 91, 473, -26, -295, 216, 106, -251, -275, 123, 221, -112, -209, 174, 88, -450, 208, 133, -249, -215, 164, 205, -296, 119, 243, 131, -31, 204, 329, -121, -226, 87, -6, -84, -448, 331, 58, -227, -140, 86, -101, -42, 402, 136, -34, -103, -81, -22, -69, 68, 275, -15, -86, 205, 307, -263, -139, 199, 90, -258, 8, 96, -172, -405, 48, 204, -72, 46, 317, 362, -99, -102, 353, 44, -273, 277, 230, -128, -303]
4676c03J99M04m34J99R5q5k85J35K60l44j14M54p0k17j44L53J2l04K8K41O7m58
4698c11N71p8l20M7K53J3n88M45M1k03N4J43r4P8j43P2J27k54K68j5j47p1P4O2
4722B4k7j02J98Q6L5k63L03l39k33J17K72j00j56J17l7K6J15J4J77m74L46J76
4744B75k74k82K94J36m85J70M85k09J49k43J55l14j40L58K5k7j84O2rNo6J60o5
4767b4J8K91k08p3J36K37k03l9J14j36n5j35J05J67j27k61L10j56M6J08n54O48
4789B09j16k55J70j56j33N48K8l39P3r3J30J03k57J0J81m13K18K08k05j48M06
4810A69j08n4O1K2o6j76J82J58j7m07J70M40l62R2k69M97l70j37K93L9o9J83j84
4833H7j4kK65m53K09o6N1p3j22L17j84j81RJ28J06p4j60R9J47j81J94k46J88k67
$$ y = [-303, -104, 300, -134, 65, 160, 75, -210, -75, 185, -159, -273, 181, 111, -106, -250, 103, 115, -189, -161, 80, 147, -311, 260, 182, -138, -91, 162, 175, -413, 32, 73, -130, -76, 67, -27, 51, -92, -20, 107, -147, 121, 106, -41, -112, -38, 24, -3, -105, 93, 179, 214, -49, 254, -85, -318, -201, 71, -29, -185, -68, -105, -79, 36, 50, 227, -247, 99, 275, 1, -281, 13, 149, -336, -166, 319, 110, 259, 16, 171, -143, -283, 75, 100, 73, -111, -49, -58, -53, -119, 41, -24, -6, 285, 77, 4, 140, 377, 174, 135, 249, 113, 58, -77, 28, 195, 68, -193, 117, -39, 7, 115, -439, 209, 93, -162, 8, -148, -281, 267, 295, -44, 29, -64, 66, 169, -88, -78, 103, -310, -92, 116, -89, -237, 169, 61, 7, 68, 90, 24, -152, 30, 188, 171, -236, -66, 374, 12, 104, -165, 332, -38, -175, 118, 157, 88, 271, 87, 73, 71, 336, -117, 92, 26, 77, 4, -118, 199, 15, -166, -157, -29, 77, 3, -157, -58, 89, -92, 102, -144, 44, -223]
4857b23J07J30jk10J1K96q1J75j52q4J06O3o4q3J60j23N0m4p9J07l6Pq3kJ51j42
4883d4m4q5O3N4r5K83k46J60J48p9r5J24J1K33j69j32r0j08P1J9k23J60J53o1
4907Hm42L28K3n6J33l2K01j93J23J18k0k44J31K0j90J44q6J09N0j57q1L0M2k39
4931b80J18q4J5K40QN2k36J29J90pk46L85o5j23j58L17ql28R7J23l42P6M37k88
4955B2j15j24L09m0j11j29K90j64J69j39j12L0K24P4l59l8J06J68k57M45j27P0
4977A92k65K9K7J97k51J61j92J61k10J74Nl77J53L60p0j21N2K62k67k57K11J00
4999G4M5qJ93r2k08k18L04j45Q9J07j88p7P8K16m3l59L72J29k49l91L39J44j98
5022h6n7J15J2j40n6M64l93P2rK85m0l54K06K92o49M54L8k06m6J09K51m56P9R4
$$ y = [-223, -116, 14, 13, -197, -186, 110, 29, 204, 52, -32, 74, 137, 73, -10, 150, 27, 77, 33, -46, 61, 25, 32, -51, -53, 98, -44, -88, -173, -110, -56, -151, 132, -114, 46, 194, 115, 20, 144, 155, 388, 219, 87, -3, -111, -40, -21, -244, -84, 69, 8, -434, -106, -83, -139, -6, -38, 163, -30, 93, 211, 191, -53, 78, 98, -92, 52, -34, 75, 125, -32, -113, -83, -41, -280, -162, -246, -231, 9, 17, 69, -167, -38, 152, 145, -101, 284, 219, 96, -62, 255, 247, -81, 16, 139, -203, -127, 310, 22, -93, -217, 92, 52, -59, -188, 102, -62, 107, -32, -144, -114, 110, 184, -175, -213, -107, 61, -196, 249, 122, 192, -73, -44, -17, 180, -71, 90, -102, 59, -151, 23, 28, -349, -196, 164, 94, -27, 25, 287, 20, -237, -26, 74, 119, 111, 304, 212, 4, -214, 90, -55, 34, 141, -47, -124, -46, 170, 127, -232, 140, 269, 20, -371, -32, 112, -86, -143, -28, -16, -156, -212, 252, -141, -69, -78, 207, 167, -187, 19, 311, -338, 116, 154, -52, -98, 11, 262, -194, -115, -21]
5046b1K09l88J41L10k40l45K08M2J28j52K17j7j34P6J32O9m76L75Nj61n0L21l1
5069B18l63j42L72L6l17k1L53J20l45K5J91ml20K45J71m55j3O08l61q0q5M77m69
5092a59QK42J18k33n8L54m05k43J84M02n38K40q7N38n39j56Q43m35j8lK96l20
5114C1m39N88q9l26m9O55k93k85M5N17l38j78K56K07k78j93K82m7l73J57K96m6
5136A00k02k5K82l12j64N19L41p16l0K69O1k70K28M6j15j45L51j32l67j13L55
5157c9K6j33J7J93nm83M11L13j74k77N23j11m58K81K1n2k45J35M34l45m49N22
5179A05j39l14k2N05R7l60k5K67j87j21K54J00l24J48M46l5o14M3L06j78R7P7
5201A26j00m13J87K26k5P4k30L71j47j03j7K72k03j40J23J40l86M4K14j4k67K29
$$ y = [-21, 188, -200, -59, 251, 11, -334, -126, -84, 44, -108, 109, 92, -42, 34, 166, 235, -241, 134, 139, -22, -72, 249, 218, -145, -287, 85, 121, -196, -217, 136, 256, -89, -64, 127, 123, -197, 48, 219, -236, -249, 359, -2, -82, -167, 310, -159, -151, 91, 209, -24, -82, 272, -133, -376, -192, 210, -328, -88, -175, 363, -176, -332, 511, 76, 58, 55, 351, 31, -408, 180, 91, -235, -284, 371, 78, -207, -162, 355, 17, -161, 95, 302, 24, -169, 113, 66, -307, -150, 146, 100, -102, -127, 155, -157, -321, 198, 539, -177, -207, 62, 123, -147, 81, 127, 12, -133, 218, 86, -281, -394, -39, -13, -146, -129, 64, 59, -424, -13, 300, 126, -151, 372, 261, -197, 84, 105, 53, -192, -57, 377, 32, -417, 105, -34, -348, -370, 135, 232, -128, -153, 114, -73, -194, 60, 160, -164, -16, 430, 395, -219, -176, 130, -48, 49, 126, 26, -387, -200, 26, 1, 75, -155, 216, 69, -34, -51, 221, 18, -122, 1, 141, -245, -201, 13, -1, -268, -39]
5223c9K66l17k9J6j53K3L02O6P8n11K07K27l17k7K33K41l19j30L50j38l75K40
5245a06L63l28k09L85J28m97j8J99J86m2k29M59r6l91O8N97n87j50K89L20m58
5266a17q7K22j70m2L53Q2j31j60j63K70k21j76N52j57j57LJ95k17r0L20k74J92
5288B7k34K11R2r6P0L4k84j0O9Q5o7o2K83J13n47L64J50l89J44J38P3j09L5o4
5312B6P3j98Q6j19N7q2K60j77J23l8j77O7M2k3L49k80k4l1J68l1k42QL38l07K95
5337A63j96j2J97k19Q9j0K80j29Rk9k04K65j52l8j13O2J1j28m3K02J09j95R6j5
5361@J21k13J97J17k09K6m0q5r6J7K43qk43n0J64q4L21j21j17r4J28P5l16K58
5385iP1J57k15o2J75j98J12j57O1J57o5J52q8j95J64Pk18PJ82nj00J52k37Q2L4
$$ y = [-39, 227, -90, -119, -103, -256, -233, 69, 135, 213, -298, -91, 136, -181, -208, 25, 266, -53, -183, 167, 29, -346, -106, 257, -71, -280, 105, 233, -264, -282, -83, 103, 61, -168, 291, 195, -196, -128, 469, -118, -268, 21, 341, -117, -204, 18, -152, -194, 159, 241, 110, -50, -213, 57, -164, -340, 212, 55, -102, -99, 96, -121, -211, 109, -165, 27, -207, 4, 96, 0, 70, 104, -180, -190, -121, -36, -103, -165, 118, 231, -316, 48, 198, -191, -47, 91, 164, 55, 90, 26, 99, -99, -13, -132, -75, -157, 103, -74, 49, 11, -166, -99, -57, -80, 269, -11, -35, -66, 102, 71, -171, -163, 175, -132, 163, -33, -45, 152, -67, 22, 12, 292, 163, 172, 143, -61, 204, 52, 14, -99, -37, -26, -154, -197, 5, 114, -81, 15, 0, 121, -92, 105, 222, 13, 39, -1, -86, -182, -165, 78, 70, -173, -223, -59, -143, 178, 57, -60, -154, -26, 49, -267, -9, 62, 219, 4, -58, 117, -81, 31, -126, -65, 92, 27, 179, 91, -104, 60, 67, -151, -144, 38, 33, -67, 85, -152, -70, -36]
5410c6r5O8RJ4n8J25J32l13J98R4k48J33K16j35k28J81k4K2l7o5M4r3q8K76l37
5435b45L03L4Q1j39k5N3j26q1N24k61k67J59K4K70l18p8O7j27J88Q4l95N56m58
5458a77J98j01J58l1p2J52pk08K39K2k41o1j0M3J15j54J40Nk7p1J36M5j80J21
5482C4J68k85L37j83n3k68L00r3p6j72J06L14m12M61l2n06K19Q7J97K6o1k5J27
5505B10k98j50L81j53p4N8J30k52O1jK41k73Q6L2J9rK10k13J09k98L31j62J05
5528I0l20K46Q4k14O2j48K63k52J97K06j69k27M56j99j23r1K88k02NJ96j59l9
5550e0P7o5J59k74O5K46l75L08J72k25M2k10J19J47k33K36j34J06j78J4K95l23
5572h1J20J20j03j70Q2L04k33l01J02K74p3k27L11N5j10l80L38J22n68L82K30
$$ y = [-36, -131, -63, -54, -40, -98, 27, 159, -154, 44, 138, -110, 23, 239, 104, -124, 57, 33, 55, 18, -47, -3, -96, -184, 92, -245, 58, 92, 173, 34, 9, 62, -64, -145, 379, 118, -149, 10, 34, 304, -14, -92, -25, -152, 36, 120, -275, 281, -177, 21, -80, 78, 47, -25, 127, 120, -88, 151, 173, -68, -129, -139, -96, 19, -135, 5, 10, -17, -88, 48, 93, -87, 34, 202, -83, 254, 71, 18, -250, 50, -43, -119, -291, -185, 129, -283, 178, 146, -360, -141, -54, 143, 169, 108, 83, 210, -88, -238, 143, -10, -84, -26, 104, -148, -87, -88, 153, -120, -34, -2, 17, 8, 218, 5, 114, -184, 147, -15, 90, -230, 16, 100, -114, -52, -200, 63, -189, 8, 214, 45, -182, 274, 75, -48, -139, 149, -53, -48, 148, -11, -50, 27, -38, 121, -153, -88, 158, -217, 91, 263, 38, 80, -130, -11, 136, -97, 139, 5, 111, -67, -53, 242, -81, 39, 159, 56, -114, -32, 272, 39, -262, -160, 114, 41, -186, 125, 180, 70, -310, 28, 150, -418, -36, 194]
5593A94P2l95L10K18m94O4J58P4n93L29M09l40o6J19j94Rk02J84L48n12J64K79
5615A35Jk94O2J33J94m68K25K25l96J40R3q2j01J03N7J92k57o3J30r2J8R0L8j76
5639i3J17L68l28j08J18j79j00K07J54O4l96K19j76n8N5j16N79m14m1K97k31j22
5661a84P0J50j63p6L20M4k35k37K58K74l78o6M12j76l20L00J33m9k39K66N3l71
5683b14K1J68J34k92L65j78k1k81M29j27m6k57O98l78j99r1L89j18n73L14N81
5704C24n38n8M96K3m83j08O48k10k91R2K36l45n9M10J34m63J06J35R0k41P5K60
5726B33j21n7j98K75k82o6J72J12k44K20L83k49m14L49k8j59K8K19J0j18j24M6
5748a3J16l24M32J74m09p8q6J62k42N0L64J5k51k9K90m62L5L73K27n72L1K34j09
$$ y = [194, 266, -129, 181, 399, -95, -31, 127, 201, -392, -63, 346, 6, -60, 59, -135, -126, -328, -144, 204, -308, -144, 135, 136, -158, -96, 37, 231, -237, -12, 213, -183, -43, 50, -32, -133, -30, 27, 219, -38, -101, 29, -63, -45, 45, 83, -93, 24, 392, 64, -44, 74, -105, -205, 2, 156, 220, -176, 43, -133, -191, -136, -252, 327, -87, -128, 169, -62, -184, -114, 36, -127, -203, 117, 161, -74, -311, -53, 221, -157, -223, 189, 13, -307, -7, 126, 77, -162, 104, 157, -214, -193, -25, 109, -183, 182, 4, -17, -298, 131, 4, -42, -299, 399, 21, -178, -269, 120, 2, -571, -257, 324, -214, -272, 224, 247, -236, -344, 304, 94, -197, -105, 131, -214, -273, 137, 271, -192, -86, 49, 139, -102, -27, 233, 112, 55, -143, 132, -150, -216, -44, 68, -176, 44, 427, 178, -236, 113, 85, -74, -46, 173, 183, 65, -59, -13, 103, -221, 211, 385, -24, -102, -188, -26, -268, -218, 146, 161, -90, -119, 171, -291, -256, 117, 344, -228, -197, 37, -72]
5771g2M2pK29l9k68M14l25j61J97K3K22l98M0K84j53k24J7L89Qk42L17k12K3m05
5795c01K72J18k25Q3Q3K0J8j19L06o21J25L32O7j85J51p6n0o0L4R8k04K44O1k08
5819c7k04K8K86m8m0O0J72l04pL87k53l28K82k1L0j94K62k0k84n7L71Rj07j0Q
5844a9J17j46j21R5j25J29O4P5l12R1J68J35l34J17JJ45j69K63o9j65K7m4L12
5867B35l71M6K10q5j81J25K71p6k79J04J79Qj69K13k64nj63L32k98J75j48J00
5889d1k74K24J78K12k17p8J07j4M5j52K37k47j67J27K18l22j20K44r4j25J78K37
5911A56k18j20k06N78k08J53Lj75j24J29j0oj49K17J95q7k64J90o9k12K60pJ90
5934B16j99J72k9j85J15j26r5L19j54R9K08l46K8K4k8Jj5K9M1j34J23K0j32p8
$$ y = [-72, -30, -37, 192, 153, -115, 299, -26, -187, 10, 33, 255, -143, -103, 181, 28, -196, -179, 210, 218, -24, 293, 81, 104, -301, -29, 89, -136, -53, 30, 50, 68, -51, 255, -366, -241, 91, 158, -27, 124, 48, -2, -62, -28, 70, -134, 110, 171, -37, -241, -213, 73, 25, -15, 45, 217, -87, -94, 293, 40, -288, -6, -27, 3, -191, 71, 51, -233, -290, 81, 90, -17, -27, -19, 98, -48, -169, -74, -199, -70, -6, 69, -243, -152, 16, 151, -183, -66, -65, 80, -89, 174, 105, -60, -33, -77, 235, -136, -90, 120, 35, -146, -21, 250, 174, -105, -1, 178, 186, 17, 230, -34, -39, -202, 130, -168, 7, -141, -41, -315, -91, 87, 299, 82, 4, 111, 97, 142, -10, 227, -20, -187, -60, 158, -164, -284, -40, -134, -259, -81, 156, -62, -182, -388, 190, -18, 135, 138, -37, -161, -32, -42, -48, -197, 20, 215, 128, -136, 54, -15, -227, 33, 26, 216, 17, 189, 160, -25, 90, -36, -131, 188, 34, 133, 341, -5, 23, 47, 19, 20, 5, 34, 75, -59, 64, 84, -48, -126]
5958a26J10K58J5k24M2m8q5o8P6P1J49k28Q7k20L74r9k41J62l0L0k31K15J30j48
5982b9q1K25M0k24n3K31k16K83n05K36O2L1J2N4j45p8K72n6j8o3L8P2l96K89K58
6007B39m60J25q8K82k69J51N0j51J52P4j24J29l20Q8L71q3k27l4K41o8k04L86
6029B60k54j2J32M0k59K29q2O1l50K55j62J80j64J29l2P5l9L6p3o5J77j62O8j07
6053a19j32J91o6J06j6j40K10l42L66j68J88j27K46l0k19n5L15k66J08o3J20k34
6075a27n0K37k84J67j6J24k52K31j5M3k26J67J86j16j03o7J21J15j43j83J87k42
6097b46K19P5j67L33m63M28m25K58K5J87j74J8R1O2j65j78L03k69P9j40K77j7
6119A11n3N2k97R5K14m0j14j61K75j56J98k27J88l05p9P5M01m58L05q0j3k84L92
$$ y = [-126, -16, 242, 257, 33, 75, 27, -58, -126, -50, 21, 170, -58, 29, -191, 183, 84, -157, 5, -25, 5, -226, -11, 119, -29, -110, 115, 155, -69, -122, 109, -107, 176, -329, -93, -31, 0, 12, 66, -79, -157, 115, 59, 41, -22, 16, 88, -308, -19, 239, -221, -96, -184, 98, -171, -20, 30, -121, 31, 105, -19, 110, -210, -122, 249, 166, -61, -95, 146, 78, -126, 260, 6, -6, 126, 166, -93, 136, 54, 115, -235, 20, -142, 38, -126, 3, -29, 46, 7, 43, -30, -95, 82, -80, -12, -119, -251, -60, -126, -20, -36, -176, 34, -308, 58, -110, 78, -49, 197, 167, -52, -107, 208, -58, 50, -13, 107, -127, -177, 60, -224, -57, -73, 51, -201, 30, 15, 58, -168, -1, 185, 69, -34, -101, 20, 135, -8, -191, -4, -246, -27, 48, -119, 214, -249, 179, -246, 12, 37, 224, 50, 68, 159, 221, 56, -122, 181, -88, -9, -149, 128, 111, 58, 110, -187, -92, 122, 82, -32, -193, 82, -74, 124, -103, 85, -220, -299, -224, 177, -281, 24, -56, -69, -353, 39]
6142C9J41j89k4r3L10j60J0J04p7j44j48L47j12q1K8K80j1m39L6K76l20J8K13
6165DJ92j07PP7k55J3r2M05l23J10Pk81K15j9QJ73k84J64L14l74j10K30J18k21
6189b9RJ12q0Q7k19K79j43l2M5J71k30j54K99j97n0OJ55o3J40k25L31j74j10L1
6213d1L61l27M4K00l23l95L84Q5j71J75K48n9j35m7K33j62j33o1L18k27r1L25
6235B01o7p9k68K38l3n2ON66o72M3J69J15j01j68OR9O8m0J06j95PR6O2j54j09
6260a56R2J25k01Q1J06k36%K44Q5m5o7K1Jm5j66K56o9l02L3M82j83m02M48j17
6284a5j73J47M18j93k91j4M82l36K8k3N0q3j63K75j51p0k85O32m93P0K84j94q6
6307a84J05L37L9j83j40K17l26J06M1J34m03L40J30r8p7j57K88m7j94J76n3j30
$$ y = [39, 180, -9, -33, -126, 184, 24, 34, 138, 61, -83, -231, 116, 4, -77, -49, 231, 220, -219, -183, 93, -227, -209, 4, 196, 89, 96, 173, -82, -69, -161, 244, -79, 31, 38, -243, -28, -47, -39, 134, -150, 14, 328, -46, -156, 74, 192, -29, -20, 92, 12, 99, -120, 159, 16, -16, 29, 200, -30, -184, 115, -82, -132, -126, 29, -34, 106, -119, 212, 38, -72, -41, 320, -7, 37, 237, -86, -481, -97, -12, -183, -8, 240, 181, 46, -1, 232, 70, -63, -124, 194, -33, -124, 201, 134, 55, -213, 25, -8, -60, -54, 512, -160, -117, 52, 167, 66, -102, -96, 3, 71, 31, 137, -58, -51, 45, 107, -47, -156, -64, 61, -140, -59, 47, -189, -189, 55, 140, 95, 28, 49, 50, 5, -161, 95, 26, -276, -243, 239, 56, -346, 102, -15, -188, -41, 377, 184, -107, -121, 361, 25, 53, 30, 80, -3, -166, 109, -42, -112, -397, 235, -258, -188, 96, -98, -184, -79, 258, 297, 114, -26, 191, -135, -29, 12, 146, -257, 83, 213, 115, 38, -119, 169, 122, -72, 104, 51, -79]
6329g9LJ38j16q0J19L16m57J17k4K70j22l32L57N7J88m59L7J33k75K75j09Q7j81
6352a37K18K5k55K17q1O8j81Q9L30n91J82k8O39n63RJ5M17l80J24k36lO8m7K03
6376A02k1j75R0j02J54K6r0j00q7K21J10k1l81K88O2j67J76J03l39O4J2p9M6J68
6400F0J04j71N9q3q8K96j86Q9o6n2r5N5J44M6k17J67J62m04kL20o5l45M45N9k74
6425d2j26R0J54J7j71L1J28l38J51L68k36Jm4jj31K23J94k44l4J63j05lk28N5
6449a28P1J09j16L25j87Q2l40J70j21jK57JJ16k48J34j63n5q6J73rJ02j06K59
6472B39k60j09J37J44j58N7P2J37n0j7j93J43r1j42J22P0k90J28J07j39r6O0J47
6495A8K54l60K98o4K1j49M6k49m1J53o6n4K39K25j40Q3k71J46N1j15O0j34kJ36
$$ y = [-79, -76, 62, -54, -134, -15, 301, -156, -39, -63, 207, 85, -247, 110, 167, 355, -104, -67, 66, -209, 66, -43, 44, -137, 81, 106, -149, 68, -13, 55, -126, -37, 293, -298, -116, -144, 495, -68, -59, -44, 373, -7, 117, -119, -122, -54, -101, 102, 81, -94, -4, -106, 48, 74, -16, -116, -203, 18, 128, 107, -274, 14, 76, -91, 85, 188, -151, -87, -75, -154, -108, 60, 164, -7, 52, -31, -119, 177, -9, 80, 14, -38, -133, -78, 66, 112, -105, 62, 224, -180, -182, 138, 73, -272, 173, 232, -42, -168, -78, 76, 93, -78, -47, 81, -257, -106, 262, 26, 27, -17, -18, -149, 74, 268, 24, -10, 153, 48, 45, -183, -128, -57, 52, -64, 261, 74, 156, -184, -14, -135, -136, 121, 122, 238, -10, 124, -39, -94, -180, -7, -16, 86, -20, 239, -21, -130, 7, 151, -7, 50, 122, 259, 209, 192, -1, 142, 51, -91, 31, 101, -189, -61, 46, -93, -189, -129, 18, 272, -88, 210, 146, 167, 18, 64, -185, -226, -73, -139, -193, 46, 271, 131, 214, -57, 89, 140, 25, 85, -49, -51, 85]
6519H5O8j98o7J50j51Q7Kj4L86k04Q9j16k15Q6K4L7r9k0k4J02Q0j93K41jm5L6
6545A26m3mk72J60n4K44j12j54J03N6j31K27m56K64L38j30j12J20l15L4q7qO8
6568a38j9R5N3L1j0pM9j56j05P3MQ4j57J14R6Q4q9k01K57j19J98Qj36j1Pq2k44
6595c21J26R4pK3J31o7J03M3p8mJ63k54J37k31o5K86j8J15J13l78QJ00j62K8J4
6620a01J88j17K80l52l0O1j2L8K76l5j62l6o8J20j88L40k73K05Pk68K63M4k80
6643a00L1J07N1n5Q3j58J0n5%R6K66n14K70j24J42j09J58j2j04j19K17J39l07
6666h7J65P0l19M2K03%p7K4L0k82M2n1L45k05l7J62k08L41m68M48j03j17p0M6
6690a06J17M1j14KR4r9J35k70P2r6K64L7k17J70N1j14J64r3o3j81K19J53j02o
$$ y = [85, 153, -45, -112, 38, -113, -26, -24, -38, 348, 144, 233, 117, -98, -12, 12, 49, -50, -70, -94, 8, 88, -105, 136, 135, 90, 126, 83, 79, -193, -33, -87, 157, 45, -109, -6, 50, -81, 146, -310, -46, 292, 162, 50, 170, -145, -111, -198, -206, -138, -157, -62, -9, 22, 12, 5, 54, -102, -207, -134, -130, -46, -203, -89, 7, 91, 2, -199, 58, -61, 137, 145, 9, -2, 5, -77, -321, -195, -101, -108, -85, 46, -21, 82, 125, 47, 43, 206, -48, 89, -142, -207, 79, 61, 176, 289, -89, -81, 19, -143, -115, -101, 87, -30, 250, -102, -132, -71, -83, -45, 231, 196, 34, -2, -70, 50, -138, 202, -71, 134, 141, -127, 136, 180, -100, -69, 38, 89, 34, 117, -41, -31, -86, -86, 10, 276, -238, 32, -92, 50, -59, 99, 87, -17, -136, 81, 220, -87, 78, 148, -171, -129, 74, 74, -3, 21, 51, -231, -189, -240, 105, -100, -137, 25, -183, 158, -310, 138, 35, -82, -152, -106, 11, 52, -62, -60, 34, -65, 70, -200, -128, -224, 40, 77, -140, 30, 81, -33, 131, 38, -25, -206, 13, 166, 64, 58]
6714E8j56K25k80k1J56k5m7K35j15M4j18k1mQ4p0j52L59l00P0J8J44j30L9J23
6738A16k0j22K95l49K2O9l0k4J26j62J35l07m3L02N4j50J48l1Lj25J64Q1j03r6
6762d7q2K22j21n9o4J72l02J63L61k31j99M1K13R5j72m3P0R8r3N8k21J68J40l5
6786A32K5k35O2K32k06j2J8J74l52K30J5M6l83J41L17k16k08n4J74k0k07N30n3
6809A50k16J03jn9p0M9J6k09K19J07L1m26L44J9k08Q3n9J49l27K57K20r2j22R
6833c3M02l67j01K99k37k48N8N34l30j86J48P8R1j16K00j15k48J59P9J06l23k8
6855a78N00l37j20L33l1k46L5P8J85k99P0j27p1qK44J5N9k20J13kQ5j63k0J98
6879I3q5J4N9m8M8J23r3j02r1L72m43LnJ37r8J24K22j41l52J38J54J3j52N6J47
$$ y = [58, -98, 127, -153, -174, -18, -43, -90, 145, 30, 74, -44, -65, -69, 15, -55, -207, 152, -148, -78, -60, 84, -46, -7, 116, 96, -26, 269, -80, -58, 11, -19, -43, 83, -79, 56, -251, -294, 8, 62, -88, 60, 29, 32, -93, 71, 152, 49, -47, -129, 93, -28, -87, -151, 21, -281, -118, 243, 12, -187, -146, 67, 162, -10, -53, 17, 115, 22, 80, -141, 27, 167, 132, 157, -78, -16, 216, 10, -2, 16, 190, -162, 68, 83, 129, -254, -113, 204, -12, -220, -274, -100, -120, -327, 203, 150, -66, 37, 36, -23, -93, -44, -28, -237, -18, 89, 120, -306, 38, 57, -151, -68, -127, 22, -305, -48, 172, 80, -42, -33, 369, 2, -99, 200, -37, -285, -227, 307, -23, -209, -61, 17, 108, -8, 192, 77, -171, -12, 67, 173, -150, -178, 322, -15, -135, 198, 167, -79, -44, 34, 219, -80, -10, -137, -208, -216, 28, 43, 102, -118, -5, -7, 78, -85, -105, 93, 8, 22, 81, 33, 81, 204, 111, 9, -82, 290, -153, -150, -155, -18, -116, 8, 230, 89, -263, -125, 29, 42, -110, -54, 93]
6904I3q1j20J27o7k1j05L40l25J80m5k1n2N4M2o2j32L7J66R5j49j19J69J74j41
6928C7j56r0K18m6J95j25r1q1J92j99l8K18l4jj34K24K7q5j94J07J26j83J8j24
6952b19L88l2j59J55j1k56L46m31L7J55K40k02n0K33k17O8o4J44m2k3m71M87o9
6975Gjn5K5K0r8MJ67l7R9j70J59J10m44K81O2l77J70J20P9j21l7P8q3k3L0kqK39
7003A94k02o8k07K06K22L5j44r9K17j49K00l10K07m42K08J22K03j80j4oo6j51
7025b24K12j3P4Q2j74K27n6O5m1l75K88R4j35J13j44L0k09J75k5K27l98K23q5
7048f9K79r7k14R8k31K6K97O9l05L91J20k24k80r4J27J46j09K18o5k37K55m8j22
7071f9R4n5m3J16j08J52P3k88O6K5J07r4K71j96N3j93Mn1P6J46l0l6m1K32l48
$$ y = [93, 12, -108, 19, -48, -69, -174, 166, -159, 21, -24, -45, -97, -43, -1, -63, -195, -158, 8, 103, -46, -165, 4, 178, 37, -119, -209, 9, -37, 158, 33, -58, -139, 53, -146, -184, 34, 0, -1, -135, 89, 116, 31, -163, -56, 70, -113, -95, -219, 169, 137, -22, 133, 122, -134, 212, -219, -182, -27, 213, 11, -39, 194, -23, 45, -19, 125, 83, 60, -411, 76, 7, 6, -49, -24, -4, -102, -98, 69, 32, 131, -39, 120, 230, -214, 67, 129, -248, -78, 42, 121, 0, -37, 41, -42, -65, -35, -37, -45, 194, -8, -76, -283, -77, 145, 180, 36, -63, 154, 5, 205, -105, 102, -340, -132, -10, 193, 13, -1, -7, -73, -224, -12, -25, 49, 131, -43, 184, 128, 193, 152, -223, 65, 159, 24, 137, -7, 23, -186, -11, -36, 191, -207, 16, -69, 210, 113, -101, -3, -234, -208, 89, 158, -147, 244, 364, 140, -140, -234, -107, 39, -70, 148, 83, -154, 101, 53, -69, 25, -30, -73, 43, -65, 87, 160, -128, -62, -37, 70, -24, 247, 51, 104, -89, -85, -136, -60, 86, 56, 20, -21, 211, -137]
7096a37J45l2J08p0L1R2k99K46l08Q8J79J55n03K96j03j57M47j56O8j73O7QN7
7119D9j60l7J62J60j17j17k2Jl0K06Nj04j92R5l9L82r9l07J37o9l6J80m0j3J57
7144A52l51K28j06R9j34K86j93j61J47k3l2K78j78O8J53j00j0m8j07J34qn2J60
7167B02k53J08j76q9J11L8n1J02j52l0L08k08jJ25q8J74j2M8j16k3l4J54j99k8
7191i0M2j86J02J88q7J74m4Qk79K53O4k65M23k64j0R3m4j12k9J70j36p2N3l8o5
7216a51M8J86k42K67j29R3k16%L10j01j3k23K40j69J12j72K67q9j7R9l5Q0n7O6
7240A54m0J6j06j00P4l6O2j11J21m7J96j3n0k15J74r7j02J53l2Q8J9j58K14l4
7264A30k62p4L10m7J53j32k9o4m6p6l0K22k5m2N3nj89J04K05o6l0k24M42k62j44
$$ y = [-137, 8, -24, 84, 14, 45, 137, -162, 84, -224, -136, 43, 198, -305, -9, -112, -269, 178, 22, 90, -83, -16, -8, 49, -111, -148, 14, 174, 57, -60, -82, -81, -111, 95, 100, -4, -196, -101, -140, 242, 143, -164, -27, -96, -132, 48, 8, -5, 152, -199, 29, -77, 22, -112, 174, -19, -180, -33, -56, -88, 190, 12, 80, 233, 133, 123, 75, -32, 102, 94, 42, 202, -51, 57, -119, -208, -97, -59, -110, -8, -160, -190, 118, -90, -91, 34, -54, 120, 108, 156, 40, 17, -17, 137, -62, -90, -48, -234, -132, 56, -31, 143, 99, 107, -172, 81, 145, -120, 303, 39, 29, 122, 78, -34, -63, 107, -29, -101, -48, -86, -151, -103, 83, -159, 108, -21, 72, -144, -144, 166, 65, 52, -171, 69, -100, 12, -160, 107, 18, 1, 100, 65, 145, 88, 154, 114, 130, 24, -76, -2, -38, 24, -87, 34, -13, 183, 170, 120, -95, 79, -18, -120, 33, 1, 89, 108, -50, 164, 130, -132, -206, 104, 57, 210, 78, 49, -15, -61, -137, -167, 55, 30, -12, 41, 36, -153, -49, 156, 90, 60, -164, 278, 16, -128]
7289a28K35j34m3J74Rj33M2j90K87K8l28L70k48O7N0o1J52k65J32k99K71Ko5N0
7313b5K54k76P6O4j66Q2j30K61m7j74K91Q7k27j1j77N4q4O5m4L22j44k05J30O1
7337C7M0j34N4j4P6l9J14k84Q2K27O5l26j40J59j1O5j9N1O3j84K87l07j7K43j01
7362a3J57m52K77KJ96j57P8k6k11M09l89K44j90j63L72J46k60N2o4p9L15k85p1
7385a12J15Q7j3J11l97K46K36l49p6j7K94o6q7K15p6n94K88J93m0K49k72J14j91
7408a42J81k6q3j37J18L71m34l0J67j31L04j21j37j27m0KJ81J10l32M24K1k78
7430a39J72j05J49j02N8j65m8J62J24J17k24j03M2RM5J25q7nj85K37q6j75L4K35
7454H5k50J78r1K84j16Q9k32O5m9L9mJ97l83l7J38K12q7j74K66j22k27J23J14
$$ y = [-128, 107, -27, -70, 104, 113, -20, 22, -168, 119, 147, -181, 189, -59, 8, 58, -3, 149, -116, 16, -283, -12, -10, -75, -25, 229, -47, 29, 93, -73, 9, -121, 140, 93, -81, 210, 297, 70, 59, -118, -64, -148, -83, -127, 195, 51, -154, -24, 37, 77, -57, -3, -17, 59, 20, 134, -150, -68, 159, 224, -102, -242, -83, -94, -29, -48, 3, 66, -118, 169, -138, -155, 88, -13, 144, -308, -31, -29, 167, 10, 88, 62, -149, 260, -129, 115, -75, -238, 134, 280, 20, 72, 8, -71, 244, -41, -112, 3, 90, 77, 188, -209, 37, 273, -76, -152, -169, 125, 59, -28, 187, 111, -483, -195, -2, -42, 207, -65, 49, -142, 39, 13, -70, -207, -89, 282, -152, -182, -15, -146, 158, 37, -100, -227, -267, -265, -84, 26, -306, 118, 139, -139, 33, -72, 77, -25, 33, -132, -180, -18, 106, 223, -1, -104, -62, -53, -8, 117, 30, 25, -160, 77, -9, -184, -150, 85, -165, 13, -78, 206, 90, 179, -53, 12, -37, 2, -2, 195, -188, -225, -87, 125, 38, -136, 130, 8, -219, -96, 18]
7477A8J36l27K65l20O2K09K70j81POmr8l09K46K44l54J18n4L3q2O2J2n1J11R9
7502A18j01m3K02n8k1j9r5J9Ql2q6N9qk1J35N4j1k60K43N2L1j66J81k35q2K85
7528A49J7j34K6j77M22j62k39R9M9j14N8m2P0j60M04j77K7l8r0n4J75j68J96j49
7552a2r4K50l52O6J35J00m7j71J43j68N3J27r2j0R7L12l92j70J80q0LJ63j39J07
7576Ij04Ll7J37K7j42K1M5M9j9P8j30L61k65RJ24j00J4j08m4J48M0j97RJ83j05
7602Fn9J35j35j2J6K99j59q1n0J8L3m3J93m12J38M0J19j72L4O2k08K67j47J12
7626fR2j69K02j06O5j39q1J65N3l6k43K01J69k31L2o0J24j16J05Q0j58j58J89
7649b6RK2k3k48K79R3q5j11p8k2N07l90J54J47j30L0j09QM4j66N0rN0l7j4J27
$$ y = [18, 154, -173, 92, -228, -166, 43, 313, 132, 139, 145, 141, 43, -266, -20, 224, -130, -12, -66, -33, -115, -53, -41, -92, 19, 118, 17, -26, 176, 118, 97, 78, -17, 2, 10, -22, -108, -49, -57, -78, 57, 111, 100, -160, 83, 135, 166, 0, 181, -54, -136, 149, 166, 32, 58, -119, 303, 141, -98, 1, 50, -64, -6, -48, 22, -138, 266, 89, 116, 78, -12, -66, 109, -59, 137, -12, -106, 144, -208, -142, -7, 93, 46, -125, 18, -150, -97, 30, -62, -72, 25, 337, -55, -225, -45, -125, -122, 41, -98, 9, -95, -92, -129, 8, 35, -107, -86, -41, 8, -11, 67, -63, 298, 33, 42, 166, 66, 80, -28, -72, 76, 116, -81, -72, 111, 6, -53, 82, -53, -65, -49, 250, 91, 10, -40, -22, 11, -32, 161, -251, -113, -73, 46, -126, -92, -30, -238, 29, -118, -6, 86, -83, 119, 13, 78, -61, -142, 23, 76, 40, -203, -2, 167, -64, -32, -92, 32, -84, 21, 101, -57, -215, -26, -17, 5, -18, -266, 13, 106, 21, -90, -168, -190, 317, -73, 81, 228, 98, 128, 19, 27, 71, -95, -45, -54, -4, -41, -55, 72]
7675G2P3j74o6K22Q6k44j48M0p7K63Q6k28j16L05J10k09L2j5p8p3K06k33J96j18
7699h8K37m1j31k0M0P9N2j53k3j87M16M1l28M2n8K27j90l4L32k83qj1J6N9R1j50
7725g3J91j52J69j96K39j02J05j73j13K54n1k01J56O7r4J85k79J8l1M7k65L66
7747F7j28P8l4q1O4K97l60J19LR3j88J12J0o7j00m3K15J82k23J15j25k85L13p8
7771d4Q8J88k70JP2n1O7k7O0k33M1J90pJ42k26l7J95l94o2K44p7J8j29K24J73
7796A46k19L09k06j9J30j42L09k58o4K65n58J70j8K08M5o8k8o0o0K78j51n8j36
7819a85k32L80J9K03k6k10Q7J38j6n1oM2k77J15Q1j7l26P3M41r0oJ63k14j74j1
7844i9J76J7j68k5R7m3J62j6j54J70k89K67Q8k35j21K46K11l50J12Q5l53K97N9
$$ y = [72, 145, -29, -95, 127, 213, -31, -179, -139, -216, 47, 133, -95, -211, 94, 204, -5, 27, 12, -66, -139, 67, -166, 30, -88, 149, 108, -23, -43, -3, 76, 128, -25, -48, -235, 181, 222, -106, -64, -122, 105, -85, -119, 213, -70, -78, -89, -73, -14, 77, -73, 118, -34, 135, -61, 178, 76, 181, 8, -105, 149, 98, -103, 53, 120, 26, 211, -68, -50, -81, -34, -299, 67, -61, 17, -17, -98, -34, 263, -97, 22, 25, 118, -70, 42, 52, -15, -115, -158, 57, 239, 16, 131, 6, -279, 34, -44, 44, 232, -38, -37, 35, -16, 51, 24, 84, -149, -108, 82, 75, 217, -9, -46, 149, -245, -307, -63, -140, -122, -251, -27, 146, -73, 236, 30, 11, 141, -1, 308, 50, -14, 251, -307, -137, -155, 53, 98, 30, 2, -58, -118, 160, 9, -49, -185, -417, -37, -18, 185, 159, -51, 36, 174, 158, 107, 101, 143, -134, -19, 62, 45, -281, -208, 233, 143, 137, 300, 86, -88, -99, 77, 94, -74, -99, -2, -45, 117, 101, -53, 117, -172, 95, 183, -52, -173, 73, 284, -66, 46, 131, -222, 75, 134]
7867A34l6j64J00k76L70j10J8Rj80l3J45Q5K31l99J74j04j4J86o5j49p8R3j41
7890b04L20k07J36J15j80j15K08j05P2k18M06k12k5K6k6L8P8m3J29j96j58K18
7912E7k63J09J81p0o5j36J5J89M8l08K75K14m42J32m4O1J05OJ27o3k76L84k17
7935A9r9m1L7Q8j46l9L13j41M2m9L7j73J14m1L97m23J53j39K13j62j9L06j00k45
7959i8K77J4j59ooQ1j77J16Kj46K08k1n2j49L52k31Q6O7k44L08k19LK9lk73K18
7985b3K43l94J43J49Q8l23P5o4O5q7J37J63l4k80J11J16rj28J62j44l8K89l22
8008a05jj0M2J38J31l94J75J46j47J2p8J82l1o4K37j44K9l1J4k8p8J44R0l82N2
8033a01K47k59K08j23J18j32k54M61MK48n97L05k1j77OK29O4m11J94J30j14j24
$$ y = [134, 98, -66, 34, -242, 128, 18, 36, 45, -135, -168, -23, 62, 293, -106, 68, -36, -50, 136, 71, -78, -156, -63, -204, 116, -91, 45, 160, -20, -135, 73, -32, 40, -178, 228, 16, -9, 17, -9, 29, 107, 64, 193, -3, -161, 57, -206, -97, 84, 14, -51, -187, -172, 17, 65, -243, 32, 246, -196, -64, -108, -47, 58, 64, 191, 128, -148, 236, 19, -80, -121, -84, 4, -142, -181, 132, -9, 33, -16, 21, -152, -38, -79, 318, -105, 48, -91, 122, -40, -59, 247, 147, -98, 179, 193, 34, 28, 22, 103, -74, 42, 44, -102, 106, 85, 33, -116, 236, 5, 91, 158, -86, 222, 3, 6, 35, 32, -241, -23, 220, -174, -31, 118, 206, -117, -42, -106, -41, -128, 9, 172, 138, -142, -31, 85, 76, -52, 110, -34, -72, 217, -105, -106, -116, -74, 64, 195, -199, -24, 122, -25, -13, -91, 91, 60, -4, 233, 89, 118, 87, 101, 73, -5, 139, 229, -153, -101, 146, -113, 95, -28, 90, -42, -296, 165, 169, 417, -180, 125, 104, -73, -67, 162, 226, -185, 9, 139, 25, -99]
8055i9K60k52j42L20r3k8J15K5Mj86p3K02j32J18j40K33k16Q5L1j38L4k2K39j43
8079Bo7J22n6j07J68J4k0J52m31J09j5M9N4n1K70k56n4j37K1R6K28j46J89j89
8103e5K85n3l59K79L7j71J41k46J3K48j47o8K00K9k82J04k77L29j73K46k10L68
8125B38j06L2k14L9J22p2M7J20p6J52k54j9m1K39j21p9L8k17P3L5nJ03o7p8K29
8150A18L7P8k11J41M2l07J37j2J27o4j26Q5n3J01j6j58K71j10j37Jk24K28j9k43
8174c14K33k2K07J37j87k69N4L02K20n02K22j69O0L15l60L7K59
$$ y = [-99, 161, -91, -233, 87, -6, -34, 81, 106, 110, -76, -149, 53, -79, 39, -101, 132, -84, 1, 32, -106, -72, -94, 145, 2, -65, 57, 1, -106, 62, 76, 56, 208, -223, -114, -129, -80, -26, -77, 193, -63, -117, -254, -233, -137, 91, -55, 134, -55, 230, 177, -182, 97, 134, -37, 104, -142, -129, 119, -28, -96, 104, 133, -149, -45, -322, 7, -166, 80, -130, 238, 132, 164, -50, -11, 111, 39, 86, 206, 130, 282, 28, 9, -32, 207, 86, 7, 45, -172, -99, -64, -69, 34, -33, -111, 118, 155, 233, 22, 163, 205, -102, 35, 23, 150, 86, -40, 45, -8, 93, 77, -81, 190, 80, -57, -56, -280, -52, -71, -314, -81, -103, 104, 241, 54, -215, -161, 141, 361, -141, 81, -88, -28, 287, -73, -36, 223]
8191B23
$$ Imaginary data points
##PAGE= N=2
##DATA TABLE= (X++(I..I)), XYDATA
0@%%%%%%%%%qJ6j6J6k4L2m0M8n6P2q8J04j25J49j76K08k43K83l28L79m35M96n65
32c01O44p32Q26r30J045j173J313j461J624j806K005k220K457k717K998l304L642
49A910m014M422m872N370n925O545p244Q039q950J0009j1256J2748j4570J6860
63I072j9839K3885k9718L8906n5578R5206l58986k93290P60460Q1252k92826K77563
75B36107M74723l60201l86898K52222Q0969n00815m3210L98190j66001m68454
85d83368K43824L76847k93304k05297M91556K04484m48248j03186L88348o3055
95A08601l31288K20758L45982k28416j99168K75572L3034l87415K7960L83667
105B49287j05859l64921J25105J92725l28418k47488L08077K12665j74211N5904
$$ y = [0, 0, 0, 0, 0, 0, 0, 0, 0, 0, -8, 8, -8, 8, -16, 16, -24, 24, -32, 40, -48, 56, -69, 80, -96, 112, -131, 152, -176, 203, -232, 264, -301, 343, -389, 437, -493, 552, -621, 692, -769, 855, -951, 1054, -1166, 1291, -1426, 1572, -1732, 1910, -2104, 2318, -2554, 2816, -3109, 3436, -3808, 4231, -4719, 5290, -5966, 6782, -7788, 9072, -10767, 13118, -16600, 22306, -33272, 61934, -297052, -590342, 170118, 251370, -41456, 236107, 710830, 350629, -36269, 215953, 296922, -203893, -247103, 151087, -14914, -483368, -239544, 137303, -156001, -361298, 130258, 334742, -113506, -216692, 171656, 108601, -222687, -1929, 344053, 115637, -83531, 192041, 225075, -162340, -134380, 249287, 143428, -221493, -96388, 96337, -232081, -479569, -171492, 41173, -133038, -77134]
115g7134L28200o814j98976J38707J78391j96736j58889J41105n6503l57685q4450
126c50784K16713n225j39406J62689K43381o7801j16628J26144R6307r5946k760
137F6684J29641l7180j69492k5414L4945j08030q0556J25323J14029o9977n1498
148g1525R2098L9211r2499k2717R8058K3077r0450k9014N0943q090l3449P5579
160C1222J03860k2028n9881K4678j6422j39765o5542R4095K9168r6651J0634J22317
172A5685j5977r9866P5245J43771l0994n5229J00230L1917j56865o1294R8528
183D5151l8478j45810N0723J20442j01825j06204J46471J14279j09576n512J81529
194A51190o698j86273J5711J21225j04543j18495J38630Q9934j57672m3029J64789
$$ y = [-77134, 251066, 244252, 45276, 183983, 362374, 165638, 6749, 147854, 91351, -266334, -350784, -134071, -139296, -278702, -116013, 127368, 59567, -57061, 69083, 165390, 69444, 66684, 196325, 159145, -10347, -35761, -816, -108846, -189402, -64079, 49950, -20027, -71525, 20573, 59784, -32715, -55432, 42626, 65703, -24747, -53761, -2818, -10908, -44357, 31222, 135082, 113054, 53173, 77851, 61429, -78336, -143878, -49783, -20615, -117266, -106632, 15685, -292, -100158, -24913, 118858, 87864, 32635, 132865, 164782, 7917, -53377, 45151, 6673, -139137, -88414, 32028, -69797, -176001, -29530, 84749, -24827, -30339, 151190, 144492, -41781, -26070, 95155, -9388, -127883, 10747, 100681, -56991, -100020, 64769]
205F4769j3857j67253P1281J69991r6337j31265J29259P8294j67399m1066J77943
216G4360K00j60980N7235J40858j09768j20482J38982Q2745j51983k9168J60321
227H2320k7177j66537O1205J44648q7982r3231J37054O5900j53439l2830J40071
238G0002k7622j41893O3327J17065r9890r0000J21147N4993j23641p0J42229k1376
250F4271j19421N7275R2934r2507p1967J03187L3289j15806p670J01809l6291
261I103r8840N8247Q0157p1219m4981R2912K7834q5020J0648R1721k2691o9261
273b1390M4601M6410p1290m5062N5682M372p0678N647N9997k1955m3751M3954
285a3463M4043l3868q649N5296R404m3634N182L1824k8642m0200J6245J1305l6152
$$ y = [64769, 50912, -116341, -45060, 124931, 28594, -102671, 26588, 104882, -62517, -103583, 74360, 74560, -86420, -29185, 111673, 1905, -118577, 20405, 103150, -48833, -78001, 82320, 55143, -111394, -50189, 94459, 6477, -86754, 50300, 116200, -37239, -70069, 70002, 42380, -99513, -36186, 80879, -19011, -109011, 12136, 67129, -56512, -56582, 85647, 64271, -55150, 2125, 95059, 2552, -69415, 33772, 67061, -48745, -56415, 45394, 9103, -89737, -31490, 48667, -22552, -67533, 25379, 53213, -31807, -21159, 70562, 47871, -21390, 23211, 69621, -1669, -46731, 8951, 13323, -57355, -51708, 8289, -13666, -57417, -13463, 30580, -3288, -11937, 43359, 52763, 9129, 14311, 46135, 17493, -22707, -6462, 4843, -31309]
298c1309j3200L0334M681k0349J5359L0664n909j2331J6770R785j7281n358J3825
311A5681j292j2863K509O560r392r904J811j703q507j497M504R33J431O399N855
326E25L957N038M637J988L100J291l123l790k972q536j1585o141m758q321k425
341c1115Q238P055L942J2078J4835N392K29N578J785r086q186j715n593j1775
355h338n610N92m344n911K064N718K288L819R719R451M442L588M767J071n265
370A8051o058l450n256r373o205j90j770n572J117P798J219j967R470J1141j638
385G317o77J2449M647j2120l070Q874q152j8585K744R085j4290j1471J5340O019
399a890j8626J28K2339k378j6532J5983K2135j3382r011K5961Q776k5202n65K3346
$$ y = [-31309, -44509, -14175, -9494, -29843, -14484, 16180, 10271, -2060, 14710, 24495, 7214, 1856, 15681, 14389, 1526, 4035, 10595, 1203, -8701, -6890, -8593, -17100, -18597, -14093, -13160, -11729, -5330, 525, 4482, 9520, 14157, 16145, 19245, 20536, 17413, 13623, 10651, 2115, -9470, -15611, -20369, -28690, -31115, -22877, -15822, -11880, 198, 15033, 20425, 20654, 26232, 28017, 18931, 10745, 9030, 3437, -8338, -13948, -13356, -17700, -23611, -21547, -15829, -13541, -9722, -3, 9448, 13890, 17478, 22245, 23316, 18051, 11993, 8543, 3287, -6086, -12291, -12481, -14251, -19823, -18706, -10908, -9689, -11656, -2186, 8955, 7317, 6640, 19089, 23736, 11616, 8546, 17420, 9268, -9317, -6573, 2512, -11778, -23249, -7909, -1890, -20516, -20388, 1951, -427, -16959, -976, 21159, 7777, -1234, 24727, 33503, 8301, 7736, 31082]
413C1082j5953l3977Q581J2648l2404j8225L0972P977k8708J2601M3123n283j9840
426g406L5054L0389l2129j7849L1519q325n3309p75L2203k6207l5906L2898K6496
439F653l7542o508N4030P011l8977J9893M3468l1976l9968L4636J9854m8249q096
452b5771N2185n021m9283K0852M3735l3816l3382M3098J6257n7010j3364M6349
464D829j1669m4250L5090N3029k6864k4324M7399J5394n2750l636M8481j5854
476B4875n2060J6014K7268m5447k9690M7299K2894l5261R901N1514j1287m2164
488a6144K3048L2699l3529k5219L3582L435m9615n407M0245k424k3510L0983L5675
501D3819k6212k8094K0502N195l4136j968L2525m606l2920M792K1700j1923j0531
$$ y = [31082, 15129, -18848, -10267, 2381, -30023, -48248, -17276, -9299, -38007, -25406, 17717, 12434, -7406, 27648, 58037, 25908, 8059, 39578, 31253, -22056, -22831, 9372, -16835, -52741, -19843, 6653, -30889, -37397, 16633, 23644, -15333, 4560, 48028, 16052, -23916, 10720, 30574, -17675, -25771, 26414, 21393, -27890, -7038, 36697, 2881, -30501, 12597, 28854, -28156, -41520, 4829, -6840, -51090, -16000, 37029, 10165, -14159, 33240, 48634, -4116, -7752, 40729, 24875, -27185, -11171, 16097, -29350, -59040, -11741, 11153, -24108, -14207, 37307, 26020, -16144, 6904, 39603, 6074, -19145, 14437, 17872, -31743, -37150, 3095, 671, -22839, 8144, 43819, 17607, -10487, 10015, 15210, -18926, -20894, 11631, 7025, -25895, -21103, 597, -11326, -21857]
514b1857L1859K6852j5687j5079J1364k493k7679m860K2935J733k2278k807J5143
527b854q828j5831K1046L2962m949j6481J3176L606l5689j7488L0988J3427k5664
540a2579M580L2036j6136m0009K0039L9466j9865k0696L6986O845n9592j4690
552d3615M9486j802l9973L4239N2044m2628m7057M8279L0935n3030k628P0424
564E4674j3477q1210J1487N0115m8678m2490P5613M3359p1636j4592P5874j4828
576B4211p7261M4648Q4135n0795o1246O4140K3200r7405j4127R8507n037q2886
588d9916L9170O8038p7494o5725Q9413M8153q3254J49J00200k8438j05490M3037
600b2157Q5993o0649n0449R3224K9325j12517j8905R3298k5042q7499O2943Q5422
$$ y = [-21857, 10002, 36854, 21167, 6088, 17452, 14959, -12720, -17580, 5355, 7088, -15190, -17997, -2854, -11682, -27513, -6467, 26495, 21546, 5065, 18241, 21847, -13842, -31330, -342, 13085, -12579, -7999, 24037, 7901, -32108, -12069, 27397, 7532, -13164, 23822, 30667, -28925, -43615, 5871, 4069, -35904, -1665, 50379, 7751, -39306, 8973, 39908, -13122, -15750, 54674, 41197, -40013, -28526, 21589, -27089, -69579, 6034, 49393, -22243, -36835, 39039, 24211, -53050, -8402, 75733, 24938, -36308, 27832, 51032, -46373, -60500, 38007, 32970, -49916, -10746, 57292, -20202, -85927, 3486, 51639, -31615, -31466, 68734, 40296, -65194, -22157, 63836, 3187, -47262, 45962, 75287, -37230, -56135, 37163, 12121, -75378, -12435, 72987]
612G2987q0309o6771Q5762K8809r7412J1029J18139j9856r6726M6254O7315q4112
624a4891n3568J02111L6476r8912o468Q5922m4333r7948N9733Q6337o3452m5762
636e4755Q8100J9972j01458K94J01154j3837p2944N0890N9212q1129o0970P1927
648F456K5627p6340O911Q4981k4529q1050L3375O0386m6338l1456P5070K9714
660F2807p3574j8197N6640j5532n8457L4927O1900l5843m7125L5375J8690n2991
672c1380q367O2042R470m8669L867L5117k7433l7967L6846M3262k3934k0470L1486
685B3870N073m6916r142M1133L886l4451O486K7245k4858l7603K3094L6320j4835
698f98j0855L8182J3181m4409j5083L7615K794l6529J0937L7885k6083m8970K0622
$$ y = [72987, -7322, -74093, 11669, 40478, -56934, -45905, 72234, 52378, -44348, 1906, 69221, -14891, -68459, 33652, 70128, -28784, -35252, 50670, 6337, -91611, -31878, 54459, -8993, -54755, 33345, 53317, -48141, -47847, 53307, 39470, -33474, 17416, 76628, -4501, -65471, 6456, 32083, -44257, -37346, 47635, 23106, -57944, -24569, 35817, -10521, -41977, 33093, 62807, -10767, -28964, 27676, 12144, -46313, -11386, 50514, 14671, -32454, 2921, 21611, -31380, -39747, 22295, 31765, -16904, -13037, 22080, -5353, -43320, -6474, 36788, 12854, -7616, 23870, 28943, -17973, -27115, 14018, 17904, -16547, -10061, 17184, -7674, -45277, -22183, 14137, -698, -11553, 26629, 39810, -4599, -19682, 17933, 20727, -15802, -4865, 33020, 6937, -42033, -21411]
711b1411L3803k7548j4247M9827J6027n1629r173M5315j0033m2395L1125M7744
723D7405l8338m2310L9367K0547n3292n387O5046m11n8227J4197M4398m0290m3922
736e1217N0945L5428n2042j3041N9905n957o3623K3390O3318l0913m6064M6382
748A6511K7271o7169k2684O3973L747n8154K2353N7177l9711n0958M9125L5564
760C7045n4074j0800O7374l416o8455J3814N3780l6029m5089N0572L3908n5407
772a6777j7013N7959j439n5673K1717N3589l3113m3654M0473K4949n2519j1279
784c2780N7882J442n0741J3714M1958l2002l8156L8370K7648l9555r092M5024
796B3712l570m5227J2570L8129k2354k8597L1739K0369l5945j0705L6255J40l3994
$$ y = [-21411, 12392, -15156, -29403, 20424, 36451, -15178, -24351, 20964, 10931, -31464, -339, 47405, 9067, -33243, 6124, 26671, -26621, -32008, 33038, 32627, -25600, -11403, 32995, -7295, -51217, -272, 35156, -16886, -29927, 29978, 24021, -39602, -16212, 47106, 16193, -29871, 16511, 43782, -23387, -46071, 17902, 21649, -36505, -14152, 43025, 3314, -47644, 1481, 37045, -17029, -27829, 39545, 36129, -32326, -18512, 35268, -761, -45850, 4722, 38630, -16777, -33790, 24169, 22730, -32943, -11226, 42363, 9250, -34404, 6069, 31018, -21501, -32780, 25102, 26544, -24197, -10483, 31475, -527, -38683, -313, 27335, -12220, -21312, 23712, 20142, -25085, -12515, 25614, 3260, -25337, 6402, 26771, -9174, -19879, 16376, 16516, -17478]
809a7478R220K8041j9582k5276K2299J6589k3417n139K9140J046k7048M618K0750
822A3763j2225j7396J7439J5117j5828p889J6321O60j9128J00J4053n395j2150
835a2558Q363J0859p459n510J0877M812r926m099P491p16q214K051R382p00n973
850a320K400N005n394o776M046N422m462l044P204L229q473l333O557j275r136
865i350K132J0618j840n688Q033Q288p419o560P155N80j2485j362J0335j828q620
880h011O325R546q081p026R256L182j1095k11J2205j657r991N833Q635q875p862
895g827R487L512j0579R7J2673j496j0077N494P311r585q268Q152K849r705N22
910g440J1621j84p326N519O842o884o570O548J722q842L4Q279j824o367M154N182
$$ y = [-17478, -8258, 19783, 201, -25075, -2776, 13813, -9604, -14743, 14397, 15443, -11605, -6987, 13763, 1538, -15858, 1581, 16698, 870, -7019, 9302, 9962, -9166, -9066, 4987, -408, -12558, -4195, 6664, -795, -6305, 4572, 9384, -542, -4641, 2850, 2134, -6080, -4029, 5353, 4653, -1320, 1080, 6085, 691, -6085, -2039, 3383, -1079, -4123, 3081, 6310, -2163, -5496, 1061, -214, -9350, -7218, 3400, 1560, -4128, 3905, 12193, 4774, -1786, 5369, 5949, -6536, -7898, 2437, 609, -8011, -1686, 7860, -221, -7247, 2009, 5191, -5904, -6115, 6090, 4433, -5558, 275, 8910, 35, -7827, 1660, 5172, -5407, -5310, 7363, 5867, -4210, 1284, 8595, -990, -9258, -1106, 1743, -7962, -7440, 4181, 3997, -3329, 2190, 9032, 2148, -4422, 2126, 3848, -4994, -4960, 3319, 1495, -4872, -718, 4464]
926D464n376l550N867J913n329J085N967j878n513K313K674n162l082M043J859
941B95l425J681M488m19k734J325J898k983k215K023P65j731L38K756p11j452
957a01M35N68j852j179N58R74q77NJ610O15j113q5J189J21j142R22J636q55j461
976c2P24O88k072q66J619M97k216K38J957o40k141K028J630k155p76K301l19k697
994b232J078L913j485k070L028J327m106j211L812j024l758J851L197l821k598
1009d099M160K486m393M66N549j916n744J915L449m562k147O012K402n833J414
1024h41N661k421m982M697M626o120l452N295j318p777J806O661l056m556N226
1039e51L431o043q07Q529Q79n776K537M668o295o023N166K735n366N59P369j603
$$ y = [4464, -912, -4462, 1405, 3318, -2011, -926, 5041, 3163, -2350, -37, 2637, -2525, -5607, -1564, 295, -3130, -1449, 3039, 2620, -114, 1211, 3109, 126, -2089, -66, 699, -1032, -694, 2062, 1351, -101, 334, 902, -950, -2129, -1571, -597, -1474, -1469, 141, 756, -357, -442, 747, 868, -274, 648, 2284, 1429, -32, 692, 1380, -692, -1558, 61, 558, -1658, -1420, 537, -103, -2244, -216, 1414, -741, -1517, 784, 465, -2232, -1154, 2759, 1274, -796, 2232, 3559, -547, -1758, 2054, 1030, -2728, -877, 2320, -1501, -4099, 61, 2547, -1846, -1380, 4169, 2253, -3491, -1576, 1873, -2689, -4836, 1176, 3578, -2255, -841, 4820, 2399, -2583, 2114, 6740, 620, -2832, 2463, 1145, -6632, -4826, 1835, -1221, -5777, -551, 2880, -3163, -3970, 4559, 5438, -338, 2199, 6867, 572, -5451, -285, 2450, -2916, -2357, 5012, 3409]
1055C409p105K056M629m935l162O405J618p420p56N304j280l104N726O073l524
1070C934k508L027q42n628J031M852k167m321L93m8m316l91N063K461l2K202J477
1087D187k628j505J038K56M0J094m76k661r17k44j665J467M363N63k713P75l43
1104F31n181j297O248K306l855J796M320n655n396O459O278n070j337O967l246
1119C968j2108J213Q451m453m833R942M874j1583k228J1675l21r685P854J1681
1133A4447r776j1271R351L052j4844r80J5579j711j4878O388J1299j1296p540
1146a2180J7569Q111j5433j991J4589n990j7148R759J6291r959r700J2839K199
1159H956j9664j981J7381l718j3270J0869J2461j5213r431J6859N913j5856K741
$$ y = [3409, -3696, -1640, 2989, -1946, -5108, 1297, 2915, -4505, -5261, 43, -1237, -4341, 1385, 7458, 3934, 1426, 4453, 3611, -2017, -986, 3866, 1699, -2622, -2229, -2277, -6593, -6984, -1921, 540, 508, 2710, 4187, 1559, 54, 1092, 1348, 1388, 2482, 2006, -655, -1572, -1816, -3481, -2014, 2349, 2912, 199, 974, 631, -4550, -5847, 401, 2707, -1148, 648, 4968, -687, -6083, 376, 6654, 1584, 247, 7214, 3968, -8140, -6927, 1524, -2929, -7762, 2180, 7054, -4529, -6757, 4918, 4597, -5088, 2766, 14447, 4671, -6600, 2751, 5803, -9041, -10021, 5558, 3847, -11031, -4643, 6656, -4640, -12180, 5389, 13500, -1933, -3924, 10665, 4675, -12473, -2714, 13577, 3618, -6082, 6757, 8956, -10708, -12689, 4692, 974, -12296, -1427, 11034, -4179, -13610, 3249, 9162, -6694, -3953]
1172c953J8610n770j5756Q558J1264j2952p398J4505P59j8748k56J3427p723j1542
1186a6975J4980J3998j2215p272J4092J311j5291L581J6313m277j0566P857M326
1199I862j4256m426J2811q54j4151L963J1927p809r961J1240J0328q713m025J0238
1213F174O24j0779J501Q728l228m681P782L179j0747m848O473j287q767K559J0423
1228C106o28o823K227N557k304l283L669K814k639j419K169o0k555K025K828l526
1244A158o470O2L413k318l447M796Q517j319n918K168N038m363n533M625M054
1259D463l933j012N079j944q217K678O116o627o830R906O542j0500l031J4045
1273F735L700j2699q00J0770m553j1934O903R445q323l998J1757r6j5671J613
$$ y = [-3953, 14657, 8887, -6869, 1689, 12953, 1, -7397, 7108, 7867, -10881, -11137, 2290, -5433, -16975, -1995, 12003, -212, -7484, 6608, 7919, -7372, -3791, 12522, 8245, -2321, 5536, 9862, -4394, -8820, 3991, 3137, -11014, -7051, 4876, -2933, -12894, -1654, 8674, -39, -4064, 6174, 6798, -3981, -2480, 6248, 3020, -1661, 6121, 9300, -1447, -6295, 178, -1109, -9876, -7317, 3106, 2478, -4345, -2118, 3439, 1135, -2148, 1521, 4335, 1696, 277, 2446, 2386, -169, 1856, 4684, 1158, -5312, -5250, -1837, -4155, -7602, -2806, 5711, 4392, -1526, 642, 5680, 1317, -4216, 409, 4463, 530, -482, 4597, 2653, -5564, -2886, 3230, -3397, -10227, -321, 6221, -4279, -7310, 6735, 10435, -2264, -3064, 7706, 3153, -8781, -1878, 7567, -756, -4754, 7003, 6907, -8764, -7151]
1287g151J4018o927j3768J1177J3544j2143q955J5355N769j5311j637J4674l491
1300E154j3024Q312J0438j2100p131J4679K561j8235n06J6320m877j5423R201
1313d631J5082q970r575J2314N082j4143r07J3674l408j2102P821J0813j1726
1326f76q539J3840M258j5474j993J3844k096j2806N401J1239p217p409R166M533
1340F071j0591n72J1347j865r270N890R291p618q219P385M503r884l574Q854P14
1355B462q309J129O854k680m589N638M319n346k002O243Q08o665R64O303j951
1370C178o138K014M382l418m423L384K740l900j950M323J310l998P04M894j158
1385A944l836K244L663l094l923L791L069l693k649M213J090n534j230M745l75
$$ y = [-7151, 6867, -60, -13828, -2651, 10893, -1250, -10205, 5150, 10919, -4392, -6029, 8645, 5154, -7870, 442, 10880, -1220, -8351, 6328, 8889, -9346, -9852, 6468, 1591, -13832, -4631, 10451, 1481, -8094, 4220, 9302, -4841, -5748, 7926, 4518, -7584, 237, 11050, -676, -9215, 4625, 8883, -6591, -8584, 5260, 3164, -9642, -4241, 6998, -219, -7628, 1538, 6071, -4520, -5092, 6255, 4390, -4880, 1010, 10301, 2683, -5536, 1849, 6352, -3532, -7106, 1748, 2462, -5847, -4718, 2136, -544, -5133, 505, 4824, -522, -2524, 3719, 4527, -2138, -1174, 5129, 3178, -2960, -946, 3436, 18, -4405, -1021, 1719, -2181, -4131, 192, 1502, -2496, -1792, 3102, 1944, -1892, 352, 4015, 921, -3002, 789, 3858, 165, -2484, 1729, 2819, -2715, -3945, 800, 425]
1400D25m420K544N003k793l147M686K460n736k291N633j57o396J705O347k651
1415A212n175M109M117o418k951O103J605n753J671P271j208n969L231L901o756
1430a010m732N365J518o441O24P392j046n934L492N179m852l411N712K989n471
1445f26K81O352j506o876J656L270n663m262N385L014m548Q67O875o39n563J924
1461e9L442m263l440M693L174l917J56N052j230n009L56K374l785l165L658K699
1477G36k733N39M117l80l635Q81K883k137j372L419J997k457j030J293j874m588
1493d341n18J360j649L7L847L278j46J602K131p70k873l73j00k298j095J175O68
1510f5j571j05L80p56j741R22J106M63J156K877J120q14M21j67k041j980P72K71
$$ y = [425, -3995, -1451, 3552, 759, -2388, 2298, 4758, -978, -3269, 2364, 2207, -4189, -2484, 3863, 1212, -3963, 146, 4263, -2155, -5106, 997, 2602, -3151, -1480, 5791, 4583, -1386, 1845, 5746, -1010, -5742, -377, 1141, -5300, -4676, 2716, 1670, -4264, -772, 4407, -445, -3856, 1856, 4845, -626, -345, 6007, 4501, -2375, -719, 2551, -3112, -7374, -1989, 1025, -3523, -2656, 4219, 3580, -1983, -59, 3383, -880, -4320, 373, 3547, -370, -214, 4838, 3608, -1401, -1045, 1329, -2456, -5621, -1963, 736, -1997, -1458, 2659, 2279, -1356, -475, 2408, 271, -1101, 2318, 4315, 1858, 828, 2121, 247, -4341, -4859, -3499, -5148, -5111, -1264, 2014, 1868, 3470, 5601, 4831, 1958, 1585, 1485, -813, -1908, -733, -65, -1636, -1741, -1361, -2117, -3858, -2936, -1830, -1367, -211, 2666, 3786, 2972, 3393, 3226, 1185, -795, -23, 248]
1528B48j202Q92J754m04k007p5n40k747j501J455Q19p0K801L998R50n15J593N28
1546E977l187j974R48j053k695r0K015j893k871R53J620j968k42M600K281j361
1562A060J718L516j475m060P33J163m223k215L130J414l389J076M499j221m215
1577b489J590K284l926k773M600K384l292P20N453r57n436J772M277l749l430
1592b972M415K364n514j424M901j294n958K301N463k892l251N451L761n326j130
1607a105N450p43p483N39M873l557m357N772N422m551j905O219O6p311J58O605
1623D092k962n830M372M101o176l829O853J857o526J476P880k299o615M128N573
1638F095n750m037O380J868q397j373P311j332o493M795P262n075n898N591K893
$$ y = [248, -954, -62, 1692, 1288, -719, -794, -1334, -4081, -5582, -4127, -3308, -3378, -577, 3421, 4371, 3856, 5449, 5977, 2790, 816, 1764, 711, -1984, -2074, -59, -1952, -4823, -3870, -2250, -4218, -4460, 140, 2421, 1060, 2778, 6294, 4819, 759, 1492, 2655, -1568, -3783, -653, 761, -2628, -1552, 2947, 1726, -2489, -899, 1385, -2541, -5314, -714, 1670, -1622, -902, 4551, 3594, -1842, -70, 4207, 458, -2972, 1443, 3807, -1707, -3131, 1770, 476, -5482, -3181, 2282, -610, -3861, 1590, 5351, 25, -1105, 4345, 3602, -3881, -3342, 1531, -2026, -6383, -611, 4811, 260, -1645, 4574, 4640, -2671, -2513, 4092, 1130, -4700, -328, 3773, -2403, -6232, 621, 2478, -4048, -2572, 5308, 3009, -3606, 522, 6095, 345, -3692, 2688, 4556, -3841, -5214, 2097, 765, -5728, -933, 6329, 1254, -4644, 947, 3840]
1653C840p919r49R307N49p843K346P021n466o747O318N204p406l497P049K44q975
1669f924J448R001j987o408O187O153o843m731Q342K951q538j53P802l737j0167
1684g604K490O978n863m948R559M638q642k038R595j02p730M576R268n372q211
1699c406N598L901r127l218R578M68j0145M19P839m702p251P386Q413o400l580
1714d227R209J870r108O85J0147k364q463M343N309q982p056P130L256q589Q9
1729f751R241j663q637L881Q957l892m048Q888L963q942l373P419r73q467L113
1744a284P108o322p536N064L942p148r69R826J514p701J806Q016m320n677O627
1759B946N611o908l624N819q30r597N42P909k157n905M885M833o565l465Q215
$$ y = [3840, -4079, -5028, 4279, 4828, -3015, -669, 6352, 886, -5861, 457, 5661, -1745, -5242, 1807, 2051, -6924, -5476, 3525, 1538, -4870, 1317, 7470, 627, -4104, 4238, 7189, -1349, -1502, 6300, 2563, -7604, -5114, 1864, -3999, -8947, 612, 5250, -3392, -5430, 4165, 4063, -3667, 909, 10177, 4805, -3406, 2192, 6093, -3034, -6252, 3326, 3794, -6351, -5932, 1907, -2795, -10046, -2660, 5753, -647, -4227, 4982, 6852, -2256, -1571, 8576, 6212, -2251, 2092, 7401, -1581, -8637, -1507, 1749, -6840, -6751, 2490, 827, -7810, -3929, 5028, 1136, -2912, 5976, 9939, 997, -2376, 5043, 4070, -4397, -1284, 5824, -498, -8034, -2970, 972, -6176, -7145, 2681, 4195, -3506, -1700, 6316, 1996, -3681, 2946, 8557, 1649, -1975, 3844, 3014, -6583, -6041, 1868, -289, -6194, -1309, 3524, -3041, -6506, 1709]
1774A709L378n844J413O777l437p976L487N294n085l827O547R79q510j172O779
1789E12j073n580M885O596m487m583O010K984o365j82P750p04p338R38M465n536
1805a708n749N619M454o088j820O295k95o353L001Q140j654m465M238L266p150
1820b69l483O321J148o602M68N538l501o304L978N279m074k130O381J438o710
1835b522k60N838j517m780L912M910m120m342M240J661n674P8O015r72n859J267
1851b125L592l667k748N456L432m134j450M505r48m462J631M292k304l179K416
1866C07J426m347j049M870Q20k891J526L111k209l585J923J756k719r48K708n65
1882A34l278M87K821p30m69K977J626k228j645J603p27j795P10J836j290j648
$$ y = [1709, 5087, -757, 656, 7433, 3996, -3980, -493, 4801, -284, -4111, 2436, 3415, -5095, -6267, 512, -561, -6141, -1256, 5340, 853, -3730, 2280, 5264, -1101, -1283, 6467, 5763, -1575, -637, 3828, -1708, -7457, -1838, 2616, -3472, -5292, 1003, 708, -5645, -2644, 5496, 3842, -623, 3615, 6881, -269, -3752, 2569, 3717, -2885, -2417, 3121, -380, -6684, -2706, 2573, -1501, -3631, 2750, 4188, -2522, -2782, 3056, 1539, -3241, 671, 5581, 1461, -2881, 1359, 3020, -2654, -2576, 3439, 2467, -3392, -2125, 1467, -2200, -4948, 508, 3940, -194, -1644, 2861, 1913, -2549, -918, 3374, 1070, -2109, 307, 1733, -2614, -3663, 1207, 2027, -864, 662, 3773, 1564, -2021, -98, 1658, -1061, -2009, 699, 134, -3144, -2657, 164, -566, -1035, 1942, 3568, 1340, -305, 1298, 571, -1224, -514, 1322, 32, -1616]
1898a616L35Q01j429L07K052Q72j064L1O93j348p30J165Q26j130K66R62q71o46
1916e24O19R75o06l33M82m59j325m93O72j3L01J331O16n03k68P30k52q23R4K52
1936D73o71j142p6k24k24L49J141N84K18N60J004k73l02R84l17r12j310j12r06
1955a156j379k99Q72L62K30Q53J105n53j48J190J58l43M11N38j41j111K20L76
1973A185r75o33q7m0j375j27O17r1l29N49J050k5l63J617R11m22J98J510l01j452
1993A417n00L00j546k455N21L45j150K03J676O73p74J294J991l12j122J428O39
2010B628j546n92J058k02k213O9P34j224j890J465R74j510M84K565Q1j025M96
2027C52J768q32j100J369O23j502o03J237n96k485K9J022j177j251J410J519o06
$$ y = [-1616, -1281, -480, -1909, -1602, 450, 1322, 258, 289, 982, -366, -1096, 69, 895, -235, 31, 993, 122, -524, 95, 1070, 464, 131, 613, 154, -1171, -1664, -992, -1005, -704, 627, 1243, 740, 472, 1202, 950, 127, 221, 473, -198, -1340, -1416, -1640, -1864, -1515, -374, 210, 428, 988, 1992, 1719, 1417, 2401, 2084, 1172, -138, -250, -1156, -2535, -2834, -1962, -1600, -1370, -517, 588, 35, -113, 1077, 1235, 892, 1303, 1841, 1700, 589, 809, 1185, 210, -423, -510, -550, -1925, -2052, -1435, -1526, -1855, -1306, -256, -281, -644, 973, 1884, 1462, 1660, 3170, 2869, 1417, 917, 1217, -329, -2784, -2263, -1918, -3068, -2865, -1189, -516, -1290, 4, 1995, 1683, 561, 1989, 2628, 1082, 490, 1548, 1346, -867, -798, -64, -1288, -3178, -1713, -739, -2249, -1765, 800, 881, -144, 352, 2120, 1288, 188, 1557, 2180, 678, 75, 1312, 716, -1769, -1740, -718, -1895, -3146, -1736, -217, -823]
2044h23L84K071M12j291M41J755j382j475J104K34j725q74J038o47j615J64J173
2061a056m48j033J802J161r0J55J538J99r74J03Q92q78j069N23o33r54o21J74
2079a209m75o93K02R54K0K01J026Q14L97M15P29n62p3p1r53k98k70n66n51m1K88
2100g16o55m74P30J28K76J72J182J17o69M46P73m72m30O95N18j511k99R27o89
2119D9j095J87J631j320j298J378P07j504P6K124J8j307Q40J685j192j819J595
2136G55Q39k296q05J724q7k533R16K702q08j295K071J325k496j293K205L41k841
2153a576N81K739j563k509J535J969j874j302L178J028l115l15L468r10l124J851
2169F1K724k641k851K643J385l324o2M519J75l907P27K674l080l199L400K720
$$ y = [-823, -439, 1632, 2044, 753, 1194, 2949, 1567, 92, 1196, 1430, -295, -1169, -131, -778, -2393, -2229, -1056, -1504, -2537, -735, 426, 336, 491, 2029, 2228, 1254, 1357, 2249, 1371, 302, 825, 192, -762, -1383, -1209, -1684, -2377, -2175, -1221, -1201, -1000, 26, 840, 1237, 1652, 2381, 1819, 1746, 1675, 722, 424, 154, -412, -963, -1004, -716, -1371, -1845, -1115, -987, -711, -539, 643, 760, 91, 537, 1310, 838, 408, 1103, 1621, 110, -189, 738, 49, -1046, -859, 772, -548, -1846, -468, 239, -1265, -1189, 935, 953, -354, 486, 2171, 979, -840, 755, 1594, -702, -1507, 217, 130, -2403, -1487, 1215, 407, -888, 1183, 2508, 12, -1281, 924, 1265, -1576, -995, 1744, 181, -2328, -793, 1176, -698, -2000, 1178, 2206, -909, -1224, 2244, 1334, -1790, 61, 2785, 144, -2707, -64, 1321, -2003, -2065, 2454, 2629, -1278, -551, 2123, -957, -4156, -756, 1964]
2185A964k882q18M055L87n096J236M486k334l424K964K755m440k633N061R64m464
2201b219P40M471k439m903L226M217l566j926N624J070o628j018M781j886m667
2216e123M652N092l622l317M512J783o216n75O381j379n932K059M241m209l476
2231e129O099K862n489j082N622j278o168K965O729k653m454M654J717p327k371
2246e303O202O15m892K516O021m061n943M138L334m985r89O132N13o785Q57O146
2262C516j869m397M669M301o102m310M681Q11o113J831P387j468o402K211L787
2277B533n025k991O938L618n079o24N154k296o737J980N571k977l901M565K477
2292C206o434j244O318J717m745J271M481l822o074L332N060l069j814N667M62
$$ y = [1964, -918, -1736, 2319, 2706, -2390, -1154, 3332, 998, -2426, 538, 3293, -1147, -3780, 1281, 2245, -2219, -1479, 2992, 553, -4350, -1124, 3093, -473, -2399, 3225, 4295, -2333, -3351, 1430, -456, -5123, -471, 4621, 999, -2318, 2194, 3977, -2239, -2814, 3567, 2188, -3744, -1685, 2556, -1653, -5129, 970, 3832, -1657, -2739, 2883, 1605, -4563, -1598, 5131, 2478, -1976, 2678, 4395, -2932, -5303, 899, 1514, -3378, -862, 5159, 1098, -4845, -707, 2627, -2358, -3347, 2785, 3298, -3487, -2630, 3516, 1647, -2750, 1919, 6220, 118, -4192, 489, 1300, -4813, -2982, 4405, 2937, -3465, -1254, 2533, -2492, -5483, 1455, 5073, -6, -630, 4524, 2228, -4509, -2529, 3042, 65, -3836, 729, 3206, -3228, -4472, 1846, 3563, -1182, 89, 4570, 748, -5326, -1994, 3066, -3, -1817, 3850, 4312]
2307D312p561j437N129q17m087M380N543l961n552M464K316n305j08O865J65o227
2323a881O57M504l698m216N376M074n587l537M803n00n906K244Q440j162n283
2338a672L541L139o492l627O995K780n483L70N216l876p047L152N728m165k738
2353d179O305J707p470o85P091n78m861L916N207n472n414M730K351n526N49P459
2369E130j357p466J308M199m485l240P132L962o070j446N363j357o287L523O218
2384E127l582m224M316J514o829n70O619L42n548K211M659m826m653N592L693
2399C841m697p65N890j569o618J477M931k862l124N414K659o199k065M866k39
2414I40m251K397N182k909m274L035K643m441n32N146K46n144M22L304k542l486
$$ y = [4312, -3249, -4686, 443, -374, -4461, -81, 5462, 1501, -4051, 413, 2729, -2576, -2684, 4181, 4346, -1881, -1224, 3280, -418, -4634, 742, 4816, -771, -4308, 495, -5, -5911, -3667, 4773, 3611, -1672, 1869, 5008, -1484, -5111, 1884, 4664, -819, -449, 4767, 891, -6156, -3004, 2724, -1441, -4179, 2126, 3833, -3637, -4322, 2769, 2191, -2670, 1246, 6453, 981, -4433, 297, 2648, -2878, -2329, 5130, 3773, -3693, -2385, 1814, -2671, -5911, 1221, 5183, -887, -2333, 3030, 1673, -4614, -1091, 5127, 1545, -2679, 1637, 3151, -3678, -4248, 2371, 2713, -2835, -624, 4035, -791, -5444, 148, 3841, -856, -1621, 4269, 2700, -3918, -2441, 2490, -372, -3496, 1918, 4577, -1622, -3687, 1179, 940, -3311, -914, 4268, 1359, -2915, 120, 2763, -1678, -2210, 2936, 3182, -1962, -1540, 1764, -778, -4264]
2430d264L859L193l175j717L306L48m259Q70M481p23k568J778J861l747j896K767
2446A14J162k351o9K803j043l266J120K523j049j265K394Q34k711r31K275M45
2462I85j766P10K324q22k473O81J285j355r07J879P57k252o44J731j94j424J120
2479c65K051r94j414R78J022j687j040J993N93k047N6J717q81j179P63K071j427
2496B10p75J298N05k212l58K109l02j839J042J530j613j687K047J374j939j3K226
2513A603m18k290Q61J930j670j524K468N32k286m05K280n00j972Q00J858j510
2529b43j389J730O02k102K19K492n64j701J369J530j849j061K049K82k126r3K102
2546A247j105j929J090K007k022o46J879L46k085N30J987p13j806J209J378j575
$$ y = [-4264, -405, 2788, -387, -2104, 1202, 1550, -2709, -1839, 2642, 1919, -649, 1129, 2990, -757, -2653, 114, 1276, -1075, -1144, 1659, 616, -2650, -1530, 993, -56, -1321, 1073, 1907, -804, -1735, 540, 985, -781, -71, 2253, 1431, -1042, -361, 924, -431, -1338, 541, 1298, -954, -1598, 133, -61, -1485, -365, 1686, 692, -722, 256, 1278, -409, -1449, 544, 1137, -910, -854, 863, -18, -1197, -434, 1637, 210, -565, 733, 1238, -974, -1332, 777, 475, -1364, -322, 1208, -405, -2092, -45, 1329, -610, -623, 1603, 1185, -1105, -244, 1686, 16, -1508, 960, 1492, -794, -1199, 1081, 581, -1391, -591, 1267, -243, -1632, 98, 700, -1402, -1183, 1309, 745, -956, 413, 1943, 94, -967, 1082, 1364, -762, -855, 1247, 142, -1787, -697, 1310, -712, -1358, 521, 867, -1218, -688, 1299, 586, -1220, -11, 1367, -208]
2562b08j026K014J95j989Q06J516m95j707J182P80j681m71J506m5j725P49J635
2579A036r27r77J205O30j594L4J396j93j396P73J187r10q10J136K86j259j67R26
2597C76k40j041R14O05r73m43O12M12j119P3J237k04o03O53R00o35n24O75l26
2616C49r82j70R11m40m42P51L34m40n52O52p1m90K03K37N1J11M53j5k85J57k30
2637I2R3m78nK79J85j1j8K03m66j34n00K82K63l63K93M53J31j46j36L25j17o00
2659c75Q6L22k08K14J91P15m78l59M98l99p14j08N42%p19O33N62o72o00P05J89
2680B5o94M15R05N4o17K93N66p21k96K91m1p22k22J079j20p16L89P48m29j011
2700h24P75L9p90J8J182L72o98O27M87q83j374P19P63j186j09J347K00j304N5
$$ y = [-208, -1234, 780, 975, -1014, -208, 1308, 813, -894, 288, 1068, -613, -1084, 422, 377, -1348, -599, 1036, 109, -868, 337, 967, -627, -593, 803, 610, -786, -13, 1174, 264, -546, 590, 876, -383, -550, 376, 136, -905, 9, 614, -359, -802, -190, 222, -897, -824, 413, 209, -394, 259, 1159, 524, 0, 675, 349, -633, -803, 108, -332, -774, -23, 311, -129, -681, -29, -100, -590, -387, -150, -99, 12, 465, 450, 165, 322, 92, 185, -293, -298, -19, 166, 155, 137, 340, -126, -260, -760, -478, -215, -578, -285, 168, 299, 153, 17, 342, 225, -375, -289, 33, -175, 39, 230, 945, 467, 108, 606, 207, -507, -615, -73, -73, -792, -159, 403, -269, -869, -164, 25, -669, -254, 651, 705, 88, 381, 947, 226, -70, 221, 180, -542, -764, 315, 195, -521, -132, 616, 187, -824, -49, -10, -800, -782, 400, 772, 74, 701, 1188, 305, -1069, -350, 413, -773, -882, 465, 665, -639, -584]
2719e84J042n38n38N40J294j014j105J389M27j158k3J540n62k029K16J133p18
2736f88l77J562J067j241p76J117r5j779O90K046o90j347Q50Q28j752j158K118
2753C75M90k097N3K239j252j430J142K180j472q38J886M52k757k50K213q5j472
2770f23J175J413k160k157J663J000j737J24K785m58k501O86J991j108j278K406
2786A221J221k515j003K105l39k385J206K536j399k200J436J061k582m96K945
2801H12R70k255K30J748j467k023J786J873j360j089K264l27k768q5K922k92j649
2818g10J106J430k463j681K065J215j806K50K463q92k763P88J765j066j019K508
2834A190J229k741j108J946j55j922J171K579r12k336Q81J186k375l40K691R20
$$ y = [-584, 458, -80, -618, -78, 1216, 202, -903, 486, 913, -245, -268, 1272, 710, -1319, -1103, 30, -688, -1065, 497, 1564, 323, -453, 664, 569, -1210, -520, 1526, 836, -511, 339, 1167, -585, -1743, 375, 865, -1232, -1179, 1060, -192, -1622, -480, 1700, 228, -610, 1276, 1728, -1029, -1279, 934, 849, -623, 552, 1965, -195, -2352, -689, 311, -1426, -1302, 1483, 1025, -1476, -790, 1201, 93, -1185, 1221, 2442, -73, -1076, 1029, 690, -1695, -489, 2047, 648, -1552, -116, 945, -1637, -2133, 812, 1782, -473, -243, 1505, 38, -1985, -199, 1674, 314, -775, 1489, 1162, -1606, -1691, 1231, 939, -710, 396, 1826, -637, -2318, -253, 962, -844, -594, 1869, 977, -1786, -998, 767, -299, -1318, 1190, 2419, -322, -1430, 516, 361, -1561, -390, 2189, 1277, -1059, -178, 1008, -1367, -1707, 984, 1904]
2850A904k298m80J677j391j759J675K356j006j268J828L76l038r6L040J36k321
2866f65P00J572k179k152J873J978j926l1K688p17k771k23K964o34j807K104J940
2883B714k794j908K305O41k429J020L271j246l145Q69J838k274j236L260J235
2898B121l147m02K346p69k532K132L378k090k454K629L86l566k71L724Rl015J259
2915b62K536k609k582K745K447k650n64K987o44l805Q06K889j170k336K838J738
2931B364l254j492L315M00k349J123K923k030l242J920J410k543m45L503K59l021
2947a159L26K431j856j823K412J698k091j437K401l59k723R26K751j61k143J497
2963F90J158k137j338K328O54k135K19J804j344k207J161J853j024j16K084k01
$$ y = [1904, -394, -874, 803, -588, -2347, -672, 1684, 678, -590, 1238, 1614, -1424, -1520, 1520, 1656, -665, 35, 1607, -572, -2724, -851, 1127, -799, -830, 1858, 1141, -1630, -1853, 1111, 477, -1330, 774, 2714, -80, -1988, 317, 958, -1471, -451, 2820, 1574, -1571, -702, 1136, -1138, -2374, 886, 2121, -1026, -1428, 918, 149, -2383, -251, 3127, 1037, -1417, 1212, 1598, -1968, -2239, 1485, 1494, -1521, -262, 2274, -335, -2917, -172, 2275, -375, -939, 2048, 1404, -2401, -1595, 1294, 124, -2212, 626, 2364, -890, -2382, 933, 1333, -1016, 107, 3030, 1000, -2242, -322, 1088, -1455, -1900, 1603, 1862, -1159, -833, 1598, -258, -2081, 331, 2029, -62, -1499, 902, 543, -2180, -1254, 1497, 1336, -807, 690, 1848, -289, -1627, 701, 1355, -780, -561, 1243, -101, -2308, -1147, 706, -318, -434, 1650, 1449]
2979A449k005l65J528k31j170R07J156j387j388J572K06j072L65J705k86j480
2995d96l3J258r75q43J065J042j093r48J250k65j179P89J405m1j163M26M79r71
3013b93r02J351P05j044l63J191m28j204M61J415j86j198Q79M67j382r65J421
3030g5L94r94K74J494n69j249O55R74n04q68R79R01j747p27J372o9j406O13J466
3049I14p17j413J369P41j355l63J945j3j913N70J159p42j195J057J225j403o12
3066g46J436m0j462J5J547l73j551J090J097j522p30J537M06j382N35J316o24
3083E49j511J016P26j177l82J468J20j512K72J274p40r85R85Q77j393m14J246
3100D19j55j005J77J264l81j218O37J067q86l68J150J08j086M66O24m52j182J003
$$ y = [1449, -556, -921, 607, 376, -794, 113, 1269, -118, -1506, 66, 272, -800, -435, 1270, 984, -496, -529, 729, -246, -1089, -24, 1018, -75, -1023, 227, -38, -1217, -428, 977, 936, -227, 199, 678, -293, -1195, 156, 861, -183, -546, 645, 217, -987, -526, 889, 703, -495, 384, 851, -531, -1496, -75, 319, -675, -401, 1093, 524, -725, -70, 904, 400, -468, 511, 1412, -335, -1062, 310, 241, -1165, -552, 914, 197, -1216, 153, 894, -461, -824, 1121, 1108, -805, -235, 924, 182, -1013, 44, 1269, -134, -746, 690, 650, -812, -797, 750, 377, -1174, -84, 1013, -509, -1239, 298, 704, -678, -143, 1173, 549, -962, 54, 780, -397, -779, 689, 809, -703, -431, 843, 103, -882, 103, 980, -413, -827, 419, 264, -741, -564, 700, 319, -899, -262, 805, -81, -449, 701, 809, -277, 189, 813, 361, -821, 182]
3118A82L19j055J21O01l7r35M54P11o60j84O47O02j065M00M96N0q46J15R01p70
3138D7m70M23J34m39j7K52K48n77m4P87l84n13J053k70l87J03K86k00j37R8N33
3159E26l87k32L78l78lJ42k30J57k02J00nK9O7k1K88Qj36K0K7j56j8j74J29K4
3183d7m21J39M38j34QK17J10l08K00K08k27M4l72K97m26r9O3K78l61K25M11j78
3205F5m88K85O07k92k42L27R0k69q7K68k7o56K96O04p26l3L34m04o7k1L13P1m56
3228e08O51M49k73k60O03L3l56M2L45n61o08K36L78o79m8M48K05o68K11O66j50
3249A56k62M20M26n47n76O76K6q14M00L84j19p26N19N58p27r2M97K13n86l6O18
3270D08m62l60M00M86l07k47L76Qn07k9K51R0n10K02P41o01m78O47M69n40J6O56
$$ y = [182, 501, -554, -433, 168, 131, -804, -350, 361, -299, -483, 164, 766, -299, 101, 597, 647, -199, -84, 817, 47, -423, 0, 134, -305, -322, -70, 178, -399, -443, 344, -40, -553, 500, 230, -157, -54, 232, 32, -105, -7, 526, 139, -93, 285, -93, -96, 46, -184, -27, -229, -129, -134, -105, -38, -59, 229, 237, 101, 121, 148, -8, -26, -200, -71, -47, -468, -329, 109, -25, -17, 200, 310, 2, 202, 410, 183, 227, -145, 152, -274, -373, -310, -32, -393, -168, 243, 65, -423, -138, 469, 177, -65, 262, 352, 83, -4, 264, 237, -419, -123, 481, -245, -278, 56, -348, -415, -436, -123, -52, -508, 143, 592, 319, 59, 662, 695, 339, 381, 726, 165, -443, -207, 171, -508, -556, -108, 97, -571, -360, 306, 156, -106, 314, 740, 193, -383, 293, 319, -495, -95, 289, 170, -556, -37, 521, -206, -298, 199, 412, -174, -210, 408, -54, -414, -14, 472, 165, -82, 294, 302, -205, -234, 17, 107, -403, -201, 540, -61, -539, 108, 577, 37, 53, 709]
3292G09l81m86J45L35m39l47M07M63q23j17O89k85l26K91N56Q8o36L10N38o31
3312F0l92N50J18l18k28K67j69o03P51K55k10p45P05N5o45j78J114L48o95L84
3332D24P44r77n44O79M05q72k90Q27j01q90j05R94l91p63P75P62o93n80O21M73
3352D98n81K52P21k69j236K65M97n45k67J196K75p60k14N39k67q59N40P51j36
3371D00r69P47L20r44k67J016L34q61K91M19l54j036P49Q38n15m19P68k80j085
3390h48M05N22l1k95M48M92p14q52O28N35q74J9R69L8q98N87K81m02n58R16L61
3411G29p69l14O42k30o24P01M16l26p49M40J81r39J91R13L43o79J11M83o45o56
3431g81N33P26m32j66N41J20r67j70R82O5j072P37L97r50q06J008N77o11K04N79
$$ y = [709, 328, -158, -13, 322, -117, -464, -57, 406, -417, -534, 155, -130, -456, -165, 391, 479, -157, 153, 691, 60, -332, 218, 336, 18, -210, 57, -112, -715, 36, 291, 81, -664, 41, 96, -549, -727, 387, 735, 40, 424, 1168, 191, -353, 326, 731, -141, -431, 396, 295, -595, -700, 294, -97, -860, -85, 677, -16, -596, 25, 498, -83, 169, 890, 621, -615, -350, 147, -398, -665, 531, 806, 46, -168, 371, 104, -755, -215, 536, 400, -569, 178, 498, -446, -713, 303, 637, -224, 67, 486, 132, -904, -155, 683, 168, -251, 517, 237, -848, -443, 79, 48, -247, 201, 693, -21, -873, -245, 290, -584, -565, 404, 442, -456, 131, 412, 10, -548, 368, 729, -40, -354, 288, 58, -566, 135, 551, 225, -524, -84, 97, -842, -651, 262, 605, -74, 37, 520, -125, -781, -248, 478, 46, -120, 421, 541, -426, -596, 386, 451, -621, 116, 513, -437, -1243, -235, 342, -269, -65, 514]
3451E14k87p41r5Q01l51j85Q79L46r70m04M72Q0q42M55J329p38p87O66L09q84
3471d33r9R20J29j220r9J255n90p18R62R68j064n23J277pj365Q5J188k33p33M47
3491A47P40j126p88Q63M20q82J44J421q18q62L88J062o25n22J049K36j318q8J107
3510E48q3q04N47P90q50j138R35K18q94K91O80J74q15K32N71o65n42J142L12o69
3530b0k57N50k52l79L2P16j57q12N08J00k36k51P37J42p47L57N03n25o03L69N74
3551C49m92j41M98J24m73l9P8J17J48k14M14k66l13L04N2qk21J18M97o79j02L84
3573A35m80k34J76O34k22k42J5K99j34j17O35n2l79j67M96j59m90L58M08n31k22
3594b73J55K18m11k08M07L08m05J97J69k51K4K72L77n26j13N89M4p35J78M39m47
$$ y = [514, 227, -514, -609, 192, -159, -344, 535, 881, -89, -493, -21, 59, -783, -328, 1001, 263, -524, 142, 451, -433, -532, 388, 517, -703, -802, 453, -137, -855, 107, 1075, 11, -512, 765, 758, -607, -522, 666, 433, -300, 147, 887, -239, -1027, -164, 256, -626, -482, 939, 121, -741, -353, 709, 84, -438, 611, 847, -471, -559, 548, 465, -339, 208, 998, 148, -990, -55, 163, -731, -440, 240, 414, -401, -169, 402, -263, -805, 337, 649, -20, -277, 273, 21, -358, -326, 390, 233, -579, -71, 29, -207, -458, 279, 421, -326, 31, 534, 9, -594, -225, 349, -143, -284, 214, 338, -135, -174, -96, 21, 169, -45, 369, 103, -210, 94, 146, 138, -83, 35, 532, -147, -249, 135, -345, -579, -403, 231, 9, -233, -218, 81, -53, -170, 465, 413, 34, -133, 363, 204, -286, 72, 480, -51, -273, -118, 100, -311, -519, -112, 196, -209, -12, 157, -94, -70, 202, 579, 53, -60, 529, 573, -162, 16, 455, 8]
3615Hm74L91K40n37j05O20n6k43J02L32k94K0O5K14l56P4M64n4n87q8P25m98o40
3638f77O23K20k09l56Q08l46j97P0L09j76m15L59J22k91o3L59J45m11M3L25k10
3659C2l39Q1N79m43K55M2k39n46P45q4l62K94J23K75l47j53L72r2m19MQ1L26n45
3682c60M51m2j23L47J81l36J6j84ml4k50L8j5n4J80P9PN4M9J38j50J37K08j27
3706B06r9J07j02l82OK83j3J36p7j18L7J01j9k40R3mr7j75L02k59K54LK02N7O2
3731B64j91M12l32j20L12l86pNm9P8k4k8M0j48K03K78k17j83r5M13l00r9L34l28
3755a68rO9K6M13m37J44M28l16j89L2l4k10LK24p3j07J79K21m60K65q6L69n39
3778b55J05N79n06j24J66M21m08k75L71L00k44j1j01J6j71K59k43Ql87N78j11
$$ y = [8, -466, -75, 165, -372, -477, 143, 87, -156, -54, 278, -16, 4, 69, 283, -73, 1, 465, 411, -176, -264, 461, -37, -677, -54, 166, -43, -399, 409, 63, -134, -64, 245, 69, -346, 13, 135, -156, -219, 140, 285, -126, -83, 242, 32, -307, -226, 353, -90, 165, 207, -32, -578, 167, 83, -279, 15, 138, 413, 66, -87, 285, 193, -226, -222, -141, 185, -360, 91, 49, -74, 273, 454, 118, 134, -50, -54, -88, -338, -300, -315, -369, -189, -110, -103, -49, 0, 138, -12, 125, 333, 206, 107, 214, 112, -270, -264, 19, 6, 142, 65, -53, -16, 85, 66, -174, -81, -85, -182, -357, -55, -314, -60, -57, 145, 202, 264, 73, 485, 153, 33, 345, -41, -48, -43, -92, -14, -38, -66, -26, -174, 29, 307, 90, -93, -188, 225, -75, -174, 160, -168, -177, -108, -82, 331, -106, 38, 466, 150, -39, -7, -41, -251, -248, -24, -97, -204, -25, 196, -264, 1, -85, 284, -255, -150, 429, -77, -201, -35, 386, -22, -297, 74, 374, 130, 119, 18, 34, -137, 122, -121, -113, -500, 78, -33]
3799c3o4L2R8K23k73L16J0k01j67J89n0k03M2L75m08j10K59j18J04q3L75l14k03
3822b04N14P3l62k34M21q8j65pL63l2m31l8L17n6l34M03j49j77N6L57j51l55L23
3845D4J20k59r5L7J93k12K11r8L04l66k50O93l99k1O8M46k58l16J30K04m23J84
3867f3K17j35j75j87M39l66L8L37N8l86J51J78j04J03O4L11k63l54K35L71m36
3888C3l22L42j00rML9k54n5L4L38k02o0L22J13n48L46L35o7m01O8K64m20k50O37
3912A87j81k39K18K34j28k91K54p1m50L01K22J74l83j02O01l45q2J59L01l70p3
3933f4M40j71k71l39M37j30l94Q4O79k98m32Q06k10l92R1K69K61o02L7L19j93
3954g3k52K32M12o29q5M69J89n48J93L85j49n87J45O34o09n0N12n6l05J31K76
$$ y = [-33, -97, -65, 33, 256, -17, 299, 309, 108, -59, 130, 80, -123, -81, 294, -114, -224, 35, -83, 21, -62, 313, -1, -204, 310, 383, 21, -213, 208, 120, -45, -52, 311, 279, -152, -190, 127, 71, -263, 140, -9, -186, -130, 227, 76, -279, 44, 164, -95, -190, -153, 40, -172, 39, -59, 245, -121, -371, 322, -77, -98, -30, 416, 158, -158, -28, 176, -247, -63, 154, 19, -156, -343, 96, -270, -232, 105, 163, -223, -72, 106, 2, 105, 169, 480, 217, -137, 98, 469, 33, -289, 53, -47, -56, -52, -13, -267, -322, -288, 50, -152, -212, 110, 223, -325, 21, 356, 289, -112, -44, 220, -200, -450, 187, 6, -233, -15, 219, 91, -200, 54, -17, -467, -166, 56, 230, -153, -255, 346, 1, -81, 78, 379, 9, -64, 376, 205, -66, -405, 32, -98, -492, -408, 271, -27, -459, 347, 137, -255, -164, 105, 366, -236, -199, 120, -73, -325, -93, 319, -310, -395, 74, 263, -285, -92, 293, 144, -443, -298, 336, -273, -323, 189, 133, -172, -41, 235]
3975B35k83j31J33K78m57P5J25L87m35o5O70n85n7m6M49l01j91N13m8k91l3K79
3997B21k34k75J11O69n09l15N70r0k17l71N23J06l90K32L23l47n23N17J39j50
4017a0j45L63r7n77K16M87k59l76L57K69k63k34N95j32k61J14L05j37m30K34J27
4038A46j69l96M63L20l87j11K72J45n31J54K48q2j70K08J36k78j48P63l25m25
4058a67N1L87l43j28K44Q2l39k0L67m3m81K23M65k54k69K71L79o57n2N92J2l69
4080d9j72M24j76j63O8L52l17o1J74K6l43j03L97j96m21N25K85j86m01M75J8m88
4102c32L21J57j13j45r0J35Q3l10L86J83l80N4N3J02k76K64J21q5m53K54J37j61
4124i5j70M22m8m3P9Q0R8m31P0K98k55k68K81m9j52l9PL50p1n5K30m46J73J54
$$ y = [235, -48, -179, -46, 232, -225, -150, -25, 362, -73, -138, 532, -53, -110, -156, 293, -8, -199, 314, 266, -25, -58, 221, -13, -288, -177, 492, -17, -332, 238, 148, -69, -440, 83, 189, -201, 31, 354, 7, -516, 1, 140, -10, -155, 208, 111, -466, -250, 237, -22, -398, -41, 228, -35, -269, 326, 194, -67, 47, 352, 215, -215, 19, 146, -23, -419, 44, 364, -23, -134, 138, 283, -248, -94, 154, 72, -98, 110, 246, -32, -180, 583, 258, -167, -116, 271, -72, -200, 44, 126, -213, -233, 134, 91, -390, -167, 298, 44, -225, 46, 425, -232, -284, 308, 320, -49, -221, 203, 27, -136, -68, 284, -33, -94, 80, 106, -237, -340, 57, -139, -560, -35, 250, 64, -337, 138, 156, -332, -11, 146, 33, -112, -202, -67, 16, -294, 92, 275, -105, -51, 2, 104, -172, 92, 213, 128, -325, -71, 66, -95, -265, 157, 109, 66, 145, 225, 323, -108, -38, 260, 5, -263, 18, -31, -183, -222, -215, 135, 64, 9, 239, -207, -34, 120]
4148A20J27m11o8M87k27j58K23k40K60k86K74J54q4k67L41k32j54k3K4j8j89M12
4170F5p8J11k63K06J4N9j17J93k36j93J97R3k35J30m6J70l52K6M59k05l0m5J00
4193B3k24Q8K87j30L1l8k13L40m08K77J36L8m66L33J35k60r3J31P1k63K17J29
4215A41j49j55K08j49q2j44J97L12k76k2L04l01K12j95K87j78k9J87%j18J20M0
4237B10l79Q3J03J22r3j07j1J02j21J0j35K71L8j24L8O8R6l4L3j55L29n6j99k14
4261a25J47P1j01K1l69M07P3j16j94Q2J59k8m8j8L7R3j53O3J40l23J57R9J59m85
4285b52J32K9pO2J4q2J22j2Q9J2J6k81K23P0k41K67l18J30JM9l43J82J98j46J21
4310C5m0p7Q3l5L8Ro8p3M19k54j87J55N6m32K03K73j91N9n6K96k09N2K3O7k88
$$ y = [120, 247, -164, -232, 255, 28, -130, 93, -147, 113, -173, 101, 255, 171, -96, 245, 13, -141, -164, -140, -158, -347, 65, -13, 98, -165, 41, 55, 114, -3, 190, -46, -239, -42, 51, -184, -54, -100, 70, -282, -256, 203, -2, -32, -77, 23, -201, -113, 174, 44, 75, 37, -176, 164, -244, 33, 169, 207, -259, 74, 209, -51, -144, -13, 58, -205, 12, 141, -8, -163, 45, -104, -186, -330, -133, 179, -97, -119, 185, -116, 96, -99, 188, 10, -19, 168, 168, 50, 170, 210, -169, -86, 17, 139, 46, -61, -72, 30, -91, -81, -216, 55, 93, -31, 7, 75, 171, 137, 170, 15, 344, 288, 89, -125, 22, 93, -8, 13, -356, 51, 124, 8, -186, -104, 55, 27, -21, -39, -2, 91, -62, 1, 141, -182, -25, 74, 233, -252, -120, -91, -98, -36, -22, -104, 18, 6, 95, 107, 123, -158, 65, 135, -106, 161, -157, -27, -26, 23, -320, -138, 60, -86, 35, -5, -82, 1, -34, 4, 13, -55, -128, 291, 37, -150, 5, 61, -371, -168, 105, -86, -27, -83, 213, 4, 56, 79, 146, -142]
4335a42QJ59j53J16j44J90R8j53J04N3k53J40p3Mll73N79k71K17k60L42j00j51
4358f6P2J53p3l6q7j18l9L42l92K06k23K4K43JJ7J37pk23J34q5J2P0K5%j00j38
4384a51J07Q4r1j8L0j61J99j28K32j84j07L35p6o8J50j6j97lJ62Rj46J61j80J50
4408I3l88N12q8m3l60M52J16o36j2L75kj95K59j89k04J46R3K43l59j91M82ml10
4431b10P9K63l0r3J28j78j91L2N51l49m7j39R0J12j11J01J3k5j44L36q8j81K33
4454A52K6j51J7r7L36m29N2P3rl16J3O35k57OJ07j44k08L7J30J81k84k2L10k86
4478a28J07M8N5k6k31J92j61K3m6L58m1m01n5M79p1m15K48P4j64o0M06o2k06J51
4502G4L46m43j74L26k26N3j0J49J06k70m0K62j07m17M13J80j09l01J92P5k40l7
$$ y = [-142, -134, 25, -128, -12, -156, 34, 132, -21, 83, 136, -117, 23, -50, -46, -49, -422, 157, -114, 103, -157, 185, 85, -66, 6, 159, 86, 50, -37, -155, -194, 148, -244, -38, -261, -237, 6, 7, 24, 161, 154, -69, 65, -20, -8, 62, 87, 87, -13, -151, -44, 40, -51, -69, -39, -200, -1, -129, 103, -81, -188, 147, 71, 3, 153, 137, -60, -63, 99, 108, -38, 123, -57, 93, -295, 217, 129, 86, -274, 178, 294, -342, -354, 21, 19, -176, 83, -106, -310, -164, -71, 172, -187, -378, 104, 100, -210, -131, 132, 102, 9, 137, -41, -232, -200, 351, 2, -45, -184, -94, 18, -93, 8, 21, -4, -148, 188, 100, -81, 152, 178, 27, 44, -53, 283, -146, -94, -21, -30, -346, -333, 302, 45, 51, 158, 14, -194, -157, -27, 154, -130, -152, 158, -128, -21, 27, 82, 56, -175, 17, -144, -121, -167, 191, 150, -251, -306, 173, 102, -313, -65, 9, -155, -215, 191, 129, -77, 74, 420, -23, -197, 129, -97, -44, -54, 95, 201, -69, -109, 153, 46, -371, 42, 222, 113, -188, 4, 79, -161, -198]
4524a98N22j03j65P4L05o02N3M01j4l27l6K21j08k50J34L25m90pL60k3j61rL26
4547B28j90k52J03J80p6l31K81K55k69j61O07q2o97J94K42j4k73L60M14o62r7
4568b40L94J92k02l24N79k17m32K01K38j51j96K65K21n53J24L71j78l18N1M24
4588B49o2m13M65l57Lj77M87k64j44n5M95k14k16K49l6J26m04M89j7p82L79M88
4610B89k47o2J10K99m55l52M49j23k58Q2K60n5j55K64K13l82NL29K20n83R4N25
4632D67m39l48M68M5k30M3j3J63l77j81N18k0j53K55J74n24q3L30J32l12N4L89
4654C58o9j40q5L25k96l95L81j1l48k01O01k6l81J0O14j26k44j21J29Pj70J90
4676BK27p51M88M23n09j28K5M57J5l89M10l6m16K4J12J16m30N46k3L1m95L62J96
$$ y = [-198, 324, 221, 56, 130, 435, -167, -114, 287, 273, -54, -90, 131, 23, -227, -93, 232, -258, -265, 95, 72, -89, -98, 228, 38, -214, -111, 69, -7, -338, -57, 198, -71, -232, 375, 293, -404, -210, 32, 18, -255, 105, 519, -143, -240, 154, 346, 144, -180, 399, 182, -250, -49, 189, 38, -158, 107, 328, -225, -101, 270, 92, -226, -175, 249, 187, -226, 239, -118, -115, -292, 195, -69, -213, -268, 227, 13, -203, 46, 10, 136, -268, 221, 204, -578, -199, 289, 42, -20, 90, 389, -66, -418, 31, -92, -350, -268, -8, -63, -218, 46, 259, -123, -118, 211, 431, -152, -58, 467, 28, -320, 148, 193, -37, 6, -7, 156, -221, -402, 116, 96, -57, 198, 372, -152, -235, 95, 227, -85, -31, 358, 289, 149, 64, 389, 93, -302, 79, 68, -280, -481, 120, 94, -287, -277, 337, 211, -33, -154, -25, -18, -188, 2, 229, -522, -34, 389, -120, -248, -223, 234, 249, -140, 270, 234, -182, -158, -46, 70, -360, 186, 163, 194, -301, 61, 257]
4699B57m91J15N33m04l33L15K56l21j06M21j72j52J01J89j74J37k91K15J06k80
4719g9O8j9Lk10L00q8k74L98K20j24p4m0j9O9l02K02L1j45m4K52j02k29J63J79
4743A36k03j50N09k39q6J49q0J56o8k21J86j31L4L7K05k29K06l02Q3j31O4M3o5
4766i7j53l9K39J69j32o1R4n9j1J60J66k79n9O4l26K67K00L9m09L87j97J71J3
4789A47J06J5k92k14M21j44l6J62O9r3l54K57N7J0l05QK41j14J63j61R3Nr1J36
4813H6o0J07J44j24j60J59Oj34J47j99J55j99j07K36r8K9J98j93m0j95J17K12
4835H7j35j5j0ln6Q7q2M5J36q3r7K05j83P1J22p4l9j48L16k11k1p2K4J69k1J79
4861A91m52J27L39m5j62k79K80j18K25k1L1l7k76K58o7J94m02L30p9j45K41j39
$$ y = [257, -234, -119, 414, 10, -323, -8, 248, -73, -179, 242, 70, -82, 19, 208, 34, 171, -120, 95, 201, -79, -11, -30, -27, -237, 63, -25, -299, 99, 319, 195, 121, 81, 62, 131, -171, 31, 62, -83, -127, 125, 23, -206, -43, 136, -67, -217, 292, 53, -33, 116, 36, 192, 124, -97, 89, -42, -8, 29, 234, 5, 211, -91, -8, -139, -75, -32, -97, -250, -289, -50, 119, -13, -74, 20, -39, -50, 110, 276, -3, -62, 2, -324, -57, 143, 182, -227, 160, -37, 134, 147, 253, 268, -24, -238, 183, 39, 3, 165, 234, 141, -213, 44, 101, 111, -194, -186, 55, -59, 104, -57, 36, 41, -50, 86, 26, 133, 277, 153, -7, 152, 158, 24, 171, -28, 127, -72, -179, 57, -41, -12, 186, -7, -47, -242, -125, 87, -48, -63, -73, -76, -132, -45, -127, -82, 54, -29, -126, 79, -104, -33, 89, 15, -24, -172, 144, -67, -88, -160, -136, 33, 12, 191, -261, -134, 205, 160, -2, -281, -1, -119, 106, 85, 116, 79, -197, 61, -6, 188, -214, 116, 37, -108, 133, -6]
4883fj05K01J69j20j5m00K20K11j33k41Q0O4J13Q0Mj76p6J13mJ57R5j53K43j96
4907A25k51K22j87M1r7L5%n6K95p4k15Q7K94q0n5O1j43J70j09Q3m2Q6k69L5o7
4932a11LrK83k69j06K30k4q4JJ08j47N9n8K32l72K12rL3J71m9j15Q7k42L66p9
4957A11k0k86L10J4j1k66O7J82k40R5J03J02j50L1L0m2j10L60k92j41k4L58r4
4980H7k45O2l6J54r6K25j3k48l7L35Ok83m9L00j96j18K78QNk28K67j52k6m8J68
5005A20Kl27L68K9k70R9k4o8m2MK59Q9l84R9l4J0o2Q2K51k57m3K82l64Q9J99J91
$$ y = [-6, -111, 90, 259, 139, 124, -276, -56, 155, 22, -219, -139, -75, 38, 118, 122, -54, -130, -17, -21, 136, 231, 78, 321, 125, -126, 96, -91, -50, -147, -112, -112, -168, 127, 53, -162, -75, 219, 139, 84, 145, 2, 172, 63, 146, 104, 190, -79, -44, -111, -108, -117, 166, -103, -209, 21, -3, -87, -86, 22, -125, -66, -124, 108, -264, -52, -61, -28, 143, 94, -21, 66, -176, 190, 111, 91, -195, 115, 129, 118, -148, -81, 101, -139, -44, 59, 161, 11, 42, 72, 30, -80, 280, -12, -153, -177, 181, 87, -158, -96, -132, 22, -74, 151, 138, -110, -147, 188, 194, -89, -138, 162, -34, -152, 126, 134, 139, -89, 178, 26, 0, -48, 120, 122, -205, 163, 192, -78, 21, -3, -71, -113, -109, 150, 239, -145, -46, -80, -70, -132, -50, 201, -56, -99, 183, -181, -92, 107, 298]
$$ [...]
8191b02
##END NTUPLES=NMR FID
##END=
