##TITLE=1H_IBDPBF1202
 CDCl3, 8 sc, 
 13.2.2019
##JCAMPDX= 6.0         $$ Bruker NMR JCAMP-DX V2.0
##DATA TYPE= NMR FID
##DATA CLASS= NTUPLES
##ORIGIN= UXNMR, Bruker Analytische Messtechnik GmbH
##OWNER= root
$$ XWIN-NMR		Version 3.5
$$ Wed Feb 13 14:05:56 2019 Russian Standard Time (UT+4h)  she@DPX200
##.OBSERVE FREQUENCY= 200.1313
##.OBSERVE NUCLEUS= ^1H
##.DELAY= (6, 6)
##.ACQUISITION MODE= SIMULTANEOUS
##.ACQUISITION SCHEME= undefined
##.AVERAGES= 8
##.DIGITISER RES= 18
##SPECTROMETER/DATA SYSTEM= spect
##.PULSE SEQUENCE= zg30
##.SOLVENT NAME= CDCl3
##.SHIFT REFERENCE= (INTERNAL, CDCl3, 0, 15.7039)
##AUDIT TRAIL= $$ (NUMBER, WHEN, WHO, WHERE, WHAT)
$$ ##TITLE= Audit trail, XWIN-NMR		Version 3.5
$$ ##JCAMPDX= 5.01
$$ ##ORIGIN= Bruker BioSpin GmbH
$$ ##OWNER= she
$$ F:/spectra/data/she/nmr/H-F/1/audita.txt
$$ ##AUDIT TRAIL=  $$ (NUMBER, WHEN, WHO, WHERE, WHAT)
(   1,<2019-02-13 14:03:33.53 +0400>,<she>,<DPX200>,
      <created by zg, POWCHK disabled, PULCHK disabled
       configuration hash MD5:
       00 E9 B6 7A A2 85 ED C7 34 08 36 98 17 FE 4E 26
       data hash MD5: 16K
       6B 05 17 96 8E 11 6C 1A 0D 40 53 0E 6B 66 D1 02>)
$$ ##END=
$$ 
$$ hash MD5
$$ CA 6C 71 98 7A B9 18 6D 5D 7C 9E 5F 92 F3 FB 04
##$RELAX= 
##$RELAX= 
##$RELAX= 
##$RELAX= 
##$RELAX= 
##$RELAX= 
$$ Bruker specific parameters
$$ --------------------------
##$DU= <F:/spectra>
##$EXPNO= 1
##$NAME= <H-F>
##$PROCNO= 1
##$TYPE= <nmr>
##$USER= <she>
##$AMP= (0..31)
100 100 100 100 100 100 100 100 100 100 100 100 100 100 100 100 100 100 
100 100 100 100 100 100 100 100 100 100 100 100 100 100 
##$AQSEQ= 0
##$AQ_mod= 1
##$AUNM= <au_zg>
##$AUTOPOS= <>
##$BF1= 200.13
##$BF2= 200.13
##$BF3= 200.13
##$BF4= 200.13
##$BF5= 200.13
##$BF6= 200.13
##$BF7= 200.13
##$BF8= 200.13
##$BYTORDA= 1
##$CFDGTYP= 0
##$CFRGTYP= 5
##$CHEMSTR= <none>
##$CNST= (0..31)
1 1 145 1 1 1 1 1 1 1 1 1 1 1 1 1 1 1 1 1 1 1 1 1 1 1 1 1 1 1 1 1 
##$CPDPRG= <>
##$CPDPRG1= <>
##$CPDPRG2= <>
##$CPDPRG3= <>
##$CPDPRG4= <mlev>
##$CPDPRG5= <mlev>
##$CPDPRG6= <mlev>
##$CPDPRG7= <mlev>
##$CPDPRG8= <mlev>
##$CPDPRGB= <>
##$CPDPRGT= <>
##$D= (0..31)
0 1.2 0 0 0 0 0 0 0 0 0 0.03 0 0 0 0 0 0 0 0 0 0 0 0 0 0 0 0 0 0 0 0 
##$DATE= 1550052212
##$DBL= (0..7)
120 120 120 120 120 120 120 120 
##$DBP= (0..7)
150 150 150 150 150 150 150 150 
##$DBP07= 0
##$DBPNAM0= <>
##$DBPNAM1= <>
##$DBPNAM2= <>
##$DBPNAM3= <>
##$DBPNAM4= <>
##$DBPNAM5= <>
##$DBPNAM6= <>
##$DBPNAM7= <>
##$DBPOAL= (0..7)
0.5 0.5 0.5 0.5 0.5 0.5 0.5 0.5 
##$DBPOFFS= (0..7)
0 0 0 0 0 0 0 0 
##$DE= 6
##$DECBNUC= <off>
##$DECIM= 32
##$DECNUC= <off>
##$DECSTAT= 4
##$DIGMOD= 1
##$DIGTYP= 9
##$DL= (0..7)
0 120 120 120 120 120 120 120 
##$DP= (0..7)
150 150 150 150 150 150 150 150 
##$DP07= 0
##$DPNAME0= <>
##$DPNAME1= <>
##$DPNAME2= <>
##$DPNAME3= <>
##$DPNAME4= <>
##$DPNAME5= <>
##$DPNAME6= <>
##$DPNAME7= <>
##$DPOAL= (0..7)
0.5 0.5 0.5 0.5 0.5 0.5 0.5 0.5 
##$DPOFFS= (0..7)
0 0 0 0 0 0 0 0 
##$DQDMODE= 0
##$DR= 18
##$DS= 0
##$DSLIST= <SSSSSSSSSSSSSSS>
##$DSPFIRM= 0
$$ [...]
##$SUBNAM2= <"">
##$SUBNAM3= <"">
##$SUBNAM4= <"">
##$SUBNAM5= <"">
##$SUBNAM6= <"">
##$SUBNAM7= <"">
##$SUBNAM8= <"">
##$SUBNAM9= <"">
##$SW= 20.0189088683792
##$SWIBOX= (0..15)
0 0 2 0 0 0 0 0 0 0 0 0 0 0 0 0 
##$SW_h= 4006.41025641026
##$TD= 16384
##$TD0= 1
##$TE= 0
##$TE2= 300
##$TE3= 300
##$TEG= 300
##$TL= (0..7)
0 120 120 120 120 120 120 120 
##$TP= (0..7)
150 150 150 150 150 150 150 150 
##$TP07= 0
##$TPNAME0= <>
##$TPNAME1= <>
##$TPNAME2= <>
##$TPNAME3= <>
##$TPNAME4= <>
##$TPNAME5= <>
##$TPNAME6= <>
##$TPNAME7= <>
##$TPOAL= (0..7)
0.5 0.5 0.5 0.5 0.5 0.5 0.5 0.5 
##$TPOFFS= (0..7)
0 0 0 0 0 0 0 0 
##$TUNHIN= 0
##$TUNHOUT= 0
##$TUNXOUT= 0
##$USERA1= <user>
##$USERA2= <user>
##$USERA3= <user>
##$USERA4= <user>
##$USERA5= <user>
##$V9= 5
##$VALIST= <valist>
##$VCLIST= <CCCCCCCCCCCCCCC>
##$VD= 0
##$VDLIST= <DDDDDDDDDDDDDDD>
##$VPLIST= <PPPPPPPPPPPPPPP>
##$VTLIST= <TTTTTTTTTTTTTTT>
##$WBST= 1024
##$WBSW= 4
##$XGAIN= (0..3)
0 0 0 0 
##$XL= 0
##$YL= 0
##$YMAX_a= 406902
##$YMIN_a= -338369
##$ZGOPTNS= <>
##$ZL1= 120
##$ZL2= 120
##$ZL3= 120
##$ZL4= 120
##$ABSF1= 10
##$ABSF2= 0
##$ABSG= 5
##$ABSL= 3
##$ALPHA= 0
##$AQORDER= 0
##$ASSFAC= 0
##$ASSFACI= 0
##$ASSFACX= 0
##$ASSWID= 0
##$AUNMP= <proc_1d>
##$AZFE= 0.1
##$AZFW= 0.1
##$BCFW= 1
##$BC_mod= 2
##$BYTORDP= 1
##$COROFFS= 0
##$CY= 11.3945322036743
##$DATMOD= 1
##$DC= 2
##$DFILT= <>
##$DTYPP= 0
##$F1P= 18.9103706918063
##$F2P= -1.10871071338519
##$FCOR= 0.5
##$FTSIZE= 0
##$FT_mod= 4
##$GAMMA= 1
##$GB= 0.15
##$INTBC= 1
##$INTSCL= 1
##$ISEN= 128
##$LB= 0.24
##$LEV0= 0
##$LPBIN= 0
##$MAXI= 10000
##$MC2= 0
##$MEAN= 0
##$ME_mod= 0
##$MI= 1.114404
##$NCOEF= 0
##$NC_proc= 0
##$NLEV= 6
##$NOISF1= 3.799351
##$NOISF2= 2.8
##$NSP= 1
##$NTH_PI= 0
##$NZP= 0
##$OFFSET= 15.70392
##$PC= 1
##$PHC0= -9047.69
##$PHC1= 10.00014
##$PH_mod= 1
##$PKNL= yes
##$PPARMOD= 0
##$PSCAL= 0
##$PSIGN= 0
##$REVERSE= no
##$SF= 200.130013532006
##$SI= 16384
##$SIGF1= 3
##$SIGF2= 2
##$SINO= 400
##$SIOLD= 16384
##$SREGLST= <1H.CDCl3>
##$SSB= 0
##$STSI= 0
##$STSR= 0
##$SW_p= 3612.71676300578
##$SYMM= 0
##$S_DEV= 0
##$TDeff= 0
##$TDoff= 0
##$TI= <>
##$TILT= no
##$TM1= 0
##$TM2= 0
##$TOPLEV= 0
##$USERP1= <user>
##$USERP2= <user>
##$USERP3= <user>
##$USERP4= <user>
##$USERP5= <user>
##$WDW= 1
##$XDIM= 8192
##$YMAX_p= 0
##$YMIN_p= 0
$$ End of Bruker specific parameters
$$ ---------------------------------
##NTUPLES= NMR FID
##VAR_NAME=  TIME,          FID/REAL,        FID/IMAG
##SYMBOL=    X,             R,               I
##VAR_TYPE=  INDEPENDENT,   DEPENDENT,       DEPENDENT
##VAR_FORM=  AFFN,          ASDF,            ASDF
##VAR_DIM=   8192,          8192,            8192
##UNITS=     SECONDS,       ARBITRARY UNITS, ARBITRARY UNITS
##FACTOR=    0.0002496,     1,               1
##FIRST=     0,             0,               0
##LAST=      2.0444736,     0,               0
##MIN=       0,             -338369,         0
##MAX=       2.0444736,     406902,          0
$$ Real data points
##PAGE= N=1
##DATA TABLE= (X++(R..R)), XYDATA
$$ [...]
1940A41J192j844l22J923K8k250N11J872j273j530J493R28j869n05K143L80j868
1957h50P66J713q47j627J146P72j572m93J547o3j301M77J240r16r37J133N34j443
1975g21m51J418K9j336L69J329l56q18J034O64r53n07J441jj265J28N37n70j088
1994a117N51M94p40j78R43N07m97K36O71m11q09L65L02o04k78N32L98o97K62Q94
2014H24m23n48L78L77o82m43P42k09l76j84M92l21l12M07M54P7n65L96N07l89
2034B02J99K20qn12L4M57l22j58l7O13q01j36J4q3o25O8L55K0j30L51N48K89k37
2057C21M37N3k42o11P82k48m66r1J41j80o03j50M10k91l26N45K38O4mM80K87M4
2079E90j53M88k75m82P6Q5l8o96K94J09k98l93L38M4J4N7N14L10l81J05P9m0m55
$$ y = [141, 1333, -511, -833, 1090, 1118, -1132, -621, 1251, -22, -1552, -59, 869, -1000, -1505, 638, 1018, -850, -84, 1629, 782, -845, 301, 1073, -499, -992, 555, 492, -809, -332, 908, -8, -945, 188, 722, -721, -1172, 246, 275, -1061, -692, 637, 281, -537, 497, 1161, 208, -299, 1142, 1141, -124, 4, 541, -29, -1117, -566, -72, -812, -990, -47, 460, -37, 199, 870, 459, -350, 15, 317, -287, -565, -33, 365, -332, -70, 824, 401, -147, 231, 608, -74, -517, 225, 16, -360, -544, -52, -373, -685, -278, 176, 253, -312, 84, 591, 202, 401, 621, 613, 101, 135, 592, 270, 112, 75, 688, -113, -249, -235, -318, -943, -875, -520, -500, -630, -279, 269, 558, 321, 758, 811, 569, -42, 740, 492, 26, -65, 76, -104, -707, -857, -447, -738, -1064, -519, -281, -217, -221, 259, 546, 590, 437, 925, 650, 168, 244, 329, 291, -405, -111, -2, -300, -693, -355, -311, -297, -240, 274, 584, 203, 308, 387, 347, -108]
2102a08R2N41o91j35lL77l58P7L68L29p39K8O03j43n07N10J81k79l53K58N18r24
2124c58Q0L69R9j020K54M07k35l59M45Q92k90l18J023M4n21l85P28r8j050L0N34
2145B71m84j419N61N48o15j71J390O77q13j20J347n4j263O86P61j042r51R45L33
2164E87j231l35J587l28j190O2J302n48j336R27J367j050l61J195L30j390o3J904
2182A429m31j591R22J038j355j004J143N01k039K38J250k2j554J214J609q49j019
2199e20J324P09j913r70J453J53j655O28J751m10j357Q23J433j252j058J348O19
2216A106j908r5J806k89j956P77J490j076j667J812J182j696k65J944Q9j976K60
2233d62J592j290j664J359J719j431q48K126N54k161m37J873p05k234J363J727
$$ y = [-108, -16, 525, -166, -301, -304, 73, -285, -208, 160, 489, -250, -222, 381, 238, -269, 241, 422, 143, -210, 48, 566, -358, -278, 91, 190, -830, -576, -169, -404, -763, -318, 574, 284, -34, 989, 1033, 512, 127, 855, 757, -293, -263, 271, -213, -1632, -1071, -523, -1138, -1309, 81, 758, -55, -175, 1172, 1118, -145, 541, 1302, 260, -691, 254, 587, -644, -979, 608, 280, -910, -848, 454, -94, -1430, -503, 864, -186, -547, 648, 978, -412, -475, 1429, 998, -593, 329, 1367, 12, -992, 151, 652, -1387, -1149, 101, 79, -1475, -261, 1348, 499, -520, 804, 1513, -400, -1370, 83, 236, -1419, -791, 960, 550, -807, 16, 1449, 197, -861, 487, 1106, -802, -897, 909, 620, -1336, -559, 931, -145, -1812, 0, 1182, -514, -779, 1165, 1254, -722, -462, 1130, -160, -1824, -465, 1254, -177, -1025, 1101, 1655, -506, -943, 930, 225, -2009, -646, 1081]
2249A081j452j109J797J222j848q24K608m47k099O70J986j066j799J667J429k193
2265c77j475K245K64k362M23K800n00k360J419J935k644j383K188P61k254J33
2281a187L010o24k715J506K312k003j788K351N63k580m20K570j00k750R57K641
2297A743j511k467K074J636k498p20L373K11k848L46K592j677k215J681J921j742
2313a01j276K302M26l103J60K937r29k125J035K054j685j531K342J142k097k95
2329g44K365n78k559P20J696o26j566K055Q15j989j092J684M30j881M99K352o16
2346I65k081R53J219j655n78J704N70j613k49J793n93j200Q88J371j121q93P97
2363B77O56j616l85J500L97j456K94Q83m30j487R12R25o64l70J204K04j076m61
$$ y = [1081, -371, -1480, 317, 1539, -309, -1133, 1475, 1028, -1071, -401, 1585, 519, -1280, 387, 1816, -377, -1852, 393, 657, -1705, -1282, 1518, 1018, -1342, 77, 2012, -632, -2015, 173, 934, -1320, -1187, 1823, 1199, -1516, -10, 2302, 299, -1489, 862, 1425, -1155, -1575, 995, 895, -1855, -898, 1743, 232, -2235, -161, 1475, -1023, -1743, 1630, 1841, -1007, -661, 1931, 254, -1961, -280, 1641, -101, -1377, 925, 1351, -1752, -1592, 1345, 416, -1709, -674, 1380, -305, -1836, 506, 1648, -449, -744, 1621, 1043, -1516, -796, 900, 274, -1292, 763, 1578, -411, -1503, 181, 611, -1270, -771, 1581, 965, -1116, -163, 1056, -599, -1177, 527, 1097, -516, -765, 1028, 435, -765, 123, 1494, 373, -520, 277, 933, -683, -1068, 432, 829, -627, -333, 550, 120, -1367, -455, 470, -194, -564, 640, 844, -232, -693]
2381f93J556k05r44M16Q38l49j331N66P08j007n67J338q1j373p4J274r3j000J435
2400D14J005j116p40Q49L64j394J41J510k49j433K94J066q07j161J185R36j278
2417d14m39J476j78j455L03J390m05r56P51P69j431k22J315O4j118L62J137p37
2435B12j255R97M44o69o46J581K90j482k32J243l55j191O98J264r74j068J602
2452D59j0j332K97J346m9j348R55O80r32o84J096L00j172M0Q65l37j290M14J016
2471C14m13q93J104N41j083j50J021q0n99N33L32l09o11M07N31j052NR16l28p86
2491f00M47L55m97l21K91M28o43L73O56p15M5L21M21m44k14O41r4m82j07N04j91
2512A74m22K92oj03j77N56l60j43R4L57k94j84M3L75m84K35K50K40l74p1L69k24
$$ y = [-693, 863, 658, -286, 130, 968, 619, -712, -146, 562, -445, -1012, 326, 245, -1128, -1202, 72, -21, -1021, 414, 1419, 303, -437, 412, 776, -618, -477, 1033, 784, -649, -355, 711, -96, -1257, -72, 864, -414, -853, 623, 445, -1010, -707, 683, 278, -678, 73, 842, -589, -811, 504, 568, -550, -188, 949, 212, -1043, -46, 398, -271, -917, 664, 954, -528, -760, 483, 128, -1063, -365, 899, -75, -1143, 459, 449, -883, -586, 760, 711, -637, 318, 998, 66, -618, 478, 778, -394, -354, 511, 174, -1116, -702, 314, -99, -992, 112, 653, -430, -580, 441, 361, -238, 295, 627, 318, -293, 114, 645, -407, -402, 514, 186, -600, -153, 202, -295, -616, -325, 103, -540, -167, 489, -226, -181, 140, 561, 117, -97, 544, 450, -32, -139, 365, 174, -248, 44, 38, -65, -242, 314, -46, -189, -95, 262, -32, -216, -173, 202, -282, -47, 203, 443, 69, -2, 367, 143]
2534A43M8J22Q0k48l35K46j08m06K33l20M36j8M5M7J0K25k0lj18J24R2k95m8J75
2558A07l6r8O4K57k97l17K96l05J96P5k54J77q8P8rj31L25j74J93J8L88j84J58
2581D39k89K96k78k65j0o9K0J23K28k12q4J7J45k86K67J0m47j14M57j32j4JO40
2604D43p2l06K37l2k54K11L36m19j90J46p2k57k82L4L76j48J18L73J15k02n5K68
2626C68l22k39J49J97l41P9K91J10k00J35J64l57l39M0Q3J2j42K34rj00N7J95
2648F5n1k88L78j7J98j75J62k70k5J8r0l52Q8PK99J13j47K71pO7j89J9j63n52
2672f41K76Q8Q2K42J45%m1J7k60J18J00M7O9j24j05P6L0l02o7P6j62n8L11k44
2696c27K88J44k15K10N6l1Q1k14J73q8p7K64K22l59j32Q9j3o09L76O6j1j99K23
$$ y = [143, 191, 313, 393, 145, -190, 56, -52, -458, -225, -545, -109, -127, -82, -35, -25, 200, 180, 177, 59, 183, 275, -20, -68, 107, 71, -27, 37, 294, -3, -320, -24, -329, -133, -58, -312, -135, -223, -145, -154, -285, 40, -134, 59, 77, 465, 281, 439, 150, 446, 168, -97, -107, -176, -156, -33, 195, -17, -101, -84, 61, -225, 42, 52, -395, -509, -52, -184, -198, -197, 443, 371, 65, 302, 270, 16, 227, 563, 144, -46, 100, 28, -229, -511, -477, -101, -249, -131, 242, 357, 155, 100, 368, 46, -193, -44, 153, -188, -109, 182, 292, 92, 227, 391, 34, -305, -265, -182, -170, -312, -78, -87, -187, -130, 65, 14, -274, 104, 87, 285, 110, 272, 2, -23, -5, -95, -447, -359, -352, -53, 60, -87, 184, 177, 244, 55, 74, -89, -641, -365, -277, -195, 47, 192, 192, 151, 168, -92, 26, 126, 173, 242, 118, 13, 89, 119, -183, -250, -174, -336, -394, -83, -327, -39, 105, -110, 100, 156, 125, 206, -8, 165, 77, 0, 264, 486, 127, -5, 84, 71, -538, -162, -96, -107, -306, -83]
2719h3J66l14Q5K34J18m02J30K01P6l10L33rL3l51l3J41l62N1J71K20k2k11L34
2742A96lk91m2Q9k12j31M10L43o41L93Jk9k61K31N28n15j47Q2J12l10j32M90m0
2765A21j52j62J81j32j14J39M51q7k86K79p4m81jN92l9m75M00J47k65k78K49J98
2787B11n07L8K97M3m54J1M29j54j87L72M19m09m91M57K95l88k52N37K32n09m47
2808d57O01l78j84M86O10p04l44M13L4m28K38M75j16l70K39J48n59j70O14K45
2828C93m09J79L07l72q04O69M45m55R6L86l58p94K12O76l68k02L64L65m18l31
2848d19M29J65o40L04P43k39n45K41K53k11k20K03L43n28j07L98m25j20j87N25
2868c7J92m72K44M74l96m01M78K63j18k95K99k55l93L24M10l5n88N18j0l96l56
$$ y = [-83, 83, -231, -146, 88, 206, -196, -66, 135, 211, -99, 234, 225, 258, -93, -126, 15, -347, -296, -125, 95, 73, -138, 196, 193, -98, -140, -51, -263, -394, 16, 359, -282, 111, 112, 83, -178, 53, 581, 66, -81, 1, 113, -197, -329, 161, 121, -31, -193, -12, -144, -258, -119, 332, 245, -41, 238, 164, -317, -318, 274, 235, -240, 160, 307, 42, -236, 13, 211, -296, -258, 39, 82, -372, -361, 68, -86, -273, 99, 518, 109, -382, 75, 370, -18, -270, 267, 499, -10, -457, 144, -234, -418, 68, 678, -26, -370, 43, 77, -351, -113, 362, 246, -124, 115, 263, -296, -466, 148, 393, -16, 163, 470, 98, -706, -37, 408, -47, 49, 435, 77, -717, -505, 171, -197, -399, -35, 330, -88, -419, 10, 175, -465, -161, 582, 343, -202, 39, 292, 81, -139, 64, 407, -121, -228, 170, -255, -375, -562, -37, 155, -317, -73, 401, 5, -396, 82, 345, 227, -68, 231, -24, -417, -93, 317, 282, -306, 212, 202, -194, -550]
2889e50L81K23j55J98P1K8o05M79j62L45m99J50M23k76k4J64J72m88J16K57O9
2910C17p93L21K24l25j58N83R1m49r4K92m2j16j90M66J03m14K77L13m16j29J87
2931D8K97j75k1P0k08j14r6K02j76Qj08L89n21o5O55nk08K33L1K51n81M9M85l73
2955F7k18K72R4k97j24L88j18k61J26J86j03l79L48O9j37j08L84Jj49J0J48q2
2977A17k13J48P6l24n5L86n3k32N9l9J22j8N7J85l46m1O5o5j52K41K72k57j1J37
3001E9k1L0j06K4Q7j27J05J17J4k68k25K45m3P1P9j74k30O7M02j08p9J77r8M7
3025D5j41K21j40l9O2L72l01j97Qp6J00RO9m87M40j54j93K60o0J18k44J71L54
3048A97k5j0j45J90j00K11n9k53k2OL14l49N8k7K86l88m0J85k32lJ92j37Q7J3
$$ y = [-550, -169, 54, -101, 97, 168, 196, -409, 70, -92, 253, -246, -96, 327, 51, 27, 191, 363, -125, -9, 248, 317, -476, -155, 69, -256, -414, 169, 260, -189, -283, 9, -33, -149, -339, 127, 230, -184, 93, 406, -10, -139, 48, 345, 170, 149, 219, 11, -103, -199, 3, -173, -165, -273, 116, -405, -470, 185, 180, -28, 205, 236, 487, -94, -45, 440, 67, -151, 121, 215, -82, -206, 182, 64, -197, -71, 115, 12, -367, -19, 50, -87, -195, 189, 190, 41, 51, 199, 117, -96, 52, 128, -196, -251, 135, 82, -150, -91, -130, -8, -26, 31, 216, -130, -171, -106, -171, -323, -82, 190, -67, -78, 59, 38, 68, -38, -14, 73, -54, 51, 168, 182, -86, -311, -66, -109, -38, 41, -133, -363, -296, 106, -2, -81, 96, -2, 45, -96, 125, -15, -54, 8, 380, 79, -118, -110, -186, -86, -77, -8, -495, -55, -209, -402, -142, -202, -84, -328, -157, 197, 172, 162, 17, 207, 107, 318, 259, 6, -16, -10, 304, -45, 13, -14, 272, -116, -156, 29, -203, -206, -14, -151, -64, -51]
3072e1l8K99j89n0P9J78k23O2M09m07L7k20L49l18o3J64j26m0R7p6J87k03J1K10
3096G8l17m6J75K97l41K07M4J11j53k7K07k77P7%l9k8l6K49l12PJ64pj38J13j00
3121i2R9o5J39l5N2k77L04k34r3L85k0p5K0k62K1K63k27J32j88j31l4M18J3l09
3145a96l7q9L68n8J9J74r4M0K63m90L05k7k24L1k8R6p7k12K63j31NJ73j19j04
3169a49J60k02p5L16N%J36k64L10j36k89K0L97l07M6PN7j35j95K34k54J35J31
3192e2K75l10k0L99m42L17l42K34K4j62J44K60l35L62l78R4K2j26K3L06l43K57
3214B07j68k49K76j72J49k66L09L7l4k27J88J10k49L21j26j29J46j0O8Ok31p0
3236a14O7k86K47j14R3K4K07j55j96J29m1K16L5p9J36o6L7p3R6k57j74M83k06
$$ y = [-51, -89, 210, 21, -29, 50, 228, 5, 67, 476, 69, 106, -114, 235, -83, -146, 18, -108, -148, -51, -127, 60, -143, -132, 78, -239, -285, -110, 187, -154, 53, 97, 208, 55, 28, 235, -42, 35, 35, -4, -32, -68, 181, -131, -124, 40, 33, -105, 8, -92, 7, -58, 81, 46, 98, -179, 125, -109, -202, 183, 163, 88, 108, -154, -133, 130, -97, 35, -153, -284, -318, 100, 113, -196, -233, -322, 46, -12, 7, 181, 87, 127, 390, -100, 205, 178, -46, -15, -43, 53, -24, -236, 27, -104, -99, 74, -45, -149, 11, -191, -266, 50, 55, 55, 191, -73, 237, 101, -188, -168, 229, -78, -32, -25, 32, -103, -298, -64, -318, -183, -52, 223, -87, -107, 292, -150, 167, -175, 59, 83, -79, 65, 325, -10, 352, -26, 68, 90, -36, -13, 293, -50, 207, 39, -210, 66, -106, 43, -223, 86, 123, 89, -138, 50, 160, -89, 232, 106, -23, 123, 113, 181, 187, -44, -114, -47, -333, -86, -200, -107, -83, 124, -31, -227, -98, -139, 77, 112, 33, 169, 103, 140, 67, 163, -94, -268, 215, 9]
3259Ij2K2rk17M7J73L3k06l1J19L11k23k47L20q4rp9N0k1j65K98j35n3j6O2J85
3285A22k63J87J37k92R1oK85k58K24k05J9l1K5RQ4l20K72J69p1k86r7L73o7k52
3309a51L93l26q4O7L53j50j62R8j25j47m2M06k02RjJ06j21j49L90k19K37n00M77
3332A57Pr8k15J88%l59K36j63J85l69L40n1J94k81N66Lm98J77L18k03m79L16L05
3355B76p5n47N06P9l28j17M07O0l19m8L02Q9o40K70L65l13k20L34r8k44M5L34
3377A18j30l69L90K70l16j45J35K71m90L44K70k55k03Q5L08k89j47K81K23q00
3397d49J13N98q3p7j21L45j82m42K78K9j76N9K21K37n03n4N33l11l58J94L36O0
3419B47l23K56n3j68j85M14N2o97P27M2j81l82J56M09l55j68M63o6k44k45K81
$$ y = [9, -3, 19, 10, -207, -160, 13, 46, -160, -191, -72, 239, 16, -231, 89, 5, -4, -83, -33, -54, -219, 79, -56, -109, -125, -63, 122, -141, 46, 183, -109, -18, -24, 261, 3, 227, 22, 41, 10, 35, 44, 128, -192, 80, 249, 178, -108, -205, 168, 101, -151, 242, -84, -168, -101, 252, 102, -60, 38, -87, -234, -276, 130, -72, -63, -64, 42, -79, -228, 162, -57, 180, -320, 157, 164, 66, -149, 39, 39, -320, -84, -247, -62, -431, -91, -142, 52, -229, 337, 340, -158, 19, 337, 134, -345, -29, 276, 201, -346, 160, 239, -89, -206, 201, 261, -58, -106, 196, 285, -355, -85, 280, -33, -253, 81, -17, -261, -216, 118, -12, -381, 9, 279, -37, -182, -47, 224, -266, 78, 348, 93, -110, -25, 283, -6, -153, 128, 351, -449, -336, 262, 179, 102, -19, 326, 144, -298, -20, 9, -167, -108, 113, 350, -153, -207, 326, 15, -343, -149, 187, 247, -76, 180, 127, -41, -226, 188, 240, -457, 270, 312, 131, -251, -95, 314, -41, -209, 254, 188, -56, -301, -20]
3440b0J09l61M39K77k32m68N71k46j12j45O93j80l74J76Rk63k65M53K84l23k21
3461a99L56j7p58L05N79k21k19O0L61n56j24N06L23l92j99N13j84l82K33K05j56
3482C4l3L14J41l80k87K80K59o78K33L95n3o23O50n9q1j54K51J94p65L42L34k65
3504D9m49J44N94n00k13M22K86p27L5N27pm25K74L75m10m80M40M51m83K22P7J47
3526C49n63J28J68O6o01Q00J3n08k66M75J9k72K3N64l75k61oN53m58r3M83r8k69
3549a29p4K80Q6l22O0L45j14m52L39L65p10Q4Q5L55o5j75L23k64j62M0J9J06p2
3572e2L96j46k24J8L46r1m42K83m9l06K56l60O40n22P9Q1K01k78L59L2j37j39
3594e5O5j6Qk17L74M5k70N0J66j71J1j18P4K40k64J7J75jj90K82l72l6q7M45j12
$$ y = [-20, 89, -272, 167, 444, 212, -256, 315, 69, -43, -188, 505, 325, -49, 127, 136, -127, -392, 61, 345, 22, -199, 157, 140, -618, -313, 266, 45, -174, -114, 247, -309, -433, 73, 396, 4, -195, 318, 134, -248, -15, 190, 34, 1, 315, 456, 76, -211, 69, 328, -350, -117, 278, 225, -398, 252, 193, 112, -42, 209, 403, -362, -20, 314, 49, -400, -256, 338, -162, -375, 47, 333, -394, -359, 168, 161, -264, 10, 385, -25, -505, -65, 386, -97, 125, 202, 349, -214, -86, 82, 148, -453, 347, 360, -148, -414, 61, 80, -192, -169, 395, 20, -241, -247, 306, -152, -245, 238, 140, -129, -203, 77, 163, -159, -99, 246, 132, -320, 19, 384, -326, -242, -157, 198, 133, -42, 281, 17, -145, -105, -86, 20, -52, 344, 198, -26, -8, 338, 247, -195, 88, 39, -267, -11, -371, 269, -253, -174, -93, 108, -170, 189, 221, 84, -55, 10, -6, 2, -215, 159, 204, -66, -16, 150, -21, -10, -128, -54, 186, -78, -61, 114, 113, -77, 205, -167, -203, -290, 155, 43]
3619D3P3N0j67L48m88J78Jj65J45J08j72L1QN8j95k9J86j19J14j69K65o1j49P1
3643c5J93ol06m5L51k28k45K82K40J6k47J57R6l71j52L41k13j7J12N4k17K30j3
3666b3J91k91K41k9q7j93K12jJ09L5J29j49k32L00k75n6K03m1r8j93J16K48Q7
3689B03k44Q9J21J4j74P7K15l92L7K10l67L8J08N9K2r4O1q1J80Q6k32O1J28kj85
3714f2k4J06o7J57j67j05L39k80J20k8l28L37J59j56q3K4j80J49N5J69m9j7m7
3737B2J42r7n8k13L96m35K59k7o4J6J60k53O5j15J50P7j58j61K45j10J2L6N4L13
3761B56m09J6J41J14k59K65J07k58J05Qp4j51l4L79l60k4K16j97K4K70j3r3j47
3784a18K99j66pM0K42k42l4K3PJ49k41J00P2j44jnj24J12M9M5O6l18L57O2l80
$$ y = [43, 116, 166, -1, 347, -141, 37, 38, -127, 18, 126, -46, -15, -7, 51, -144, -173, 13, -106, 8, -161, 104, 43, -106, -35, 158, 152, -154, -199, 152, -76, -321, -39, 201, 217, -30, 127, 223, -148, -300, 41, -172, -189, -77, -23, -240, -10, -23, 168, -123, 118, 89, 2, -191, 21, 20, 129, 164, 293, 144, -88, 212, -63, -119, 84, 43, -55, -248, -132, 116, 203, -41, 48, 169, 183, 9, 86, 301, -91, -54, 156, -211, -173, -65, -6, 16, -78, -17, -98, 82, 168, -64, -3, 125, 123, -62, -86, 20, -47, 110, -57, -162, 177, -103, 17, -11, -339, -2, 157, 1, -82, -58, -238, -89, -34, 135, 86, 69, 22, 164, 67, 9, -204, 192, -243, 16, -11, -75, -59, 101, -152, -87, -202, -52, 25, -133, -294, -49, -159, -147, -111, -57, 256, -153, -137, 4, 118, -141, 124, 231, -27, 78, 86, 12, -139, -173, 206, -154, -178, 38, -159, -135, 135, 122, 29, -118, 181, 15, 8, 48, 290, 48, 14, 37, 44, 193, -48, 52, 124, -20, -21, -26, -150, -38, 11, 56, 122, -196, 161, 223, -157]
3809a57j6L95pk85J41q4l6J5J31k62J4K15J04r3j68J16K4j18j7K2J25j15J33l
3833G4q0j31P1J06j33K9K66k26l5j92K79L4m25L34J78j54n6J11Q4%k28K17n4k50
3857a81m5J81N4m68M85J47k76J69M45l25j49r7M50j90l31K58J1r7k66J66M1k08
3879b26J89L30m35j4R7O8k9j96J70J99j93p9J90K73m91K21L89m34l37L05k0om9
3902g8J79K0k61p3K94J18o49L69K78j64k83J85K00j61oK6K25m66K18R2j95j43
3924b75J52M82k63m67L41K46l02q9K33K32m98L60J20p9o11L04L54p40J78P40k00
3945B18l47N4J84p5j66M99O3m99k57N29j19o93K71N45r9o30K65N51m68j61O93
3966C58l30k41J11N18q8p26L4Q46l71m21L21K06m84k79P90k47l33K98M76j34q22
$$ y = [-157, -173, 222, 215, -70, 71, -13, -49, -34, 97, -165, -151, 64, 168, 75, -93, 23, 47, -71, -88, -66, 59, -56, 77, 74, -6, -137, -66, 40, -93, -64, 202, -24, -59, -251, 28, 62, -363, -29, 149, -5, -61, 50, 134, 134, -94, 123, 69, -181, -226, -45, 9, -459, 26, 173, -103, 66, 511, 186, 37, -60, 390, 200, -131, 127, 138, 41, -225, -59, -18, -226, -37, 293, -142, -156, -59, 9, -20, -216, -46, 153, -40, -119, 71, 344, -147, 74, 463, 29, -308, -3, -23, -29, -78, 101, 121, -140, -213, 81, 199, -450, -81, 197, 33, -250, -65, 135, -26, -32, -6, 219, -247, -29, 63, -132, -275, -123, 359, 96, -371, -30, 216, -86, -175, 58, 290, -208, 152, 272, 193, -418, -114, 240, -500, -322, 418, 218, -129, -75, 109, 34, -132, 367, 430, -69, -326, 203, 84, -609, -338, 207, 108, -522, -257, 294, -174, -335, 358, 28, -213, -102, 416, 328, -398, -364, 482, 111, -310, 11, 217, -267, -546, 244, -3, -336, -38, 438, 304, -518]
3987e18N06K92m98N2K04N21n38k52M13j86k96K2P71l52n61K84L16m64k11Q79l03
4008H1l44M0O49m94l82M59L68l02k82M68N1n66j27M76J67m51k4P48p91k29M05
4029h0J98k90q7O64k97n60J60P56l23m36M17L56l18o59N42Q5n02K58N00k44m18
4050b78K22L00l26k86Q10j1n11k89O68k87n32K78N93n10k36N77k43m79L64J29
4070d7L43o27K55L73l03m28N56K19m86k6L65J7n86L09J35j24j06K84L31n45j41
4091b32K23L46o15J80M43J10p28L15Q9l15k6L35L63p04K50K23r3m99NP31k09m15
4113b23M85R8n45m1M15M0l15m4J99j34l00L28J17k69k08M38K73l47j64J66nk90
4135c26L71L21k53k81L5M09l33j33N11l07j03l29M28J1k27P8M13l27j89L93j48
$$ y = [-518, -12, 280, -218, -166, 38, 559, 21, -231, 182, -4, -300, -278, 493, 141, -420, -136, 180, -284, -495, 384, 81, -263, -223, 426, -68, -450, 9, 377, 75, -207, 261, 312, -254, -381, 95, 262, -189, -213, 535, -256, -485, -80, 118, -172, -259, 405, 108, -452, -292, 464, 141, -295, 122, 478, 160, -499, 43, 128, -374, -116, 384, 140, -278, -56, 244, -82, -368, 442, 431, -80, -369, 299, 12, -520, -242, 351, -159, -395, 182, -61, -540, -176, -47, 296, -331, -76, 297, -6, -434, 122, 341, -145, -171, 194, 211, -375, -66, 69, -55, -161, 123, 454, -91, -232, -9, 337, -278, -98, 345, 455, -273, 42, 131, -184, -210, 125, 488, -216, 34, 257, 164, -335, -330, 401, 192, -223, 262, 360, -185, -226, 189, 229, -86, -130, 69, -65, -365, -37, 80, -189, -397, 41, 314, -33, -197, -31, -36, -326, 45, 366, 113, -168, -133, 276, -57, -190, 321, 14, -89, -418, 10, 21, -206, -128, 285, -42, -231, 162, 14]
4156A4L5k18K06K76l42j3O9J15l79J42L76j66j28j50J49j85j22P21k21k79L8J23
4178F1R3k72r2M00k91m3J74P3m19K57j4J62r0n2K11J19l76J1J54l1q1q1K36j87
4202g8K03j07j62N3P0O3J73k43o5K32k39J25M0k03MJ66j37J00k19L81p8k55J78
4225BJ10k73r1J33j75K05J17K19l60nK34k56M11k2l92K26j8lj64N7Q1m4n3j7j22
4250b00J67J00j11k85L90n6m3K52k42K5lj1Q5l6N6k06K20Nj71ll5N5J10k50P9
4275a08K5J62n0NL23l09L07l81O5j2kK04m39M16k86p7n0J65j34N1j11K19J04k82
4299a95J36K44k25N1p8J9j56L90j93L08k70J17q0k02nJ41q0o9R5Q7j48L79j01
4322A65m6k30J7L81q5l46J64J70k78K7j44J07J81k65J17J06j50J02P0L5k67M56
$$ y = [14, 49, -169, 37, 313, -29, -42, 27, 142, -237, -95, 281, 115, -13, -163, -14, -199, -321, 400, 179, -100, -62, 61, 154, -118, -210, 190, -101, -144, 30, 103, -316, -59, -73, 89, -1, -53, 158, 277, -99, -88, 66, 35, -46, -127, 109, -78, 125, 18, -144, -91, -21, 42, 215, -28, -93, 139, -100, 25, 65, -138, -134, 32, -105, -5, -224, 157, 79, -176, 2, 112, -161, -252, -119, -294, -89, 28, 247, -113, -118, 116, -140, 271, 249, -143, 83, 65, 62, -102, -45, 36, -8, -61, -78, -200, -33, 67, -44, -329, 61, 5, -38, 214, -28, -3, -6, -17, 68, 32, 88, -118, 102, 107, -64, -67, -102, -47, 63, -187, -108, -83, 79, 29, 34, 357, 48, 355, -26, 39, 27, 25, 229, -210, 206, -80, -157, -207, -42, -176, -125, -236, -17, 87, -195, -59, 185, -40, 11, -67, -48, -204, 186, -7, 301, 31, 148, 68, -134, -139, 2, -78, -147, -52, 35, -113, 266, 165, 119, -111, -94, 287, 202, -144, 20, 190, -88, -61, -205, -98, 83, -182, -65, 41, -109, -7, 63, 98, -169, 287]
4344B87k64J5p6J37l74K29L9j19K13j18j26K83j05p9M01m99K97l60M51m8l98M06
4366A92l13K45k34M21k79j14%K34q7rj10J3J46o9j34K63k78OL39J24m88j34M42
4389A76k50P1j02L7j09j13J78K97n54L17K73k25j39J73J79kl02l0K46k78k3K07
4411B7M8k02j65K96Q5j62L17J93l00q1R1j16j57P0J08K0l24J45K45k3m67J99K21
4434F8k33Q6J99Jk73Q8M4K03l16N1L04k53j00J00J93n07J15M03j43l42J91K57
4456A36k17k62N38J32l53m8K90q8l39Q7J74N1k92N7J82k50r4N01j32k67K29K52
4478B87l05m3K61l8k22J37K16p3k79m7L80j38k27J53R2Qk08K56l5k91j01P80n75
4501a2j92J17K40l75K79l4L33k49k45O0J25k40k12P19k61j20J93K63n35j60L53
$$ y = [287, 23, 38, -38, 99, -275, -46, -7, -126, 87, -31, -157, 126, 21, -58, 343, -156, 141, -219, 232, 184, -214, 192, -121, 124, -110, 311, 32, -82, -82, 152, 65, 56, -54, -41, 105, 36, -98, 165, -113, -107, 232, 356, -132, -266, 176, -74, -3, -105, -68, -177, -290, -112, 185, -369, -52, 221, -4, -143, 30, 209, 207, -95, -125, 121, -157, -180, 27, 75, -127, -292, 4, 89, -73, 244, 437, 137, 56, 147, 31, -126, -56, 52, 72, -252, -107, 138, 115, -352, -153, 68, -165, -79, 120, 121, -152, -64, -20, 183, -133, -82, 222, -31, -131, -31, 162, -345, -230, 173, 30, -312, -121, 136, -81, -343, 195, 327, -26, -74, 216, 128, -211, -124, 50, 101, -191, -134, 48, -202, -296, 205, 73, -194, 35, 287, -18, -61, 200, 162, -60, 77, 293, 220, -59, -106, 274, 136, -91, 62, 154, 162, -46, 210, 175, -116, -217, 563, -12, -204, -87, 153, -222, 57, 23, 356, 107, -138, -78, 47, -193, -405, 314, 53, -67, 126, 389, -146, -306, 47]
4522D7R9j23j1M97p32j29J32L59k44kK73K37n11l2R5K59k15j08M27k62l71R0L79
4545A54n21J36J10N60p38J52Q3K53l14J61M94m85m52N58J55p30L58K55o3p5p5
4566b4N8j40l69N35M04l29l26M05j20l69J94L98M3m95K51K05m75l05L93L21m95
4587b40P5M17j70m62P0O18j99l78J73J00l1j78K09j9l26J19M41j83k64L35J10
4608B17k69j64P16j29l69k24K17R1n20L59L64k32k42L64J71l68k83M15j26j35
4628a47R6J38k67k16M29K33l95KM29j02m03j4L17K2m89N36P7j56k47J91P0j59
4650e5o5M59l53l41K66K42j04k50K74K11l14k82N39r5j2j05P8P7l37K18Q5n54
4672d18L78K80q9j38r8K58j32l3K6J21n9r3P8K09n84R9J93j56J42k47N63o7n85
$$ y = [47, 146, 23, 12, 509, -223, -352, -220, 139, -105, -107, 166, 403, -108, -140, -45, 214, -1, -109, 318, 56, -315, -225, 154, -367, -231, -121, 439, -299, -147, -64, 189, -125, 36, 530, 45, -407, 151, 306, -424, -66, 189, 126, 51, -24, 34, -106, -475, 60, 464, 135, -191, 214, 94, -275, -81, 317, 360, -135, 116, 321, -154, -459, -66, 255, -240, -165, 252, 82, -380, -310, 308, 109, -269, -96, 4, -27, -205, 4, -15, -341, -222, 219, 36, -228, 107, 217, -52, -216, 500, 371, 2, -222, -5, 86, -434, -75, 289, 57, -185, 179, 350, -18, -301, 114, -12, -147, -51, 87, -180, -396, 33, 266, -129, -127, 302, 200, -203, -217, 100, 122, -367, 169, 246, 90, -157, 34, 104, -55, -120, 339, -14, -355, -89, 153, 49, -201, 73, 284, -30, -312, 227, 132, 120, 15, 93, 170, -167, 51, 136, -418, -40, 240, 151, 13, -85, 173, 41, 8, 34, 155, 96, 3, 81, 290, -294, -195, -2, -158, -16, -263, 300, 233, -352]
4695c52L66K59l57n5J90K09m49J52R5j55K37q6K5k0m28L89N8j00L3J95J1n85O5
4718c03O75k86n14N16J9j50j65K92o9k47J01L79j70l02K53K07j04l33L41j17l6
4739a3l0oj08j17K13J84k93J72k76L66j51l3K1N0r9J74R3j50l94N64K09n25P3
4762g6R5J51l35J49K45P1m77K27k0j8j20nJ01j54q4M88j26mk4j45J05j69J93J09
4786A77qk58J32J4j52K8J68k06J01J44j17K9rK5r1l4J3J92K8l43J46L6R1Q5l70
4811a79K31l9Q1j24J57j10K4j2M0J55j94rK6PN5r3n1qL38k08q5J96l53L40j60
4836B5n1K29k23k35L20o4p2k99L95q8p9o4K58k41K4M7R4j11J43J4m5o6J01J1J6
4861C9O5j11L02k85p9N7J04k75J2J94J64k68J13J21k4p0j2k90K77m7k75L64j44
$$ y = [-352, 14, 273, -84, -139, 51, 260, -189, -37, 58, -97, 140, 54, 79, 59, -369, 20, 78, -22, 11, 206, 217, -368, -303, 372, 86, -428, 88, 107, -43, -208, 84, 15, -232, -131, 248, 78, -224, 29, 236, 132, -201, 140, 23, -13, -43, -49, -157, -274, -61, 123, -170, 2, -274, 92, -59, -92, -71, -21, -120, 54, 147, -3, -397, 167, 376, -149, -76, 19, 170, -165, -16, 229, 300, -177, 50, 30, 12, -108, -113, -12, -166, -250, 238, 112, 108, 84, -61, 44, -125, 68, 177, 169, -89, 43, 57, -95, -67, 101, -105, -4, 140, 23, 52, 43, 68, -23, -57, -44, 148, 176, -167, -21, 15, 106, 191, -179, 52, 13, 94, -30, 127, 17, 41, 29, 69, 224, 30, 21, 47, 54, 109, 16, -35, -43, 295, 87, 2, 198, -155, 185, 25, -26, 203, -20, -255, 65, 1, -71, -370, 25, -63, -142, -206, 52, -189, -165, -118, -24, -135, 8, 22, -23, -89, 12, 23, 39, 104, -7, 295, 10, -69, -12, 92, -183, -171, 23, 187, -81, 32, 153, 129, 59, 47, -243, 34, -13, -288, 76, -68]
4884f8NL48k27o0J49P8k41N6Ko6k23K36j19R0R1oLn2m3J27L1J06l21q5R0J97k62
4911a64J57j24j24L85q9j45J59Km9J13J6k27K49j72r5J45j53q3N6Q0J38k99L33
4934A09m5k11J23K67j22j0j12O0j63K1j8k6J57O0K30k46J27P5O2m73J62J50l8
4957A39j84L62j04k0j20K83j83j65j29J65j26L3L63j07m2j95J65Qj14N8n9J86
4979B14l02K58O5k30J31k58K97j46O0l1J14j93j41L19j21k37K24L4j80Q8n9J88
5001I4o3k88L97j03p6J63j08K55k33K2k3r9l6J59Ll46J95K53l61j26J90M78k31
5024A16j65J43r4j58J00K30Prm5P3N9m22J47J76k23M0Q1j10k10m8N15k73j65L24
5048H9J27k82q9L94k33j16j06J49K86l25jK10P9k09K1M5l75m9M21Qk15j12N12
$$ y = [-68, -63, 285, 58, -2, 147, 225, -16, 40, 42, -24, -247, -11, -130, -40, 51, 45, 48, -4, -47, 80, 111, 217, -104, -189, -99, 98, -164, -7, -131, -255, 130, 41, -104, 55, 57, 8, 121, 137, -90, 159, -13, -108, 37, -116, -199, -143, -63, 75, -224, 109, 64, -147, -24, 243, 121, 111, -1, 59, -104, -83, -101, -127, 30, 90, 320, 74, 201, 276, 338, -135, 27, 177, 139, -45, 317, 213, 193, 73, 356, 173, 8, -121, 44, -82, -49, 314, 207, 165, -30, 135, 143, 29, 87, 28, 214, -88, 170, 235, 5, 136, -122, 175, 29, 89, 58, 172, -21, -162, 157, 36, -201, 23, 57, -123, -35, -94, 94, 31, -257, 140, 37, -39, 124, 16, 271, 38, 60, 37, -62, -98, 61, 64, -282, -87, 166, -195, -321, -131, 347, 116, -49, 94, 0, -158, -58, 172, 179, 170, 125, 198, 257, -165, -18, 158, -65, -25, 56, -54, -264, -312, 203, -70, -235, 89, 216, -66, -155, 239, 6, -110, -216, -67, 219, -106, -107, 103, 182, -27, -6, 39, -336, -385, 36, 44, -171, -283, 229]
5071B29k02j42J33R9k86m8L21J07m83K41K27l3l51K62J87m69p9J9M02k36l75N98
5093A21m1j73PK48j37l63L45kk42L44L6J3k58J6nJ60j22P5J32l28k1Q0M3m4J92
5118G6R5O4l42P5O7nj39n3M04l89K95R1j18l86L34K60j62j04J27j95L0j96J76
5141EP1l81M9O06j63k68J44K27m30r8M92j71l57M1M21j12r6J68J42M6n75M35n8
5164A38j62P6n6O3l69J72J95l59L0L29o7J58j36J90Pm16M52j29Qj34j85K60l3
5187C2k52M62kl28k44M37N3l74nL20J21m21K99P7n2l24J55MJ27k37L18k41j7J05
5211A3j76L74n32N14j06l24N4N5K04m39M77J9L3k07K58j46n7j08N28l41l25K56
5233B4O7J65k8k96K08m7m38K31K84k51q9Q3L5j54K61Nq8j10L49j81n3N3J45j0
$$ y = [229, 27, -115, 18, 117, -169, -217, 104, 211, -272, -31, 196, 163, -188, 74, 261, -208, -287, -268, 134, -102, -477, 121, 80, -93, -86, 162, 25, -338, 7, 5, -237, 107, 143, 156, -102, -86, -91, 69, -53, 22, 154, -174, -195, -115, -72, -116, 76, 171, 235, -107, -32, 35, 30, -109, -162, 242, -147, 148, 239, 121, -265, 69, 329, 167, 63, 190, -5, 25, -171, 5, 76, -305, -256, 350, 187, -81, 63, 290, -140, -238, 254, 83, -274, -233, 188, 76, -20, 148, 290, 336, -239, 196, 138, -24, 52, -4, 59, -310, -138, 57, -302, -272, 57, -10, 148, 12, 202, 209, -207, 245, 116, 124, -10, -195, 65, 32, -220, 242, 240, -88, -332, 105, 158, -216, -221, 99, 220, -201, 98, 175, 123, -201, -46, -42, 85, -152, 166, -75, -92, 13, -163, 211, -321, 193, 87, -237, -183, -128, 76, -363, 114, 133, 166, -41, 217, 71, 14, -94, 434, 93, -232, 24, 91, 256, 228, -68, 140, 93, -345, -114, 170, -81, -170, -87, -52, -206, 55, 60, -28, -138, 211, 30, -23, 30, 175, 165]
5257A65l93J13K54k26q1J49k7K4k31K01J30J5j49K99k79J26P7L0k11r9J21J91
5279A99k04j09K48Pl43L02k63J26L9J37k87j16J48J00O4n1k1Q1m9n8j49K36r5
5302e8k40K58J67l1M6P6j79k15K26P2k53j54K98Q9j80l4J85j9j21K70j44j82K64
5325A41k82Q8J88l18L85k22J2r0j02K18q8L11j26l46K88J14j29j07J66k48J62
5346A5l8J28j05j59K38k12R3J98j64m7o2J4qpR1J04k27J60j58Q5k12K38r1k1J73
5371B6J37j24j67J58j0n6J70k92J05r3L59m77J39J62J22q0k07PJ70oj56K26j73
5394f0l8j11L28k5k88J04J17kk98L95j19M7m3K14j7j33L2o6l1k10J36r5M5o9J57
5419c0q2m3L95k08oJ03k48M7k0M0K1j58L54k80P6J34l54L96K54k79j00j8P2k52
$$ y = [165, -228, -115, 139, -87, -168, -19, -46, -22, -253, -52, 78, 93, -56, 243, -36, 90, 167, 197, -14, -113, 8, 199, -5, -114, 134, 141, -202, 100, -163, -37, 2, 139, -148, -264, -116, -16, 48, -3, -24, 57, 8, -50, -199, 37, -58, -298, -40, 127, 96, 142, 218, 39, -176, 50, 122, -131, -285, 13, 102, -78, -112, 73, 54, -67, 203, 59, -123, 141, -141, -53, 135, -183, 202, -20, -8, -98, -200, 18, -70, 241, 115, -231, 57, 171, 42, -65, 101, -147, 15, -23, 105, 0, -159, 79, -133, -40, 158, -6, -53, -115, -101, -109, -116, -25, 79, -148, 12, -146, -61, -273, -35, -126, -147, 26, 163, 39, -128, 30, 20, -36, 134, -158, -53, -146, 213, -264, -125, 37, 159, 79, -128, -121, 49, 43, -113, 113, -60, -98, -209, 119, 94, -194, -90, 27, 25, -273, 122, 3, 50, 7, 221, 204, 71, 103, 37, 6, -204, -68, -163, -118, -187, -30, -112, -155, 240, 32, 26, 129, -119, -72, -92, -52, -31, -189, 165, -115, -39, 95, -259, 137, 391, 112, 12, -6, 66, -186]
5443a86P5J7J7K00j11p9J08N5j40Q3L7r9J07J23j60r9j0Q1R8l59J13Mml2J60R1
5469I0k19L35K2k83k93K92O6J30j08J32j42o7j54K62j33o1J90P2l75J88J65q5
5491B4j90K28P1k60J57J97l5k23k7K28j12j18J21l1j88j1J74L62m98J75J98n88
5513c46M15J12k45J54r6k4k77K99J09M3J7n1k45L38j73J8m3j1K53k92R0j39R5
5536Al79K52J26m1J24l3j26k6p5K85j50r3K73k92J93p9K28l85J95J29m3q9J68
5559A63j40n9Q5k02J61J5J08J1k01j82K64K98l27j28K51J79j61j62J34Q1l01r0
5581b03R7K00l26K6M79k11l6j85L68k79j87n1K59J4rJ95p6j46O1j14Q9o6K45O6
5605B10k11p3oJ59k65j15L96k7k27L67P6j92j03j8J0m8j8J12J46o1K8o4j13o4
$$ y = [-186, -111, -94, -77, 123, 12, -67, 41, 96, -44, 39, 76, -23, 84, 207, 47, -52, -62, 19, 117, -242, -129, -125, -129, -161, -1, 90, -129, 206, 228, -55, -348, -56, 10, 140, 32, 164, 22, -45, -199, 63, -70, -131, 59, 131, -244, -56, 109, 24, -166, 62, 133, -127, 30, 227, 192, -31, -58, 170, 58, -60, 61, 30, -158, -169, 5, 367, -131, 44, 242, -346, 69, 181, -64, 90, -6, -30, -307, -8, 101, 144, 161, 110, -135, 203, 30, 48, 5, -6, 247, -45, 45, -94, 1, -378, -126, 0, -41, 83, 50, -76, -102, -177, 108, -42, -135, 138, -154, 39, -40, 188, -197, -2, 127, 84, -5, 163, 23, -36, 49, -153, 8, 23, 131, 142, -59, -241, 23, 321, -6, -134, 117, 296, 135, -27, 107, 188, -113, -203, -106, 94, -232, -206, 273, 62, 26, -159, 209, -70, -257, -308, -49, -35, -44, 151, 75, -71, -10, -124, -35, -101, 144, 210, -1, -74, -80, 79, -186, -301, 95, 68, -159, 208, 284, 92, -11, -29, -19, -67, -85, 27, 173, 112, 140, 76, -37, -101]
5629a01K03Q0l26L9J21r6r7J89L15o21K23J81Q1k48k01L25O4l5j73j3K54r2M9
5652A21J76l79QJ80J5k73K09j8J8p9k4k8O8k62J46J43q7n6R4j46J24k27J41J96
5676F0r5nL4o7k5J40J96j55j16nj64J9R1K84j39k05qM26k52q7P8K38n53J56J74
5701B0K8j00L03o4l32j2K45j54J30j52P9R2j45J52j46J43k55K64n1j54J04J9O1
5724G5n5o0K83l14j2j40L06k56K30j85L10k88J81r8O3K0j33J09k11J83r4J83j71
5747g4Q8kP5n8K5P3k6k27J35J66j52j01N6J56j67k2M1Rp2k9R5m6O3M1J10j41o5
5774d9K37j41j88K93j29k8q5L6M5r6J25Po0J77j30M2j39J12J72p8o9j43J76k37
5798a50N3j7J29M5q0p1N6N1l17J91K54k41J83K56n48J80J55K8j91j00P7j04L05
$$ y = [-101, 102, 182, -144, -105, 16, -80, -177, 12, 327, -294, -71, 110, 191, -57, -258, 67, 131, 96, -77, -90, 164, 72, 121, 297, -82, -74, 106, 121, -152, 57, 39, 57, -22, -46, -74, -6, -268, -122, 21, -66, -122, -28, -174, -50, -277, -136, 60, -35, -40, -6, -73, -98, 42, 238, 83, -33, -38, -202, -183, -92, 192, 53, -152, -160, 266, 14, -73, 5, 243, -310, -154, 20, 48, -52, 251, 187, -145, -157, 88, -66, 64, -88, -9, 83, -62, 90, -56, 87, -168, 96, 45, -109, -5, 14, 75, 20, -40, 243, -71, -83, -223, 83, -173, 57, -128, 182, -106, 75, -23, 40, 60, -73, 36, -175, 8, -86, 97, -74, 14, 12, 87, 29, 54, 127, 101, -126, 9, 175, 23, -78, -22, 134, -33, -55, -14, -5, -77, -106, -11, -57, 6, 47, 157, 16, -49, 188, 47, -141, 152, 23, -5, -90, -54, -9, -105, 20, 27, -33, 144, 14, 56, -83, 29, 201, 123, 54, -89, 87, -150, -97, -114, 15, 60, -20, -91, -35, 16, -301, -110, 144, -97, 86, 342, -206, -26, 129, 157, -34, -134, -57, -161, 144]
5821A44j34o4K30m9R5j51M6K0k43J5p0K12q5L26l96P5K00k09J7K8J32j83l6O5
5845a5J48k48J60O7J14l88J79K74l42J8K18l75L48l72P8K37k89J39L6j35J43m4
5867d9j11P4J72J7k97N17m13J88Jj17P2mJ24k88J90Qj43O7Q8j24j18Q2K20j93
5891c7o2L71k13p5O5O4j80M4JJ19%l4Q2j98l9J46p9l5J38o7Qq6J56k62L54l00
5917a19K57l33k84M43O3o4Q7k0k27K93l9o5K84l09L16n07L89j48j47J25K8l4K2
5940A1k0p1K26n7Lj32l6J30J15j27j38J21r0j34K52j01J35N2M2j92J30l5k7J34
5964A91l34J56N3j45J10rj83L31Nj53j59K44j15p1r8mJ12j47K47m3J8K3o2N2O2
5989H1p9R6j73L1L07n33K56J51j04j07R3J21K5l91J80P9Rj63J72M3J74l13L08
$$ y = [144, 10, -54, 176, 127, 222, 71, 117, 137, -106, -91, -161, 51, -34, 292, -104, -29, 171, -38, -21, 7, 139, -44, -80, -15, 133, -115, 45, 112, 226, -162, 17, 291, -51, -33, 185, -190, 158, -214, -136, 101, -188, -49, -13, -148, -5, -49, -160, -86, 86, 103, -194, 323, -90, 98, 99, -18, 54, 50, 174, -114, 76, 84, -59, 8, 96, -28, -146, -64, 156, -37, -99, 272, 59, -16, 49, 113, -67, -23, -22, 97, 97, 63, 145, -53, -92, 54, -25, -60, 78, 11, 19, -67, 89, -173, 181, -119, 138, -195, -479, -36, 27, -37, 50, 30, -197, 96, 57, -8, 276, -33, 283, -224, 165, 17, -130, -5, 23, -11, 11, -9, -80, 146, 89, 92, -40, -76, 54, 169, 42, -96, 25, -65, -199, 53, -48, 87, 139, 181, -11, 119, 84, 57, 191, -143, 13, 66, -79, 31, 22, -161, 170, 175, 22, -137, 107, -8, -79, -177, -181, -69, -216, 31, -12, 6, 29, -33, 19, 81, 2, 98, -75, -44, 263, -270, -14, 137, 33, -74, 19, 140, 165, -226, -46, 33, 42, -121, 51, 94, 268, -45, 263]
6012B63l49K02j56j04J44O5j05k7L82k83K8j24J18J12J3j12K58m00m4R2J02j47
6034g2P6R6p0q4j81J36R2q2k9r0J04L36m29P7M2K37j53P2R9r2n6o3J12j16L9N
6060FM5k96K75p1J46mj98J11o8Np8Q8j91K6K48P6N3l5j63J13j49L8l5J65k85M59
6086B81k79Q4L8p0J10n6p0m9M7n2m8O0Om7K2M2j92J59R5o4L10m98J14K59K0m61
6112b39J81J17p0J03n3l57K05M31k22l6Q4p3j34k2K13J23l63P3o9J58q1Q7K3q8
6136ik8l4L9j5J68r0J49k69n1L98nk81P7J49k51n2J69l05J26J46J05k38K10j84
6160g6J76j09j33L48l99J70l87K17M11k56J87K6N1j79M4o9k08M8J88m0p8L08l84
6183a44K37j89K66nk50l1K95q3k24P3J15P5l06L29O0n5k26K57p2j2q3j89m7K98
$$ y = [263, -86, 116, -40, -144, 0, 65, -40, -67, 315, 32, 60, -64, 54, 166, 179, 67, 325, -75, -119, -27, 75, -72, 4, 100, 30, -54, -235, -99, -7, -89, -118, -208, -104, 232, -197, -120, -78, 159, 6, 78, 177, 85, 29, -34, 78, -38, 1, 6, 51, -245, 30, -41, 105, 101, -97, 14, -54, -49, -127, -39, -230, -204, 44, 120, 173, 138, -25, 88, -61, -23, -58, 107, -178, 281, 2, 86, 124, 54, 164, 108, 38, -11, 36, -16, -64, -4, 2, -45, -23, 19, -173, -14, 81, 17, 327, -171, -57, 202, 222, -239, -58, 59, -11, 92, 39, -318, -113, 318, 96, 60, 144, 71, -63, -85, 128, 251, -112, -39, -108, 50, -31, 56, 79, -9, -37, -71, -32, -47, 121, 31, 180, -89, -140, 258, 253, -28, 49, 198, -53, -105, 64, -241, -115, 31, 136, -102, 108, -76, 100, -9, -142, 206, -193, -23, -410, -193, 218, -38, 149, 175, 226, 47, 91, 22, -186, -138, 50, 10, -68, 240, -144, 93, -96, 170, 165, -85, -116, 179, 96, -128, -55, 60, 135, -171, 158, 218, 163, -63, 194, 122, 110, 27, -162, -209, 89]
6207H9j61p6L41r5J28l79J60j48L05o3r9n0J8J17r6J15K2k03R7j41L26m09J93
6230im1k4q3LK98o5r7J51q1k70K06Q1p3j88K57J83r3j67JJ82o4j46N6O2o8M8p5
6257a6j8J12j61K05j74j98L21r1j86L34k06N5J19j34J74p2q5qK26k94N8J86k18
6280g1J86p2r7J17j42J19Q7j75n0K21Q4k48J70k31J03k2M2m6J08k74M10j55j73
6303a09J19O9k55J76l6J63j95r2J75o0l1K88k62j10L99j82Q1J6j86R1j75P5J15
6326G4k14r7L49J0j85J70j35QJ77o0j07J68n6J5O1l62K28j82J8K89k29j26K92
6349A06Q6k49k10N21j77j16j6n8o9K8K04o0Nm2R2k50J20j62K94J52k77K33M0l40
6373a45K72O2m35M38r2j96J5L14l25J96j39K4J95k02J63k74J58J6Ll39M42l25
$$ y = [89, -72, -148, 193, 98, 226, -153, 7, -141, 164, 101, 2, -48, -30, 87, -9, 106, 128, -75, 22, -119, 207, -202, -9, -50, -74, -157, -154, 144, 79, -18, 133, 52, -218, -12, 69, -4, -192, 65, 248, 155, -12, -11, 171, 107, -39, 17, 79, 11, 59, -16, -34, 78, -83, 122, -52, -250, 71, -20, -206, 128, -78, -23, 96, -38, 136, 64, -21, -29, 197, -97, -39, 147, -71, 115, 43, -54, 63, -79, 40, 127, -48, -98, 123, 207, -41, 129, -102, 1, -21, 21, -25, 83, -191, 219, 64, -109, 10, 79, -176, 0, -36, 127, -68, -160, 15, -45, -76, 212, -50, -160, 239, 57, 138, 154, -32, 59, -116, -41, 74, -140, -237, 112, 122, -63, 107, -28, -20, 157, 97, -10, 158, 102, 117, 178, -184, 44, -138, -120, 169, -60, -186, 106, 192, -57, -267, 254, 77, -39, -55, -113, -182, -154, 50, -10, -5, -47, 45, -205, -85, -247, 47, 199, -78, 155, 195, -145, 127, 189, -246, 192, 100, -96, -81, 233, -92, 104, -35, -11, 184, -18, 145, -129, 29, 45, 48, -291, 151, -174]
6395a74K09J6j79J03p9J29lj13J21j6k8n3RJ63j91K69m27J48J60j10j23K53p8
6418Fj51K06j96K68o4k00L28k59K4L8L4l8k62J92ML28l85j9J73J81m03J15K6j0
6442f4P3j96J10J85N3K7k01R8o3L7K5j36J11O9l7m1j19j2J71k6j34K35J24l84
6466i5K25j82R4l1K1N4k41o0L02q6j20J32o8K99j36l62J76K67l10j24J72j74J16
6489a31J96O9l18K66o4J02j42M5K73l46J02R7j37j0l21J70J44J30l06J53k25P1
6511a82L41j04r1K42k96K79m34K10J64j30J00J1k15J58k6q4N0k56L06l0L11m05
6533h1J3j0J57k19K43k23K47k51J88j99J17R5j79K09k14J27j24J83k04j80L14
6554IQ6K6J66m5k94O1j57j33K97NkJ61j41M4k67J03J00o3J8P1M0j70K27k9j15
$$ y = [-174, 35, 51, -128, -25, -104, 25, 22, -91, 30, 14, -14, -67, -58, 105, -86, 183, -244, -96, 64, -46, -169, 84, 6, -145, 61, -135, 133, 69, -131, 197, -62, -38, 0, 34, -4, -266, -74, -70, 258, -127, -146, 27, 208, -195, -80, -54, -64, 9, -187, -77, 108, 161, 188, -13, 85, 22, 59, 84, -52, 59, 128, 91, 50, -69, -81, 90, 64, -70, 165, 289, -95, 130, -52, 42, 11, 32, 86, -155, -215, 87, 1, -119, 13, -55, 244, 108, -254, -78, 189, -121, -245, -73, -247, -131, 65, 134, -184, 82, 18, 120, -22, 23, 296, -50, 52, 149, 12, 2, -319, -149, -5, 125, -181, -28, -253, -182, 159, 55, -36, 206, -90, 189, -245, -35, 129, -1, 99, 110, -105, 53, 27, -57, -7, -263, 43, 13, 324, -81, -68, -78, 79, -140, 103, -120, 127, -124, 64, -135, -18, 77, -102, 107, -107, 20, -104, 79, -125, -305, 9, 95, 121, 287, 242, -52, 9, -148, -281, 16, 21, 19, 180, 39, 83, -184, -81, 19, -44, -26, 45, 85, -85, 142, 113, -2]
6579bj3J52l33J36j30J86K32n60M79M9m1k93P5q8n5r8L27J2l9j8J36N0M0j95l1
6604b2J58p0k5m7p6J8m7L6J18K22m05J29m9j21J34l1L63n10K09j0r1R3j71N4K51
6629A10k25P0K7L6j53L11j47j30N0J48j79K03j52K32m3j73K38j84P1J49k82K18
6651A95j90M4j10K2K27j70j21n0q6L23k20K28j32Q0q4L35n42L78O2j61m3j22N5
6674h2j33J85J40j77K63j51o6j14k4J00J64M6j76J3r5J88P1K6m5L6k74O6k88L25
6698bk3k19L04j84K83l32K29j11l5m3J10k07J25J01J87j58kK48j14k92J80q9K58
6721B14j86K99l26j23K90l14L10m54L76j04n7K18j86K24k85K54l35L77l19n6L05
6742A22l06K31Pr0J27l37L00k54K42j25L2K37k45k50J53k4J19P1J64j67j52K18
$$ y = [-2, -15, 137, -196, -60, -190, -4, 228, -332, 147, 196, 155, -138, -63, -151, -206, -304, 23, 35, -4, -22, 114, 164, 204, 9, -22, 136, 66, 41, -6, -82, -64, -111, -75, 43, 265, -140, -11, -60, -181, -47, -78, 285, -225, -16, -26, -117, -24, -195, -141, 110, -115, -45, -18, 18, -135, 176, 29, -101, -51, 97, -82, 121, -31, 201, 158, -15, 223, 39, 110, 259, -23, 195, 5, 49, -61, -39, 188, 18, -103, -153, -239, 84, -136, 92, -40, 40, -44, 291, -251, 127, 189, 28, -15, -137, -82, -215, -30, 110, -67, 196, 45, -21, -135, -159, -59, 105, 151, -25, -12, -107, 81, 152, 178, 133, 169, -105, -39, -327, -2, -25, -244, 60, -124, 159, -173, 56, -55, -90, -133, -23, -230, -105, -4, 183, 25, 23, 271, 157, -135, 45, -44, 214, 28, 327, 1, -122, 168, -146, 164, -290, 86, -18, -75, 143, -43, 181, -104, 150, -185, 192, -127, -183, 122, -184, 47, 54, -36, 91, -246, 54, -200, 42, -83, -51, 186, -59, -309, -156, -180, -61, 10, 174, 7, -145, 73]
6764G3j17R1K4K1j05J2J70k20J03j0j76m0J91J93q8o1j34K36l15K28j7o1N5k16
6788a63P1J60l15J97rk7o7j9K10o5L62l89K01j97K5n5J58o5m2J35Q4p8rj73nK75
6814B00j20KQ4l7m2O3j82L4J75n2k0n4j76K20N9k33J38o3k3rJ22J31j90n9Q1k54
6840b05K26J75l99N9N6J35K1k12L93n03O0J03j28J17J10N2m8M2P0j07m0M7J63
6863A87r7r8O9k16K99k21J68P0l1k28J08o5MN0k1j52J52J83k53L89k77k36M30
6886B14J49k98P2j73J90qk24L66m21J89q9J03j12K03o7k8J44j62J89j43l22Q5
6908a43J24K86k97n8O6k24K80q4Q5j45K91M4m43K36M0j39j22K27J78j60j04J29
6930F7Or1j2L5k57J3J72P6J33n3j36K61j58L8r3J2K64j75l68K50k6M8M4o5m62
$$ y = [73, -44, 47, 71, 92, -13, -1, 169, -51, 52, 42, -134, -174, 17, 210, 122, 61, -73, 163, -152, 76, 59, -2, 53, -163, -92, 68, -247, -50, -59, -86, -153, -172, 38, -27, 335, -54, 147, -50, -25, -80, 78, 13, -29, 106, 190, 112, 103, -70, -75, 200, 80, 82, 166, 129, 87, 150, -32, 2, 177, 125, 105, 51, -125, 95, 154, -79, 59, -4, -27, -36, 86, 217, 27, -32, 49, -205, 21, 196, -203, -144, -88, 47, 68, -144, 249, -254, -194, -91, -219, -102, 8, 60, 12, 54, 124, 17, -23, 24, 187, 90, -8, 61, -155, 144, -77, 91, 161, 130, -98, 10, -55, -51, -1, -22, -174, -22, 161, -92, 297, 20, -216, 214, 363, 65, 137, -36, 154, 146, -78, 288, -133, 56, -33, 70, -42, 161, 94, 66, 210, 48, 237, 94, -228, -143, -19, 267, -30, -88, -22, -246, 34, -50, 35, -110, 181, 225, -218, 18, 58, -81, -203, 24, 202, 42, -62, 67, 73, -18, -30, 5, -252, -239, -67, 9, 142, 89, -47, 214, 56, 94, 1, 13, 277, 102, -266, -16, -42, 6, 50, -15, -477]
6955d77O30k90O9j96L53J76j76n9K64r9k99J04K8kJ0J5K0k45J92J72j24J5o1l6
6979a6k9J94r1n7M5L7j07OJ02l32J49J95l2j42j17K13k02J49j06K87j76J20n3
7002C7J37m03J39Q9j62K80o8PJ8k61K07J41j44m6J47j21K10j48o9NJ13r7o1J12
7026F2m5p7J03Jk21K36P2j69L1K12l56K26k58L67k23J10j36o9K75k37n2J38L81
7049C71k48k09O8ML8N0mj54P3n6n1J36k14K94l92M8K70j61J29J71k2j89p9K89
7073A62k08j37R8J72J8m2Rm8n6M20l61p3m3J66j81J16r0J21j47K39l14M4K32m0
7097E7o5J68l01p5J36P5j17J38M9p6J3J94k86K81O0j44j82j6K9L0K8J49O4k26
7121a7J37N5p8k15J44j99L0J49j35k4J63L2J50j97P0L5k9j70N7K96k37M3R0l08
$$ y = [-477, 153, -137, -68, -264, 89, 265, 89, 30, 294, 195, -104, 0, 28, 26, 36, 51, 71, -174, 18, 190, 66, 81, 20, -16, -45, 149, 58, 1, 46, 83, -24, -18, 84, -248, -99, 96, 64, -78, -195, 18, -184, -35, -141, 146, -30, 90, 37, 174, -229, -90, -1, -163, 117, 49, 56, 74, -187, 20, 161, 17, -29, 118, -3, 207, 59, -10, -5, 108, 11, -50, 62, 17, -60, 43, 44, -177, 59, 131, -38, -7, 205, -151, 75, -183, 184, -39, 71, -65, -134, 141, -96, -148, -10, 371, 123, -86, -18, -14, 24, 74, 70, -84, -11, -67, -118, 18, -196, 98, -294, -246, 24, -137, -8, 163, 141, -48, -127, 162, -46, -183, -85, 87, 105, 63, 72, 24, -32, 388, 27, -46, -89, 77, -104, 12, -78, 43, -104, 135, -179, -135, 97, 57, -8, 160, -141, -216, -80, -5, -122, 16, 65, -11, 2, 196, -90, 191, 251, 107, -75, -91, -62, -32, -4, 145, 209, -17, 120, 175, 97, -118, 26, -173, -143, 6, -129, -153, 10, 42, 192, -5, 65, 100, 71, -99, -42, 254, 17, 60, 150, -158]
7145a58J96J03m7k48J14N5n8N0R5k15J45j40J47q2N1J20j9k16J44L7Q3k50J40
7168D7J06j69L5M1o7pk30J61O9M1j15J06r7M2J07J9l7j0QJm3l2J28k00J44P1o
7195A13j20O1j76j33K32J11p3L8Rj49N3j8r7K32j56k15M98j82j08J84k31J43N1
7218F7O1n1j98R0j06L35j77k63J75L4J46j56m6J49R2j42jJ04r5j02J62q3J8r8
7242h5N5L78k26j41L6J7P1k29L80p0l10Q8j27M5J60K2l28L69j98N4J72l11J63
7265a5nJ8J14k43P6k22K50M5M2o8J85l40K16Q1j12p7O6R7O3j59J52J2l09p2K29
7290B4mk40M40k69j83L01j96K13k53K23Pk51J8P8j40L28j10m2M7O9k1j96K99N
7314A47k27j7J89j14q4R8j00OP3J38k17J72j83j8K64L0j31j18J3k2J05m4j19N9
$$ y = [-158, 38, 141, 94, -154, -40, 15, -43, 7, 102, -113, 32, -108, 39, -43, 8, 128, 109, -107, 37, 74, 157, -93, 47, 153, -16, 19, 60, -7, -14, -244, -83, -14, 27, -88, 18, -79, -37, 70, 89, 52, 42, 50, 51, 8, -24, 104, -96, 48, 119, 113, -7, 54, -122, -255, -23, 88, 15, 53, 62, -87, -34, -52, -149, 83, -73, -288, 210, 28, -80, 104, -127, 16, 67, 128, 77, -121, -31, -137, 198, 21, -242, -67, -33, 113, -43, -89, 60, 152, 10, 9, 113, 18, -84, 78, -5, 13, -85, -30, 348, 122, -19, 17, 34, 105, -124, 256, 186, -124, -36, -163, -118, 42, 64, -264, 105, -93, -39, 133, -178, -15, -20, -2, 112, -131, -55, -277, -27, 18, 60, -8, 177, -163, 53, 134, 22, -55, 11, 108, 171, 12, 164, 176, -133, -205, 24, 20, -220, 220, -49, -232, 69, -127, 86, -167, 56, 63, -188, -170, -92, -232, 96, -14, -56, -9, 60, 39, -157, 142, 147, -80, -97, 92, -22, -106, -8, -108, -102, -29, 109, -108, 64, -119, -137, 127, 157, 26, -92, -79, -101, 4, -40, -159, -100]
7338a00K56j06j41j10M7K39j55J53k03M1L0J03j39j77J39L45p6l13J06J16j19
7359f4J80j19QJ98q9n7k09J34J96o2m5J59J73j58k74L30l34q0K46j47M3p9M59
7382D09m91J81n2J44k28K1K02k9j57K06l21j11J2K98q0j03JN1qq1K66j67P8J9
7406F0Q1J3q4R0j2k1l07J45m5K44k76M19l44k17M28k69L84m01J62j82L4m0L04
7429A66o6o9p5q4L0J15m2j32L44l94K28L9J1N5l33M91l61J49J20J8l39Q7N7n3
7453c8N5Koo9R7j13J60M7j17j04M0q0J12R9o4q4J26j99O7P0L40m08P7o3O0j71
7479a64J28K08n4R1k04m1J36k3k30P9R4j3j57K04j75j06J13K79n5j77j52K42m1
7502a8J14m5K5K4r4k45L17J04j19j26j13J25j83K55K0j50J09k83J61K98j50jm05
$$ y = [-100, 156, 50, -91, -201, -154, 85, -70, 83, -120, -79, -49, 54, -85, -262, -123, 222, 146, -167, -61, 55, -64, 116, -3, 5, 203, 114, 57, -152, -18, 178, 116, 71, 230, 403, 245, -29, 301, -33, -113, 133, -14, 29, -50, 409, -82, 99, 47, 191, -37, -16, 186, 157, 0, 206, -115, -226, -214, 84, 4, -99, -98, -47, -55, -136, 130, -37, 41, 60, 141, 154, 70, 160, 148, 127, -180, -35, -80, 164, -112, 307, -37, -254, 174, -95, 289, -112, 50, -132, -98, -138, 166, 100, 31, -44, -128, -98, 17, -25, -157, 187, -207, 21, 60, 71, 126, -207, 284, -77, 72, 192, 210, -129, -42, 15, -38, 17, 19, 13, -56, 41, -72, 88, 135, 18, -86, -46, -126, -14, 85, 21, -63, 63, -136, -69, 1, 341, -67, 10, -53, 7, -164, -36, 172, 118, 209, 5, -36, 100, 77, -153, -74, 20, 7, -150, 54, -121, -227, -114, 165, 110, -67, -219, 23, -18, 96, 51, 76, 100, 6, -239, 78, 182, 63, -63, -176, -51, -234, 21, 41, -109, 0, -283, -122, 176, 26, 25, -380]
7525c80J8L34Q4k7j01R8l0K4k02L15l15K70j45J28p6j98K34o0o9K3J54o7%P2k22
7550a38J55LJ32l68K53j15J48j12O4K12j92J19k11K30k04Q8J71O4m66M25k44J25
7572A39j82j61r4L13J04j39J07m5l01J04K15j39P2L17k70n2K21l22K5K14j91K87
7594B22k61Q4l02L35k09J74M8j40N7j13K36J9j89K4K34p6oj39O7j68L3q0K40q8
7618BK18j6j27O1k7j97K14k39J23K29k51J60l26J36L95o44J49J19K3J1P9j82J17
7641B7M6r5K78l61K91k48j12N9J1L9J01k05K13j49J38K2q2J54m8M8o6P4J29j92
7665G2k76K35j56J44j43L58k81J70l6j77l1J05k39L24j30jr5M0K42l0j39p6R9
7688b1k38K21j03K98q5j03p3P8k85L74l50J57K41l00K15k9L6K56l15J96O4l6j64
$$ y = [-380, -362, -28, 56, 29, -72, 26, -4, 20, -182, 133, -182, 88, -57, 71, -5, -203, 31, -29, -98, -75, 79, 12, 12, 84, -138, 17, 20, 152, -216, 37, -78, 70, -42, 22, 234, 42, 161, -50, 180, -24, 64, 235, 299, -167, 258, 14, 139, -43, -204, -298, 15, 119, -20, 87, 42, -259, -155, 60, -79, -7, 310, 40, -12, 209, -113, -88, 126, -65, 222, -39, 45, -257, 78, -131, 43, 91, -49, 8, -105, 131, 150, -39, -15, 219, 143, 137, -2, 65, -103, -70, -150, 90, 2, 220, 204, 77, 138, 111, -86, 128, -111, 12, 241, -10, 150, -176, -40, 355, -289, -140, -21, 2, 13, 92, -90, 27, 73, -22, 256, -105, 186, -62, -174, -115, -104, -65, 36, -169, 44, -105, 33, 55, -27, 127, 79, 127, 61, 135, 264, 72, -204, 31, -125, 19, -124, 234, -47, 123, 87, -90, -121, -16, -255, 69, -61, -62, -157, -117, 125, 95, -44, -120, -21, -259, -38, -141, 157, 72, -31, -104, -26, -311, 63, -287, -130, 111, -189, 26, -3, 33, 289, -26, 170, 234, 198, 34]
7711C4o4J13L1p1k47M82j83j55K95l57J97k03K63%l31J80o5J12N4j04J2l7J09
7734F5m4j98pK37m3p8Mk59J38R4K50p4L3n2J53k01M1k41J1J49m9j58K19J36j55
7759b9J31J73k00j64j01K75j53J30j49R4n3J42L6Kj66N3K1J9p0K04m13N4Q7J63
7783H6l58J44J59J00O8k67p1J46MQ5ml74N07j04l94K31J31j88N8r7O4L2J34k98
7807b06L36j51l2J92j00K75k39L4M7j83J43m1J78m22J15L9j34k3m3K17m8k36J34
7830a48K10m5J26j15K40k64j17j4J96P3r3j6J29q6m60M81j52J57o4Mm0J40j56
7853a4J46jL1j66k4o7K41j91J91k7l07J91J31q0j28J60q6K00j47K7j29J69k1k54
7877a55J51q4M8J87j81J36j6nqm6j73O1P3R4K22m13J03k8J22k8M5j27J56r6J76
$$ y = [34, -30, 83, 114, 43, -204, 278, 95, -60, 235, -122, 75, -128, 135, 135, -196, -16, -81, 31, 85, -19, -7, -44, 65, 21, -177, -184, 53, 10, -68, -64, -323, -185, -91, 159, 85, 118, 66, 219, 18, 59, -182, -171, -22, -71, -229, -10, 126, -29, 102, 275, 75, -89, -190, 85, -68, 62, -87, 7, -46, 96, 132, 134, -32, 21, 42, 61, -9, 195, -218, -164, -77, 86, -272, -128, 31, 131, 199, -68, -139, 7, 11, 96, 92, -282, 225, 121, -273, -42, 89, -99, -41, -138, -74, -42, 92, -206, 130, -21, -53, 139, 39, 314, 75, 109, 156, -27, 116, 75, 253, -169, -54, -15, -149, -172, -215, 2, -46, -282, -148, 62, 17, 143, 28, 268, 4, -113, -127, 69, 142, 49, 33, 162, 76, -384, 97, -55, 102, 38, 42, 2, 142, -14, 132, 131, 162, -4, -28, -95, 146, -45, 146, 119, -188, 3, 134, 54, -74, 86, 0, 200, 53, 80, -49, 120, 99, -155, -4, -88, -40, 147, -34, 102, 86, 81, 73, 27, -146, -85, -12, 82, 304, -109, -6, -34, 88, 60, 105, -22, 134, 38, 214]
7902B14oj18K9J09J54l49p7K37l31R0J3J61k32K57%k49K36j05k9k78J67P0R0k82
7926b29M58j10j30n9M18l29j38j9L19l64K27j26r6M8K38O2k49L21k62J25P2k47
7948g0kJ54p1J5K6o7n1j48K08l1n5%J07J17k45M08j01k03R1J03o7K52m66K52l40
7973a84M6J55L2pJ97k06j10m8J85L3J28k26L3j47J30L7L8j95J14J26k5l16MK07
7997AQ2K7K6q0L1q0J71j24m5J24M0k74J48r1j88Q0J68o3J49N0j41j79K32%j93
8022a29n3O3O6O7J6j27K1n2K15L4J22k12p2l08K86k0J46O3j08n7K24n33L29j6
8046c5j24M5R8mN3K09k55J0L47l13k05K68J4j93k9J72LpJ06j15J16j19j55J80
8070F7j58K79j41j80P0k12J81l0K85q2j13K03J08k33j58K4n6L7J37Jn5Jj44M06
$$ y = [214, 208, 90, 119, 228, 382, 33, -44, 193, -138, -48, -35, 126, -106, 151, 151, -98, 138, 33, 4, -274, -107, -37, 53, -229, 229, 119, -11, -70, 348, 19, -119, -138, 181, -183, 44, -82, -178, -130, 108, 170, -79, 242, -20, 105, 177, -70, -72, 82, 11, 26, 52, -15, -66, -214, -6, -37, -92, -92, 15, 132, -113, 295, 194, -9, 82, 185, 118, 370, -96, 156, -184, -138, 17, 49, 42, 239, 33, -77, -125, 60, 93, 221, -5, 28, -119, 11, 48, 86, -109, 5, 131, 106, -210, -206, 1, 83, 110, 136, 56, 87, 7, 178, 54, 9, 133, 173, -101, 47, -44, -232, -152, 16, -47, 102, 152, 11, -168, 64, 64, -129, -182, -119, -53, 14, 30, -97, -76, -128, 87, 121, 243, 31, -41, -349, -63, -83, 63, 126, 18, -39, 185, -348, -19, -35, -159, -114, -16, -20, 33, 242, -13, -3, 344, 31, -174, 94, 108, -85, -114, 58, 61, 54, 160, 45, 161, 42, -113, 67, -91, 188, 47, -133, -63, -275, -94, -124, 161, 79, -34, 169, 277, 44, -114, -90, -146, -109, 28, 29, -26, -25, -169, 237]
8094B37n05K26J82j15J7k21l5K50lM9j45L58n13J22qMpj9M89m54J90j79L16j63
8118G3j74L5L7j33K54j66J44Q6q8k57J8M65l98M5r1J69k20J72LJ20J2o8j69K78
8142A47j65P4O2j09j61J80k8R9M2k91Q7j20K32q3O0m1o0R2K42m43J82J84k81K48
8166A49j34j04J51r6l7L39j96J40j23M5k56N3j62K16j19J67k42J84m9K57j77J57
8188A63m2j87j06
$$ y = [237, -268, -42, 140, 25, 42, -179, -214, 36, 33, 82, -63, 295, -218, -96, -104, -100, -107, -126, 363, -91, 99, -80, 236, 73, -101, -66, -29, -162, 92, -74, 70, 156, 68, -189, -171, 294, -104, -59, -150, 19, -201, -29, -26, 94, 106, 38, -131, 147, -18, 56, 118, 9, -152, 28, 0, 99, 141, -150, -63, -183, 49, -34, 26, -15, -75, 17, 259, -184, -2, 182, -99, 149, 15, -89, 62, -34, -71, 268, 72, 212, 89, 134, -122, -69, -231, -15, -134, 33, -209, -25, -74, 183, 6, 163, 121, -66, -172]
8191a72
$$ Imaginary data points
##PAGE= N=2
##DATA TABLE= (X++(I..I)), XYDATA
0@%%%%%%%%%%%qJ6j6J6k4L2l2M0n4O2p2Q8j04J20j41J65j90K20k52K88l28L72
33A98m24M80n40O07o82P62q49R45j048J165j292J427j575J740j920K114k331K568
51A345k827L115l438L799m204M665n194N809o532P398q455R782j1508J3850j7226
66i621K2541l2177N5065k07767j66410M34183N0487j62761J51853K71509j95690
77B11212k23197J31660M7378k84296l6211K26540q0693k74034J21787K29533j46369
88g6690j34534K64976J44233k36794p8737K19198j1717j99356R7064K14567j03771
99I8439j39024J32236M1835k18094k9222K08210k6145k10875M6075J39312j45976
110a03229j62809J52638J60111p1598N446J82438K5648j27744L2942R9774r9683
$$ y = [0, 0, 0, 0, 0, 0, 0, 0, 0, 0, 0, 0, -8, 8, -8, 8, -16, 16, -16, 24, -30, 32, -40, 48, -56, 64, -77, 88, -102, 118, -134, 154, -174, 198, -226, 254, -286, 321, -361, 401, -448, 497, -551, 614, -678, 749, -826, 914, -1006, 1108, -1223, 1345, -1482, 1633, -1805, 1994, -2210, 2455, -2739, 3070, -3462, 3936, -4519, 5263, -6245, 7605, -9621, 12920, -19257, 35808, -171959, -338369, 95814, 146301, -16460, 135393, 406902, 211212, -11985, 119675, 167053, -117243, -153454, 73086, -7607, -281641, -159854, 69679, -76690, -211224, 53752, 197985, -38809, -117546, 101652, 89935, -109421, -12357, 202210, 98439, -40585, 91651, 133486, -84608, -113830, 94380, 68235, -142640, -96565, 42747, -103229, -266038, -113400, 46711, -24887, -19441, 162997, 188645, 60901, 93843, 193617, 93934]
121I3934j23414N8886K935j86642q1798J19217L8235p1467P1941J61337K116p6914
133H366M4461O2127n2293l3162O2010L251r1681l5419K1749m5819o1339M8602
145f9147P9568j6058l8340L9234L6815m2179l1141M8170M0023l0726k4641K5299
157A6877P509k7111J5212N3972J220m3169m979J041o7208o4024L4183M8099k8263
170e6641p875P5655L2992n3605J794P8931Q079n4289K2333M1684o7477p5070L4710
183a8779J8693p3007p480Q7144j617p8319L5813R2087l1284n1985P6699N1096
195I9061r1121m9057O7952p583q8735L0295R2710l9195o8540O6168M7688q8386
207b8743l0105R7474Q701r4020J7298Q3608m9771p6344O8468O1940p3594k7692
$$ y = [93934, -29480, 29406, 32341, -154301, -236099, -116882, -78647, -150114, -78173, 83164, 85280, 8366, 52827, 114954, 62661, 29499, 91509, 94760, 3079, -32340, -10591, -56410, -117749, -69147, 10421, -5637, -43977, -4743, 32072, -10107, -41248, 6922, 46945, 16219, -8422, 16877, 24386, -2725, 12487, 66459, 67679, 24510, 19531, 20572, -46636, -110660, -76477, -28378, -56641, -64516, 11139, 44131, -9474, -7680, 71251, 79330, 25041, 47374, 89058, 21581, -53489, -18779, -86, -73093, -80573, 6571, 4954, -73365, -37552, 54535, 23251, -28734, 47965, 99061, 7940, -41117, 26835, 19252, -69483, -39188, 53522, 14327, -54213, 11955, 59643, -28743, -58848, 38626, 47327, -46693, -29395, 54213, 4442, -71902, -3434, 58506, -15088, -42780]
219d2780Q7683J446r4764J7522Q3806m0929o6475O4930M9061q2484l3276Q4006
231B7746Q424p8885K3520P9396m2637o9328N1395M1240p0193k1968P9842M707
243C3259p3719K0261O8303l7646n2964N5689M0202o3152k3022O1710m861o6897
255d2837J7922N8076l2260m2924M6936K9791n3700j3215N7030q9m9650J8750M4872
268C8702l0291l6327L6868K1024m2896j0335L9944p299m2649J2793L3086k0938
280h318j9937L5257J9987k7496k507L1781m687k9678Q956J8247k2689k1107J5980
293f211M659k4161j573K3088l87j2718J5516K0163o990n234J6168M422j6799m735
307E208O193r473j6038K381N417q222k606J0171L463n335L092P893q50k367N661
$$ y = [-42780, 44903, 46349, -48415, -30893, 52913, 11984, -54491, 10439, 59500, -22984, -56260, 27746, 36170, -42715, -19195, 60201, 17564, -51764, -369, 40871, -29322, -51290, 28552, 33259, -40460, -20199, 48104, 10458, -42506, 13183, 53385, -9767, -32789, 28921, 24060, -42837, -24915, 33161, 901, -42023, 4913, 34704, -18996, -32211, 24819, 24730, -24920, -6170, 38702, 8411, -27916, 8952, 29976, -12920, -23255, 16689, 9390, -33259, -20466, 12620, -8318, -28255, 7002, 26989, -507, -3014, 28767, 24080, -5598, 3358, 21605, -1084, -22191, -6211, -1552, -25713, -27286, -4198, -4585, -17303, -1787, 18376, 11386, 6152, 22320, 26742, 9943, 5208, 11401, 1928, -14110, -11729, -6312, -14534, -17140, -6969, -3506, -8841, -5749, 2144, 1294, -1073, 4588]
322D588M969j710N16L968r91m270j472j590n459m287j529k502k126N80Q00N98
338i917K721M084L012L529N697L430Q39J552j20m444n731l811n225p045l311L13
354a4427P99O18M954O173L354K761M654K663p44k26P43k072m984l273k331m052
370e390n761k030J343J81O8M476O805K871K104N524M399k726k979K203j636r167
386B85l837K851m580q660K666O197n037l324J0116O364o340J815J3419o10j0841
401D84N010R973j0008j0263J1215M980j6240m284J4856m365j8686O260J5566j2701
415h203j2796J7876J0525j7380L47K6900Q88j9771J1574J9774j9158k1346J7170
428F400P121l0655p754K5885n354k7861J4654L0888j3534j4055L2058J6247l1650
$$ y = [4588, 9557, 7847, 8363, 12331, 11340, 7070, 5598, 4008, -1451, -5738, -7267, -9769, -11895, -11315, -10515, -9917, -7196, -3112, -100, 3429, 9126, 12556, 13395, 14947, 14827, 10383, 4652, 841, -4384, -11429, -14740, -14427, -13628, -13010, -8056, -1883, 1471, 4232, 8886, 11549, 10805, 10579, 11322, 9250, 4266, 993, -1338, -5390, -11151, -13181, -11838, -11657, -11589, -7113, -308, 2563, 4667, 10191, 14590, 11864, 8885, 11088, 9452, 285, -3552, -701, -5281, -13941, -11275, -5078, -10115, -13439, -3323, 3041, -3299, -1484, 11935, 11325, 484, 5494, 15467, 5459, -4804, 6411, 11391, -4849, -9133, 5723, 1358, -17328, -11068, 4498, -8203, -20999, -3123, 7402, -9978, -9631, 17269, 18157, -1614, 9960, 29734, 10576, -10770, 6400, 13521, -17134, -24888, 997, -4357, -32218, -17564, 13324, -210, -14265, 17793, 34040, 2390]
441B390p561K9570q483l6547J1055K6814k5428k5327K9681J6944l1603q80M2263
454B2888j303l4719J3915K9676k7406k8394L0242J6328l7199p138L8097m677l6507
467b6197J7365L7560k1336k6017K8730J3186m1476j1982L7404P59l1848J7312
479f540L6977k0394k7608K8131J9840l2466j0784L3431m256m1740K028K8453j6648
492a1576k3517K9709K6993k4039j1152L1892N886k9800M648L1482j1651l2997
504a4122P988J4638k5268j6617K9400J8613j9471k858K5135m618k8763N771K5892
517A5720p836k1293J2680J4428k2637j6251K4603J7855j6501k192K4476l435l2271
530a2654r59K4180q011k2240J6336K0536k5512k2716K5345J8145k2811J067L9401
$$ y = [2390, -5171, 24399, 15916, -20631, -9576, 17238, -8190, -33517, -3836, 13108, -18495, -19375, 22888, 21585, -13134, 781, 30457, 3051, -25343, 4899, 21227, -15972, -23110, 14987, 10310, -26197, -8832, 28728, 7392, -18625, 10105, 23291, -18185, -30167, 7237, 7996, -23852, -6540, 30437, 10043, -17565, 10566, 30406, -2060, -12844, 20587, 16331, -25409, -23381, 5072, -11576, -35093, -5384, 21609, -2430, -13582, 18310, 24196, -5604, -956, 30526, 18875, -14122, -6134, 8504, -16764, -33381, -3981, 14632, -4839, -7697, 17438, 12820, -15943, -10172, 15720, 7884, -13409, -729, 13699, -8938, -25189, -586, 17269, 768, -1424, 23052, 19617, -12654, -13613, 10567, 2556, -19684, -3348, 17188, -8324, -31040, -5695, 12450, -10361, -9294, 30107]
543C0107o02m0271P89K8025j9090k8732L1250K8898l4688k2529L5459N762m1627
556b7249J0038N2561j2167m6538K0007L0212m3079k7720N3529K4382m8838l562
568a8424N0550j7721n5667K9641N3756l6319l4160N0033J6097o9455j2462O5031
580B0900m093n5432L2475N7164m7500n0288N2783L1475n8722m786P1525j0488
592C5013p5240J8152N5595m2975m2874O6176L8204o9352k1607O5793o800o7850
604d7765L1362P2537l7463n4597M9071K8318p0967j6783P7111L638o9049J9431
616a5156N8641m7273n8195N6958M7231n5791j6710O9467k977p5775J2907O5680
628C9007k8324m6208N2518L6813o7258l1705N9870O789n9671J8498O4482l0095
$$ y = [30107, 29505, -10766, -9977, 18048, -1042, -29774, 1476, 30374, -4314, -26843, 8616, 14378, -27249, -17211, 35350, 23183, -23355, -3348, 26864, -16215, -43935, 9594, 33976, -14862, -18424, 32126, 14405, -41262, -11621, 42135, 5816, -28344, 21689, 37786, -31669, -44131, 20900, 16807, -38625, -6150, 51014, 3514, -46774, 6009, 37484, -21238, -26024, 45501, 35013, -40227, -22075, 33520, -9455, -52329, 13847, 52051, -17301, -38908, 26885, 20085, -47765, -16403, 56134, 18671, -35926, 13145, 41463, -29504, -46287, 30824, 34462, -34587, -15156, 43485, -3788, -61983, -5025, 42206, -13585, -30295, 39172, 36195, -39580, -26673, 39007, 10683, -35525, 16993, 53806, -13452, -45157, 14713, 21502, -38169, -19671, 44811, 14716]
640A4716n9402L3316L7770m6517j7543O4152J5728n7081o99M7957k1271m5576
652c4450L5281M3025l8227l2311L5518O921n1156k628N2025N62l5522J7883L2509
665B9430k9076k9776L2763K6595k7457r064L0593n249m3016j20L2858n369k1387
678a8275K0852K2431k6652k3742K2275J5800k0279j649K9479q84l3269j862K4353
691H578o418j8619J9615K4284k0176k3706J6012R715k4867m058L2856M277k9708
704a2215Q08K4504j1847k4132K3595K9878k0778k0654K1679M993l6128m681L5609
717A0631J64l0523J1065K7033k3403k4450L2437K4714k7787p839L4447n121m3278
730b1910N582L4861j5473k7978K7451K2017l6053j7532L6000O189l4259J1227
$$ y = [14716, -44686, -11370, 26400, -20117, -37660, 26492, 42220, -14861, -15560, 32397, 11126, -34450, 831, 43856, 5629, -26682, 8836, 15757, -35399, -38027, 13998, 14560, -20962, -3079, 29430, 354, -29422, 3341, 29936, 2479, -6585, 24008, 18759, -24257, -24377, 8481, 3112, -18275, 2577, 25008, -1644, -25386, -3111, 12689, -7590, -9239, 20240, 19356, -13913, -15775, 8578, 2160, -16459, 3156, 27440, 7264, -16442, -430, 9285, -15582, -19640, 13216, 17493, -12215, -11407, 13097, 1250, -22882, 713, 30591, 9813, -10841, 10838, 15831, -20297, -24978, 10631, 10795, -19728, -8663, 18370, -5033, -29483, 2954, 27668, -119, -7958, 26489, 21368, -21910, -16328, 18533, 3060, -24918, 2533, 24550, -11503, -29035, 6965, 13154, -21105, -9878]
742i878L9743j7921l5319K2921K3746l3094j4037M1799Q075m0720J186L5505j6761
755E245l3087K6830K8627l1718j9809L3213L627l9317O730M1943j0550l0611K3433
768D556K4269l3188j9510L4519Q700l4306K989L3107j4335l1808J9866K4108k5097
781f130j3280L1780O848l3047Q62L0115j0224k5277J8400K0433k3779j6207K4046
794D540N615k5217M423K7883p266k2150J2874J5302k0292j1646K2652O557k1402
807h127J090J9749p913j8857J0940J3576j4833q597J6311L822j6142K065J6776
820I860l795j2263Q359R285j2450p603J1714L454j1472J546J1135m522j0337M576
834b513O012p778l764R274L240p135L50P183k705o161L425M403m074k935M927
$$ y = [-9878, 29865, 11944, -23375, -454, 23292, -9802, -23839, 17960, 26035, -14685, -13499, 22006, 5245, -27842, -1012, 27615, -4103, -23912, 9301, 12928, -26389, -19659, 22284, 11734, -18877, 4556, 28825, -4363, -23873, 10646, 19346, -14960, -11971, 21136, 6801, -25007, -5141, 18967, -6130, -19410, 12370, 19218, -13829, -12967, 17148, 6924, -18353, 47, 20480, -3299, -19506, 4540, 10155, -15062, -10639, 17244, 9978, -12172, 702, 16004, -4288, -15934, 6718, 13275, -8127, -7037, 12712, 4799, -14058, -3118, 10458, -4375, -12972, 3339, 7161, -8981, -6916, 9860, 6065, -6198, 2161, 11446, -1004, -8607, 3107, 6561, -4911, -3365, 7770, 3248, -7089, -2513, 3499, -4279, -8043, 1231, 4471, -2664, -2314, 4869, 2164, -3997, -572, 3831, -243, -3178, 1749]
849A749K360l960P7L884j437m439p55J826k212j915K859K970o45n21K055N98k637
866a43j250J137N13j517K50K349M79j671j24J879o02k910J287K106j416j640K503
883A230J263l610j851K029l75l744J404M298n00j101L915K558l401j916L055j529
899A725m560N00L645j505k996L422K881l709j877L512j53m030R01M073j520k931
915b622L047K460l239k110L384R32l170N44L854r79k763J775J676l488k172K138
931g33O95k908O56L538K33k117J254J977k166k122J197R95k113o26K379J129j418
948a50J04J774N7j713J00J903q60j852M41J518j412k335J197J526j808j985K734
965g61J778k805l48M293P2l439J053L860j997l675L167L087l945k396M517N89
$$ y = [1749, 4109, 149, 226, 4110, 2673, -1766, -2521, -695, -2907, -4822, -1963, 1007, 362, -159, 1896, 2494, -143, -1393, -256, 257, -1260, -1010, 1339, 1818, 147, 23, 1902, 1300, -1610, -323, 1783, 367, -1273, 1230, 2493, -1117, -2968, -939, -1314, -5058, -3654, 644, 144, -957, 2958, 5516, 2115, 199, 3254, 1725, -2835, -2335, 1310, -195, -3191, 231, 3112, -597, -2474, 1038, 885, -3145, -2244, 1829, 309, -2622, 425, 2885, -354, -2464, 920, 1852, -1318, -774, 3080, 2101, -662, 1113, 2789, -699, -2871, -733, -38, -2946, -2290, 1248, 1481, -636, 618, 2595, 429, -1693, -496, 499, -1614, -2240, 139, 1268, -150, -46, 1728, 1785, 72, 172, 2075, 1215, -637, -196, 1322, -90, -2425, -1228, 298, -1510, -3495, -761, 1017, -1788, -2136, 2157, 2229, -1210, -157, 3703, 1706, -1969, 1198, 4285, 340, -2056, 2461, 3050]
981C050o047n57N275j825n761L657N223m569l714O445K808o000j44P677j433p469
997c384L096O291n692n335P176L996q357k296Q002q32q844K355Q146m686o826
1012g190O781M698p876k593J0542J729q800J883Q876n003q833N838O578p720m534
1027e624Q417J544j0314p84J0048j532p984N856P968o823p049P402M371q886j557
1042d947J0024p3j0247J894R040l641p581P329P086q750o566P561K026j0135K46
1057f734J2029q08j0143L551Q548o499p887R407P594r313m892J0181j20j3472
1071h558J035J3241k385j0309P596R287j0645r204J2621P217j3057k241J4330
1084H928l409j7599M038J4808o893j0576J3296J0149j6460p634J7016K779j6821
$$ y = [3050, -2997, -3554, 1721, -104, -5865, -2208, 3015, -1554, -5268, 1177, 3985, -2015, -2159, 5518, 4085, -3384, -288, 6003, 311, -5024, 2152, 6148, -2209, -4505, 3497, 2665, -6179, -3824, 4322, -364, -7190, -409, 4289, -3587, -6180, 4362, 6091, -2709, -826, 8050, 3047, -5786, 52, 6630, -1090, -5624, 2793, 4337, -5977, -6761, 3287, 1755, -6229, -373, 7595, 772, -6277, 1125, 5496, -3390, -4947, 5077, 5004, -5243, -3349, 5691, 2050, -5531, 1798, 8884, 134, -6432, 1129, 3155, -6980, -6734, 5295, 4487, -5656, -2105, 6443, -56, -7943, 1464, 9058, -255, -5147, 5034, 4914, -8558, -7523, 5718, 3333, -6976, 620, 9907, -738, -9942, 2679, 9896, -3161, -5402, 8928, 5519, -12080, -8042, 6766, -127, -10703, 2593, 12742, -3718, -11352, 5664, 8443, -8378]
1097h378M085J8651p977j8638R815J3335j5434q639K1054O790k1259k331J8889
1110I963o611k0445J1979K0078j4574j4303J7912P880k3177k646K6492P5k1744
1123i121Q102J9269j7084j9259J9378J4200k1807o008K3887k576k7890O610K5143
1136A2844j0532j7643K0130J5503k4788j2373K4237L389k3534O091K6097j1445
1148G976k3513J4321J5517k0411j0141K6298O136k6425r44K2158q787k1982J6209
1161c588K1560j6636j4756J9065N530k3635N60K6268k184k0691R157J5224j8720
1174b846j6331J9633J1173j8791l077K1593k467k2363N371J9337q805j3477J5605
1187D555R958j9265p484J7811J823j7594O220J8696r328j8882R223J2594j2815
$$ y = [-8378, -4293, 14358, 6381, -12257, -2442, 10893, -4541, -13180, 7874, 14664, -6595, -8926, 9963, 3352, -17093, -5114, 14964, 390, -13913, 3999, 11879, -11298, -13944, 12548, 12623, -9121, -1019, 18250, 1166, -18093, 1285, 15485, -6322, -12330, 11557, 8981, -18909, -12299, 12844, 2312, -15331, 4799, 20302, -4486, -16859, 7378, 10767, -12767, -6676, 19421, 7976, -15537, -1216, 14301, -6110, -16251, 10047, 16183, -10242, -11186, 10972, 2185, -19797, -3588, 17972, 1336, -13420, 5645, 11175, -12460, -11900, 14368, 12184, -8507, 650, 15874, -2846, -19177, 456, 11629, -7162, -10239, 11354, 8887, -13476, -8105, 11232, 2427, -11050, 4555, 14513, -4752, -12236, 5575, 7398, -10196, -3976, 14720, 5392, -13490, -4267, 8327, -4488]
1200d488o777J9397O516j7805l952J3152m761j4434R787J5736r437j1134J1999
1213C799N532j7074l827J7640K274j5953J746J4000o099j3643R678J3264r067
1226B270p450J1779K466j6470j646J5735j236j3641O841J2909j2195j5472J1088
1239e022J1057j1630l763J7588M015j6430j028J4806m716j2894R889J1553j4266
1252h41j0885J4243N249j7448m81J9482k149j9537M745J6105r518j1957J5285
1265B293J1834j4253n359J5443k163j8529N036J7746q539j4340J2984J0921j8500
1278e426r838J8129M780j7574J408J7691n139j5513J0241J3924j1807p452J5438
1291H862K618j9537j034J7432m650j5801R784J4573j2702j2103J3215O766j4500
$$ y = [-4488, -11265, 8132, 14648, -3157, -7109, 6043, 1282, -13152, -3365, 12371, 2934, -8200, 3799, 9331, -7743, -11570, 6070, 8344, -7609, -5863, 8137, 2038, -11605, -1927, 11337, 2270, -5180, 6599, 9065, -7405, -9051, 6684, 5448, -8193, -1352, 11557, -638, -16110, -5022, 6035, -5595, -9358, 8230, 12245, -4185, -5213, 9593, 4877, -8017, 1872, 13425, -841, -11726, 2517, 7766, -9682, -10163, 9319, 7170, -12367, -7622, 8483, -1035, -12992, 2293, 14127, -126, -5485, 9958, 7795, -10734, -5698, 12048, 3509, -10831, 2153, 13074, -5426, -15264, 2865, 7645, -9929, -8521, 9170, 4031, -11482, -1241, 12683, 876, -6576, 8862, 11480, -8057, -9091, 8341, 3691, -12110, -2326, 12247, -455, -12558, 657, 7423, -7077]
1304g077j305J7056j534j3916O299J1664j1716r592J3328O175j5282k848J4747
1317E999j618j4604N459J3657o743r817R650N901j1666k843J2686J5j1085M387
1331f22R831q574j0381R649O091j0258l347J1278R10j0585J810R508l971o962
1345e623P143N352p649l032Q507J23q400J824P871m326p785M441M993o453l871
1360f885P371K495o252N47O074j437n136L906M881m238l178M986J059o291p73
1375b871N377p74n085J325L903k636l644L436K697l064o60M115L18l899M81L684
1391B703j925l235K412K757k766j870L317J214k964q57K780q15l260O79K290j566
1407a106j330K600J843k507q41K338R0k799J055K835q97j850J511J775k527j797
$$ y = [-7077, -8382, 8674, 7140, -6776, -477, 11187, -529, -10121, 3207, 9382, -5900, -8748, 5999, 4381, -10223, -4764, 8893, 2150, -7667, 1983, 7884, -3782, -6625, 6061, 6076, -5009, -622, 9209, 635, -9746, -97, 5994, -4264, -7611, 3667, 4577, -6008, -4198, 5310, 1339, -5623, 1520, 6872, -777, -3809, 4698, 4821, -3579, -1755, 6116, 1790, -5995, -1554, 3439, -3014, -6885, 486, 2981, -3271, -2724, 3350, 1913, -3223, 683, 5564, 1326, -1852, 3134, 4193, -2098, -2871, 2506, 1732, -3353, -2028, 1875, -761, -4405, -969, 1728, -1336, -1996, 2119, 2437, -1462, -981, 2703, 778, -2457, -45, 2712, -54, -1924, 1393, 2607, -357, -1214, 1566, 751, -2509, -1830, 460, -1106, -2436, 164, 2007, -500, -1341, 997, 1087, -1712, -657, 2178, 1281, -569, 942, 2717, 190, -1607]
1423a607J597J84k358M88K831l62j711J475K108k269k246J619Q71k817k74L215
1439G44J80j847J501K406k083j926J742N77k226n24L030J79k861P13J965k146
1455e76k257J703J422k038K3L235L05k136N55J818k189k430J616J269j725M05
1471a000L117P21j967L89J483k270k402Q61N05j587n12K464M37j403L82J672j059
1488a69j160J679J447o08J3J443K20k274j146K82j236j706Q98J494K8K64J870
1505A339P36j268n63K96q20j228M7R59M60J22Q37O37l64p68r5l03p86l83P51N20
1525A26m03q2P47l57n60k00R05K40k13P84J152m13j412l75n03j495j533P71J143
1544a678L0J249K025J384p23P7Q79j379k231K2N90j616j325J562P85j830j8J583
$$ y = [-1607, -10, 174, -2184, -1696, 1135, 773, -938, 537, 2645, 376, -1870, -251, 620, -2197, -2471, 744, 924, -923, 578, 2984, 901, -1025, 717, 1294, -932, -1456, 1574, 1753, -1108, -395, 1570, -576, -2833, -1130, 292, -1746, -1723, 1512, 1817, -319, 236, 2054, -135, -2565, -949, 320, -1405, -1000, 2117, 2838, 871, 1260, 2743, 473, -1929, -1068, -563, -2150, -2662, -198, 239, -1164, -782, 890, -169, -1329, 350, 1797, 1189, 1202, 2645, 2865, 591, -555, -273, -1509, -3215, -2317, -823, -795, -531, 1339, 2075, 807, 244, 540, -280, -1508, -1461, -502, -42, 80, 917, 1554, 1190, 422, 327, 24, -762, -1145, -394, 126, -277, -359, 388, 31, -529, -729, 176, 416, 203, 987, 2139, 1726, 314, -61, -564, -2059, -3592, -2821, -1678, -1648, -399, 1626, 3010, 2287, 2364, 3243, 1864, -367, -345, 245, -1371, -2696, -1134, -349, -2179, -2197, -614]
1562f14j32j456J246K913l91j011K037Q35k691j384K124k86k787M11K810j056
1578E68k193J372J684k804k189K058R52l114O87M450M90j796J785L636k507l009
1594G0K127Q85m353j644L541l86m085M09L862j902l056L590L659k725j137M418
1610C273R80m487l28L994j507n200J659L530k989k938M354K710m368j070M994
1625B607o10n454J418M830k382l611M189L444m680k355M948N24n628K17N854k455
1641H56n461L430M426m578k834N891K236n971q1O600j396o218L096N142m860n254
1657d976N113K783o900j278P097N55o554K673O429l499n268M885M351n866k902
1672c357O768Q13q004R37O902k745o529M166N331o051m411O851K866p042k58P996
$$ y = [-614, -746, -2202, -956, 1957, 1566, 555, 2592, 3427, 736, -648, 1476, 1190, -1597, -1186, 1624, 568, -1625, -253, 1431, -1373, -3562, -1504, -552, -3666, -2979, 1471, 1961, 165, 1950, 5586, 3079, 70, 2197, 3082, -1271, -2915, 626, 240, -3845, -3436, 426, -1476, -4532, -942, 2717, -8, -1145, 3273, 4253, -234, -562, 3432, 1925, -3275, -1616, 1914, -1075, -4013, 341, 3051, -1317, -2387, 2607, 1997, -3457, -2039, 2791, 409, -3202, 987, 4431, -249, -2604, 2344, 2868, -2760, -2543, 3311, 856, -4605, -1175, 3251, -1327, -4161, 1730, 3966, -2005, -2086, 4514, 3118, -3100, -4, 5138, 278, -4976, 137, 2920, -3980, -5258, 1839, 2394, -4160, -1487, 4942, 1443, -3825, 1060, 5411, -455, -3357, 3411, 4224, -3780, -2843, 4059, 1314, -5215, -1049, 4282, -1769, -6180, 671, 3537, -3505, -3763, 4233]
1688D233j336p440L470O754m720n127O689L591p835k439P351j03q180J675P507
1703D090l837o211N613M859o756l215Q134J549p717L75Q058k468p345M582O402
1718F113n382m997O765K825q476j492Q089j027p620K875O995n097n838O431M954
1733E118o810k334P958L29p838J091P382k990o722M753N338o409l908O828K313
1748D099p901J50P707j759p602L716O201n414m225O378L669o900j315O821m72
1763C153p586K577O570m127n741N013L691o072k303P627J218o571P82O826k965
1778B092o327M476M589n890l996O269J485o979m0P265j484n653L577N727m481
1793F30m274O016K373o166r44O462j021o720K008N365l911m691N181L185n793
$$ y = [4233, 2897, -4543, -1073, 5681, 961, -4166, 2523, 6114, -1721, -4160, 3191, 3088, -5092, -3417, 4090, 253, -5958, -345, 4514, -2242, -5457, 2677, 4226, -3491, -3116, 4942, 2474, -4871, -289, 6113, 731, -4266, 2499, 5324, -3152, -4644, 3445, 2418, -5202, -2327, 4668, -429, -6267, 164, 5118, -1692, -4026, 3932, 4261, -3577, -2486, 4896, 1906, -4816, -63, 5275, -1134, -5042, 1786, 4099, -3802, -3652, 4055, 2296, -5306, -1590, 4611, -803, -5028, 1350, 5019, -1881, -3196, 3625, 3153, -4433, -1856, 4714, 587, -5154, -141, 3550, -2522, -4825, 2802, 4020, -2551, -1769, 5057, 2092, -4235, 241, 4830, -1060, -5056, 1213, 2698, -4281, -4321, 2944, 1460, -4193, -616, 5111, 630, -3644, 2372, 4745, -1421, -2365, 4097, 3076, -3644, -1636, 3729, -182, -4873, 308, 3493, -2300]
1808b300k177N795O14n721J776O289k290n067M034M045m956k254N263J051o290
1823b188n52N038k129n355L039M571l884k811N182K299m958m03N637l96n230J855
1839b85M756l750m251L719K984m873j496N223J29n453Q92M756j815l898L330L125
1855C093l572k648M602J296m333J28M622j296m668J631L776l248k746L836K033
1870B506l851j104M596J39m067J438L652k221l380K581J835l568j893L780N73
1885A016l629Q28L857j289k867K431K949k584k064L174M44l744j29L422r51k987
1901b123J307K509k285j875K593J049k612n31L177l20k504J239K567j704j366
1916h79K282J226k887r26K263j4k903N37K449j829j840J986J410j982j11K737
$$ y = [-2300, -4477, 1318, 1932, -3789, -2013, 4276, 1986, -3081, 953, 4998, 42, -2212, 3051, 4102, -2188, -2740, 2298, 169, -5186, -2147, 2424, -1460, -4271, 911, 3210, -1748, -2151, 3486, 3090, -2140, -285, 4471, 721, -3530, 189, 3173, -1700, -3196, 2027, 2156, -3297, -2405, 2351, 536, -3362, -32, 3093, -479, -3127, 1475, 2771, -1562, -1434, 3188, 1892, -2776, -1145, 2631, -617, -3363, 473, 2506, -1345, -2449, 2147, 2286, -1781, -343, 3309, 1088, -2292, 289, 2124, -1444, -3337, 443, 1016, -2613, -1785, 2072, 783, -2084, 347, 3296, 712, -1352, 1822, 2266, -1478, -1607, 1815, 864, -2123, -816, 1693, -592, -2467, 126, 1175, -1437, -1968, 1209, 889, -1615, -376, 2191, 487, -879, 1403, 2629, -258, -1184, 1079, 1065, -1838, -1301, 1148, -681, -2521, -535, 875, -1107, -1218, 1519]
1932A519L4k244N86J949j388k166J879J084j987p32K232j47j690P79K100j107
1948G01j570J242R19j976q51J809K77k125N60J699n16j274J177J116j366m82J613
1965I53J09j692K32J562q58j229R48J029j239l52J141L07j609K75P69m59j366
1982a479O80R63q40l97J758J85o42Q2J074m41j260O31P8p24o22P72O9o48QQ11
2002E8k28k53K06P74n52k47P13j65o31l37J023l13o33M69N39j57k42N19L01p57
2022H7j31L12k69n90K6L72J32n47J62O37n92j39M78J10j91l34P28P6k73L66M06
2043H26m22k77K39K84n27l77M22q6m69m04N23j85l15j13O51p2J44M11M59j57l0
2064E25J67J49k56l14L26k99p49K77j33J7n25K84J03k20J3M52K25k90O07M33J40
$$ y = [1519, 1553, -691, -105, 1844, 456, -1710, 169, 1253, -734, -1466, 766, 619, -1071, -292, 1808, 701, -869, 373, 1292, -684, -1535, 274, 551, -1574, -1014, 685, 169, -1105, 72, 1188, -178, -660, 953, 1062, -630, -398, 1164, 306, -923, 25, 1054, -185, -537, 604, 911, -698, -423, 346, -113, -1479, -799, 164, -676, -1073, 685, 870, 228, 310, 1384, 943, -317, 314, 392, -332, -954, -182, -113, -761, -753, 58, -170, -423, -217, 557, 5, -242, 471, 306, -325, -662, 361, 48, -585, -116, 423, 266, 24, 543, 844, 87, -44, 268, -1, -591, -565, -193, -61, -608, -446, 191, -401, -540, -62, 48, -143, -477, 251, 327, 54, 420, 826, 404, 127, 366, 650, 123, -254, 168, 82, -387, -791, -268, -453, -768, -881, -230, -302, -158, 253, 712, 555, 525, 692, 841, 585, 271, 597, 298, -451, -174, -307, -290, -815, -531, -428, -648, -635, -183, 42, -248, 359, 792, 932]
2085I32o09K07J5j57n45j70M63n83k53M63j26N5j60N25j58K06n5M26k04m35L00
2106A37L09o82pJ31J25j66k45N23k46o9J25O01m01l97K41M61k69l9K20K51p30
2127a27j4M09P6r84oP22m76q87O11P22n88n7J116L25j77n6Q01l40j172M69O5o76
2149b44r48O41O26j249k79J629n1r00N90J134n30o90J086N47j189r5R33j22j514
2168f25Q8J071l84j124R92J007j147j122J424j2j451l2J681r3q03P34J082p09
2186E77j006J300O22j572p37J042N1j617L19J676m51j252J086J064j447p85J916
2203G86P03j623j16J221l63j819N24J022q46j109K053J134j620j98J710k82j935
2220g58J34J883j311j825J341J235j307o96J963P51j874m05J644p15j632J152
$$ y = [932, 323, 530, 545, 388, -157, -327, 136, -447, -700, -237, -363, -308, -468, 57, -101, 105, 50, 476, 272, -163, 137, 446, -236, -243, -112, 13, -153, -398, 125, -121, -190, -65, 536, 135, -262, -21, 440, 171, 132, 352, 603, -127, -141, 268, 344, -640, -646, 76, -400, -1287, -676, 46, -542, -599, 517, 842, 665, 609, 1410, 1070, -102, 367, 432, -244, -1192, -551, 75, -1174, -1453, 176, 125, -775, -185, 949, 419, -271, 815, 1362, 173, 78, 1011, 889, -625, -537, 534, 150, -974, 18, 1025, -122, -1244, 180, 168, -1283, -1315, 366, 273, -530, 204, 1286, 577, -429, 871, 1493, -79, -816, 226, 277, -1340, -1021, 655, 204, -1048, 38, 1102, -345, -1130, 786, 1489, -134, -250, 971, 608, -1211, -687, 335, -511, -1620, 433, 1567, -53, -251, 1459, 1177, -758, -624, 1259, -52, -1877, -536, 699, -608, -1304, 659, 1410, -464, -869, 775, 60, -1572, -420]
2236d20J995j384j240J764Q46k377l46K233k64j673Q64J604j284j986J668Q64
2252H64j978o66K174L19k004N07K525p17k226J681J812k483j671K354O75k409
2268a243J10L101p07k526J219J641k275j363K363J161k471l86K568k34k991J025
2284a008K542j310j962K495J258k226j146L134J25k732J76K099j582k378K118
2299c97J549j780p73K635J55k794mK583q75k216J811K264j923j339J963R32k640
2316h49m45K824m46k302Q85J528j501j467K003J157k090o95K235k24k400J008
2332g79K501p41j845J418Q54j932j038K150M83j945K86J912n85k015J034J391
2348A149j114j079J541P70j711p76J689j72j353O12J573r86j399J027Q92r91l01
$$ y = [-420, 1575, 191, -1049, 715, 1561, -816, -1162, 1071, 807, -866, -2, 1602, 318, -1668, 0, 864, -1114, -1780, 394, 713, -1291, -784, 1741, 1024, -1202, 479, 2291, -192, -1863, 491, 1166, -1243, -1133, 1968, 1261, -1265, -46, 1595, -680, -2043, 320, 1481, -990, -1376, 1192, 958, -2033, -1008, 1534, 224, -1738, 757, 2015, -211, -1357, 1777, 1902, -830, -654, 1445, -137, -2515, -397, 1152, -628, -1401, 1234, 1389, -1405, -1409, 1174, 299, -1917, -106, 2158, 235, -1104, 859, 1791, -849, -1294, 1530, 1084, -1218, -333, 1195, -306, -1773, 230, 1387, -703, -1398, 837, 613, -1787, -779, 1722, 981, -864, 554, 1408, -524, -1562, 588, 1071, -874, -588, 1324, 739, -1276, -242, 1149, 35, -1044, 497, 1267, -444, -1220, 469, 297, -1056, -444, 1129, 143, -1256, -229, 663, -328, -629]
2365f29J658M11j575m46J275n24j184Q00J118q64j013J219J74j437l10J633j74
2382A32r19N48J108m93j220J018J118j066m48P29K37j463j34J119j58j069P72
2399a89Q56j136p97R25R38j090j15J516P2j590K34J372q03j178J112R60j388l20
2417f21J221m50j137L75J475p33j146J050N59r97p80J483P64j543L47J151o13
2434D05j579Q13J254o77j062J424P2j228K5J168N5j491P69P56o36j114J118M49
2452E21j281r8J037O2j241M88J222p93l94P56O26r99K32O63k26j313N49R91q51
2471d9o17O71L46j155KJ109j15q18M76O42p14m78R98M86p44k21Q60l58o00J40
2491a39N29k44k50L60r0m52j50L11M5n56L62M07m01m8L79J37m04L27M14k31l25
$$ y = [-629, 1029, 1440, -135, -581, 694, 170, -1014, -214, 904, 40, -973, 246, 420, -1017, -1327, 306, 132, -787, -239, 869, 376, -844, 174, 1292, 226, -222, 507, 744, -719, -853, 266, 108, -961, -189, 667, -469, -1266, -341, 597, -493, -608, 908, 980, -610, -376, 996, 193, -985, 127, 1087, -301, -621, 600, 150, -987, -612, 863, 130, -1016, 34, 593, -404, -1184, 299, 1063, -480, -133, 1018, 405, -1174, -361, 893, 216, -846, 578, 650, -578, -553, 615, 670, -821, -52, 704, 68, -1046, 72, 521, -760, -858, 179, 241, -1000, -512, 710, -83, -477, 279, 905, -94, 138, 801, 575, -738, -189, 802, -49, -666, 5, 351, -804, -802, 307, 192, -626, -150, 492, -222, -700, 298, 784, 40, -181, 679, 321, -279, -139, 390, 146, -104, 256, 166, -286, -436, -125, -80, -636, -274, 133, -268, -316, 63, 200, -204, 123, 537, 306, -19]
2512a9Q7M77o30j33L93j32k25J88L19j55n42J36L31l51J02J85p3m46M33J38N2
2533A35K3j17L59R2k21K10j22l51R7j3p7k48J25J04k99p4M32k12l1K43Q0q2j7
2556C6J76j99m7pj03K38J86j72q4K03k03K64k02k31J29l2k82r4L23j74J98J5J63
2579A01p9K00r0l3LJ55l6l20J28M06m89n2J87j10j79O1M51k83qJ02Q0j93j38k3
2603a59j39q3O1J30J08J38J51O3J03j06R1j36j99J26j35k57P5K42q0j25rK09k96
2626b27j8j36N39j64j90K45M08l53J09J3l39M3m1N56l01J12j43Q6l66k76K84j60
2648c19k1K54j12M51k66K32J55l61O9K9p3j10k7L68k33J34j16J1l62M20m6p7J43
2671A43n5q4P9l17K83j75P1m57J80O0NL79k18L78q0J7r6k5J09k78J11J32j9l67
$$ y = [-19, 68, 545, -85, -218, 175, 43, -182, 6, 325, 170, -372, -236, 95, -256, -154, 31, -42, -488, -55, 83, 135, 158, 41, 400, 492, 271, 481, 359, 8, 105, 92, 15, -233, -108, -4, -303, -377, 55, -157, -188, 55, 135, 53, 36, 212, 13, -34, -41, -144, 94, 280, 108, 24, 227, 24, 288, 86, -145, -16, -48, -330, -424, -101, -275, -77, -62, 101, 22, 222, 132, 99, 102, 257, 221, -99, 29, 435, -54, -106, 81, -29, -208, -147, 304, 21, 13, 115, 195, 2, -136, -159, -298, -381, -320, -190, -82, 56, 207, 270, 373, 267, 358, 222, 23, 149, 14, -243, -168, 74, -6, -131, -140, 69, -227, -245, -381, 158, -6, -196, 49, 457, 104, 213, 226, -113, -70, -111, 445, 144, 256, 113, 199, -167, -443, -159, -319, -340, -86, -198, 253, -13, 219, 374, 13, 82, 111, 38, -72, -99, 269, 36, 170, 54, 65, -297, 123, 77, 0, 143, 88, 4, 83, -234, 49, -126, -55, -512, -332, -272, -267, 112, -106, 272, 192, 209, 113, 88, 197, -81, 30, 162, 143, -224]
2695b24J48l2pq4L01l11M7j33K69j7o9K51K62k01k59j13R7M7K97K3j30Qk70L29
2719B29k49l58R3K20j82k28P09j75l0N4K18k85k43J77oq7r4M52Lj42k51J15R7
2742C7l67K51R4J8rK15M8l58p9J10M7l54k1K45K74n50P05k1l72K8J62J03m59P7
2766a76M26k85k24K4M64j98m01J66L51o61L83M74l03l4K7L81n69L1O9K50o3m7
2788H5L98k13l98ML23k7k89J63K24l98m53K74N81m68L4N22j37p80M40N30l38m36
2810c59P06K35o96j67M69j53l77J41M56K7o85J05N02m50l46Q31J3l60j07N26l01
2831A0l89R4O72j6o46N12J04l05m50Q47k33k04p1M86n51j56l0L72n43K79L16l6
2853F2k64M2K9Q7R0R5L69n21n0L46j86j21l1L99k01k85l3N97n70k33K81K95k04
$$ y = [-224, -76, -108, -115, -199, 102, -209, -162, -295, -26, -43, -112, 139, 401, 200, -59, -172, -75, -28, 269, 292, 162, 170, -100, 229, -20, -378, -285, -65, -247, -475, 234, 59, 29, 83, 301, 16, -227, -50, -56, -143, -237, 215, 218, 76, -175, -60, 37, -330, -79, 15, 33, 24, 239, 287, -71, -150, -40, 7, -347, -368, -123, 151, -399, 306, 285, -87, -59, 103, 206, -253, -176, 250, -35, -259, -235, 229, 31, -370, -204, 147, -514, -131, 343, 40, 6, 33, 414, -155, -124, -55, 195, 132, 85, 483, 270, -128, -124, 199, 172, -117, 46, 270, -128, -581, -307, 274, -194, -160, 362, 225, -555, -115, 415, 77, -359, 347, 582, -114, -281, 188, 35, -342, -201, 255, 282, -403, -298, 204, -246, -592, 239, 252, -108, -215, 311, 10, -379, -285, 387, 371, -275, 237, 341, 36, -414, 433, 200, -4, -75, 411, -140, -296, -326, 46, -497, -218, 98, 62, -202, -160, -131, -44, 46, 141, 510, -11, -61, 285, 99, -22, -53, 346, 145, -140, -173, 424, -146, -379, -98, 197, -7]
2876gk56L02J59m53J31M67p7l05j71N11m39M6J44pr9j54L31q1l61L8K99J13k18
2899h7J53J9k93n0L38N9l36P6O40j99m26J14J49J9l34L96o2m3m15Q3K80j93j38
2922b50N70j05n05K02J04j76j89L76M39k24j15k3K88l78o1O24m37k77L38k02k94
2943b95j36M49J58l65p8M59j19k68Q4J09K12J28l19K57j45j12j14O9o5N3J64l23
2965a97K24j00J28l2l30L14P4k39j2M13l01j37n5L86r2j0J53k78k41K57J17j46
2987a04K59j04J92o8l59J36J97K9k67J35M6k72J46R3k69j07L34k7j52k8M07r0
3009A27j26J31k8O8l47M7K58l06j13N7Q1p4n0r3L86j3j6Oq5M00j90J19m40L24
3033A23n0K8M1j02o7Q6j9l28J20J73o8l0m5J7K60l23P3K69j06l1J46k2q9j57L62
$$ y = [-7, -263, 39, 198, -255, -124, 343, 266, -39, -210, 301, -138, -92, 52, 45, -54, -208, 123, 42, -319, -281, 18, 131, -87, 66, 85, -208, -258, 80, 139, -197, -121, 519, 320, -106, 8, 157, 176, -158, 238, 176, 133, -282, -199, 81, -112, -250, 320, 215, -290, -88, 16, -160, -349, 27, 466, 242, 127, 104, 392, 14, -47, 577, 140, -137, 201, -1, -295, -431, 18, 176, -189, -267, 192, 73, -195, -111, -2, 210, 338, 19, 276, 131, 19, -95, -26, -91, -38, 126, -197, 27, -73, 55, 23, -307, 7, 81, -158, -170, 243, -58, -195, -250, 136, 44, 34, 187, -91, -332, -75, 42, -104, 155, 51, 243, 175, -184, -48, 149, 178, -89, 46, 92, -180, -34, 59, -210, -317, 17, -10, -162, -190, 217, 127, 1, 132, 104, 172, -175, -128, 130, -176, -289, -232, -151, -225, -275, -368, 18, 5, -11, -5, -90, 310, 120, 239, -201, 123, 73, 101, 142, 40, -27, 59, 40, -288, -168, 5, -63, -93, -138, -121, 139, -184, -111, 158, 52, 21, 167, 145, 56, -101, 261]
3058B61k69OK15k00m0m7m9K02l12L42m0k25P6o0p3J07k06K54M3j0L12j03l95K95
3082H4O5Q4o5l0j52r4J91j48K1j01k4N2J08K63n38J92J80k05P5K8k48K28l9R5
3106B2j87K46Kl38K21M9J75n8k88M2k70N74j62l6j19J67m0p0k2R2RJ52j53OJ17
3131A31j40J30Ko8J1j21J34k3J37jj10k76J01j62J52j75N05k39J20k82j14N45
3153B57l76M0O3L35j81q9J44j41O1k30P5M7l8m0m5q0O2k0J09j85J4K83k67M06
3177B04J06k21j90K20j28J83j23K29J6n03K89j75kO4M3k8q9o2l5J59n8N4K28j55
3201B6r0J74J3p2K2Q1j02l8J92k1k05J06j01R5k47J43J10N3m81K75J32m7k51L29
3225I6j66j15N0o6J12j16K05j75K65K32N2j06j56p8K09l65K79j90J30N5j58k4
$$ y = [261, -8, -2, 213, 13, -27, -74, -123, 79, -233, 109, 69, -156, -80, -140, -213, -106, -312, -58, -15, -25, 287, 184, -211, 84, 149, 233, 168, 138, -14, -108, 83, -65, -44, -145, -169, -117, -9, 254, -284, -92, 88, -117, -42, -14, -262, -34, -73, 22, -165, 81, 83, -255, -34, 15, 190, 132, -156, -114, -384, 190, 28, -8, -127, 40, 0, -70, -92, 0, 9, 161, 8, 14, 131, -9, 121, 123, 55, 66, -55, 79, 56, 193, 192, 82, -194, -93, -255, -103, -278, 227, -12, 108, -174, -288, 257, -119, -79, -16, 319, 138, 49, 193, 52, 113, -117, -42, 5, -33, -73, -118, -198, -136, -156, -47, -232, -218, 65, -202, 204, 310, 89, -101, 119, -9, 174, 51, 280, 296, -207, 82, -93, -95, -31, 12, -16, -105, -167, -202, -43, -101, -47, 181, 26, -64, 110, 123, 51, 73, 154, 52, 14, 206, 185, -20, 86, -15, 80, -167, -24, 86, 139, -342, -67, 65, 18, -233, 96, -70, -185, -135, -201, -89, -205, 0, -175, 90, 322, 374, 268, 112, 34, 243, -122, 157, -33, 97, 152, -6, -30]
3247c0q6O3j49L50j75PM5OK25n3o3j08nN6l9p6oK28l03j42R2J50j60Qm2M41m29
3274a95K01L26k51k21K38m5J6j89M11k75k05J9K33M1P8j81K71j54l38L26r9n2
3296d5j23J45Q8j43l4L6m9q0J39L4J24q5L22o5l89J11J40O7j55J85J05m23j50
3319b45L72Nl04J9K77J19n37j7K02J67q1J59J35k59l1J09M61q43K35L00l35o7
3341a59mJ70j2k05K88j7j68j9K00K17n47K81M56m06N4Ko2k67K59q0K64n43K25
3364g3M79m06k93K33M82m85k68J60K58j29k20O48k01k79K22K1k32k37N07j69j69
3385a51J8J59K98q13L32L24j82j68K44K14m45k27O13k45l09K18M22P7q42M71K17
3406B25k69n6L06J30o16PM70Lk60j48L04q5j23RL93l71o9L65np2k26L47j22m48
$$ y = [-30, -116, -53, -202, 148, -27, -20, 25, 31, 256, 203, 140, 32, 27, 83, 44, -32, -38, 190, -113, -255, -163, -13, -173, -165, -207, 234, -195, 6, 332, 81, -140, 98, 53, 69, -120, 291, 16, -189, -170, 63, 104, 182, 1, 272, 118, -220, 106, 7, -45, -168, -23, 65, -78, -112, -76, -125, -205, -66, -32, 92, 7, 329, 264, -125, -14, 126, 193, 38, 223, 328, -95, -245, 127, 132, -172, -153, 124, 243, -294, -311, -109, 58, -23, 136, 271, 12, -19, 90, 551, -292, -57, 243, -92, -159, -163, 7, -5, -210, 78, 61, -107, -126, 74, 291, -256, 25, 481, 75, 129, 131, 69, -198, 61, -19, 245, -298, -73, 406, 0, -293, -60, 422, -63, -331, -171, 87, -42, -262, 386, 185, -94, 128, 149, -83, -320, 187, 18, -151, -133, 26, 324, -489, -157, 167, -15, -183, 61, 275, -170, -397, 216, -29, -338, -120, 302, 379, -463, 8, 225, -44, -100, 206, 336, -280, -273, 197, 200, -60, -208, 96, 11, -112, -103, 290, -81, -150, 215, 210, 138, -88, 259, 137, -311]
3430c11L39K05k48k23N63p6p48K33M23j86k07L18L94n24k71L59J83k17j99L74
3450A81o4k64L10O2r7j98J83K01k95l7K2j41l25K00M52J13p03L97R3l52R7k0M85
3473C00m47l5N81k25n64J74P58m03q2O9K10o66R1L34J20n49J39Q16m74p28L40
3494b41M31j62j29K12K87p24J3N59n4m18J75N98l95m76N05p4m74J67N71l13n02
3515d44K32M14m05k54K15O83p67L06K72j03k72k38P49j92j90NK13l53j85J12N02
3536C00l92J9K78j9n22k9N72l73j00N87J32q22J88L80l8l43P3L23k09j46L1K28
3558A18k48j45L37L80n43j0L24j44j36p1N38m06j28J3j7j44n1N12k77k9J26K24
3580B23k40l17L16J65p9j6J63j45j78J53j62K21j65J48j88N7k17K32J56r7q2L06
$$ y = [-311, 28, 233, -15, -238, 325, 249, -499, -266, 157, -29, -236, 82, 476, -48, -319, 40, 223, 6, -193, 181, 117, -147, 163, 225, 128, -70, 113, 314, 19, -18, 4, -137, -462, -262, 190, 303, -400, -3, 90, -262, -165, -185, 300, -147, -182, 399, 174, -390, -216, 542, 139, 57, 126, 336, -330, -239, 95, 215, -334, -195, 621, 147, -581, -241, 190, 28, -101, 111, 398, -326, -313, 246, 192, -226, -51, 547, 152, -324, 181, 107, -367, -200, 371, 58, -444, -212, 202, -203, -457, -242, 441, -326, -20, 252, 149, -123, -361, 388, 196, 6, 11, 224, -129, -314, -202, 300, -92, -73, 205, 186, -336, -365, 207, -166, -266, 321, 453, -369, -181, 199, 161, -182, -109, 214, 5, -141, -110, 118, -130, -275, 62, 442, -101, -111, 213, 69, -67, -138, 400, -6, -134, -121, -138, -282, -333, 179, -98, -127, -1, 223, -17, -334, -18, 147, 68, 52, 215, 70, -108, 45, -117, 104, -61, 87, -101, -44, -261, -29, 127, 30, -52, 254]
3602B54j53J6r0J73o1m06L08J08o9l92Q4m1K07k1kL2K31j58J01k08k4J29O2Q8
3626A68j00N5j27j72q0L16J96m81J63J62j91j28O13qn14jJ67K1n7k4J33o9j10
3649f8L20k16n7k24J57K71k47j14M25l45j0N8L2j26K20j64J86l21R5K13k0r1l5
3672f1K32j82j79J54J27j91J30QOn7J26L0k98O2J01n5j91j22L43L1j15j14M71
3695B56k74j01K21o0k20K24j48K93j03q3j00J25k55j82K66Q0j35K01J40J17j28
3716A34p5n1j52K35p1p2P4J57j84j20N8o1j27K97PJ5M6l00J40J18Q9P1k79J75
3740A24M5j41j77J63j12k88K30L79l46J25Q4l4j47K00J38l35K45j09O1p0k11J54
3762b2L1j18O7oj64P9O3Q0r1k27L23K54k0j24O0j33N8JJ03j90l5J50l26L53m14
$$ y = [254, 101, 117, 27, 200, 139, -267, 41, 149, 80, -312, -228, -269, -62, -83, -85, -53, 178, 20, 121, -87, -111, 18, 80, 168, 68, 123, -4, -176, -256, 60, 256, -225, -62, 100, -91, -219, 394, 386, -128, -129, 38, 59, 2, -22, 111, 42, -68, 252, 36, -21, -245, -88, 183, -64, -178, 247, -98, -108, -50, -18, -144, 76, -88, 98, -223, -128, 85, 65, -26, -61, 171, -11, -190, -36, 91, -100, 30, 38, 44, -13, 113, 143, -155, -93, 8, -47, -238, -360, -17, 14, -101, -215, 256, -18, -119, 102, 42, -178, 46, -102, 191, 88, 5, -95, 30, -225, -407, -141, -61, -196, 5, 145, 262, 134, 59, 8, -144, 91, 20, -52, 22, 179, -5, -125, -67, -128, -255, 42, 49, 64, 110, -190, -50, 68, 157, 228, -51, 124, 169, 28, -149, 14, -98, -386, -156, 223, -123, 2, 86, 52, -95, 105, 243, -92, 153, 44, 105, 35, -176, -22, 9, -109, -42, -48, -212, -133, -70, 10, -81, -308, 15, 269, 249, 125, 185, 52, 110, 111, 214, 24, -11, 139, -187, 166, -248]
3787b48L71J04m22L68j73Ok61M52j24k66J13J39K50n69M19L2k51L8R2j18j27L25
3809A50l4R0m10J36N35m74m7j10P8o6P8K56m27N3K75J52k58k33K19K04j71j03
3831a07L60j9l30k03M28k38J13l6p1J09k76N18j76k37P4Q6J04l06L74J5m05N5
3853a68L61K7l28RJ59Kj89k5K10p8n2K64l4p0o5J53O3l67o2N23n46KJ02L89k76
3878Dn3n3M9p9j89M53J4k84O4J23j72q3K88K57n06L3K64k34j63M62L4q0m23J24
3902a50N26o73L53J09r9m04L17L98n54n5L32Q8l06k64N27q6n19L50OK02l32K13
3924b1J42K02l56J49J07n29J8L29R4l34L34R9l67m13M45K61k54o1K64L21o12O3
3946a19M08m98j20M09L02o22OK93N9k45J12L12k53o70O63J1j26k62N18K12p04
$$ y = [-248, 123, 227, -195, 173, 0, 6, -255, 197, 73, -193, -80, 59, 309, -260, 159, 191, -60, -22, 70, -48, -175, 150, 116, 206, -204, -68, 467, -7, -54, -164, -86, -152, -74, 182, -245, -192, 83, 235, -23, -256, -37, 167, -4, -107, 253, 234, -96, -299, 129, -109, 4, -32, -103, 6, -270, 248, 72, -165, -91, -5, 99, -207, 167, 182, -223, -168, 193, 220, -108, -99, 60, 62, -127, -152, 58, -20, -72, 192, 158, 88, 23, 176, 239, -128, -190, 333, -213, -211, -109, 280, 4, -49, -102, -53, -132, -321, 132, 146, -138, -74, 49, -123, -206, 82, 339, -167, -134, 130, -104, -267, 195, 229, 149, -274, -150, 376, -297, 56, 165, 66, -338, -21, 377, -177, -232, 100, 188, -118, -382, 145, 59, -460, -110, -104, 98, -234, -21, 121, 323, -33, 116, 223, -306, -288, 41, 135, -199, 135, 234, -133, -546, -101, 160, -94, -155, 109, 430, -182, -119, 289, -209, -329, 80, 382, -240, -234, 59, 118, -127, -15, 297, 44, -626, 37, 48, -78, -340, 178, 390, -314]
3967c14J52N75k32o12K87L27o6k84K34K31m02j01K88N79r23J60M07j42o36K70
3987b02K70M0k94K7M36n69j96O27j30j80M01Q8j51o20K47M76m28m7M12L9n69k11
4009e34O59l79j96L67N58n98q7K08K01l76K91M27j97l18j92J98K0l63L68M2k46
4030a47p6N45k99n02K13O11o7k38J58L22o31l06K37L90k65j68N93k36o01K84J67
4051a6l17J79L43J71l75l16N55Ml25M51K61o60l87M84J19k08k86M10k7l52K02
4072i0N43m58m41N05K79k21j07L06Q0p95L64K91j28l5J18J13n18k37N21P3n50
4093c87K65O41k62o94K69M26k93m44Q49O8l88k90K11K08m10K25o1J64n00K20K38
4114E5l09M1K73L22m20L4J52J7l17J23L93l84l09L66J42k88m97O33J54l17m3M97
$$ y = [-314, -162, 413, 181, -431, -144, 183, 117, -167, 67, 298, -104, -205, 83, 662, -261, -101, 306, 164, -472, -202, 68, 108, -186, -159, 277, -292, -488, 139, 9, -171, 230, 318, 167, -453, -206, 270, -158, -205, 207, 246, -323, -534, 125, -254, -450, -83, 475, -123, -210, -2, 199, -177, 114, 541, 344, 26, -166, 32, 52, -311, 57, 99, -147, -223, 322, 23, -479, -266, 345, 278, 40, 198, 520, -111, -417, -180, 210, -55, -223, 370, 134, -467, -183, -16, -333, -154, 189, 360, -15, -331, 224, 228, -97, 354, 615, -45, -432, 52, 171, -37, -323, 87, 60, -292, -90, 453, -5, -446, 59, 338, 117, 10, 316, 396, -399, -35, 256, 128, 93, 211, 324, -194, -431, 90, 163, -387, -122, 519, 257, -437, -168, 258, -35, -479, 370, 438, 50, -240, -29, 179, -231, -6, -67, 97, -403, -183, 55, -254, -213, 60, 382, -38, -4, 148, 165, -152, -29, 364, -20, -329, 37, 179, -109, -606, 27, 181, -136, -179, 318]
4136C18l74l23K79L27j83k07L72j30j02k38K11J05O4k46K12k17k41K91J86j10
4156fr4O7K45l23j31N30l23k79J67K78o6m8j13P0j91k2M54n0l16O0L32l05kK32
4180A66m0jj21K52l40q1p1M44k57j98N49k66p7n12M91L68m14K34lJ09l79K75l6
4203I2M9k17K4K50k90L7P5O8j54q0m5n0M7K3K56j30o6M09j70k76K23R4p5k68M40
4228B66Pk50k15L68m11O7n8K08k5J9j07P4J44j64m7L39j70r7K30j17P7R6n10J41
4252a35M49k13k39n1P9J52L2j07l3j37Q3O0L33j10l1o4j5o7K2K24j0j76j06q3
4276a43M9K09j51p1j10J77K6q4K3l7Qk5K62Q9j64q6J77j99j41J41p8j07K39R2
4300I6J06k65K01r9k01J72K07p5j7l10P1P4j4Q1J78k38J12q6J77j72p1J01o0o2
$$ y = [318, -56, -379, -100, 227, 44, -163, 209, 79, -23, -261, -50, 55, 119, -127, 85, -132, -373, -82, 104, -6, -100, -33, 212, -111, -242, 288, -35, -314, -147, 131, 65, 17, -96, -26, -217, -239, 215, 165, -151, -91, 241, -64, -66, 166, 126, 125, 4, 256, -84, -165, -236, 208, -49, -247, 302, 36, -41, -553, -62, 306, -108, 126, 123, 232, -147, 128, 92, 141, -76, -52, 198, -92, -55, 20, 88, -66, -146, -191, -241, -194, -171, 85, -45, -111, 298, 128, -148, 75, 169, 94, -174, 266, 273, 23, -192, 176, -235, -168, -226, -18, -43, -24, -131, -57, 87, -77, -124, 215, 45, -52, 178, 61, 138, 234, -276, -135, 314, 101, -138, -189, -110, 42, 74, -33, -66, -203, -120, -60, 273, 163, 132, 68, 53, -14, 8, 232, 222, 46, -60, -143, -94, 115, -36, -107, -217, -40, -14, -98, -75, -112, -104, -129, 133, 222, 58, -28, 149, -50, -191, -50, -128, -235, 4, 96, 202, -63, 138, 39, -162, 10, 217, 142, 125, -185, -114, -40, -54, 27, 205, -33, 79, -7, 170, -2, -73, 28, -32, -94]
4324i4k7PK91o0l3Q8j66j7K59k87J69k97J58k76M8K87Pj88P3k3K99j30J82k72
4348bj45K32J5k65J17r6J95Nj37k0K53k19J92J12k69O1j77L51k5k01Q4K9M6p6
4372F0j0J31j55k69L25J81l07j35J10n5L1j03L71rk81L85j05m34L02Mr5Q8j41
4395a11R0o9r3O8J61j81K3O3J16k36K10K62m92n8K78N3q6j61K67k64M9j41K66
4418A4k8O3J17k45J20r0P6J17j19k38L23l1n80M57J01l66J69N6j12l8J90O7J8
4441D1L10j79K5n8l26L53K10l94l85L67R5l90L8M28p1k69K07J83M5n77M59J71
4463B83n91L66O2J90o45L52K23m31j60M32J90o18K26L45j29n23K9P21l65k00L42
4484I9Qj64r3M20k1l72P8K53k32j63N2K28L7j18K41m9m04O7L31j52k66J75J22
$$ y = [-94, -121, -114, 177, 117, 84, 172, 6, -11, 248, -39, 130, -167, -9, -285, -237, 50, 57, -131, -58, -81, 218, 88, 270, -2, -147, 85, 100, -165, -48, -144, 51, 56, -81, -101, 152, -67, 125, 237, -32, 29, -148, 203, 178, -23, 61, 90, 136, 60, 50, 181, 26, -243, 82, 263, -44, -179, -69, -124, -93, -196, 175, 166, -115, 270, 165, -269, 33, 37, -58, 30, -111, -21, -90, -183, -115, 46, -135, -112, -49, 67, -169, 41, 303, -189, -247, 31, 84, -2, -163, 104, -160, -111, -252, 14, -14, 49, 166, -79, 41, -49, 27, 144, 25, -213, 110, 79, -501, -44, 57, -309, -140, -84, -196, -234, -44, 23, 41, 351, 172, 197, 139, -187, 166, 376, -18, -403, -36, 59, -331, -293, 135, 64, -205, 2, 185, 230, -347, 112, 283, -308, 58, 120, 310, -335, 17, 240, -191, -351, 81, 271, -347, -121, 224, 95, -428, -399, 322, -43, -243, 99, 107, -57, -150, 270, 249, -123, -45, 208, -24, -187, -135, 93, 130, 12, 253, 204, -200, -133, 198, 46, -220, -45, 77]
4507G7j41l56M81J49k80r2K82J22m26L56J03o14RN74J87n56j92L22M3l20J67J55
4529E0j7m28L11M05o17m50Q48jl19rL26r9m05M71N3j12N9K79j31l81M7K20k18
4552a18j10K33K91l85j39J37L49m72J4N60l2m82q4M24k53k26L93L51n78k60M89
4573A02j8m00J23L72R7n26L05J38j98k24J34N50o82l2L44J72p62K83N83k16j28
4594A7J68L61n22l16L16K82n90L47M82m97l02J2L86j48j98J36L76l52M8Q6rk59
4616a76J01K63r7k99L62J73o32J87K36J16m45J64J58k13l65M83J81k03q9J53K70
4637C28o41J11K40K57j38j40J33j13k45j2L95l13L9L25j61l36K59K73j55l14M30
4658B22j17l02j39K97J91j38l2J49R5l12J29L14k79j74K37K00n35O0J77J91m05
$$ y = [77, -64, -420, 61, 210, -70, -162, 120, 242, -184, 172, 275, -339, -330, 244, 431, -125, -317, 5, 48, -272, -105, 50, 33, -395, -84, 321, -296, -746, 102, 101, -218, -227, 99, 0, -405, 66, 119, 7, 66, 345, 214, -167, -120, 100, -118, -228, 5, 296, -89, -228, -91, 258, -214, -200, 360, 328, -154, -238, 186, -67, -293, 100, 451, -127, -387, 102, 84, -316, -193, 179, 276, -250, 55, 193, -5, -229, -95, 455, -227, -259, 85, 257, -505, -222, 361, 145, 17, 185, 546, 24, -292, 24, 306, -284, 63, 545, 48, -254, -242, 144, -4, -202, -66, 310, -42, 6, 92, 83, -176, -75, 188, 91, -208, 154, 327, -305, -118, 118, 234, -211, -47, 111, -102, -467, 16, 197, -6, -95, 58, 328, -313, -202, 38, 295, 157, 17, 150, 37, -208, -220, 175, -138, -99, 226, 65, -271, -12, 261, 106, -208, 222, 105, -197, -336, -39, 152, 14, -18, 131, 226, -86, 43, 357, 78, -96, 141, 341, -194, -134, 43, 234, -171]
4679a71J62J73J5m35M31j0k61K3m2R5j27j42O40k21k99L02J6r4k48L02q2k70p8
4702c21L83j02p2M1M26l98j24L90J55m02K5K67J24m36r6J90K3n1R9j16l0j03J61
4725C3K51m04O0O74n75On0J18j77k22L44K14m46J71K15k25m4N5J19K7l33J95L2
4748C8j91l9L37j37J1L3K87l16q1m1K14j19j3Pj1K22l22L14M8k4r8l9l76J80O0
4773e6p6n3k4K30j56j16K60J56J4l79L13O6Mp2Q5J2m32L8M5k4J03K64j92M7j55
4798i8K5J77j89r2J11k1J36j58N9R5J9K18k35j2j72J47O2k43l4M1K48k11j7j20
4822b64K34j34K90M1m55J74K75r6rj56J32j52N9k00L45p2j1n6NK45p1j61k3O5
4846EJ29j00j67K2O5M8J49l99J33L18k72j59K17N1o8Q1k07K69J0nj18O2L9n8n2
$$ y = [-171, -9, 164, 179, -256, 175, 165, -96, -73, -115, -20, -147, -289, 351, 130, -169, 133, 149, 55, -193, 109, 27, -243, -321, 62, -40, -112, -71, 355, -43, -167, 223, 378, -24, 1, 268, 392, -44, -140, 50, 73, 22, 121, 5, -25, -128, 33, 284, -120, -60, 614, 39, 45, -5, 113, -64, -286, 58, 272, -174, -3, 212, -13, -57, -2, 117, 144, -189, 6, 38, -153, -192, 145, 8, 19, 52, 339, 23, -58, -99, 115, -4, -17, -10, -21, 201, -121, 193, 241, 217, 119, 80, -296, -116, -56, -132, -185, -209, 21, -135, -251, 9, 165, 179, -200, 113, 179, 183, 111, 196, 208, -224, -186, -141, -165, -62, 202, 10, 57, -98, -73, 104, -85, -177, -66, -87, 49, -109, -50, 45, 64, 282, 47, 35, -137, 10, 72, -171, -205, -164, 84, -127, -144, -264, -30, -164, 126, 167, -288, -114, 161, 65, 56, -100, 32, -120, -61, -261, 84, 12, 1, -55, -50, 195, 124, -37, -60, 5, 134, 34, -133, -111, -46, 2, 151, -248, -115, 203, -69, -228, -11, 40, -28, 53, -154, 115, 125, 120, 2, 64, 103, 45, -7]
4871gm8o7L43m06l2J16j39K27l75N60j00j68O8J57j34j06J31jR4p2l1j73N07m57
4895a13K5L01l03r6R1J85o2k80L19j22K35k1k21k3j21M20n0k07KK62j65K1J03
4918A80j67M8j47K72j75J21j54J66k3j54K22k62mJ7l6q6M10j90Q2Ok55J75j78
4941a32L59j80j6J4j75J4K60k81K08l67L19l12M0L0r7J45n1L21k47K5L21k18q3
4964a03R5M7L0j42R0j32J26m1k6n6n2K18L6j85RL6Q9j6j74j14O10m07k34L21J26
4989A51j86j12O2K78j57l4j5J93n4j58oJ2KJ5J46j55k7K02j9k62J29L08l96P4
5013iR2j4j25k6j16L12l72R2K91j49O8k16M00m15P9P7N5k79K30K80o7p9k25K17
5037A01k27K39k06L01l35j79K43J37l64L79R3p6Nk52N66n89R1J40o8M9j61K37
$$ y = [-7, -55, -122, 221, -185, -217, -101, -240, -13, -388, 172, 72, -96, -28, 129, -5, -111, 20, 19, 113, 41, 10, -163, 344, -113, -88, 213, -90, -186, -95, 90, 28, -252, 67, -55, 180, 159, -62, -85, -206, 214, 164, -43, -41, 221, 56, 77, 180, 13, 61, -86, 186, 11, 132, -22, 144, 121, -33, 189, -73, -77, -60, -96, -182, 228, 38, 120, 126, -129, 46, -132, 227, 47, 31, 45, -130, -116, 144, -137, 71, -296, 23, -289, -249, -219, -316, -171, -222, 99, -148, -123, 198, -20, -103, -8, 39, 69, -73, 17, -115, 11, -30, -56, -112, -164, 54, 90, -95, -86, -50, 39, 23, -151, -265, 345, -62, -296, 25, 151, -35, -147, -85, 193, 36, 2, -13, 180, 126, -32, -38, -26, -24, -9, 137, -18, -45, 157, 138, -124, 5, 313, -83, -9, 83, 69, -56, -82, -198, 114, -258, -166, 125, -24, 44, -172, 228, -187, -108, -31, 24, -255, -25, 255, 188, 109, -116, 101, -126, 113, -93, 208, -127, -306, -63, 74, -290, 89, 182, 106, 111, -141, 425, -164, -73, 67, -1, 48, -113, 124]
5059A24l23j25M09k1o5k63N91j41j77k46J35J63l58K62N3J58k65K19L9m62K24
5080f9k3K81m13L28k31j8l4j18K70l52P0J73K46m24J57M25l92Rj46M31j47j30
5102a07J05J04m05J85K22J91m31J01M15l57j49J5J28k53J34K31l3k68J95J67n2
5123A38l37J50M84p57J53J67J42l58K48P5P5k25K15L61o54l8LM43m04n1M14k03
5145D1k65J95K33k27k67K99J49j64k61J71L32o15J26N78l36m40O98J10m05M3O1
5166E6l7k65j19M94k00q5L20k74j88j23L62K02nl81O72k02m29J30L17l76k79M68
5188E8R2k40m5K26j23k10K52Q9p0j89J13J1j63M8j60L09Lr6K95j12j34j25L45
5211A74j54n80N08K18r0k19J19M9j88R0K40O0l63J56J38m01K14L8J75l07j81P35
$$ y = [124, -199, -324, 85, 64, -1, -264, 327, 186, 9, -237, -102, 61, -297, -35, 18, 176, -89, 130, 169, -293, -69, -92, 189, -224, 104, -127, -145, -179, -297, -27, -379, -309, -136, 110, -314, -157, 268, -124, -115, -261, 170, 23, -107, -2, 102, -303, -118, 104, 295, -136, -35, 380, 23, -126, -111, 17, -236, -102, 129, 96, -172, 23, 190, 138, -199, -49, 435, -322, -169, -2, 140, -218, 30, 105, 180, -45, 170, 531, -123, -161, -158, 285, -119, -170, 244, 41, -224, -29, 204, -23, -290, 9, 158, -6, -267, -96, 236, -379, -253, 325, -11, -451, 247, 357, -48, -5, 56, 19, -246, -365, 129, -71, -156, 164, -110, -298, -421, -59, 143, 138, -243, 429, 227, -202, -72, 245, -131, -410, 58, 150, -90, -135, 91, -32, -242, 10, 99, 29, -160, -47, -36, -199, -151, -311, -2, 1, -95, 200, 88, -46, -171, 174, 20, -560, -52, 166, 76, -143, -24, 25, -163, -73, 167, 227, -136, 20, 158, -243, -29, 9, 184, -123, -304, 431]
5233D31m99J26o2K05j05k72J37J46j10l1L5j02M1O5J64l18J26J6K50k96o0J38
5255B5Rj52J13q7K69j91J6R5p9k8k89L59j97J23J34j71j04R6K06j44k84K84j74
5278a71q2K22J19n0j50M0K67j17l51J26J99J86j87j61K60p1j87K02J2j53j35M06
$$ y = [431, -68, 58, -4, 201, 96, -176, -39, 107, -3, -34, 1, -101, -60, 5, 169, -149, -23, -7, 243, -53, -113, 25, 34, -118, -5, -92, 177, -14, 2, 97, 18, -10, -299, 60, -137, -14, 120, -51, -155, -59, 147, 3, -281, 3, -171, -253, -31, 88, 38, -112, -72, 195, 78, -273, -147, 52, 238, 51, -110, 150, 79, -108, 94, 106, -47, -182, 224]
$$ [...]
8191C75
##END NTUPLES=NMR FID
##END=
