##TITLE=1H_IBDPBFO102
 CDCl3, 8 sc, 
 5.2.2019
##JCAMPDX= 6.0         $$ Bruker NMR JCAMP-DX V2.0
##DATA TYPE= NMR FID
##DATA CLASS= NTUPLES
##ORIGIN= UXNMR, Bruker Analytische Messtechnik GmbH
##OWNER= root
$$ XWIN-NMR		Version 3.5
$$ Tue Feb  5 16:01:51 2019 Russian Standard Time (UT+4h)  she@DPX200
##.OBSERVE FREQUENCY= 200.1313
##.OBSERVE NUCLEUS= ^1H
##.DELAY= (6, 6)
##.ACQUISITION MODE= SIMULTANEOUS
##.ACQUISITION SCHEME= undefined
##.AVERAGES= 8
##.DIGITISER RES= 18
##SPECTROMETER/DATA SYSTEM= spect
##.PULSE SEQUENCE= zg30
##.SOLVENT NAME= CDCl3
##.SHIFT REFERENCE= (INTERNAL, CDCl3, 0, 15.7039)
##AUDIT TRAIL= $$ (NUMBER, WHEN, WHO, WHERE, WHAT)
$$ ##TITLE= Audit trail, XWIN-NMR		Version 3.5
$$ ##JCAMPDX= 5.01
$$ ##ORIGIN= Bruker BioSpin GmbH
$$ ##OWNER= she
$$ F:/spectra/data/she/nmr/H-F/1/audita.txt
$$ ##AUDIT TRAIL=  $$ (NUMBER, WHEN, WHO, WHERE, WHAT)
(   1,<2019-02-05 16:00:37.50 +0400>,<she>,<DPX200>,
      <created by zg, POWCHK disabled, PULCHK disabled
       configuration hash MD5:
       00 E9 B6 7A A2 85 ED C7 34 08 36 98 17 FE 4E 26
       data hash MD5: 16K
       EF A1 83 96 2F CE 46 1B F4 41 4F C8 7F FB 62 61>)
$$ ##END=
$$ 
$$ hash MD5
$$ B9 D8 BF 11 DC C6 07 EC D6 EC 63 07 4B C0 52 93
##$RELAX= 
##$RELAX= 
##$RELAX= 
##$RELAX= 
##$RELAX= 
##$RELAX= 
$$ Bruker specific parameters
$$ --------------------------
##$DU= <F:/spectra>
##$EXPNO= 1
##$NAME= <H-F>
##$PROCNO= 1
##$TYPE= <nmr>
##$USER= <she>
##$AMP= (0..31)
100 100 100 100 100 100 100 100 100 100 100 100 100 100 100 100 100 100 
100 100 100 100 100 100 100 100 100 100 100 100 100 100 
##$AQSEQ= 0
##$AQ_mod= 1
##$AUNM= <au_zg>
##$AUTOPOS= <>
##$BF1= 200.13
##$BF2= 200.13
##$BF3= 200.13
##$BF4= 200.13
##$BF5= 200.13
##$BF6= 200.13
##$BF7= 200.13
##$BF8= 200.13
##$BYTORDA= 1
##$CFDGTYP= 0
##$CFRGTYP= 5
##$CHEMSTR= <none>
##$CNST= (0..31)
1 1 145 1 1 1 1 1 1 1 1 1 1 1 1 1 1 1 1 1 1 1 1 1 1 1 1 1 1 1 1 1 
##$CPDPRG= <>
##$CPDPRG1= <>
##$CPDPRG2= <>
##$CPDPRG3= <>
##$CPDPRG4= <mlev>
##$CPDPRG5= <mlev>
##$CPDPRG6= <mlev>
##$CPDPRG7= <mlev>
##$CPDPRG8= <mlev>
##$CPDPRGB= <>
##$CPDPRGT= <>
##$D= (0..31)
0 1.2 0 0 0 0 0 0 0 0 0 0.03 0 0 0 0 0 0 0 0 0 0 0 0 0 0 0 0 0 0 0 0 
##$DATE= 1549368036
##$DBL= (0..7)
120 120 120 120 120 120 120 120 
##$DBP= (0..7)
150 150 150 150 150 150 150 150 
##$DBP07= 0
##$DBPNAM0= <>
##$DBPNAM1= <>
##$DBPNAM2= <>
##$DBPNAM3= <>
##$DBPNAM4= <>
##$DBPNAM5= <>
##$DBPNAM6= <>
##$DBPNAM7= <>
##$DBPOAL= (0..7)
0.5 0.5 0.5 0.5 0.5 0.5 0.5 0.5 
##$DBPOFFS= (0..7)
0 0 0 0 0 0 0 0 
##$DE= 6
##$DECBNUC= <off>
##$DECIM= 32
##$DECNUC= <off>
##$DECSTAT= 4
##$DIGMOD= 1
##$DIGTYP= 9
##$DL= (0..7)
0 120 120 120 120 120 120 120 
##$DP= (0..7)
150 150 150 150 150 150 150 150 
##$DP07= 0
##$DPNAME0= <>
##$DPNAME1= <>
##$DPNAME2= <>
##$DPNAME3= <>
##$DPNAME4= <>
##$DPNAME5= <>
##$DPNAME6= <>
##$DPNAME7= <>
##$DPOAL= (0..7)
0.5 0.5 0.5 0.5 0.5 0.5 0.5 0.5 
##$DPOFFS= (0..7)
0 0 0 0 0 0 0 0 
##$DQDMODE= 0
##$DR= 18
##$DS= 0
##$DSLIST= <SSSSSSSSSSSSSSS>
##$DSPFIRM= 0
$$ [...]
##$SUBNAM2= <"">
##$SUBNAM3= <"">
##$SUBNAM4= <"">
##$SUBNAM5= <"">
##$SUBNAM6= <"">
##$SUBNAM7= <"">
##$SUBNAM8= <"">
##$SUBNAM9= <"">
##$SW= 20.0189088683792
##$SWIBOX= (0..15)
0 0 2 0 0 0 0 0 0 0 0 0 0 0 0 0 
##$SW_h= 4006.41025641026
##$TD= 16384
##$TD0= 1
##$TE= 0
##$TE2= 300
##$TE3= 300
##$TEG= 300
##$TL= (0..7)
0 120 120 120 120 120 120 120 
##$TP= (0..7)
150 150 150 150 150 150 150 150 
##$TP07= 0
##$TPNAME0= <>
##$TPNAME1= <>
##$TPNAME2= <>
##$TPNAME3= <>
##$TPNAME4= <>
##$TPNAME5= <>
##$TPNAME6= <>
##$TPNAME7= <>
##$TPOAL= (0..7)
0.5 0.5 0.5 0.5 0.5 0.5 0.5 0.5 
##$TPOFFS= (0..7)
0 0 0 0 0 0 0 0 
##$TUNHIN= 0
##$TUNHOUT= 0
##$TUNXOUT= 0
##$USERA1= <user>
##$USERA2= <user>
##$USERA3= <user>
##$USERA4= <user>
##$USERA5= <user>
##$V9= 5
##$VALIST= <valist>
##$VCLIST= <CCCCCCCCCCCCCCC>
##$VD= 0
##$VDLIST= <DDDDDDDDDDDDDDD>
##$VPLIST= <PPPPPPPPPPPPPPP>
##$VTLIST= <TTTTTTTTTTTTTTT>
##$WBST= 1024
##$WBSW= 4
##$XGAIN= (0..3)
0 0 0 0 
##$XL= 0
##$YL= 0
##$YMAX_a= 24447
##$YMIN_a= -23383
##$ZGOPTNS= <>
##$ZL1= 120
##$ZL2= 120
##$ZL3= 120
##$ZL4= 120
##$ABSF1= 10
##$ABSF2= 0
##$ABSG= 5
##$ABSL= 3
##$ALPHA= 0
##$AQORDER= 0
##$ASSFAC= 0
##$ASSFACI= 0
##$ASSFACX= 0
##$ASSWID= 0
##$AUNMP= <proc_1d>
##$AZFE= 0.1
##$AZFW= 0.1
##$BCFW= 1
##$BC_mod= 2
##$BYTORDP= 1
##$COROFFS= 0
##$CY= 11.3945322036743
##$DATMOD= 1
##$DC= 2
##$DFILT= <>
##$DTYPP= 0
##$F1P= 18.9103706918063
##$F2P= -1.10871071338519
##$FCOR= 0.5
##$FTSIZE= 0
##$FT_mod= 4
##$GAMMA= 1
##$GB= 0.15
##$INTBC= 1
##$INTSCL= 1
##$ISEN= 128
##$LB= 0.24
##$LEV0= 0
##$LPBIN= 0
##$MAXI= 10000
##$MC2= 0
##$MEAN= 0
##$ME_mod= 0
##$MI= 1.114404
##$NCOEF= 0
##$NC_proc= 0
##$NLEV= 6
##$NOISF1= 3.799351
##$NOISF2= 2.8
##$NSP= 1
##$NTH_PI= 0
##$NZP= 0
##$OFFSET= 15.70392
##$PC= 1
##$PHC0= -9119.824
##$PHC1= 13.00004
##$PH_mod= 1
##$PKNL= yes
##$PPARMOD= 0
##$PSCAL= 0
##$PSIGN= 0
##$REVERSE= no
##$SF= 200.130013532006
##$SI= 16384
##$SIGF1= 3
##$SIGF2= 2
##$SINO= 400
##$SIOLD= 16384
##$SREGLST= <1H.CDCl3>
##$SSB= 0
##$STSI= 0
##$STSR= 0
##$SW_p= 3612.71676300578
##$SYMM= 0
##$S_DEV= 0
##$TDeff= 0
##$TDoff= 0
##$TI= <>
##$TILT= no
##$TM1= 0
##$TM2= 0
##$TOPLEV= 0
##$USERP1= <user>
##$USERP2= <user>
##$USERP3= <user>
##$USERP4= <user>
##$USERP5= <user>
##$WDW= 1
##$XDIM= 8192
##$YMAX_p= 0
##$YMIN_p= 0
$$ End of Bruker specific parameters
$$ ---------------------------------
##NTUPLES= NMR FID
##VAR_NAME=  TIME,          FID/REAL,        FID/IMAG
##SYMBOL=    X,             R,               I
##VAR_TYPE=  INDEPENDENT,   DEPENDENT,       DEPENDENT
##VAR_FORM=  AFFN,          ASDF,            ASDF
##VAR_DIM=   8192,          8192,            8192
##UNITS=     SECONDS,       ARBITRARY UNITS, ARBITRARY UNITS
##FACTOR=    0.0002496,     1,               1
##FIRST=     0,             0,               0
##LAST=      2.0444736,     0,               0
##MIN=       0,             -23383,          0
##MAX=       2.0444736,     24447,           0
$$ Real data points
##PAGE= N=1
##DATA TABLE= (X++(R..R)), XYDATA
0 0 0 0 0 0 0 0 0 0 0 0 0 0 0 0 0 0 0 0 0 0 0 0 0 0 0 0 0 -8 8 -8 8 -8 8 -8 8 -10 16 -16 16 -16 23 -24 24 -27 32 -32
46 -32 39 -40 47 -49 56 -61 66 -74 82 -90 101 -113 128 -145 162 -188 222 -262 325 -416 568 -874
68 -874 1705 -8716 -23383 5831 18807 2774 3464 24447 18397 -2033 170 6053 -10215 -16220
82 -16220 652 1861 -16690 -13353 4888 -94 -13084 -623 13908 4522 -3484 5880 6411 -4662
96 -4662 -1112 10650 6236 -900 6886 9889 -3002 -7450 2075 1565 -8435 -6779 -684 -7205 -13819
111 -13819 -7066 -1251 -3825 -932 7668 8276 5246 9084 11132 5131 2784 5463 116 -9622 -9025
126 -9025 -3879 -6765 -9196 -2239 2965 -158 -424 4752 4992 2013 4902 8092 3017 -2257 -44 1085
142 1085 -4041 -5958 -1271 721 -2582 -3259 -454 -448 -2233 -337 2331 405 -2496 -1075 759 -1409
158 -1409 -2528 1888 5934 4589 2720 3770 2776 -1327 -2085 45 -1928 -5027 -2026 1187 -3309 -6693
174 -6693 -514 4733 864 -1281 4012 5333 -52 -931 2295 -134 -3420 136 1354 -5283 -6501
189 -6501 1284 2802 -3247 -1284 6274 4425 -1886 112 3322 -667 -2146 2556 1563 -4129 -1882
204 -1882 3283 -587 -4782 792 4641 -822 -3059 1930 1640 -3095 -687 3677 -27 -3163 1363
219 1363 2558 -3056 -2955 2730 1612 -2758 218 3284 -1500 -3752 1759 2822 -2509 -1527 4145 2344
235 2344 -2536 -209 2824 -518 -1965 1669 912 -3405 -1559 2223 -1063 -4226 243 3393 -471
250 -471 -2001 1674 1879 -943 510 2560 -289 -1521 2195 2155 -2827 -2780 1857 1214 -3038 -2232 911
267 911 -116 -1724 -84 704 -443 698 2615 981 -829 1154 2579 276 -1291 -4 237 -1160
283 -1160 -1161 -693 -1581 -1443 491 578 -1192 -463 2067 1956 64 275 1555 964 -316 -382 -363 -959 -892 -331
303 -331 -655 -1190 -649 131 33 -313 -178 216 645 863 568 260 713 1249 776 -47 -4 354 37 -542 -612
324 -612 -481 -660 -777 -537 -347 -540 -594 44 822 785 190 405 1323 1307 39 -767 -234 127 -615 -1434 -1300
345 -1300 -617 -136 -102 -408 -397 455 1343 1103 198 254 1372 1774 619 -666 -518 485 367 -1186 -2125
364 -2125 -1151 260 -77 -1513 -1497 288 1358 339 -852 -112 1443 1512 205 -403 310 925 506 -447
382 -447 -1024 -693 262 420 -741 -1309 66 1323 396 -884 -229 1077 862 -123 -290 131 429 548 79
401 79 -687 -441 485 89 -1218 -1070 19 -153 -929 -445 260 -92 -55 862 869 169 697 1525 774 -159 298
422 298 401 -703 -912 -95 -425 -1239 -451 481 -219 -558 639 966 44 244 867 -185 -1038 147 482
441 482 -1308 -1549 443 637 -1067 -691 1058 804 -124 581 758 -604 -412 1146 346 -1512 -345 1666
459 1666 401 -1436 -190 1353 462 -283 387 47 -986 -304 334 -1165 -1785 427 1550 -482 -1535
476 -1535 371 1584 493 -199 521 798 318 -56 -754 -1437 -662 810 577 -671 -316 1053 881 -448
494 -448 -560 535 1007 439 -297 -771 -858 -439 -94 -339 -466 401 1175 462 -695 -375 735 697 -121 -170
514 -170 70 -416 -879 -628 -461 -428 342 977 329 -274 382 644 -134 23 1011 374 -926 -211 721 -619
534 -619 -1370 573 1338 -693 -1283 405 139 -1442 -209 1475 -217 -1487 691 1280 -1522 -1419 2148
551 2148 2243 -748 -352 1659 -24 -1824 174 1043 -1206 -869 1623 -116 -3283 -941 2385 232
567 232 -1684 1412 2659 -755 -1456 1339 677 -1537 670 2590 -813 -2804 436 1236 -2209 -1893
583 -1893 1853 1237 -1584 -308 1258 -904 -1207 1932 1627 -1462 -223 2463 52 -2543 290 2190
599 2190 -784 -1640 1143 475 -2395 -623 2126 -258 -2182 972 2098 -1527 -1875 1920 1819 -1191
615 -1191 -81 2098 -340 -2261 528 1688 -1130 -1122 1737 566 -2671 -1320 1306 -166 -1248 1498
631 1498 2158 -1004 -1468 1216 816 -1452 56 2525 786 -1664 -733 102 -1348 -1188 1080 1104 -647
648 -647 -196 956 -445 -1807 -7 1954 1107 -174 163 292 -651 -850 -155 22 186 987 732 -1059
666 -1059 -1633 -80 767 -295 -632 734 1159 -215 -1003 -341 222 390 836 687 -351 -404 618 196
684 196 -1342 -800 1095 658 -1194 -924 430 52 -504 487 700 -408 -6 1198 20 -1386 389
701 389 1845 -298 -1753 269 971 -1193 -1105 1310 774 -1313 -96 1456 -594 -1702 1059 1875 -946
718 -946 -1107 1436 459 -2146 -419 2031 44 -1529 983 1582 -1621 -1829 1288 949 -1489 -62 1959
735 1959 -321 -2035 506 1385 -1260 -1033 2037 1258 -1730 -709 1503 -89 -1492 558 1253 -901
751 -901 -827 1147 133 -1677 177 1993 -7 -1382 496 1008 -921 -848 794 172 -847 469 908
768 908 -1089 -1197 1113 1011 -1092 -625 1244 579 -829 -120 547 -255 -151 676 -298 -1341 103 1261
786 1261 -279 -1175 562 1285 -364 -1003 105 266 -317 188 549 -383 -469 744 545 -959 -650 994
804 994 759 -699 -553 516 339 -370 -163 138 -153 -192 102 -162 -488 42 624 247 -239 77 363 -104
824 -104 -430 -87 171 -54 -98 230 203 -182 -225 93 84 -246 -180 156 85 -140 64 186 -157 -263 209 247 -343
847 -343 -322 446 563 -100 -210 294 322 -156 -291 -230 -233 6 227 -135 -434 146 592 -17 -560 -51 410 73
869 73 -203 24 82 24 282 177 -454 -437 346 329 -516 -488 370 469 -136 -251 13 -24 -39 100 -117 -358 136
892 136 620 101 -409 27 446 20 -357 -118 21 -53 116 178 -184 -212 326 310 -347 -421 208 341 -137 -216
914 -216 108 140 -47 -34 -71 -222 -94 152 37 -180 12 260 119 -87 -28 12 -78 -48 48 -23 -115 17 149 16
938 16 -139 -110 -20 4 8 -16 -64 25 234 215 -42 -161 72 239 45 -254 -197 105 221 -45 -331 -219 139 201
962 201 -155 -367 -72 367 290 -177 -274 128 372 87 -310 -260 134 316 1 -374 -240 248 331 -147 -414 -52
984 -52 352 147 -287 -228 135 303 147 -110 -173 78 321 84 -328 -225 268 269 -222 -347 27 196 -13 -118
1006 -118 -2 63 98 113 -5 -139 -10 171 51 -172 -100 30 -17 -119 -80 -28 -33 18 86 51 -32 12 86 61 -23 -59
1032 -59 -15 35 74 46 15 -26 -16 5 -21 -141 -165 24 191 39 -232 -130 169 156 -53 -32 180 242 98 -76 -166
1057 -166 -104 91 165 -67 -277 -128 69 -90 -338 -235 195 460 204 -215 -225 168 217 -158 -221 181 404 143
1079 143 -176 -258 -192 66 235 -49 -379 -3 447 -34 -661 -228 518 317 -180 -16 244 51 41 221 -49
1100 -49 -244 304 491 -371 -780 74 476 -333 -613 186 384 -242 -235 267 99 -167 244 372 -261 -338 345
1121 345 321 -329 -188 396 106 -448 -163 200 -94 -207 223 227 -248 -241 77 -29 -142 195 328 41 -2 214
1143 214 -7 -333 -38 338 102 -181 -86 -68 -237 -187 -49 -89 50 394 243 -283 -228 264 197 -194 -49 263
1165 263 67 -184 -84 -126 -284 26 396 32 -398 17 458 -15 -474 -26 433 110 -209 7 86 -105 43
1186 43 232 -106 -338 169 454 -148 -512 83 467 -159 -553 -70 288 32 -13 294 161 -160 43 209 -248
1207 -248 -435 256 554 -177 -527 50 212 -382 -400 263 328 -69 37 238 -150 -361 171 370 -118 -121 360
1228 360 150 -447 -241 278 83 -153 246 362 -218 -416 -12 16 -262 -27 333 131 -79 106 20 -304 -61
1249 -61 400 158 -242 41 310 -97 -379 -75 40 -117 23 125 -233 -265 288 265 -369 -253 472 320 -360
1270 -360 -209 309 95 -161 140 184 -204 -29 416 -21 -597 -87 459 -94 -557 43 437 -53 -232 156
1290 156 89 -238 52 363 -46 -259 322 441 -277 -465 131 201 -283 -221 168 34 -205 5 88 -215 -173 268
1312 268 197 -201 -103 271 141 -161 -16 195 45 -70 30 -8 -187 -100 96 -21 -143 16 139 -15 -97 48
1334 48 104 -16 30 162 66 -85 -7 92 -8 -128 -60 28 -30 -38 8 -24 -86 28 90 -65 -180 24 187 19 -149
1359 -149 0 157 57 -67 -35 -19 -26 72 45 -181 -192 126 190 -162 -212 160 304 -20 -150 53 107 36 29 -20 -147
1384 -147 -38 201 11 -333 -124 277 140 -236 -113 203 118 -70 -20 1 -47 57 109 -160 -256 73 240 -95
1406 -95 -240 90 229 -34 -152 22 33 -53 28 48 -101 -37 166 103 -151 -57 154 57 -126 -4 116 -11 -66
1429 -66 51 36 -92 -45 69 -7 -84 52 104 -14 -13 93 28 -140 -67 69 -50 -169 -41 79 21 -31 8 18 0
1454 0 47 37 -77 -67 107 115 -83 -126 39 76 -61 -135 -34 40 64 63 8 -5 99 143 -7 -161 -70 82 52 -90
1480 -90 -95 35 110 36 -70 -93 -15 74 20 -94 -86 52 108 0 -108 -57 57 67 -42 -73 12 118 95 -15 -99 -32
1506 -32 27 -28 -150 -143 3 77 30 -30 35 113 119 23 -47 -9 50 41 -31 -60 9 37 5 -53 -24 13 28 30 21 17 27 26 -37 -82 -62
1539 -62 -50 -85 -67 9 60 29 43 105 96 10 -39 -10 -10 -43 -66 -57 -56 -7 18 -52 -93 14 124 37 -60 -7 130 96 -24 -51
1569 -51 10 41 36 -23 -63 7 135 102 -56 -89 46 71 -96 -205 -117 12 10 -45 -25 56 125 126 18 -43 37 119 34 -97
1597 -97 -98 -22 -20 -103 -153 -94 6 51 19 -28 41 131 98 -3 1 72 61 -10 -39 -30 -27 -7 43 6 -35 -1 49 -29 -117 -46 38 -4
1629 -4 -32 26 59 5 -4 59 37 -33 4 75 -8 -87 -41 -20 -105 -119 -24 -5 -70 -12 122 80 -33 33 126 61 -35 6 57 -7
1659 -7 -46 -17 -46 -101 -13 64 1 -93 22 130 10 -86 20 113 83 10 43 20 -16 14 -5 -90 -91 56 61 -91 -150 -26
1687 -26 37 -39 -67 8 76 85 52 -12 -38 38 103 6 -93 0 81 -1 -108 -67 13 10 0 -4 -23 -14 59 51 -29 -21 119 107 -18 -19
1719 -19 83 52 -54 -31 8 -45 -71 3 0 -82 -48 59 5 -73 1 101 25 -49 57 76 -65 -99 20 29 -90 -55 73
1746 73 39 -60 -18 50 -25 -34 70 71 -48 -28 71 -4 -116 -33 101 77 -14 24 58 10 -23 -5 -7 -33 26 55 -33 -96 -33 36
1776 36 -2 -36 20 66 43 -10 -56 -49 -19 10 -16 -52 -14 43 6 -47 -32 9 55 45 26 -27 -12 41 5 -76 -63 42 66 3
1806 3 -15 50 53 11 6 30 17 16 37 -9 -72 -46 37 -2 -69 -14 75 52 -20 -16 25 2 -30 -8 7 -23 -25 3 -17 -56 -25 26 1
1839 1 -30 13 49 9 -49 -5 44 -17 -34 39 67 4 -25 14 35 -3 -5 20 3 -16 3 3 -52 -48 43 60 -5 -18 53 71 -4 -30
1871 -30 7 33 11 -19 -33 -53 -38 -6 -23 -64 -23 45 34 -38 -30 26 43 14 3 3 19 36 7 -18 -23 21 28 -16 -44 0 31 20
1903 20 -12 -11 14 36 46 2 6 46 55 10 -21 -3 11 -6 -9 -18 -11 -9 2 -1 -24 -23 -3 3 -16 -16 11 1 -19 -16 -8 -5 -7 -9 10 -21 -14 -2 -5
1942 -5 -12 -4 22 1 -6 21 28 21 1 28 34 19 -8 -9 6 -5 -19 -11 -3 3 -16 -9 -2 11 26 27 2 -10 12 22 -2 -36 -22 3 -12 -37 -19
1979 -19 -6 -2 -6 -25 -26 -11 17 12 -30 -11 31 28 3 -15 14 32 12 0 4 1 13 3 -17 -30 5 22 4 -16 8 26 22 -1 -2 20 11
2014 11 9 -2 -20 -10 4 2 -23 -17 9 -3 -14 -4 -5 8 -11 -21 -13 -15 -10 -1 -1 -3 -8 20 9 10 13 6 9 3 9 18 10 5 18 8 6 10 7 8 5 1 7 1
2058 1 1 11 -2 -12 0 2 0 -10 -10 -3 3 -8 -7 -9 -4 1 -21 -18 -8 7 -2 -8 -5 7 -3 20 -1 -12 4 -3 10 -3 9 13 26 14 4 13 15 12
2098 12 4 0 -1 7 11 0 -14 8 10 9 -1 4 4 1 -10 -10 -23 -18 -8 -17 -12 -8 2 0 -11 -9 0 3 4 1 9 -2 0 -1 -3 -1 10 3 6 13 13 28 10 10 10 6 -10
2145 -10 -4 5 13 7 17 2 15 11 10 9 7 6 -2 -11 -3 -6 -12 -24 -18 -12 -1 -9 -10 4 -1 7 -7 -14 -15 -6 -1 6 -18 1 -8 -3 7 11 12 16 9 6 9 3 9 13 3 14
2193 14 14 6 11 10 9 16 11 12 16 -2 0 -8 -7 -5 0 -8 -8 1 -3 0 -8 2 7 5 -11 -5 -17 -5 -20 -11 6 -1 4 -2 3 11 2 24 6 12 21 13 5 15 12 12 14 11 19 22
2243 22 19 28 15 -1 9 4 -17 -16 -1 1 -4 -7 3 -2 -1 -10 6 -3 -3 1 11 -5 -5 0 -12 -7 -5 4 -8 -1 -10 1 11 14 10 1 8 14 4 5 2 18 32 17
2287 17 26 9 11 5 17 10 2 11 12 7 -2 14 15 5 -18 -1 -3 -14 -1 1 20 -5 -4 4 -9 -11 6 3 -20 -1 22 6 -2 -6 15 10 -6 7 6 1 -4
2328 -4 17 10 6 6 22 6 -5 4 13 14 -1 13 10 2 0 14 -6 -2 11 9 1 -5 8 -22 -17 -8 -1 -1 -15 2 -10 -11 -21 -6 -7 -4 -4 -5 -14 -8 4 8 0 -1
2372 -1 2 3 -5 4 12 7 5 6 9 0 -2 16 5 -8 17 22 4 -4 7 26 -1 -7 1 -1 5 -5 1 -15 -25 -1 -4 -15 -32 0 -9 -15 -12 -7 7 -14 -1 7 -7
2415 -7 -2 4 5 -26 -14 13 12 3 9 25 15 6 6 17 5 8 28 18 12 23 25 -6 -2 9 22 13 -3 11 2 -14 -2 10 -3 -3 1 -5 -16 2 3 -2
2455 -2 3 8 6 -17 -12 2 11 -3 -12 0 14 -2 -8 5 1 6 10 15 0 15 21 22 -3 4 22 13 1 -2 3 13 5 9 -15 -18 20 22 -14 -22 3 23 -3 -20
2497 -20 -13 5 4 -3 -4 -17 -6 -7 -15 -16 -13 -4 0 -10 -18 4 13 -1 -1 -1 11 19 3 -7 1 18 8 -8 -5 3 10 6 0 10 10 13 15 3 7 3 0 -2 -13 -3
2541 -3 -5 0 -8 -19 -9 -11 -12 -13 -8 -4 -12 -16 -13 -12 -16 5 -4 -10 4 14 -1 -1 7 12 4 -9 -3 6 14 -3 -8 9 13 14 -7 -20 10 17 6 -7 -2 19 16 -6 -1
2586 -1 4 9 -3 -18 -7 -3 6 2 -16 -22 0 -13 -8 -19 -14 15 -4 -17 -21 -1 8 -1 -21 -12 1 16 -7 -25 0 7 18 -8 -9 8 13 5 0 2 4 24
2626 24 10 -7 12 8 19 -5 -11 10 17 0 -3 -6 5 -2 0 -12 -8 -11 0 -22 -15 -13 -13 -6 -6 -3 -14 -1 -5 -7 -4 0 -4 0 2 3 -1 9 -6 7 9 8 6 5
2670 5 8 15 8 0 16 -1 8 9 4 5 13 7 -6 -11 4 4 -3 -14 -2 4 -11 -13 -13 0 5 4 -13 -22 -5 8 -9 -19 -17 7 12 -9 2 0 13 5 2 3 10 21
2714 21 14 -2 7 25 32 13 0 -1 12 8 4 2 3 16 16 6 0 6 18 4 -15 -5 2 -7 -15 -3 5 -7 -7 -1 -6 -23 -1 1 -1 -9 9 15 -8 -7 11 0
2756 0 -8 -1 8 4 -4 -10 12 1 -2 14 17 7 21 27 -4 6 9 17 4 -7 18 18 12 -20 -10 4 -1 -6 -10 -7 -24 -7 -3 -27 -18 16 17 -9 -18 -1 16
2797 16 -15 -6 0 -1 -5 0 -11 -16 -2 17 0 -12 16 19 9 4 11 17 16 21 7 -3 18 23 6 -6 -2 3 12 -10 3 10 4 -6 0 -7 -28 -9 -17 -13 -22 6
2839 6 4 -34 -25 -2 17 -18 -14 16 11 -28 -11 7 3 -5 21 19 1 1 28 12 -24 1 29 13 -8 9 14 -1 -12 11 7 10 1 9 5 -21 4 27
2877 27 -13 -24 0 15 -15 -37 -8 8 -13 -9 -18 -9 -11 -1 -9 -13 -12 16 -4 -29 -18 8 23 -2 -14 -6 14 14 5 -6 7 27 25 -12 -2 5
2913 5 22 -15 -11 2 13 12 -6 -7 -7 8 21 10 -19 1 18 -14 -36 -12 0 -1 -11 -1 -5 -30 -8 2 -10 -20 9 8 -29 -34 14 17 -8
2948 -8 -7 24 9 -11 -7 21 5 -1 28 31 5 -1 26 14 -19 16 38 14 -18 16 17 3 -9 9 10 -14 -11 4 -12 -12 9 8 -14 -24 11 6
2984 6 -23 -14 19 11 -9 -15 0 -2 -6 3 4 -4 8 15 -6 -13 6 22 20 -1 9 15 18 21 10 0 21 27 25 -11 0 22 6 -6 -10 9 0 -4 -12 -20 -3
3025 -3 9 0 -9 -2 18 7 -10 -24 4 6 13 -3 -5 2 -12 -2 1 7 3 14 7 -6 -3 16 20 -5 2 15 19 8 10 18 13 -8 5 11 9 6 9 2 10 7 13 -5
3069 -5 4 4 3 0 -12 -9 4 -8 -19 -15 2 -4 -3 -3 -6 7 2 -16 -13 7 9 5 -11 8 9 20 11 0 10 20 18 3 1 10 18 0 -4 2 8 22 13 -7 8
3112 8 5 12 4 8 -1 -4 -5 -6 -18 -3 11 -4 -15 -12 -16 -5 -4 -23 -12 2 1 -11 0 -11 12 1 -3 -4 18 10 -3 -1 0 14 5 18 4 10 11 4 7 12
3154 12 12 7 4 -4 1 -3 -8 -11 -4 -6 5 -11 -13 -4 8 -9 -12 -10 5 1 -16 -14 -9 2 -12 -5 -11 1 -3 1 -10 -9 14 25 -10 -10 5 37 9 -1 -6 13
3196 13 22 16 13 11 16 18 21 -18 -1 19 21 -16 -15 9 19 11 -10 -11 4 13 -13 -14 -3 18 15 -21 -14 -14 9 12 -14 -13 6 11 5 -18 -5 19 -1 -10 8
3237 8 3 6 13 7 -1 22 27 10 4 7 11 14 -6 -3 16 12 9 2 9 -2 14 4 5 3 3 10 -4 -20 4 5 -1 -9 1 -1 -17 2 -9 1 -6 0 -5 4 -4 3 -3 -13
3283 -13 -5 11 0 -1 -12 2 21 13 -2 -1 4 20 13 -21 -11 22 14 -4 -9 10 17 3 10 -1 2 18 18 -22 -28 9 28 -14 -36 -11 5 -6 -24
3320 -24 -12 2 -2 -10 10 -10 0 23 30 -11 -20 22 25 -8 -23 13 25 7 1 8 2 15 17 20 4 10 33 8 -15 -3 31 12 -1 9 32 4
3356 4 -11 4 4 -4 -5 5 -1 -18 -10 -8 -26 -17 -15 6 -10 -4 7 3 -12 -4 4 -3 2 16 2 -2 10 13 -2 5 21 29 1 4 25 19 9 -2 2 -4 1 15
3398 15 0 -16 3 23 0 -29 -6 11 7 -5 -3 7 -3 -8 3 -8 -11 8 24 -10 -30 -5 16 -23 -25 3 20 -7 -20 8 3 -7 25
3431 25 31 9 6 23 14 -24 -9 35 28 -2 -12 27 11 -24 4 8 3 4 10 7 -12 -7 11 -7 -11 6 14 -15 -15 11 8 -11 -4 9 8 -16 -3 7
3469 7 -3 -16 12 2 -19 3 20 -6 0 8 25 19 -3 0 15 6 17 25 12 19 26 7 -14 -10 33 31 -7 0 16 4 -6 -1 0 5 3 36 -11 -42
3507 -42 6 25 -6 -44 6 20 -7 -24 -14 5 -12 9 18 -1 -16 13 8 -16 -14 31 33 -13 -7 17 17 -4 1 18 9 3 7 -3 -13 14 28
3542 28 0 -2 20 29 12 2 21 11 11 3 0 -3 -7 -5 -1 -16 -9 4 -7 -19 -7 1 10 1 7 8 0 -9 4 9 -7 6 7 8 -6 13 24 -8 -9 17 29
3583 29 11 5 17 18 12 17 20 4 2 29 7 0 3 28 -2 -9 -2 11 -2 -34 -20 -1 5 -4 -6 -12 -21 9 19 -2 -24 2 26 -4 -24 -10 6 9
3621 9 -10 0 9 14 24 7 9 0 30 21 -9 -2 10 31 -4 -15 12 6 2 3 -3 -1 7 8 -6 -21 1 14 -11 -18 0 6 -2 -4 -2 -13 -3 -9 -11 -18 -6
3662 -6 5 -6 -17 8 9 4 0 14 14 -3 8 12 1 7 10 8 13 13 26 19 6 11 26 30 -3 -4 21 15 3 -5 -13 1 13 4 -15 -8 5 1 -19 -34 -7
3703 -7 8 -1 -9 -11 3 0 9 -1 -8 18 14 2 -16 -1 12 3 -5 0 5 3 7 -1 -1 24 27 5 -1 9 23 8 5 3 3 2 19 -4 -2 9 1 3 -8 0 -2 -2
3747 -2 -1 -15 -10 -2 8 -13 -4 -8 5 8 -3 8 11 -1 -14 -1 -4 -7 3 -5 4 13 3 9 1 16 15 15 14 20 19 14 6 7 13 4 12 2 3 6 16 4 -5 -1 7 10
3793 10 -5 -9 5 1 -6 -8 -1 -4 9 -11 -9 -17 6 2 -9 -17 14 26 9 -17 -13 12 15 7 2 10 10 17 11 17 9 25 11 -7 3 12 17 -4 -2 5 9 8 2 -5
3837 -5 1 16 11 -13 -14 -1 8 -2 -9 -8 1 -1 -10 -16 -10 -4 5 -7 -6 -2 10 1 -17 7 11 -7 10 14 6 10 2 21 16 8 29 26 6 4 17 4 -22 0 10
3880 10 -4 -14 -7 10 -2 -7 -4 1 2 6 11 -4 -12 0 18 -2 -33 -7 0 -2 -20 -24 12 7 -12 -6 -6 2 18 11 -7 -13 16 19 6 -12 25 26 11 -11
3920 -11 -10 13 7 13 13 -12 10 10 -8 -15 -4 23 8 -3 -13 6 -2 -7 -26 -7 -8 19 3 -25 -24 2 11 -7 -2 -4 2 -1 -5 -3 -11 -10 0 0 -20 2
3960 2 21 2 -17 6 22 3 -13 12 20 1 -6 13 14 -13 4 15 -13 -10 18 8 -8 -23 -3 -1 -31 -21 6 -2 -31 -22 4 -2 -15 -6 2 -5
3996 -5 -7 4 -3 -27 -2 8 10 -22 0 14 -6 -24 0 15 8 8 13 -6 -6 15 13 -3 -8 21 22 -8 -14 -7 12 2 0 -1 -9 8 3 -14 -20 5 3 -2
4036 -2 -16 -18 -4 -2 -6 -24 2 -5 -6 0 -19 -14 20 8 -24 -8 19 18 -11 18 19 20 0 16 19 -5 0 22 9 -16 16 27 -5 -11 4 13 2 8
4074 8 10 12 -8 -16 11 -4 -9 -2 9 -21 -19 -15 1 -32 -14 9 -6 -27 -19 2 3 -21 -12 8 10 4 5 -13 -9 17 12 0 -9 10 28 1 -9 -1 10
4113 10 5 -4 -5 21 15 8 -2 -18 -7 10 -8 -18 -9 -2 3 -7 -13 -4 -1 -2 -10 -12 -11 7 2 -23 -13 -2 1 -7 -16 9 4 3 -3 2 -12 0 8 13 -9 5 20
4156 20 13 -10 2 20 15 2 6 16 11 -9 13 8 7 -2 -8 -13 -8 2 -2 -8 -10 5 3 -14 -11 4 -2 -8 -2 -5 4 -6 -3 2 -9 -1 8 0 -2 -3 13 -5 -3 -1 8
4201 8 21 3 0 -2 16 16 13 -5 8 33 17 -7 -2 7 4 -6 -8 -6 -7 15 5 -19 -14 3 -8 -14 -12 -7 0 -4 -24 -12 -2 -4 3 -25 -6 -6 8 1 0
4242 0 -1 13 0 -6 2 14 0 0 7 12 22 4 3 5 2 8 22 -1 3 9 9 3 3 2 19 9 8 -4 10 6 4 -6 -6 8 -3 -2 -7 2 -15 2 -15 -15 -2
4285 -2 1 -14 -11 1 6 3 -2 2 11 -2 9 -3 11 6 19 -8 -12 19 19 9 -16 4 4 14 4 -8 -1 19 9 -3 -6 -2 6 6 4 -13 5 12 -4 -3
4325 -3 -6 -5 5 -1 -8 -16 0 10 -7 -10 -3 5 3 2 -2 15 10 11 11 4 8 24 11 6 8 8 15 -6 -5 16 9 14 1 -1 -4 1 -6 10 7 -1 -6 -4 -2 5 5 -1 -5 -8 1 -6
4375 -6 -3 -9 1 1 2 2 -9 -11 13 -6 9 -4 1 13 -2 10 3 11 2 2 20 22 10 7 1 5 17 1 3 4 8 12 -10 -7 -8 1 7 -7 -5 -7 0 7 -18 -9 2
4420 2 13 -14 -11 -1 11 4 -9 -11 -9 -6 3 -7 -10 -9 15 15 -14 -6 10 7 -3 7 21 19 3 5 13 19 -1 3 5 1 2 -2 11 4 7 12 5 -16 4 6 -8
4463 -8 -6 3 -7 -16 -12 -2 4 -16 -1 2 -12 3 -6 7 1 3 15 -5 0 -10 1 -3 0 -2 7 19 4 12 6 11 17 19 19 2 4 9 0 -5 -1 6 12 11 8 -8 9
4508 9 6 -5 4 -12 7 4 -12 -4 1 -10 -1 0 -5 -5 15 7 -16 -22 -6 27 -1 1 14 22 16 -2 12 14 9 15 21 5 -1 10 6 4 -3 22 18 0 3 10 19 -8
4552 -8 -1 10 -11 4 18 -2 -12 6 8 -4 -5 3 14 -2 -18 -3 -8 -6 -13 6 -4 5 7 -9 -5 2 2 6 0 11 19 16 -7 11 15 5 -7 14 -2
4591 -2 8 3 13 -1 -2 14 16 -4 0 11 19 4 2 9 -12 7 -4 -2 -13 0 7 2 -7 -3 -4 6 -15 -5 0 6 -8 3 3 -14 1 18 -1 -11 9
4630 9 16 1 -6 7 25 23 12 31 32 16 -2 6 10 7 9 18 -15 -6 4 0 -6 -4 -1 4 -10 0 9 -4 -7 -7 -8 -12 -4 -10 -16 -14 7 10 -1 1 -8 -4 5 -3 -6 -1 4
4677 4 -1 16 5 5 -1 14 13 13 14 2 -5 11 7 10 -2 6 1 13 1 9 -3 -5 20 7 -10 -16 11 -1 -12 -16 -12 -13 0 -11 -17 -1 2 -1 -6 -2 3 10 9
4720 9 -13 3 16 11 -2 5 4 8 5 5 11 3 17 9 0 5 27 11 0 -1 15 10 -8 -5 -3 11 3 -3 -11 -7 -9 8 9 -11 -8 -1 -5 -10 -13 -7 -6 -17 -11 -9 0 7 -3
4767 -3 -8 -6 11 3 6 -5 10 11 5 7 11 10 10 1 3 11 0 18 8 0 6 7 4 8 2 13 -3 1 2 9 -13 3 2 5 3 5 -12 -7 0 3 -6 -7 -9 -6 0 -7 -8 10 -10
4816 -10 -3 2 -11 2 4 24 10 13 15 28 2 10 14 14 8 6 -8 21 5 10 0 4 1 7 -2 1 4 3 8 -14 -12 8 3 -6 2 -5 -2 1 1 -19 0 1 6 1 -4 -4
4862 -4 9 4 -7 -3 -3 16 8 11 -1 -2 10 5 4 -1 15 7 7 6 18 15 7 2 14 4 10 8 4 -3 11 -8 -7 5 -3 -2 -15 -9 -5 -5 -2 -6 -8 0 -5 -14 -5 -8 5
4909 5 1 -4 5 5 7 -3 -2 2 -7 9 -2 3 7 9 11 17 2 3 6 15 10 5 11 16 9 5 2 5 -6 -6 -8 -4 12 -3 -1 -13 -3 -3 -2 -10 0 5 6 -9 -7 -4 1 0 -2 -4
4959 -4 14 -2 -7 2 2 5 16 9 1 20 11 6 13 6 10 4 4 5 -2 4 22 0 5 -4 3 -2 -8 -2 0 -3 -13 -9 -2 0 -4 -7 -5 -6 -2 -3 -4 -10 -10 6 -9 -5 0 18 13 -3
5009 -3 10 -9 10 5 13 -1 14 13 4 0 10 22 16 4 10 14 6 5 4 9 4 -3 5 5 8 5 0 -3 5 -4 3 0 -10 2 -1 -8 -5 -8 -10 -3 -9 -12 -15 -9 -11 6 -6 5
5057 5 0 9 -1 7 14 12 14 13 2 13 13 4 7 -8 7 9 15 13 8 1 -2 12 -1 -12 10 1 -3 -3 16 -5 -2 -11 -6 -9 -12 -3 -1 -2 -21 -3 -3 -2 -6 5 4 -2 16
5104 16 5 0 1 -9 12 8 8 8 5 20 3 0 5 3 1 12 16 5 12 10 11 -5 -3 17 -7 -2 -2 2 -5 1 5 -8 -7 -5 -7 -24 -11 3 -4 5 -11 2 4 11
5148 11 -2 -12 -7 -2 3 10 -4 10 3 4 8 8 2 1 14 13 14 8 13 16 9 10 22 8 0 13 8 7 3 -2 11 6 6 -7 -1 -6 -14 -10 -4 -14 7 -14 8 -7 -4
5193 -4 -3 -10 3 13 1 8 -3 3 1 3 9 11 -1 13 15 6 -9 6 5 4 2 6 7 18 12 11 3 6 9 2 12 0 10 1 2 1 7 4 -6 -8 2 -2 -3 -14 -15 -7
5239 -7 1 7 -3 -15 -6 10 11 3 2 0 -2 4 11 8 16 9 8 13 19 2 23 11 12 12 16 13 5 11 9 11 6 12 -1 12 6 8 -3 15 9 5 -9 0 1 9 -14 -13 2 -11
5287 -11 -12 -18 2 -2 -12 -6 1 -1 -1 10 0 14 5 6 2 8 11 11 11 5 14 15 5 18 14 -2 10 20 17 -5 1 6 13 -1 -1 1 2 -3 -3 2 -5 -3 2 -12 2 -17
5333 -17 -2 -2 4 -1 2 -3 2 4 -2 14 0 3 0 6 11 6 -2 1 9 12 10 11 18 27 4 15 11 20 11 14 4 7 -8 7 -2 -4 4 3 -4 -3 2 -9 0 -8 -2 -16 -11 -9 -13 0
5383 0 -7 -16 0 -10 -13 -4 -5 -7 4 -6 -2 12 2 8 11 4 -1 8 10 0 2 -4 7 4 6 15 7 14 7 5 -2 1 5 -4 2 3 -1 -3 -18 1 -6 -8 -9 5 -8 -13 -11 -10 -14
5432 -14 -9 -11 4 -6 -2 -1 0 13 5 -3 1 4 15 4 6 -1 -8 12 4 -8 -3 14 13 15 2 5 6 11 -1 7 -12 16 -1 8 6 6 -2 6 -8 3 -4 -13 -11 -4 -3
5477 -3 -9 -6 2 -12 -10 5 -12 -3 -6 -12 -10 6 -14 -1 7 0 -1 -2 6 5 3 3 19 15 6 8 5 9 4 11 -2 8 6 1 2 4 9 2 12 -1 -2 -10 5 4 -4 -1 2 -6 -9
5526 -9 -9 -16 2 -9 -12 -11 -2 9 1 2 9 0 11 -2 -4 10 13 -2 5 5 3 8 9 4 -1 12 10 3 11 3 0 7 -2 -1 5 2 -1 -5 -3 -2 2 4 -17 -7 -10 -12 3 4 -5 -6
5576 -6 5 -15 -5 -12 -3 -6 -5 0 0 4 -7 2 -2 6 5 -3 -5 1 -1 12 1 18 7 11 7 17 6 10 7 9 5 17 0 -2 -7 3 4 -11 -13 3 1 -4 -6 -1 4 4
5622 4 -8 -4 2 -10 -1 -5 1 -7 -12 -5 -4 -11 5 2 1 3 7 4 14 -1 2 0 2 10 13 3 9 10 7 -4 10 9 -2 4 3 15 -6 -9 -5 2 3 -8 -1 -9 3 5 -11
5669 -11 -2 -4 -6 -6 -9 -1 -1 0 -4 3 10 -3 -4 9 17 11 -4 10 6 2 11 7 9 0 13 10 12 7 5 21 15 7 2 15 4 18 7 12 13 9 6 -8 -3 2 -7 8 6 0
5717 0 0 -10 2 2 -12 -7 -5 2 0 1 -1 -4 2 8 8 -1 16 20 8 2 8 15 5 5 14 12 8 9 9 10 15 9 6 6 3 -1 8 -14 -1 6 -1 3 1 5 2 0 -5 -2 -3 4 -2 0 -13
5770 -13 -4 2 -14 -9 -4 7 7 -9 4 -1 -1 -1 11 7 7 13 9 13 10 18 2 2 12 6 2 9 2 0 -11 2 -12 -15 -12 1 4 -2 0 10 -7 -11 3 -4 0 -14 2
5815 2 -2 -4 -7 -8 -17 1 8 8 -4 -12 -1 11 1 -1 -3 5 -3 6 11 -2 8 15 12 7 12 6 -1 2 8 9 3 -2 -3 8 0 5 -7 1 -17 -5 -9 0 -11 -6 2 -4 -11 -18 3
5864 3 -6 -3 -7 -7 4 4 2 2 -2 11 3 -1 0 -1 -2 6 6 -1 1 3 13 5 16 -1 4 11 18 5 3 2 -6 8 -1 9 -1 -14 3 -1 3 -3 -5 -13 -13 -4 -9 -14 -5 -14 -20 -7
5914 -7 -12 1 -7 -7 1 1 0 12 -7 13 5 7 1 -4 11 6 14 9 4 6 6 16 1 13 6 3 7 0 1 4 -1 -2 4 10 13 -4 0 7 -2 -15 -5 -7 -4 -3 -7 -22 -15 -12 1
5963 1 -4 -8 -8 7 -3 -6 -8 -11 10 2 2 2 14 7 16 4 -3 2 8 12 4 15 10 10 -1 6 4 -1 6 3 11 0 -6 9 6 -3 -7 -2 -10 -10 -8 -18 -11 -11 -11 -4 -6 1 -6 -4 -8
6014 -8 4 -5 -2 8 1 -3 3 12 13 5 5 13 18 12 6 13 12 13 11 20 -1 6 6 2 -1 1 4 14 2 -16 -8 -3 -12 -1 -8 -6 -3 -4 -13 -3 -8 -7 -8 -10 0 -7 1 -8 6 -10
6064 -10 -1 1 -8 -2 3 6 -3 0 1 10 3 11 8 14 23 13 2 1 9 8 6 10 -1 -1 7 -5 5 -8 -5 9 -15 -5 -18 -10 -11 -14 -7 -6 -7 1 -5 1 -11 -7 -14 -4 2 3
6112 3 11 9 -2 14 11 0 2 15 6 -5 1 12 7 16 10 1 7 3 -1 10 4 0 -3 9 -2 -6 -4 0 -3 -7 -15 -4 3 -5 -4 -4 -2 2 -6 -11 -2 -10 -2 -2 5 2 -8 1 -15
6161 -15 5 1 -4 -1 10 3 0 -1 -7 0 7 0 4 6 12 7 -5 3 0 -5 6 5 -2 5 -4 -5 -9 -3 1 3 -2 -12 1 3 -9 -7 -10 -9 -12 -4 -11 -11 -12 6 -1 4 -4 6 9 4 0
6212 0 -3 5 -5 -3 12 10 10 7 2 10 6 -2 7 1 8 8 -2 -3 7 5 -7 4 -3 4 4 3 -6 -6 -7 2 -3 -6 5 -6 -8 -9 -12 3 -6 -7 -5 2 0 4 -1 4 11 -1 10 7
6262 7 -4 0 10 8 4 3 12 10 16 2 6 13 12 0 4 9 6 14 -2 -7 -7 7 -1 0 -9 -10 -8 -8 -12 -6 -5 -2 -7 -6 -9 3 -3 -7 0 -3 5 4 -3 -2 -6 -1 9 7 0 14 1
6313 1 5 11 -1 15 10 14 12 7 14 13 4 7 -1 3 1 -4 -14 -2 -4 -5 -8 -7 -14 -16 -19 -13 -21 -11 -13 -9 1 3 -14 1 -10 -6 -11 -4 -7 7 -7 -4 5 4 7 18 7 2
6361 2 9 7 13 -1 0 13 18 5 13 12 9 6 1 9 21 -7 4 -14 4 7 5 10 -13 2 -6 -3 -12 -10 6 -2 -12 -5 -3 -5 -4 -4 -3 8 5 4 7 7 10 18 6 13 3
6408 3 8 -2 12 1 12 4 6 5 8 1 7 3 1 7 -4 7 -7 -8 0 3 -1 -2 -6 -3 0 -6 -13 4 -4 -6 -15 -19 -10 -3 -10 -4 -6 -3 8 5 2 7 18 10 -1 16 9 13 -4
6457 -4 9 3 11 5 10 5 -1 5 -1 6 9 7 4 2 0 -4 10 -6 2 -3 6 8 -1 3 -3 3 0 6 2 5 -8 5 -10 2 -1 11 -2 -11 13 8 3 4 2 1 9 6 1 6 6 5 6
6508 6 2 10 8 7 9 10 -2 17 3 7 2 7 2 -2 -2 -7 -2 -3 2 -8 -6 -7 -8 -10 -14 4 1 -15 -10 4 7 -15 -10 4 -1 15 -1 3 -1 3 1 12 2 16 11 19 10
6555 10 10 21 10 10 7 21 10 2 0 2 -2 -1 10 -3 -8 -8 -2 -7 -18 -8 -1 -11 -11 1 -4 -10 -7 -12 -10 -2 -10 -7 -12 -3 -3 -3 5 -2 -4 -10 7 3 10 6 10 7 15 13 6
6604 6 3 6 2 8 4 3 -4 4 2 11 11 5 13 -1 0 0 -3 0 5 -7 0 -9 4 -16 -14 -9 -12 10 2 -5 4 -4 9 3 -6 -8 -3 14 -7 3 2 8 -2 -3 -2 14 11 6 2 -9
6654 -9 13 2 9 -8 1 1 8 8 -4 -11 1 3 -4 6 -4 6 -10 7 -11 -11 -1 -9 -10 -3 3 -15 -6 -9 0 1 -5 -1 0 3 10 5 -9 -3 4 9 12 4 6 13 11 -1
6700 -1 9 8 7 6 9 4 13 7 -4 -1 -1 -6 -2 5 -1 2 -9 -20 -2 -14 -2 3 -3 -3 -4 -1 -5 -9 -7 0 -6 -6 -18 -3 -4 -16 -3 -4 -3 1 12 4 3 -4 0 5 8 9 14
6749 14 15 4 5 11 13 6 5 14 11 3 -2 1 12 -4 -9 9 3 10 -5 2 -1 8 -7 -6 -9 -2 1 -2 -1 -5 -6 8 5 2 2 3 -3 -6 12 -1 12 7 4 11 13 21 1 15
6797 15 -4 5 9 8 7 10 6 11 -4 6 2 0 -1 -2 1 1 -1 5 -7 -8 -10 -14 -2 -6 -13 -9 -7 2 -8 9 -1 -12 2 5 3 11 8 2 7 11 1 7 4 7 9 -4 5 6
6845 6 11 11 4 1 9 9 16 4 4 -5 7 3 -4 -6 1 3 -3 0 0 -6 -8 -1 7 -6 -4 -15 -5 -6 -10 -3 -6 -7 2 3 -11 -4 -4 16 -1 3 8 -1 1 7 12 10 11 14 1 -1 1 4
6897 4 4 15 2 5 6 4 -3 -6 2 -5 10 -3 -1 -9 -6 -6 -3 -12 0 -4 -7 -4 -3 7 -8 -12 -5 -1 2 3 -4 -2 4 3 2 10 14 9 12 11 9 12 13 2 8 14 8 16 5 14 13 16
6949 16 0 -1 -7 3 -12 7 -4 -1 -1 1 -9 -1 -1 3 -1 -1 -6 0 -5 0 2 -2 3 -3 -5 -5 3 5 -2 4 -9 4 7 5 8 -4 14 0 12 7 8 22 8 3 19
6994 19 3 4 2 3 2 3 -5 2 -5 -5 -3 -13 3 -8 -4 -8 -1 -1 -5 -1 -6 -14 -3 -9 -5 -4 -2 0 1 6 8 2 3 6 8 6 11 6 5 3 10 0 11 7 2 15 3 5 15 9
7044 9 13 16 6 9 3 4 3 -3 -2 -2 -5 3 -2 -4 -7 -9 -6 -8 5 -2 0 0 -9 0 0 0 6 10 -4 4 0 -7 4 8 7 6 4 -1 2 12 -1 -1 16 5 17 14 6 -2 7 4 2 2
7096 2 -6 10 -2 3 4 3 4 1 -20 -7 -3 1 2 -9 -10 -11 -8 -6 -9 -11 6 -2 1 -3 -9 14 2 8 5 7 3 7 -1 11 3 5 11 1 1 6 11 2 11 5 3 4 6 -2 9 -5
7146 -5 3 -2 3 0 -3 -10 1 2 -12 -11 -10 -7 -9 2 -13 -2 -9 3 -7 -5 3 0 -3 -4 4 6 10 14 17 14 12 9 1 5 5 1 13 12 5 2 1 2 -5 -15 2 -4 -4 0 -14 2
7196 2 -5 -3 -9 3 -5 -15 -8 -15 -9 0 -12 -1 -15 3 -2 -10 -12 -11 -1 -1 -3 -5 -2 3 4 -1 3 2 5 9 1 0 0 10 13 2 1 6 5 1 0 3 -5 -1 -9 -5 -1 -12 -9 -8 -5
7247 -5 -19 -12 -3 8 -7 -6 -1 -9 -16 -11 -1 -6 -2 5 -8 -3 -10 2 0 0 1 0 -3 -3 -10 -1 6 -9 -4 5 4 11 4 -3 -2 4 5 -3 -5 1 -1 0 -6 4 -5 13 -2 -11 -1 -10
7297 -10 -11 -8 -3 -6 -1 -2 -21 -5 -3 -3 -5 -1 -1 4 -9 0 5 1 -13 0 -5 -1 -1 5 2 7 4 -10 1 1 -3 3 5 -1 0 5 4 7 5 1 2 2 -8 -7 1 -7 -6 -6 -7 -12 -4 -2
7349 -2 -10 -5 -6 -8 -15 -1 -3 6 -2 0 6 -2 9 14 -1 12 -6 5 3 -5 3 10 1 -2 -9 -12 -5 2 -6 -4 -5 -2 -2 -9 0 -10 6 -4 -10 -1 -10 -13 -2 -5 -8 -8 -6 0 -2 -16
7399 -16 2 -11 -4 -10 -9 -19 -3 1 -2 10 7 -3 3 -6 8 11 -2 6 7 8 11 1 8 10 6 3 -7 5 8 0 0 -5 -18 -14 -8 -17 3 -3 1 -14 -2 -6 -6 -14 -10
7444 -10 -15 -17 -12 -19 -19 5 -10 -10 -4 -15 -15 -7 -5 -5 -2 -4 9 8 6 7 -7 14 10 5 0 16 6 1 5 4 5 0 1 2 3 1 -8 -11 -10 -11 -5 -14 -4 -5 -10 -10 -5 -23 -7
7493 -7 4 -14 -9 0 3 -5 -8 -6 -11 -1 -7 -12 -3 -6 0 9 0 -3 -2 1 -1 -1 -1 4 8 -2 7 18 2 -6 -4 9 10 3 -2 -6 -10 -8 -3 0 -11 -13 -17 -13 -2 -5 0 4 -2 -5 0 -13
7545 -13 -4 -6 -13 5 -2 2 5 -2 8 2 4 10 1 -1 -6 4 12 6 11 -5 0 -1 13 1 6 6 2 4 4 12 -6 2 11 -2 3 -6 -3 -19 -1 -7 -5 -3 -8 -7 3 -3 -5 -6 -7
7594 -7 -6 -5 3 -4 -3 12 3 0 -6 -7 16 11 3 7 7 19 7 2 17 7 11 15 6 -1 11 14 4 -1 3 -3 -4 -6 2 -7 -2 -2 3 5 7 -10 -5 -5 -14 -9 -11 -16 -9 -5 -8 6 -3
7645 -3 -3 -1 -7 3 -6 4 1 7 6 17 11 9 1 5 15 6 9 3 0 7 -2 0 0 1 0 -2 -2 -5 -2 11 -4 -2 -11 -12 -4 11 -2 -3 3 -6 -1 0 -7 0 -1 -9 -3 -2 -1 -9 -7 -9 7
7698 7 10 10 14 7 9 7 13 3 6 2 15 5 15 8 9 6 -1 5 5 4 2 7 11 -8 -7 -1 -2 -3 -6 -3 -14 -8 4 -12 -2 -1 0 5 -8 -4 3 -2 7 -3 -2 8 5 8 12
7747 12 11 13 -1 12 6 14 2 0 11 6 12 3 0 -1 8 3 8 4 10 -1 2 5 2 9 8 -1 4 4 4 -9 -7 -2 2 1 -2 -5 0 -6 1 4 3 2 4 2 -2 3 0 5 -4 12 0 6
7799 6 7 13 11 2 14 5 17 10 1 10 5 7 10 6 2 -10 7 0 -5 11 6 -4 -3 1 4 -7 -4 -10 -5 -4 -11 -8 -6 1 -10 -7 -10 -3 -5 -1 2 0 16 17 8 10 2 17 19 7
7849 7 12 8 12 12 12 8 11 7 5 9 5 19 4 2 4 -2 -6 2 3 7 7 -7 12 8 2 -1 -4 -16 -4 -5 -10 -11 -8 -8 -3 -8 -15 2 2 -4 8 2 12 -7 4 4 15 -2
7897 -2 12 21 16 7 5 6 -2 15 6 8 5 15 4 -1 1 3 -6 -4 -12 2 3 6 1 -4 -6 -2 6 3 -8 -3 6 -8 3 4 11 -3 2 7 -9 -7 0 7 12 14 9 -3 10 -7
7945 -7 0 13 4 15 8 12 6 5 19 -1 4 7 -5 11 8 -4 3 4 0 -6 -3 5 -5 2 0 11 -1 3 2 2 6 3 -6 -7 10 -1 9 5 1 0 9 9 9 8 11 22 18
7992 18 10 4 16 5 16 8 4 12 10 11 -2 11 8 0 4 8 6 6 1 1 6 -3 -2 6 6 3 2 1 -5 -6 -5 -3 -8 -6 -5 -3 7 -13 3 3 10 14 6 1 3 11 9 4 11 17 2
8043 2 11 3 10 11 12 7 14 4 8 10 7 1 5 6 9 0 -4 0 -10 -9 6 -7 -1 -4 4 -8 -11 -4 0 -4 -6 -12 -9 -4 3 -14 5 1 6 9 10 16 4 -2 6 12 9 8 -6 2 12
8094 12 7 4 -1 -2 9 7 9 -1 7 -3 10 -1 -8 5 -1 -1 -6 -3 0 7 3 -2 -6 1 -7 -1 -5 -3 -6 -12 -10 -2 -7 0 1 -2 14 1 14 13 15 7 12 9 3 5 6 8 12 4 7
8145 7 7 8 7 -6 3 -7 -2 6 3 -1 -2 -12 -7 -6 -10 -3 -3 -1 0 0 5 2 9 1 -10 -10 15 4 5 -4 3 -2 -2 -4 12 8 15 8 4 -7 11 17 6 13 2 7
8191G
$$ Imaginary data points
##PAGE= N=2
##DATA TABLE= (X++(I..I)), XYDATA
0 0 0 0 0 0 0 0 0 0 0 0 0 0 0 0 0 0 0 0 0 0 0 -8 8 -8 8 -8 8 -8 16 -16 16 -20 24 -24 32 -32 40 -40 48 -51 56 -64
42 -64 72 -80 88 -96 105 -117 128 -141 156 -172 189 -210 231 -255 284 -316 353 -398 451 -515 597
63 597 -704 850 -1062 1396 -2022 3564 -15817 -16559 4654 -16375 -14447 7928 10986 -6748 2259
78 2259 17510 10527 3424 18281 16900 -5556 -9390 6524 337 -15446 -6564 8214 -2392 -12637
92 -12637 -2251 3475 -5993 -3680 7618 3172 -6897 -477 5375 -3453 -5324 7993 11265 1973
106 1973 2541 9075 2255 -7428 -4265 -1235 -8366 -10920 -4873 -4306 -7368 -2107 4428 3426 4679 11522
122 11522 11010 4123 5132 9504 3945 -3751 -2320 -1313 -8256 -11732 -6920 -4780 -6108 -1596 4410
137 4410 2399 -798 3024 5722 1197 -1259 2776 3771 -1141 -3126 -223 506 -1002 765 3355 1217
153 1217 -2300 -1609 -112 -2336 -3779 -151 2931 475 -2072 -132 1433 105 1267 4872 4020 384
169 384 1217 2549 -2952 -7562 -2965 1181 -3638 -6598 -736 2674 -1039 -663 4714 4416 1007 3233
185 3233 4360 -1938 -4241 2177 2914 -4380 -4174 3041 1664 -4714 -2087 3371 878 -1202 3178 3092
201 3092 -2658 -1619 3334 -240 -5176 -364 3927 -1478 -4330 1161 2393 -2260 -677 3981 812
216 812 -3165 768 2781 -2377 -2771 3225 2827 -2226 -352 3157 -1047 -3904 1224 2870 -2647 -2729
232 -2729 2826 1424 -3790 -1354 3074 577 -1456 2085 2314 -1900 -806 3019 120 -3695 -17
247 -17 2958 -1428 -3847 86 1221 -1767 -812 1929 34 -1365 2151 2854 -1517 -1509 3247 2687 -2074
264 -2074 -1626 1805 557 -2163 -1106 -90 -1496 -1173 611 -488 -1947 374 2503 736 -470 1552
280 1552 2434 816 257 656 -380 -1053 -73 -444 -2498 -2141 254 184 -1609 -944 1140 1123 77 470
298 470 1144 811 675 996 464 -436 -275 176 -286 -887 -736 -269 -39 -17 -276 -421 108 647 296 -283 90
319 90 790 704 256 330 534 239 -186 -333 -538 -1012 -1292 -934 -438 -589 -987 -468 741 1033 260 139 1217
340 1217 1827 1055 208 326 691 458 -312 -1088 -1316 -795 -282 -679 -1358 -866 543 1044 137 -510 284 1470
360 1470 1260 -165 -779 299 1245 294 -1427 -1460 42 540 -858 -1859 -753 952 929 -264 -359 883
378 883 1632 1081 209 -34 435 1002 659 -647 -1226 -90 745 -493 -1800 -965 452 121 -930 -781
396 -781 34 404 369 70 -310 156 1091 811 -315 -94 1023 735 -403 -300 228 -388 -833 -229 -156 -817
416 -817 -303 782 433 -244 537 1143 310 -19 693 283 -900 -651 -16 -927 -1546 -455 146 -592 -341
435 -341 763 383 -198 964 1477 -195 -736 938 931 -1109 -1101 679 497 -733 -67 654 -269 -187 1269
454 1269 670 -1239 -434 1319 -89 -2092 -777 1098 217 -749 196 546 -221 300 1047 -239 -1054 586
472 586 1203 -1123 -2267 -165 1228 6 -669 513 1169 653 274 44 -250 323 1188 383 -1248 -1145
490 -1145 142 -27 -1162 -836 686 1216 467 -233 -313 -122 176 217 -281 -664 -181 252 -477 -1260 -411 1065
510 1065 1163 355 329 738 319 -257 -110 37 -199 -54 155 -615 -1217 -422 262 -219 -112 898 526 -672
530 -672 -74 1005 -63 -939 677 1395 -681 -1392 509 775 -803 -23 1532 -70 -1744 73 952
547 952 -1538 -1655 1707 1824 -1405 -1186 1462 576 -1181 809 2192 -68 -614 1469 101 -2971 -982
564 -982 2286 29 -2635 13 1673 -1506 -2282 1121 1452 -830 716 2731 -243 -2365 896 2222
580 2222 -1212 -1519 2009 1374 -2131 -1312 883 -767 -1569 1254 1350 -1723 -898 2095 326 -2256 502
597 502 2840 -131 -1632 1145 1146 -1791 -604 2170 10 -2449 251 1768 -1652 -2306 1586 1826 -1571
614 -1571 -931 1717 -6 -1947 843 2492 -341 -1021 1652 855 -2392 -1170 1801 385 -1514 502
630 502 1256 -1783 -2274 889 1219 -993 172 2562 821 -1816 -584 1054 -139 -450 1352 1089 -1179
647 -1179 -1168 198 -687 -1722 165 2042 750 -961 -431 241 -363 -401 539 797 489 655 231 -1196
665 -1196 -1368 408 1238 -39 -666 439 683 -817 -1448 -329 517 412 436 275 -474 -403 705 573 -660
684 -660 -150 1511 872 -1207 -1007 544 186 -794 -100 317 -698 -521 759 98 -1078 489 1971 -36
702 -36 -1618 411 1462 -686 -1054 1205 814 -1516 -674 1179 -397 -1624 901 1895 -931 -1506 1159
719 1159 741 -1800 -389 2211 329 -1771 436 1492 -1386 -1724 1570 1575 -1244 -422 1725 -259 -2191
736 -2191 252 1638 -904 -1195 1710 1177 -1907 -981 1688 425 -1372 461 1472 -746 -1142 908
752 908 342 -1538 -47 1832 -124 -1741 241 1252 -630 -802 1038 683 -728 172 795 -961 -1224
769 -1224 972 997 -1200 -888 1177 637 -995 -250 834 73 -226 541 -61 -1019 200 1311 -202 -1269
787 -1269 363 1170 -572 -1236 205 666 -146 45 483 -309 -567 478 385 -951 -637 1001 760 -787
805 -787 -587 732 575 -324 -172 287 -20 -230 45 -105 -411 29 507 60 -475 -124 269 -81 -342 81
825 81 403 132 -25 191 138 -244 -280 101 129 -170 -91 272 223 -85 9 143 -168 -323 54 127 -393 -355 374
848 374 460 -242 -320 300 370 -122 -218 51 120 190 270 -75 -412 27 384 -239 -714 -110 461 82 -261 52 233
871 233 86 157 94 -374 -316 411 408 -403 -372 498 533 -243 -399 33 59 -87 16 -84 -260 127 500 -22 -526
894 -526 -39 451 19 -367 -35 242 88 89 131 -175 -243 185 190 -409 -414 291 417 -124 -224 176 215 -64 -107 -55
918 -55 -123 -43 161 39 -184 -19 218 52 -168 -71 63 10 11 135 80 -33 67 155 7 -166 -115 25 7 -32
942 -32 -79 -90 -20 106 39 -164 -207 66 236 42 -164 -41 279 309 -20 -266 -106 191 134 -235 -376 -32 313
965 313 122 -302 -303 152 355 11 -313 -118 277 329 -32 -313 -98 322 295 -198 -404 28 357 51 -376 -237
987 -237 171 243 -26 -245 -186 95 269 39 -271 -91 365 295 -242 -324 103 234 -79 -226 -65 33 7 3 -57
1010 -57 -107 58 239 125 -101 -17 152 67 -85 -60 -1 -18 -26 19 -16 -95 -46 44 22 -53 -38 29 73 75 35 -7 -14 12 34
1039 34 18 -45 -39 90 160 -44 -303 -185 101 56 -189 -157 89 126 -24 -104 -32 121 293 282 0 -182 -15 112
1063 112 -59 -286 -156 201 285 -70 -439 -302 148 228 -97 -146 277 421 34 -270 -181 32 230 285 4 -273
1085 -273 21 386 -82 -635 -186 518 175 -473 -303 110 -36 -108 136 56 -89 335 529 -201 -553 307 688
1106 688 -198 -598 166 379 -350 -454 124 75 -271 43 283 -218 -291 401 428 -240 -178 416 176 -412 -122
1127 -122 362 65 -168 183 201 -294 -314 73 17 -175 65 193 -136 -225 55 13 -187 135 504 238 -140 -32
1149 -32 72 -105 -102 43 -9 -27 152 -28 -469 -307 275 279 -121 5 349 147 -191 -69 32 -102 64 328
1171 328 -53 -449 -55 408 -48 -467 20 495 89 -340 -65 127 -62 -37 162 -71 -258 191 470 -83
1191 -83 -452 125 487 -161 -574 -31 357 -12 -217 59 30 -269 -65 229 -53 -181 430 621 -136 -533 73
1212 73 319 -283 -349 298 321 -226 -222 98 -138 -303 224 420 -72 -212 236 109 -440 -204 388 230 -132 127
1234 127 289 -245 -416 88 206 -117 -22 279 -3 -325 -146 -57 -289 -47 410 202 -229 41 355 -12 -308
1255 -308 49 254 2 -12 83 -183 -257 199 220 -390 -299 390 263 -449 -293 332 166 -214 54 216 -132 -37
1277 -37 375 57 -470 8 569 16 -506 45 459 -131 -451 -18 66 -276 -57 313 -25 -257 250 414 -248
1298 -248 -401 264 394 -143 -175 259 142 -205 -64 94 -189 -187 196 149 -284 -201 216 118 -197 -51 240 108
1320 108 -66 53 84 -61 -11 162 39 -147 -50 58 -98 -210 -36 44 -46 -29 101 44 -92 -5 117 21 -95
1343 -95 -14 91 27 -35 6 5 -51 21 69 -75 -159 28 168 -17 -186 -12 166 34 -83 -6 70 62 80 56 -110 -127
1369 -127 138 153 -195 -264 105 213 -145 -244 29 140 28 30 44 -36 41 203 27 -294 -108 266 96 -314 -172
1392 -172 206 112 -130 -40 72 19 73 116 -85 -179 117 247 -98 -259 88 237 -65 -190 23 104 -22 16 52
1415 52 -71 -59 118 54 -189 -101 153 54 -146 -22 147 23 -64 36 33 -105 -79 41 -19 -106 13 70 -32 -46
1439 -46 87 48 -99 -16 140 26 -102 -4 130 12 -92 -50 -30 -25 -12 15 -42 -10 167 153 -48 -90 75 97 -73
1464 -73 -152 -50 27 23 -20 -64 -51 43 86 -36 -138 -12 154 81 -71 -61 69 78 -33 -112 -97 1 81 29 -69 -44 111
1491 111 117 -39 -147 -58 45 23 -86 -73 37 136 105 -13 -58 52 105 48 -71 -66 49 75 -45 -116 -72 0 -5 -69
1517 -69 -75 18 104 93 17 -14 43 46 -45 -101 -74 -21 2 -8 4 28 54 61 15 -10 -1 9 -38 -51 -3 -11 -63 -63 11 16 -41 -13 77 112
1551 112 77 64 43 29 29 6 -89 -131 -44 48 -32 -113 -22 122 66 -66 -53 24 37 -3 -56 -73 -17 109 76 -49 -48 109
1579 109 148 -27 -102 -4 90 23 -99 -113 -57 -15 -27 -97 -88 61 187 112 10 58 148 97 -29 -88 -41 17 -17 -91 -118
1606 -118 -52 44 22 -54 -24 72 79 -4 -18 5 29 18 41 0 -42 -9 35 -19 -75 -16 48 5 -66 -21 8 -60 -78 0 19 -22
1636 -22 41 134 80 -7 45 98 -14 -76 8 15 -87 -85 16 -27 -115 -47 88 45 -26 43 122 50 -3 37 31 -34 1 63 -31 -130
1666 -130 -42 48 -51 -149 -33 90 34 -40 -12 31 8 42 55 4 1 121 98 -58 -121 12 57 -45 -104 -27 37 0 -33
1693 -33 -74 -39 51 116 36 -44 49 116 25 -77 -24 63 44 -18 -25 -52 -39 0 -10 -101 -75 54 43 -70 -63 75 57 -31 -7
1722 -7 83 31 -15 31 32 -56 -54 29 -14 -117 -29 82 5 -63 31 92 -16 -53 81 87 -31 -30 73 12 -89 -46 26 -19 -34
1751 -34 47 62 -44 -48 55 14 -93 -38 87 39 -76 -57 23 -18 -35 15 43 25 42 52 -40 -102 -39 42 -16 -57 -5 50
1779 50 20 -22 -25 3 51 72 17 -16 -5 28 -12 -67 -44 15 45 38 9 -8 6 45 14 -39 -14 48 40 -70 -88 -23 -6 -35 -18
1810 -18 23 35 25 53 16 -40 -17 43 5 -72 -49 39 12 -63 -33 28 18 -13 29 49 15 -6 23 2 -51 -24 26 18 -36 3 41
1841 41 3 -55 -3 40 -7 -28 17 46 -38 -55 -11 30 -5 -11 26 24 -21 -5 6 -48 -60 22 18 -61 -85 -10 34 -35 -36 30 62 27
1873 27 14 8 7 5 20 -10 -46 -22 33 -8 -61 -53 6 25 -14 -35 4 27 27 5 -6 11 42 41 -18 -30 1 22 -1 -44 -31 -19 3
1906 3 -23 -38 -23 7 30 -9 -16 7 29 7 -4 2 11 13 8 -10 -21 -9 11 2 -15 -8 13 16 -18 -8 6 11 6 2 9 -2 -1 13 8 -7 -9 1
1944 1 -16 -31 -22 -2 -7 -21 -2 15 5 -5 12 16 -3 -1 -10 8 -17 -22 -26 -25 -20 -13 -19 -32 -2 1 27 15 1 13 34 22 -7 -17 17 13 0
1981 0 -10 -7 -4 25 3 -31 -27 9 6 -23 -33 3 13 0 -6 0 19 23 14 -1 -2 0 17 -16 -40 -13 9 -18 -42 -12 -1 13 -1 0 0 3 20
2018 20 8 -3 -5 14 16 0 -4 14 22 3 4 1 -6 0 17 0 -10 1 9 -12 -9 -1 3 -9 -15 4 3 -5 -8 -8 -7 -7 -5 -1 -2 -3 -2 10 -8 -4 4 -3 -7 6
2062 6 15 -12 -1 11 11 4 0 -2 9 22 1 -6 -17 5 19 5 -2 3 16 6 4 -8 -4 -3 7 -1 -13 -4 -2 -2 -22 -11 -19 11 -3 -10 1 1 -3 -5 -13
2103 -13 -14 -2 -7 -8 -15 -24 2 1 8 -3 -1 4 2 3 -11 -15 -6 -4 -12 -11 0 7 16 9 23 12 6 4 -5 -1 8 3 -5 -8 1 -6 -4 -4 12 6 1 -4 -3 14 -7 -10 -5 -18 -11
2152 -11 -13 0 -7 7 20 11 5 16 8 -1 -10 -2 -4 -2 -18 10 7 5 10 13 13 1 24 -6 3 -4 -8 -4 -13 0 -5 -10 -9 -2 -9 11 -1 3 -3 -1 -5 -8 -16 -14 -4 6
2198 6 -6 -3 8 0 -11 -11 -1 -7 -9 3 -1 -9 6 -2 -5 3 6 5 -5 1 16 12 0 8 -2 -9 4 -2 -4 3 -3 3 -3 -16 -3 -5 -10 -20 -6 0 -6 0 5 -14 -9
2243 -9 2 3 -2 3 5 -6 1 -8 0 -1 -14 -10 -6 -10 -4 -3 3 4 19 1 3 8 7 -1 -5 7 -1 20 0 15 12 14 19 -6 -3 -8 -5 -6 -11 -8 5 0 -13 -11 1 0 -7 -8
2291 -8 2 -2 1 20 -10 -17 5 18 -1 -6 -2 13 -4 -5 8 14 -6 13 12 -8 -4 16 10 2 -8 16 21 -17 -4 13 17 -2 7 19 -4 3 21 11
2329 11 -2 -4 2 -13 -6 2 9 -18 -6 0 -9 -21 -7 -8 0 -5 4 9 -16 -4 14 9 -5 -16 5 5 -8 9 9 10 2 7 1 7 -2 -7 -9 -3 16 10 -5 2 -3 11
2373 11 -10 -5 2 4 -9 1 -2 -7 -5 2 -2 -29 -7 -4 -22 -24 -3 6 -5 -8 1 8 2 11 15 5 -1 22 24 -10 -9 -2 8 -8 -12 5 5 -3 -2 -1 -2 -6 13 0
2417 0 -4 -14 7 16 -15 -4 17 4 -16 -19 -8 -7 -5 7 -5 -8 0 -4 -7 -3 2 9 -22 -5 1 -8 -4 3 0 4 4 -8 5 -12 -8 12 3 2 8 19 -2 -8 13
2460 13 8 -5 -6 9 3 -4 9 -5 -18 0 -5 -4 -20 -2 16 -9 -13 -2 11 4 -14 6 4 3 -1 3 -9 -4 9 8 -2 -9 9 12 -10 -20 -2 12
2498 12 14 -5 0 4 8 15 8 10 8 18 9 -12 -10 4 7 -12 -12 -4 2 13 -1 5 -5 5 3 -17 -7 -4 -1 -5 -21 -1 -1 -8 -13 3 1 9 7 -5 -1 9 1 6
2542 6 9 3 4 11 12 2 11 17 4 -2 -1 4 4 7 -2 11 13 6 5 0 17 6 8 0 8 23 -3 -23 -7 9 8 -3 -4 -1 2 5 -7 -13 -11 1 3 -16 -14 16 -1
2587 -1 3 -9 -10 9 9 5 -14 -1 10 15 0 -15 1 21 8 -9 -10 0 14 -6 -16 -9 6 11 -9 -16 -5 11 8 -11 -13 -12 1 -2 -10 -2 -2 -8 -7 -21
2627 -21 -2 1 -3 -7 -11 1 4 -1 -2 9 1 14 8 -5 2 2 4 -17 -16 17 3 -3 4 -3 5 -1 -5 -6 11 2 -10 -6 -2 6 -2 -12 -3 0 2 4 -15 -17 -3 4 -4 -13 0
2674 0 -9 -1 -12 -3 -9 -10 -10 -10 -15 2 2 -2 -13 -4 5 -5 -19 -8 5 10 12 7 -4 4 18 10 -2 0 18 10 -9 -13 7 9 12 -13 -16 8 3 7 -8 -17 -5 9
2718 9 2 -12 -5 10 9 -2 -16 -6 3 -2 -3 -6 0 -3 0 -13 -9 5 10 -9 -8 9 1 5 6 -3 -9 -14 6 -10 6 3 3 -7 -9 24 6 -10 0 14 12 -16
2760 -16 -16 5 11 -15 -3 0 -8 -15 -4 -28 -28 6 11 -2 -23 12 7 1 -16 0 21 1 -7 -1 -5 -12 -7 0 -13 -13 15 8 -26 -18 8 12 -1 -5 12 5 4
2801 4 2 -6 -11 0 13 -13 -25 -3 10 -2 -19 -8 8 -8 -9 -9 -2 -15 13 -2 -23 -12 2 5 -23 -9 11 -2 -10 -2 -6 -14 8 23 3 -4 3
2838 3 8 -11 -19 9 21 -6 -10 3 11 -16 -5 12 -6 -6 -1 20 -14 -26 10 -2 -31 -2 23 2 -22 -14 1 -16 -19 -4 2 -21 -6 -5 -21 -11
2874 -11 -3 7 -10 -26 5 21 -7 -13 8 35 5 -7 -2 6 11 11 3 -7 2 16 -3 -23 1 20 4 -19 -22 -2 2 -8 -20 -5 -3 11 0 -31
2910 -31 -18 6 15 -8 -21 5 11 -8 -16 -18 -13 -3 17 -16 -27 -5 12 -9 -22 11 30 -3 -2 -6 4 6 12 20 1 -1 15 21 -20 -26 20 32 -4
2947 -4 -11 24 6 -26 -4 24 3 -4 12 6 -21 -27 6 -17 -26 -7 16 -15 -20 -4 12 -5 -20 -2 5 -14 -20 -2 -6 -14 2 13 -19 -16 13 5 -13
2984 -13 -18 8 14 0 -8 -2 0 7 10 1 -21 0 0 -7 -23 -4 7 3 -28 -15 -5 -12 -4 -26 -16 11 -1 -17 -19 9 16 8 -6 0 14 2 -5 -14 -11 -5 13
3025 13 1 -11 -3 14 6 -14 -12 14 28 -3 -18 -5 8 11 0 4 5 5 5 7 -11 -19 -5 -2 -17 -6 18 5 -6 -17 -1 13 -5 -6 -7 -3 -9 -2
3063 -2 -7 -7 -1 8 -2 -6 15 0 -7 -8 15 5 -4 -11 -2 21 -10 -1 -3 -14 -2 -1 0 -2 9 7 1 -7 -1 6 5 -2 -13 0 7 5 -5 -5 -4 7 3 -19 -24 -14 0
3108 0 -19 -23 -5 0 7 -21 -5 -2 5 6 0 -12 5 17 10 -13 -5 11 11 3 -8 -1 4 15 -4 -4 1 14 -14 -17 -9 6 16 -10 -6 13 -9 -8 -9 -11 -10 -5
3150 -5 -1 -14 -16 -2 -2 -12 0 -8 -1 0 -20 8 -5 -4 0 -9 5 -2 -6 -7 -9 5 -3 -10 -4 17 15 6 -10 -1 3 9 3 -24 -1 12 6 -16 -13 -3 6 2 -18 -23
3194 -23 -3 10 -2 -34 -16 -2 6 -7 -22 -13 6 3 -22 -23 -2 11 3 -18 2 14 8 -6 -16 0 12 12 -13 -9 8 10 7 -8 -8 -1 20 3
3230 3 -17 -9 10 12 0 -14 -3 -3 -3 -4 -9 -11 3 1 -31 -20 8 2 -7 -11 9 -4 4 -10 9 -9 -2 -6 2 0 3 -1 -1 -12 0 9 -9 -12 -16 12 8 -15
3272 -15 -13 10 -5 -11 -10 -12 2 9 -2 -9 -2 9 -2 -11 13 -5 0 -5 -7 -16 -10 5 -19 -28 -20 14 -2 -16 -23 -3 -2 -13 -11 -12 0 10 -3 2 -20 9
3312 9 14 -3 -20 7 35 11 -15 2 10 4 -12 -4 -8 -4 20 16 -13 -21 6 14 -11 -17 10 28 0 -12 -2 -2 -8 -5 5 -11 -1 0 -12 -34 -16 12
3350 12 3 -12 -14 6 -7 -27 -1 17 -3 -3 10 13 -13 -2 10 7 4 11 17 -6 -7 6 4 -11 -2 14 -2 -4 -7 -7 -6 -5 -5 -9 -14 0 -1 -24 -18 5 3
3391 3 -18 -8 -4 -15 -9 -5 -9 -20 -20 5 -13 -42 -7 18 3 -11 -6 4 -14 -11 5 0 2 21 24 -7 -39 4 23 -6 -18 26 19 -21 -29 -10 -4
3428 -4 -18 -4 11 -13 -28 0 -2 -35 -11 15 16 -16 -23 10 -3 -19 -1 2 -7 -13 4 1 -19 -15 10 0 -11 -1 12 0 -20 17 21 8 -2
3463 -2 8 11 -7 -4 0 6 6 11 4 -6 3 13 2 -22 8 6 -13 -27 -11 2 -2 -2 -1 -18 -12 0 -5 -24 -14 16 14 -13 -18 18 1 -15 -3 18 -9
3502 -9 1 16 -14 -21 7 33 7 -26 7 18 -11 -31 -6 23 13 5 5 -1 -14 7 11 -24 -12 21 21 -17 -25 10 9 -14 -11 12 -1 -6 -9 -15 -15
3539 -15 -20 9 -5 -29 1 4 -7 -15 -3 3 6 -8 1 3 -5 7 1 -3 -7 8 -2 -3 -1 15 -1 -13 -11 3 -7 -11 -2 0 5 -12 -12 -7 -13 13 9 -16 -10 5
3581 5 7 -18 -12 -11 1 -17 -8 7 -10 -14 1 -7 -28 -8 20 1 -21 -6 8 5 -17 7 6 6 4 2 -1 -3 8 17 5 -12 17 29 8 -24 -2 18
3619 18 1 -15 -20 -9 8 6 -4 -8 -15 11 -4 -28 -12 7 5 -9 -12 1 4 -7 -20 -13 -11 -2 9 -10 -22 -5 13 -6 -14 9 10 -11 -10 4 12
3656 12 16 10 13 2 3 10 -5 -4 -3 11 -7 -14 -5 0 5 -15 -3 6 -9 1 -6 -12 -2 4 7 -19 -14 18 2 -17 -5 13 10 -5 -15 8 -1 -9 2 -14
3696 -14 1 8 12 6 -9 8 20 9 3 9 16 4 -4 -13 -5 16 12 11 1 -1 18 4 -20 -20 -2 -3 -15 -13 -26 -10 5 -15 -25 -4 11 -2 -14 -12
3734 -12 4 13 14 -8 -7 8 15 2 -9 -3 15 9 -5 -6 -3 7 7 -5 -9 4 0 13 -8 0 5 7 5 0 -3 11 8 5 1 -4 8 -3 -1 -4 2 -5 -8 -14 -5 1 4
3779 4 -3 5 9 -4 2 9 14 11 -1 -12 8 16 13 -16 0 13 10 9 -20 15 -2 12 1 -1 -6 12 18 0 -7 11 10 -5 -8 -12 16 -1 -15 -16 -9 8 8
3820 8 -9 -23 2 12 -17 -19 -19 -4 4 -2 -11 7 -3 6 -8 -1 -1 7 13 6 -15 5 9 -6 0 -2 11 2 12 7 10 8 12 -9 -10 -11 2 0 2 8 9 -2 -17
3863 -17 -11 -2 -2 -9 -8 -9 -4 -4 -8 -9 -8 22 9 -18 -5 13 5 -18 -20 -1 -3 -8 -2 6 -8 8 3 10 -2 9 12 15 -13 17 31 7 -10 -9 15 9 2 -7 12
3906 12 -4 10 -3 -11 -21 11 19 -13 -14 -2 12 -6 -24 -18 9 8 6 -8 -22 -5 2 -16 -22 -9 25 10 -15 -11 9 15 4 1 8 12 19 4 -15
3943 -15 -6 17 10 -18 -7 14 14 -3 -13 3 7 1 8 3 -10 5 15 -7 -31 -9 17 -5 -22 -1 4 -23 -27 6 -3 -18 -14 4 -6 -8 1 17 -12
3980 -12 -11 18 17 -8 -4 28 18 -20 -17 18 5 -9 6 14 -4 -4 13 4 -14 -3 36 12 -20 2 17 -1 -16 -5 8 5 -8 5 6 -7 4
4015 4 9 0 -11 13 7 -11 -23 -11 3 4 -17 -4 4 5 8 -8 -10 5 33 1 -4 -1 16 1 3 3 4 1 1 13 -6 -3 26 -2 -20 -12 4 5 -24 -7
4055 -7 14 2 -10 6 10 0 -4 15 -9 -23 -5 13 -25 -36 -2 6 -7 -16 4 11 -30 -8 17 6 2 10 7 8 3 11 9 -8 0 24 18 -22 -2 9
4093 9 -2 -11 5 12 0 8 -6 -8 -8 2 18 -3 -3 15 13 -12 -21 2 14 -2 -11 -4 -12 -6 -11 -6 -5 9 15 -5 -18 -9 7 11 3 -3 14 13 16 6 -5 5
4135 5 21 14 0 -3 16 6 -5 -6 5 4 -5 2 -2 -1 6 -5 -9 -22 -10 1 -9 -17 -12 15 -9 -22 -10 9 -5 0 0 18 5 4 -3 -2 1 6 8 0 -11
4176 -11 16 7 -8 0 17 13 0 -3 8 8 -1 7 -1 1 13 3 3 -8 -3 27 -1 -11 -15 7 0 -17 -7 5 -9 5 -11 -19 -6 8 5 -15 -19 1
4214 1 3 -3 -16 -3 21 11 0 -2 -3 8 16 1 -8 -8 11 -5 -4 9 13 5 16 1 8 6 12 7 -6 0 11 8 -9 -15 7 10 2 -15 5 0 0 -11 -6 -9
4256 -9 -10 -1 -7 -11 10 10 1 -8 6 9 6 3 -7 4 14 -1 2 6 9 1 -1 4 14 8 -3 -3 -1 8 4 -15 -8 4 -4 -5 2 -12 -3 10 -2 -3 2 9 0 0 -10 -9 0
4303 0 -12 -17 -14 4 -1 -13 -3 -15 -5 2 -5 -1 -12 4 11 -12 -4 5 -2 2 4 6 -2 12 6 -9 -6 9 12 -2 -6 -1 9 11 -22 -9 -12 -4 -5 -9 -7 -5 -2 -4 -22
4348 -22 -8 0 -1 -11 -5 3 2 -18 -17 5 0 1 -12 -11 -5 -1 2 -2 -15 -6 12 0 -7 2 11 -3 -1 6 7 6 12 -5 6 7 4 -3 -1 0 10 0 -16 -9 -6 -7 -10 -13
4394 -13 -8 1 -2 -13 -12 -6 -2 -10 -13 -3 0 1 -4 -4 0 -3 -4 -2 -21 -5 -6 4 -11 3 7 8 -6 -4 11 15 7 0 6 -3 3 1 -2 -9 5 8 -6 -8 -4 8 2 -12 -12
4441 -12 -4 -5 -6 -8 -4 -20 -6 -1 -3 -6 -2 4 0 -10 -2 19 14 -7 4 18 -4 -6 12 13 3 -1 15 3 11 10 13 5 -2 -9 3 -1 -21 6 3 -18 -19 2 -3
4484 -3 -10 -2 5 -5 0 1 -16 -8 -2 7 2 -14 -10 -5 -11 -23 -19 3 8 4 -6 -7 0 9 3 3 -1 19 18 -2 -13 3 0 7 0 1 -9 4 1 -11 -10 -4 2 7 -14 -11 16
4531 16 -6 -13 -2 -1 -4 13 5 -7 -10 -2 -2 -11 -20 7 -15 -23 -14 8 1 -11 -2 -6 -4 12 0 5 -7 -4 7 8 -6 5 13 4 -5 16 6 8 -4 2 9 -1
4573 -1 3 -7 -4 -5 7 -1 1 6 2 10 -7 -5 4 -5 -7 -6 0 -3 0 -10 -7 -22 0 -3 -4 -2 0 11 -4 -8 1 -3 -1 1 2 -5 -2 5 -5 -3 6 11 4 1 7 6 2 -7 7 6 -9
4624 -9 -8 3 -12 -12 -5 10 -13 -10 1 -5 0 -21 -6 7 -4 -8 -8 -8 -5 -7 -2 -9 -9 2 -9 -8 2 5 5 -13 -3 1 2 -8 -2 -3 -1 5 6 -12 -1 2 10 2
4668 2 4 11 4 9 -8 -2 0 3 5 3 -12 -13 -5 -14 -21 -14 -8 -19 -8 -11 0 -8 -14 -7 -4 -1 -6 -9 1 -4 6 4 -10 -13 7 5 -1 -6 12 17 -7 -4 -3 8 -5 -3 -3 -6
4716 -6 1 9 -7 -6 1 13 0 -15 -3 3 0 -3 6 -11 -12 -2 -8 -7 -9 0 -5 -11 -9 0 -2 -9 -10 -11 5 0 6 -2 -2 5 0 10 -4 -3 9 2 9 4 0 -3 -4 3 -2 -3 -6 -8
4766 -8 -1 -8 -2 -1 -5 -8 1 -3 -3 3 4 5 -6 -8 -11 -4 -6 1 -12 -10 -13 -5 -8 -5 -5 3 -11 -13 -8 2 -12 5 -9 -1 4 -3 11 -2 2 12 9 6 -1 3 6 -1 1 4 15 9
4816 9 -1 -4 -2 2 -7 -6 -17 -3 5 -11 -20 -7 -4 -2 -17 -13 3 12 0 1 -7 -2 6 3 -8 -14 1 2 -3 -10 5 -1 2 -9 2 -1 5 -2 1 -1 8 15 -7 -1 5 1 11
4863 11 -2 -4 -7 -6 7 0 -9 1 -5 -8 -17 -8 -3 1 -12 -11 -11 8 -7 -6 1 3 2 -1 -11 6 10 6 -3 -2 7 -3 -3 -4 -1 -5 0 -7 14 0 19 -7 -1 8 1 1 9
4910 9 2 9 7 -3 -13 3 3 2 -1 -3 -5 -2 1 -9 3 -7 3 -14 -25 -7 2 6 -9 -14 1 -3 3 -4 -7 2 9 10 2 -10 14 4 3 2 -3 6 -2 13 -3 -4
4954 -4 5 -1 5 -3 9 -5 2 -8 -3 4 1 5 0 -6 3 -6 2 -1 4 -11 -4 -1 0 2 -1 -9 -3 -1 -1 -6 -1 4 6 4 -1 5 10 10 4 1 3 3 13 6 2 -1 3 4 -10 -13 0 2 -9
5007 -9 4 -4 -1 3 -2 0 -1 2 1 -6 -9 -10 17 -5 -4 -3 -2 -9 0 2 7 1 15 2 -6 5 -8 4 -10 -17 -5 7 10 4 3 9 6 13 7 4 5 18 -3 7 13 10 12
5054 12 -4 9 3 10 -3 -11 -9 -1 -5 0 -6 -28 -6 -3 -20 -8 -8 -2 -16 -1 3 3 -2 -5 -5 -3 -8 -4 -4 -11 -6 0 -1 3 10 10 9 4 9 13 13 -2 5 13 -5 12 17 7
5102 7 -1 7 6 3 -6 9 4 -5 -4 -1 14 -6 -12 -3 -3 -7 -7 -7 -11 -1 0 0 -10 1 10 3 -11 -8 8 5 4 9 -3 -3 -8 -4 -5 7 8 8 2 10 5 2 7 -6 1 2 1 7
5152 7 -4 -11 -2 7 -6 -6 -8 -3 -7 -16 -14 -8 -5 -13 -14 -9 -15 4 -10 -8 -5 6 2 0 -1 8 4 5 -1 8 0 4 14 3 -5 1 15 8 -2 5 3 -10 -1 7 10 -4 -1 -1 -4 -12
5202 -12 6 -2 -4 -3 3 -10 -8 0 -7 -3 -12 -3 -3 -3 -1 -2 -6 -4 -4 -8 -10 -8 -10 -7 4 8 5 14 5 11 1 15 6 5 8 6 8 9 1 -2 3 5 8 -8 1 -7 -5 -5 -5 -12 -2 4 0
5255 0 -12 2 4 -3 -14 3 -2 11 -3 -12 -2 1 -6 0 -3 -9 -4 -8 0 -4 -7 1 0 0 -2 -6 8 -3 23 8 11 7 4 4 5 9 5 -5 7 6 -3 0 -13 -8 -2 -17
5301 -17 -5 -3 -4 -16 -18 -6 -7 -4 -2 -1 -10 4 5 3 -7 6 4 10 8 -10 -5 -4 6 0 12 -11 -1 -3 6 9 4 -3 -3 -6 11 2 2 7 5 14 0 1 7 0 15 4
5347 4 -6 -8 -7 -6 2 -12 -7 -6 -9 -2 -5 -18 -7 5 -3 -4 -10 -2 -2 -2 -12 7 -6 -1 -1 12 -7 0 -3 -9 -4 1 4 5 8 -5 -2 0 -11 -3 11 -2 2 2 5 6 0
5394 0 -7 -3 -3 0 -6 -5 -12 3 0 -15 -3 -8 -10 0 -20 -6 2 -5 9 -4 -2 9 -4 0 9 4 15 1 8 3 16 11 -2 7 11 2 9 5 1 5 0 -3 -1 2 7 4 10
5441 10 10 1 -5 6 -5 -13 5 1 -3 -7 -9 -13 -5 -6 -16 -8 -3 -5 2 -7 2 -3 3 8 4 6 5 -4 6 15 13 21 7 3 20 26 5 10 6 -3 -1 1 3 4 -2 -2 5 0 14 13 -4
5492 -4 -2 -5 -10 -2 0 -6 15 1 4 -2 3 -10 8 1 -3 -1 -15 -7 -3 -1 1 10 -6 -5 4 3 -3 4 4 0 4 11 16 13 -6 8 11 5 -2 0 12 2 5 6 -4 11 -4 -11
5540 -11 -1 -14 -4 -2 0 -1 -3 -2 -8 -6 -5 -7 -3 -13 -8 -12 -6 2 -11 -1 -11 4 -9 -7 -2 17 11 4 0 1 10 -1 9 -1 2 10 -2 7 9 4 9 3 -2 -4 -6 2
5586 2 -10 7 -10 -7 0 -6 -5 -10 -18 -15 -4 13 -14 -9 -17 -7 9 -2 -4 -3 5 10 11 -6 5 7 9 2 -2 8 -4 -5 0 12 2 3 -2 -2 3 2 1 2 -8 5
5630 5 -8 4 2 0 2 4 3 -7 1 -3 6 -16 -9 -5 -8 -11 -1 1 -7 -5 -8 -11 -10 -5 -8 2 1 2 0 -6 -4 -3 -8 5 -6 0 -1 -2 7 2 4 -3 -7 -4 -8 -1 -7 3 0 -10 1
5681 1 -11 -8 -3 3 -5 -7 -3 -2 -9 -11 -7 -8 -8 -4 -18 -12 1 -18 -8 -20 -14 -8 -7 -4 -12 -9 0 0 0 -11 1 6 4 -5 11 4 -6 12 13 -1 4 -1 2 -9 -3 0 3 6
5729 6 16 -10 -4 -10 4 -13 -8 -4 -3 1 -11 6 2 -3 -9 -7 -3 -6 -8 3 -11 3 -5 4 -7 -9 -3 -7 -4 -5 -5 4 -3 3 -4 0 0 3 -6 0 0 8 4 -8 9 -5 9
5776 9 -3 -5 -24 -7 -6 -16 -4 -6 4 -4 2 -8 -16 -8 -8 -13 -9 2 0 -5 -1 6 -10 -8 5 4 -4 -8 -13 -12 3 -10 -5 -3 -2 7 0 3 0 10 -3 1 0 0 4 3 1
5823 1 -2 -3 -7 -6 -13 0 -7 3 1 -6 -2 -6 -7 -17 -18 -15 -4 -2 1 -9 -3 5 1 -10 -3 -9 -4 -2 -6 -8 5 -2 3 12 -5 -1 -2 -2 -7 2 8 2 -4 6 1 8 -3 -6 5 3
5873 3 9 -9 -10 -4 -6 5 -10 -9 -14 -11 -19 -12 -3 -3 -7 -10 -11 -10 -1 -6 -13 -1 3 2 -10 1 0 4 3 8 -2 3 8 8 -5 1 7 6 -11 1 -5 -2 8 3 0 -1 -8 -7 0 -1
5923 -1 13 -4 0 1 1 6 -4 -15 -8 -2 -6 -14 -2 -2 -13 2 -9 -4 3 1 7 -1 1 5 4 -10 -5 5 12 7 9 13 9 10 7 -2 8 -4 0 8 6 6 3 -4 2 -1 -2 4 3
5972 3 -2 -7 8 -5 -2 5 3 6 6 -5 -7 -2 1 -4 -7 -5 0 -5 -6 -8 -9 -15 -13 3 -5 -19 -10 -7 -3 0 3 4 5 12 14 2 -1 2 -2 1 -4 0 -3 -3 -12 -12 -6 -10 -10 -5 -5 -19 -10 -8
6026 -8 -12 -5 -9 3 -5 -2 -2 -11 -9 1 -10 3 8 -13 -3 -13 -3 -5 7 -17 -7 -3 -10 5 6 -1 2 -11 10 -3 -14 8 4 5 6 3 4 3 1 0 0 -10 3
6069 3 -9 -4 -6 -10 -9 -13 -15 -7 8 -13 -7 -2 1 6 2 -11 1 1 1 2 -6 5 -12 1 -7 -4 4 -3 -3 -16 -1 7 -2 -3 -9 -1 8 4 4 -5 -1 4 1 -4 -7 -1 -11 1 1
6118 1 -11 -3 -10 0 -13 -15 -3 -9 -8 -13 -4 -5 -7 -7 -13 -5 -3 -2 -7 -8 11 -4 10 7 13 4 5 18 4 -7 1 -6 4 11 7 -4 -4 8 2 3 -6 3 -7 15 -8
6163 -8 -4 5 -1 7 -11 -11 0 11 -6 -9 -7 -4 -21 -13 -10 -7 -9 -10 -2 0 2 0 -3 -5 2 3 2 -9 2 -2 12 1 -4 3 10 -3 -3 10 -1 -6 -3 -9 1 -1 7 -1 -5 -5
6211 -5 -3 13 -9 -15 -14 -5 -12 -1 -10 -1 5 2 -3 6 -14 -1 -11 -15 -6 -10 -19 -6 -2 -3 1 -7 -2 7 -6 -4 -3 -6 3 -6 4 -2 9 10 -2 -17 -1 0 8 -5 -9 3
6257 3 -4 -4 -2 -3 1 -1 -13 -7 -12 -6 -5 -12 -7 -10 -7 -7 -8 1 8 4 -5 1 -6 -5 4 6 -2 -6 4 -5 -10 -4 -12 -2 4 -9 -5 -7 4 0 -7 -1 7 10 -5 -1 7 9 -5 -3 -8 -10 -3 -6
6311 -6 -15 -12 -15 -14 -1 -2 -14 -9 -6 -9 -24 -18 -8 -7 -5 -13 -9 -6 -12 -12 -3 -6 5 -11 -8 -2 -1 -6 -7 -9 5 -3 9 1 14 -3 -7 5 1 11 -1 -3 2 1 -3 -3 -9 2
6359 2 -4 -6 -4 -15 -18 -15 -14 -7 -14 -2 -10 -3 -1 -20 -7 3 0 3 -3 8 1 -11 3 -7 -5 8 5 -3 8 -8 -4 5 1 1 3 9 7 4 1 -6 -6 -7 -7 10 2 -2 2 2
6407 2 -13 -3 -7 -10 -7 -11 -11 -16 -12 0 -5 -9 6 -14 -7 0 -12 -10 -7 -10 -15 -5 -3 -5 4 5 6 10 12 14 4 -8 2 0 -9 -3 -2 3 -4 -15 -4 -6 -12 -2 -7 -1 -10 -6
6455 -6 -9 -20 -9 -5 -3 4 -11 -6 -14 -9 -9 -22 -11 -6 -6 -5 6 8 0 -2 3 6 2 -5 0 0 1 5 7 10 2 3 -1 0 -5 0 -7 1 -14 -7 15 -8 -8 -12 -8 -10 -4 3 -5 -19 -13
6506 -13 -16 -8 -6 -16 -3 -15 -10 -9 -3 -17 -12 -8 -3 -4 -13 -8 -8 2 3 -7 1 -9 -3 -2 2 2 -1 5 4 -2 6 -2 -1 0 4 5 -8 -12 -6 -7 -6 -5 -9 -6 -3 0 -8 -9 -9 -14 -12 -12
6558 -12 -8 -16 -19 -12 -5 -2 1 -1 -7 -14 -7 1 6 -2 6 0 -14 -2 -8 6 -2 -6 -5 5 -12 -3 8 -1 1 -10 -20 -4 -2 -8 1 -5 6 1 -4 -8 -16 0 -5 -7 -10 -15 2 -11
6606 -11 -15 2 -6 -16 2 -16 -4 -11 -8 1 2 12 -2 -2 2 -1 7 -1 10 11 -4 -2 1 0 6 7 5 -5 4 9 1 -7 1 5 -9 7 -9 -6 4 6 8 -1 6 -7 -14
6651 -14 5 0 7 -3 5 -9 -1 -14 -8 -2 -4 -3 8 -5 -12 -17 4 1 -3 2 -2 1 7 10 4 7 13 10 9 -10 0 9 -5 -5 -2 0 -5 -4 -3 -8 -1 -4 -9 -15 -3 0 -7 -10 2
6700 2 -2 8 -6 -12 -6 -6 -3 -7 -3 2 -11 4 -10 -11 -9 -5 -3 -6 -3 1 -6 -7 2 3 8 3 3 2 1 3 0 0 2 5 -2 2 -5 3 10 -19 -10 -7 -4 -8 -5 1 -14 -5 2 -9 -20 -4
6752 -4 -7 -2 -9 -4 -1 -2 -8 -9 -6 -7 -7 -5 7 4 -9 -6 -3 2 -4 5 7 -1 8 5 3 1 13 18 -2 -3 10 -7 3 -7 -11 0 -7 6 -10 -15 0 -9 -13 -10 5 3 -4 1
6800 1 -2 -8 -10 -14 -6 -3 0 4 -4 -8 -4 -8 1 0 -6 0 -5 11 7 -3 2 -5 -1 -1 3 0 -6 -5 7 2 11 -12 -1 -14 -9 -2 0 -6 -12 4 -11 -11 -19 -8 -3 -9 -14 -18 -9 -9 -8 -3
6852 -3 7 -9 -5 -3 -11 -3 0 -8 -3 6 7 4 -1 7 10 -10 -3 8 -5 -2 -13 -8 -3 5 -11 2 -10 -8 -1 -8 -8 -5 -4 -4 0 -6 -6 -2 -18 -7 -4 -12 -11 -2 -3 -11 -1 -16
6900 -16 -15 -13 -10 -16 -3 -21 -9 -5 -3 -6 1 -3 9 -3 -3 7 -3 -3 3 4 -5 0 -5 -5 6 5 -5 5 -3 0 -5 -14 -2 -7 -7 -10 -4 -10 -8 -9 -13 -13 -6 -6 -7 -5 -8 -4 -7
6949 -7 -9 -13 -5 -6 1 -10 -3 -11 -6 0 -8 1 -3 -10 -13 -9 -3 -2 -15 1 -3 2 -3 6 5 -7 7 4 -2 -14 -15 -10 -2 -10 -16 -17 -20 -8 -16 -24 -3 -4 -7 -12 -15 -1 -9 -6 5 2 1
7000 1 -7 -9 -11 -2 1 1 -8 -8 6 2 0 -7 -12 -10 0 -11 1 12 2 -1 8 2 -3 8 2 -5 1 1 -12 -19 -10 -1 -2 -11 -13 -5 -11 -11 -26 -14 -9 -21 -1 -8 -5 4 -8 -16
7048 -16 -3 -7 -3 8 -2 2 3 3 -2 0 0 3 -3 -7 -5 -1 -3 -4 -4 1 6 -6 -1 0 6 -2 7 -10 10 -9 12 -10 -8 -5 -1 -6 -22 -7 -2 -12 -13 -1 -10 -7 -18 -17
7094 -17 -6 -8 1 -2 4 0 1 12 -6 8 2 10 11 5 8 14 -2 4 5 0 1 4 2 10 -7 4 -9 -1 -3 0 3 1 8 0 -2 -3 -5 3 -2 -5 -15 -3 -14 3 -2 -7 -9 2
7142 2 -4 -16 -12 -11 -6 -3 4 -9 6 4 -6 -11 14 4 5 13 -5 -5 0 2 0 4 -5 -1 -8 -4 -5 -9 -10 -18 -11 -12 -10 1 -2 -11 -13 -1 -15 -16 -16 -3 -9 -6 -11 -7 -8 -10 -10 -10
7192 -10 -2 -6 -1 -2 -8 -8 -8 -4 -6 0 -2 -3 1 7 2 3 -2 -9 -6 5 -4 1 -1 11 0 -13 -2 -10 -6 6 -5 -1 -1 -12 -9 -5 -4 -11 3 -2 -5 1 -5 -2 5 -9 -8 -11 11
7241 11 0 -1 -3 1 -2 0 -8 8 -3 3 1 -6 -5 7 -4 -5 5 2 -7 6 3 10 9 4 -4 -2 -2 -1 -11 -22 -7 -4 -5 -10 -4 -5 -3 -19 -2 -2 -3 -1 -7 -5 0 8 -11
7288 -11 3 -2 -10 0 -6 -7 -1 3 3 -10 2 -2 2 -2 -13 -6 -14 -7 0 -7 -5 -13 2 -4 -15 0 -1 -5 -14 -14 2 -10 -13 -11 -8 -1 -7 -7 -2 -8 -8 -5 -6 -3 -14 -11 -3 -9 -6
7337 -6 -1 7 4 14 4 -3 5 3 9 5 8 -1 2 -4 4 -5 -9 -2 -10 1 2 -5 3 -3 -14 3 -8 -1 3 -5 -10 -7 -5 -7 -10 -6 -15 -5 -3 0 -14 -13 -5 -11 -14 -18 -14 -2 -3 -13 -8
7388 -8 6 -5 5 4 4 3 0 6 -1 9 -5 0 4 3 -6 0 3 -4 0 -3 -13 -5 -11 0 -6 -20 -12 -9 -4 -10 -10 -9 -12 0 -5 -11 -12 3 3 -2 -9 -5 7 -7 -1 -13 -11 -21
7436 -21 -5 -2 -6 -6 -1 -3 -4 1 5 6 -6 -4 -12 9 -5 -3 0 3 5 2 -14 -6 -7 -8 -12 -9 -9 -13 3 -10 -4 -9 -11 -3 -8 -4 -6 -21 -11 -12 -5 -11 -17 -6 -9 -3 -15 5
7484 5 -8 -5 0 10 -2 6 9 2 -4 -3 -8 4 2 -6 3 3 6 -7 -3 -4 -3 -1 10 -6 -4 -10 -3 -6 -12 -5 -8 -21 -12 -6 -1 -12 -1 -8 -4 -10 -4 -16 -8 -9 -4 3 -8 -2 7
7533 7 -12 -12 -10 1 -11 -9 -5 -5 1 4 5 -9 -6 1 2 -6 7 -5 -3 -5 -8 6 -8 3 -7 -3 -2 3 -8 -1 -1 -13 -8 -16 -12 -14 -12 -13 -10 -5 4 -11 -2 3 -12 -4 -10
7580 -10 0 3 -4 0 3 -5 7 -9 -12 2 -3 -9 -16 11 -4 -10 -11 -11 2 -3 -15 -16 -3 -4 -11 -12 -7 -4 -4 -13 -6 -5 -1 -7 -10 -8 -10 7 -8 -13 -18 3 -8 -6 -5 4 3
7627 3 -3 -3 4 -4 12 -3 2 4 1 10 -5 18 9 -3 -1 0 11 3 -4 0 -10 -16 4 2 -4 -12 -3 -4 6 -7 -14 -7 -8 -13 -7 0 -3 1 -1 -5 -6 6 3 -3 -4 -8 -1 -5 -2 -8
7677 -8 -4 -3 1 -8 0 -4 -2 0 4 3 -3 -3 -1 2 -11 -2 -5 -3 -9 -11 0 -2 -27 -8 -17 -10 -16 -17 -6 -17 -28 -14 0 -16 -15 -12 -16 -9 1 -10 -3 4 -2 -4 -3 -4 -5 -2 -7
7726 -7 1 -1 -1 3 -3 -5 -7 6 2 2 -11 4 1 3 8 -4 -3 -5 -5 4 -3 2 1 -5 -9 -3 -3 -11 -1 -16 -10 0 -13 -15 -12 -16 -13 -5 -3 -3 -5 -3 -5 -10 -12 -10 -5 -9 -10 -3 7 -5
7778 -5 -6 6 7 4 11 1 -3 -9 -5 -2 -5 -3 -9 -11 -5 6 1 -6 -12 -3 -15 -2 7 -6 -1 -7 -6 -5 -7 -12 -10 -11 -10 -5 -4 -7 -5 -5 -6 -4 1 -4 5 6 3 0 -8 6 -6 -1 -1 5 5
7831 5 -7 5 -12 -7 -2 -11 2 -1 -4 -6 -9 -12 -3 1 -4 -5 3 -17 -8 -8 -7 -4 -12 -3 -1 -7 -10 -10 -11 -7 -4 -8 -6 -7 -2 -7 -10 -2 -3 2 -7 5 3 2 -4 9 12 4 21 -5 2 6
7883 6 7 -3 -6 1 -4 -10 2 -1 -1 -15 -14 -11 -8 -14 -16 -11 -19 4 -1 -7 0 7 -6 -8 -5 -4 5 -2 -7 -11 -11 -4 3 0 -3 1 -5 -3 5 8 15 6 5 9 4 1 2 -2 6 -4 -5 -3 1 5 -5
7938 -5 -3 6 -7 -6 -13 -1 -7 -9 -7 2 -9 -12 -4 -9 -4 -10 5 10 -5 6 -8 -1 14 -2 -5 -5 -5 -1 -5 -4 4 -4 7 1 -3 -4 -1 5 -2 -3 4 7 5 5 0 2 4 -7 -8 -11
7988 -11 -5 -2 -4 -12 -5 -8 -6 1 -6 -3 -5 11 -10 -4 -6 -9 1 -9 -6 8 2 -12 5 -1 2 8 20 5 5 -1 7 4 3 0 5 6 2 13 -4 14 -3 -8 -7 -4 -15 4
8034 4 3 -6 -5 2 -16 -8 -8 -8 -11 -7 -9 -2 -10 -16 0 -15 -6 -5 -10 0 -2 -2 -4 4 2 9 -3 -5 10 10 6 5 -2 8 8 6 -1 1 1 1 1 -13 6 12 -1 -4 1 -4 2 -2 -12
8085 -12 -9 -1 -8 -3 -10 -12 1 -3 -18 -5 -8 -2 4 1 -4 -4 -4 -8 -5 1 2 -6 -2 -5 -8 -2 -2 10 -3 12 3 6 6 5 8 9 -4 1 6 -4 2 -9 -5 -2 -11 -16 -2 -3 -11 -3
8135 -3 -7 -6 -8 -15 -11 -18 -10 -9 2 -5 -5 0 -5 -3 -12 1 -2 6 8 3 -18 6 0 2 1 5 6 3 1 0 9 2 13 2 6 12 3 3 -4 12 2 -9 -5 -2 -13 -2 -2 -15 -10
8184 -10 -9 -10 0 -19 -6 -11 -9
8191i
##END NTUPLES=NMR FID
##END=
