##TITLE=1H_IBDP3001
 CDCl3, 8 sc, 
 8.2.2019
##JCAMPDX= 6.0         $$ Bruker NMR JCAMP-DX V2.0
##DATA TYPE= NMR FID
##DATA CLASS= NTUPLES
##ORIGIN= UXNMR, Bruker Analytische Messtechnik GmbH
##OWNER= root
$$ XWIN-NMR		Version 3.5
$$ Fri Feb  8 16:56:30 2019 Russian Standard Time (UT+4h)  she@DPX200
##.OBSERVE FREQUENCY= 200.1313
##.OBSERVE NUCLEUS= ^1H
##.DELAY= (6, 6)
##.ACQUISITION MODE= SIMULTANEOUS
##.ACQUISITION SCHEME= undefined
##.AVERAGES= 8
##.DIGITISER RES= 18
##SPECTROMETER/DATA SYSTEM= spect
##.PULSE SEQUENCE= zg30
##.SOLVENT NAME= CDCl3
##.SHIFT REFERENCE= (INTERNAL, CDCl3, 0, 15.7039)
##AUDIT TRAIL= $$ (NUMBER, WHEN, WHO, WHERE, WHAT)
$$ ##TITLE= Audit trail, XWIN-NMR		Version 3.5
$$ ##JCAMPDX= 5.01
$$ ##ORIGIN= Bruker BioSpin GmbH
$$ ##OWNER= she
$$ F:/spectra/data/she/nmr/H-F/1/audita.txt
$$ ##AUDIT TRAIL=  $$ (NUMBER, WHEN, WHO, WHERE, WHAT)
(   1,<2019-02-08 16:55:31.84 +0400>,<she>,<DPX200>,
      <created by zg, POWCHK disabled, PULCHK disabled
       configuration hash MD5:
       00 E9 B6 7A A2 85 ED C7 34 08 36 98 17 FE 4E 26
       data hash MD5: 16K
       C3 78 98 9B 6C 31 D0 57 0E 45 1D EA C6 66 32 3A>)
$$ ##END=
$$ 
$$ hash MD5
$$ EC 42 16 C7 9E 3C 1C 60 89 55 CA BD 97 5B 56 A0
##$RELAX= 
##$RELAX= 
##$RELAX= 
##$RELAX= 
##$RELAX= 
##$RELAX= 
$$ Bruker specific parameters
$$ --------------------------
##$DU= <F:/spectra>
##$EXPNO= 1
##$NAME= <H-F>
##$PROCNO= 1
##$TYPE= <nmr>
##$USER= <she>
##$AMP= (0..31)
100 100 100 100 100 100 100 100 100 100 100 100 100 100 100 100 100 100 
100 100 100 100 100 100 100 100 100 100 100 100 100 100 
##$AQSEQ= 0
##$AQ_mod= 1
##$AUNM= <au_zg>
##$AUTOPOS= <>
##$BF1= 200.13
##$BF2= 200.13
##$BF3= 200.13
##$BF4= 200.13
##$BF5= 200.13
##$BF6= 200.13
##$BF7= 200.13
##$BF8= 200.13
##$BYTORDA= 1
##$CFDGTYP= 0
##$CFRGTYP= 5
##$CHEMSTR= <none>
##$CNST= (0..31)
1 1 145 1 1 1 1 1 1 1 1 1 1 1 1 1 1 1 1 1 1 1 1 1 1 1 1 1 1 1 1 1 
##$CPDPRG= <>
##$CPDPRG1= <>
##$CPDPRG2= <>
##$CPDPRG3= <>
##$CPDPRG4= <mlev>
##$CPDPRG5= <mlev>
##$CPDPRG6= <mlev>
##$CPDPRG7= <mlev>
##$CPDPRG8= <mlev>
##$CPDPRGB= <>
##$CPDPRGT= <>
##$D= (0..31)
0 1.2 0 0 0 0 0 0 0 0 0 0.03 0 0 0 0 0 0 0 0 0 0 0 0 0 0 0 0 0 0 0 0 
##$DATE= 1549630531
##$DBL= (0..7)
120 120 120 120 120 120 120 120 
##$DBP= (0..7)
150 150 150 150 150 150 150 150 
##$DBP07= 0
##$DBPNAM0= <>
##$DBPNAM1= <>
##$DBPNAM2= <>
##$DBPNAM3= <>
##$DBPNAM4= <>
##$DBPNAM5= <>
##$DBPNAM6= <>
##$DBPNAM7= <>
##$DBPOAL= (0..7)
0.5 0.5 0.5 0.5 0.5 0.5 0.5 0.5 
##$DBPOFFS= (0..7)
0 0 0 0 0 0 0 0 
##$DE= 6
##$DECBNUC= <off>
##$DECIM= 32
##$DECNUC= <off>
##$DECSTAT= 4
##$DIGMOD= 1
##$DIGTYP= 9
##$DL= (0..7)
0 120 120 120 120 120 120 120 
##$DP= (0..7)
150 150 150 150 150 150 150 150 
##$DP07= 0
##$DPNAME0= <>
##$DPNAME1= <>
##$DPNAME2= <>
##$DPNAME3= <>
##$DPNAME4= <>
##$DPNAME5= <>
##$DPNAME6= <>
##$DPNAME7= <>
##$DPOAL= (0..7)
0.5 0.5 0.5 0.5 0.5 0.5 0.5 0.5 
##$DPOFFS= (0..7)
0 0 0 0 0 0 0 0 
##$DQDMODE= 0
##$DR= 18
##$DS= 0
##$DSLIST= <SSSSSSSSSSSSSSS>
##$DSPFIRM= 0
$$ [...]
##$SUBNAM2= <"">
##$SUBNAM3= <"">
##$SUBNAM4= <"">
##$SUBNAM5= <"">
##$SUBNAM6= <"">
##$SUBNAM7= <"">
##$SUBNAM8= <"">
##$SUBNAM9= <"">
##$SW= 20.0189088683792
##$SWIBOX= (0..15)
0 0 2 0 0 0 0 0 0 0 0 0 0 0 0 0 
##$SW_h= 4006.41025641026
##$TD= 16384
##$TD0= 1
##$TE= 0
##$TE2= 300
##$TE3= 300
##$TEG= 300
##$TL= (0..7)
0 120 120 120 120 120 120 120 
##$TP= (0..7)
150 150 150 150 150 150 150 150 
##$TP07= 0
##$TPNAME0= <>
##$TPNAME1= <>
##$TPNAME2= <>
##$TPNAME3= <>
##$TPNAME4= <>
##$TPNAME5= <>
##$TPNAME6= <>
##$TPNAME7= <>
##$TPOAL= (0..7)
0.5 0.5 0.5 0.5 0.5 0.5 0.5 0.5 
##$TPOFFS= (0..7)
0 0 0 0 0 0 0 0 
##$TUNHIN= 0
##$TUNHOUT= 0
##$TUNXOUT= 0
##$USERA1= <user>
##$USERA2= <user>
##$USERA3= <user>
##$USERA4= <user>
##$USERA5= <user>
##$V9= 5
##$VALIST= <valist>
##$VCLIST= <CCCCCCCCCCCCCCC>
##$VD= 0
##$VDLIST= <DDDDDDDDDDDDDDD>
##$VPLIST= <PPPPPPPPPPPPPPP>
##$VTLIST= <TTTTTTTTTTTTTTT>
##$WBST= 1024
##$WBSW= 4
##$XGAIN= (0..3)
0 0 0 0 
##$XL= 0
##$YL= 0
##$YMAX_a= 878806
##$YMIN_a= -687997
##$ZGOPTNS= <>
##$ZL1= 120
##$ZL2= 120
##$ZL3= 120
##$ZL4= 120
##$ABSF1= 10
##$ABSF2= 0
##$ABSG= 5
##$ABSL= 3
##$ALPHA= 0
##$AQORDER= 0
##$ASSFAC= 0
##$ASSFACI= 0
##$ASSFACX= 0
##$ASSWID= 0
##$AUNMP= <proc_1d>
##$AZFE= 0.1
##$AZFW= 0.1
##$BCFW= 1
##$BC_mod= 2
##$BYTORDP= 1
##$COROFFS= 0
##$CY= 11.3945322036743
##$DATMOD= 1
##$DC= 2
##$DFILT= <>
##$DTYPP= 0
##$F1P= 18.9103706918063
##$F2P= -1.10871071338519
##$FCOR= 0.5
##$FTSIZE= 0
##$FT_mod= 4
##$GAMMA= 1
##$GB= 0.15
##$INTBC= 1
##$INTSCL= 1
##$ISEN= 128
##$LB= 0.24
##$LEV0= 0
##$LPBIN= 0
##$MAXI= 10000
##$MC2= 0
##$MEAN= 0
##$ME_mod= 0
##$MI= 1.114404
##$NCOEF= 0
##$NC_proc= 0
##$NLEV= 6
##$NOISF1= 3.799351
##$NOISF2= 2.8
##$NSP= 1
##$NTH_PI= 0
##$NZP= 0
##$OFFSET= 15.70392
##$PC= 1
##$PHC0= -8678.81
##$PHC1= 10.60019
##$PH_mod= 1
##$PKNL= yes
##$PPARMOD= 0
##$PSCAL= 0
##$PSIGN= 0
##$REVERSE= no
##$SF= 200.130013532006
##$SI= 16384
##$SIGF1= 3
##$SIGF2= 2
##$SINO= 400
##$SIOLD= 16384
##$SREGLST= <1H.CDCl3>
##$SSB= 0
##$STSI= 0
##$STSR= 0
##$SW_p= 3612.71676300578
##$SYMM= 0
##$S_DEV= 0
##$TDeff= 0
##$TDoff= 0
##$TI= <>
##$TILT= no
##$TM1= 0
##$TM2= 0
##$TOPLEV= 0
##$USERP1= <user>
##$USERP2= <user>
##$USERP3= <user>
##$USERP4= <user>
##$USERP5= <user>
##$WDW= 1
##$XDIM= 8192
##$YMAX_p= 0
##$YMIN_p= 0
$$ End of Bruker specific parameters
$$ ---------------------------------
##NTUPLES= NMR FID
##VAR_NAME=  TIME,          FID/REAL,        FID/IMAG
##SYMBOL=    X,             R,               I
##VAR_TYPE=  INDEPENDENT,   DEPENDENT,       DEPENDENT
##VAR_FORM=  AFFN,          ASDF,            ASDF
##VAR_DIM=   8192,          8192,            8192
##UNITS=     SECONDS,       ARBITRARY UNITS, ARBITRARY UNITS
##FACTOR=    0.0002496,     1,               1
##FIRST=     0,             0,               0
##LAST=      2.0444736,     0,               0
##MIN=       0,             -687997,         0
##MAX=       2.0444736,     878806,          0
$$ Real data points
##PAGE= N=1
##DATA TABLE= (X++(R..R)), XYDATA
$$ plain form
0 0 0 0 0 0 0 0 0 0 -8 8 -8 16 -16 24 -24 39 -41 56 -64 80 -96 113 -136 160 -190 222 -257 295 -342 392 -448
31 -448 511 -583 660 -745 838 -943 1055 -1182 1319 -1464 1629 -1807 2003 -2213 2446 -2700
47 -2700 2979 -3283 3615 -3984 4388 -4838 5336 -5897 6528 -7243 8068 -9022 10149 -11496
61 -11496 13150 -15224 17927 -21609 26938 -35394 50928 -89101 391289 381640 11757 640972
73 640972 394659 -259065 -151143 304831 -198978 -651142 -297034 -132548 -642579 -499311
83 -499311 205181 176517 -282288 94386 553918 122482 -223901 318864 544361 89
93 89 -136161 282581 122814 -330713 -87016 302793 9972 -204110 134097 96837 -479760
104 -479760 -507539 -52490 -129354 -428031 -70294 359901 120565 -80035 294187 477455
$$ packed form
0@%%%%%%%%qJ6j6K4l2M0m8O3q0R7j20J44j76K09k49K96l50M12m79N52o37P34q40
31d48R59j094J243j405J583j781J998k237K501k783L093l436L810m216M659n146
47b700N679o262O898p599Q372r226J0174j1233J2425j3771J5311j7090J9171k1645
61a1496K4646k8374L3151l9536M8547o2332Q6322j40029M80390r649l69883O29215
73F40972k46313o53724J07922M55974n03809m52164L54108J64486n10031J43268
83d99311P04492k8664m58805L76674M59532m31436l46383N42765K25497n44272
93H9j36250M18742j59767m53527K43697L89809k92821k14082L38207l7260n76597
104d79760k7779M55049p6864k98677L57737M30195k39336k00600L74222J83268
$$ plain form
114 477455 192825 180851 426617 220532 -182333 -145338 -56897 -350495 -463324 -134200
124 -134200 -38348 -306862 -259998 87200 113332 -29434 177367 437566 298050 83876
134 83876 114645 72558 -158904 -196839 -27194 -25059 -132687 -43102 78201 -33297 -136828
145 -136828 6267 126359 13365 -74140 18395 42207 -91441 -115659 35790 106807 45301
156 45301 57280 125063 58508 -55082 -12147 64956 -11437 -82085 -3961 -1839 -176402 -221040
168 -221040 -45221 24734 -51486 43030 239709 187003 18377 70636 150372 -4768 -113154
179 -113154 8177 9732 -192086 -191993 -6298 -40921 -157213 19016 204517 51707 -66759
190 -66759 113037 157963 -61856 -62356 151712 82119 -138081 -53118 79259 -97941 -193058
$$ packed form
114D77455k84630j1974K45766k06085m02865L6995Q8441k93598j12829L29124
124a34200R5852k68514M6864L47198K6132j42766K06801K60199j39516k14174
134H3876L0769m2087k31462l7935J69645K135j07628Q9585J21303j11498j03531
145a36828J43095J20092j12994q7505R2535K3812j33648k4218J51449P1017o1506
156D5301J1979O7783o6555j13590M2935P7103p6393p0648P8124K122j74563m4638
168b21040J75819O9955p6220R4516J96679n2706j68626N2259P9736j55140j08386
179a13154J21331J555k01818R3J85695l4623j16292J76229J85501j52810j18466
190f6759J79796M4926k19819n00K14068o9593k20200Q4963J32377j77200r5117
$$ plain form
201 -193058 40970 122009 -78947 -54004 161410 63039 -153894 -18196 149280 -31036
211 -31036 -138609 73103 112058 -118028 -92838 133268 58544 -119603 22734 151245 -54673
222 -54673 -153973 54566 83664 -119185 -59446 154497 52387 -126433 16245 137176 -46632
233 -46632 -111168 90066 90848 -117845 -76926 90467 -18365 -153071 8504 117239 -46875
244 -46875 -81958 104730 92885 -79665 -11053 142500 33644 -89733 34144 88941 -76855
255 -76855 -105696 46608 22550 -116604 -46826 71755 -25343 -102960 26817 84505 -30781
266 -30781 -26596 101724 71943 -38598 16019 93647 4805 -59319 21672 32368 -75432 -80136
278 -80136 2726 -24457 -86715 -21092 48609 1852 -16992 58587 72016 7188 12045 60806
$$ packed form
201a93058K34028Q1039k00956K4943K15414r8371k16933J35698J67476j80316
211c1036j07573K11712L8955k30086K5190K26106p4724j78147J42337J28511k05918
222e4673r9300K08539K9098k02849N9739K13943j02110j78820J42678J20931j83808
233d6632o4536K01234P82k08693M0919J67393j08832j34706J61575J08735j64114
244d6875l5083J86688j1845j72550O8612J53553j08856j23377J23877N4797j65796
255g6855k8841J52304k4058j39154O9778J18581r7098p7617J29777N7688j15286
266c0781M185J28320k9781j10541N4617P7628q8842o4124Q0991J0696j07800m704
278h0136Q2862k7183o2258O5623O9701m6757j8844P5579J3429o4828M857M8761
$$ plain form
290 60806 24748 -32160 -9102 10576 -36614 -54240 -12581 -8356 -41011 -24606 13635 3975
302 3975 -10110 19905 40157 20456 14192 30901 24240 1514 139 5176 -6946 -15873 -10244
315 -10244 -11285 -22193 -24018 -20598 -24106 -25538 -18180 -8476 1981 15191 26882 36701 46283 47316
329 47316 37859 29137 21044 2893 -17946 -26514 -32509 -45846 -50726 -41573 -36341 -35956 -21260 670
343 670 10338 18699 38994 51725 47122 43452 45473 33017 10012 -2405 -8336 -23749 -36999 -35543
357 -35543 -31876 -34372 -32073 -20826 -13630 -10264 -760 12110 18589 21202 28283 34136 30485 21287
371 21287 16276 12580 1057 -12282 -15670 -13571 -19388 -24686 -15959 -7631 -12352 -12070 1661 5552
385 5552 -3802 1726 17970 12754 1297 12635 22324 3767 -6781 9078 8237 -15256 -12789 6032
$$ packed form
290F0806l6058n6908K3058J9678m7190j7626M1659M225l2655J6405L8241r660
302C975j4085L0015K0252j9701o264J6709o661k2726j375N037j2122q927N629
315a0244j041j0908j825L420l508j432P358R704J0457J3210J1691R819R582J033
329D7316r457q722q093j8151k0839q568n995j3337m880R153N232L85J4696K1930
343F70R668Q361K0295J2731m603l670K021j2456k3005j2417n931j5413j3250J456
357c5543L667k496K299J1247P196L366R504J2870O479K613P081N853l651r198
371B1287n011l696j1523j3339l388K099n817n298Q727Q328m721K82J3731L891
385E552r354N528J6244n216j1457J1338R689j8557j0548J5859q41k3493K467J8821
$$ plain form
399 6032 -6241 -25960 -8378 7021 -13539 -16404 15475 19227 -4915 7942 35712 16176 -8632
412 -8632 13285 21209 -19554 -34008 -6086 -15158 -48988 -27615 10763 -5104 -17079 26717 45222
425 45222 10634 13413 53940 35622 -10879 3956 21630 -26544 -55596 -15817 -6942 -46356
437 -46356 -30481 21169 5278 -27037 11389 41829 35 -11985 35543 29930 -24595 -12113
449 -12113 30419 1163 -29393 17530 41651 -8433 -18738 26154 10995 -40993 -18776 18679
461 18679 -22417 -54493 -10834 3632 -38763 -22749 42977 40790 6021 36816 63838 12790
473 12790 -19328 16793 17223 -34130 -31839 4968 -20119 -55751 -18420 17125 -7454 -8342 37501
486 37501 34921 -12242 -8342 20592 -2273 -26602 3249 18688 -16212 -25299 6440 8670 -7569
$$ packed form
399F032j2273j9719J7582J5399k0560k865L1879L752k4142J2857K7770j9536k4808
412h632K1917P924m0763j4454K7922r072l3830K1373L8378j5867j1975M3796J8505
425D5222l4588K779M0527j8318m6501J4835J7674m8174k9052L9779Q875l9414
437d6356J5875N1650j5891l2315L8426L0440m1794j2020M7528n613n4525J2482
449a2113M2532k9256l0556M6923K4121n0084j0305M4892j5159n1988K2217L7455
461A8679m1096l2076M3659J4466m2395J6014O5726k187l4769L0795K7022n1048
473A2790l2118L6121M30n1353K291L6807k5087l5632L7331L5545k4579q88M5843
486C7501k580m7163L900K8934k2865k4329K9851J5439l4900r087L1739K230j6239
$$ plain form
499 -7569 17650 47939 27885 1384 6126 -1646 -32936 -35426 -11387 -10684 -23421 -14611 -2759
512 -2759 -9454 -6943 16416 32011 30222 26326 19119 3944 -10435 -14344 -9852 -822 4151 -1254
526 -1254 -6113 -6753 -13874 -17497 1300 19110 9696 -257 6615 -5273 -34554 -26560 8881 10656
540 10656 -673 23404 35972 128 -14569 21012 25010 -8343 1798 26043 -16765 -61656
552 -61656 -29153 -568 -31312 -22160 41630 36078 -22603 -5193 40909 6130 -20888 39973
564 39973 59636 -15769 -35234 15064 -11480 -70598 -17387 49598 -3184 -43519 21488 31361
576 31361 -49528 -33984 59632 38866 -31517 15373 58357 -26459 -63754 28871 47878 -34181
588 -34181 -14751 61484 -847 -87288 -19040 44274 -29410 -46370 54809 48917 -57906 -34972
$$ packed form
499g569K5219L0289k0054k6501M742p772l1290k490K4039P03j2737Q810J1852
512b759o695K511K3359J5595j789l896p207j5175j4379l909M492R030M973n405
526a254m859o40p121l623J8797J7810r414r953O872j1888k9281P994L5441J775
540A0656j1329K4077J2568l5844j4697L5581L998l3353J0141K4245m2808m4891
552f1656L2503K8585l0744R152O3790n552n8681J7410M6102l4779k7018O0861
564C9973J9663p5405j9465N0298k6544n9118N3211O6985n2782m0335O5007R873
576C1361q0889J5544R3616k0766p0383M6890M2984q4816l7295R2625J9007q2059
588c4181J9430P6235o2331q6441O8248O3314p3684j6960J01179n892j06823K2934
$$ plain form
600 -34972 56616 10845 -46260 43333 89735 -17815 -53823 34779 19200 -74511 -23156 71096
612 71096 1628 -76044 -1145 33608 -60938 -57354 62504 55863 -36856 4391 72770 -7894
624 -7894 -64432 34053 74799 -20088 -28232 53992 7894 -92661 -39456 43120 -16843 -56449
636 -56449 31018 47536 -51117 -48263 46868 31616 -30491 28325 83293 1331 -53106 13281
648 13281 28237 -42601 -26500 50927 17997 -55913 -22169 21173 -28467 -44665 31096 48497
660 48497 -16959 -20504 27323 2315 -40701 4796 53781 17521 -12653 18516 16894 -32682
672 -32682 -29202 18938 15042 -19391 -7673 9317 -23637 -44222 -7557 21940 8582 6554 29472
685 29472 23006 -10234 -13055 11839 14738 -897 2938 11733 -9769 -36330 -25149 -314 -2941
$$ packed form
600c4972R1588m5771n7105Q9593M6402j07550l6008Q8602j5579r3711N1355R4252
612G1096o9468p7672P4899L4753r4546L584J19858o641r2719M1247O8379q0664
624g894n6538R8485M0746r4887q144Q2224m6098j00555N3205Q2576n9963l9606
636e6449Q7467J6518r8653K854R5131j5252o2107N8816N4968q1962n4437O6387
648A3281J4956p0838J6101P7427l2930p3910L3744M3342m9640j6198P5761J7401
660D8497o5456l545M7827k5008m3016M5497M8985l6260l0174L1169j622m9576
672c2682L480M8140l896l4433J1718J6990l2954k0585L6665K9497j3358k028K2918
685B9472o466l3240k821K4894K899j5635L835Q795k1502k6561J1181K4835k627
$$ plain form
698 -2941 -6667 17550 27568 -3807 -20612 6603 18195 -6140 -1702 29786 13714 -31163 -21889
711 -21889 10653 -6251 -22149 18233 36595 -10940 -27170 11171 5886 -34093 -6193 43357
723 43357 11505 -31813 3805 27084 -22512 -30105 33458 36268 -21381 -10524 31548 -8351
735 -8351 -50638 1184 35353 -18850 -31898 27023 18253 -44344 -16317 49679 18495 -25453
747 -25453 22927 45599 -24348 -43450 20137 17417 -39151 -10621 42793 -3511 -50275 4096
759 4096 33158 -23903 -26444 42339 31388 -34526 -11231 39939 -1763 -38908 15609 38475
771 38475 -22907 -31567 24611 12338 -37781 -4164 43831 2432 -33616 10416 23554 -30860
783 -30860 -30308 26658 18966 -24362 -23 34203 -3337 -29958 11210 24709 -16319 -14754 25359
$$ packed form
698b941l726K4217J0018l1375j6805K7215J1592k4335M438L1488j6072m4877R274
711b1889L2542j6904j5898M0382J8362m7535j6230L8341n285l9979K7900M9550
723D3357l1852m3318L5618K3279m9596p593O3563K810n7649J0857M2072l9899
735h351m2287N1822L4169n4203j3048N8921q770o2597K8027O5996l1184m3948
747b5453M8380K2672o9947j9102O3587k720n6568K8530N3414m6304m6764N4371
759D096K9062n7061k541O8783j0951o5914K3295N1170m1702l7145N4517K2866
771C8475o1382q660N6178j2273n0119L3617M7995m1399l6048M4032J3138n4414
783c0860N52N6966p692m3328K4339L4226l7540k6621M1168J3499m1028J565M0113
$$ plain form
796 25359 10139 -27066 -4781 23813 -5019 -23791 8557 15978 -18225 -16818 16240 10108 -12377
809 -12377 4686 22110 -1719 -17479 2275 6205 -13932 -8931 13867 8556 -8157 1043 11552
822 11552 -1631 -10271 2454 6784 -4499 -5127 4571 3292 -4733 -2492 2783 -1422 -7022 -4029
836 -4029 23 -413 -500 4797 9327 6506 500 -265 1010 -4578 -9643 -3341 3649 -217 -2700 5347
852 5347 7365 -2980 -4499 4189 849 -8567 -1760 7291 -798 -6603 4446 7346 -7125 -8112 5407
867 5407 2256 -9404 589 14169 4009 -4411 8009 9587 -8685 -10978 3704 -980 -13874
880 -13874 -2421 11158 -337 -7736 6859 9302 -8329 -8158 7323 2309 -10918 183 12707
893 12707 567 -6439 7194 8836 -7176 -5617 8182 2383 -9070 1062 9805 -2900 -9991
$$ packed form
796B5359j5220l7205K2285K8594k8832j8772L2348P421l4203J407L3058o132k2485
809a2377J7063J7424k3829j5760J9754L930k0137N001K2798n311j6713R200J0509
822A1552j3183q640J2725M330j1283o28R698j279q025K241N275m205n600K993
836d029M052m36q7N297M530k821o006p65J275n588n065O302O990l866k483Q047
852E347K018j0345j519Q688l340r416O807R051q089n805J1049K900j4471r87J3519
867E407l151j1660R993J3580j0160q420J2420J578j8272k293J4682m684j2894
880a3874J1453J3579j1495p399J4595K443j7631J71J5481n014j3227J1101J2524
893A2707j2140p006J3633J642j6012J559J3799n799j1453J0132Q743j2705p091
$$ plain form
906 -9991 1425 2053 -11379 -8560 4293 1584 -4915 4956 12428 3265 -1055 6979 5311 -5746
920 -5746 -4409 3337 -954 -6748 -83 4478 -2826 -4938 1446 47 -5344 -2732 2873 534 -1411
935 -1411 2911 4584 -210 -899 2375 829 -2425 -18 2914 759 -103 2329 1719 -1477 -1975 -977
951 -977 -2925 -3027 -653 -182 -920 705 2886 1005 -691 816 660 -2139 -1668 972 636 -633 1222
968 1222 2402 419 -594 1722 1752 -1570 -845 1948 449 -2413 -731 1571 -1275 -3472 -465 527
984 527 -3077 -3021 1381 1506 -2208 299 4341 1660 -1967 2543 5257 766 -1147 4379 4086 -3766
1000 -3766 -3320 2370 -1390 -7964 -2871 2654 -4326 -7594 1066 3768 -4033 -1267 9866 6054 -3008
1015 -3008 3438 9861 -724 -6792 4521 6165 -7237 -6767 5899 666 -11448 -2094 8700 -2990
$$ packed form
906i991J1416O28j3432K819J2853k709o499R871P472r163m320Q034j668j1057
920e746J337P746m291n794O665M561p304k112O384j399n391K612N605k339j945
935a411M322J673m794o89L274j546l254K407K932k155q62K432o10l196m98R98
951i77j948j02K374M71p38J625K181j881j696J507j56k799M71K640l36j269J855
968A222J180j983j013K316L0l322P25K793j499k862J682K302k846k197L007R92
984E27l604N6M402J25l714K507M042k681l627M510K714m491j913N526k93p852
1000c766M46N690l760o574N093N525o980l268Q660K702p801K766J1133l812r062
1015c008O446O423j0585o068J1313J644j3402M70J2666n233j2114R354J0794j1690
$$ plain form
1029 -2990 -9891 4423 7290 -8868 -6607 10696 5806 -8265 2180 14272 -796 -10151 6829
1042 6829 10727 -8072 -6701 10529 1785 -16266 -4879 8477 -6626 -13947 6695 11297 -8231
1055 -8231 -5495 15023 7626 -9721 3156 16886 -2240 -13860 4095 6804 -13744 -10133 11388
1068 11388 4206 -13658 -483 13070 -4658 -12684 8681 13169 -7559 -5762 13301 3847 -14027
1081 -14027 -1083 13329 -2370 -10523 7044 8919 -11244 -9437 9023 2167 -12981 -1353 10674
1094 10674 -4287 -12200 5196 11311 -3354 -992 15028 8373 -8147 -1716 8122 -3638 -11443
1107 -11443 1347 5066 -9664 -11210 1921 923 -8988 -953 11931 5511 -3658 4183 10011 -1071
1121 -1071 -5226 5989 8018 -4102 -4583 4260 234 -10114 -4232 5360 -1410 -8823 -587 4608
$$ packed form
1029b990o901J4314K867j6158K261J7303m890j4071J0445J2092j5068r355J6980
1042F829L898j8799J371J7230q744j8051J1387J3356j5103p321K0642M602j9528
1055h231K736K0518p397j7347J2877J3730j9126j1620J7955K709k0548L611K1521
1068A1388p182j7864J3175J3553j7728q026K1365M488k0728J797J9063r454j7874
1081a4027J2944J4412j5699q153J7567J875k0163J807J8460o856j5148J1628J2027
1094A0674j4961p913J7396O115j4665K362J6020o655j6520O431R838j1760p805
1107a1443J2790L719j4730j546J3131r98r911Q035J2884o420r169P841N828j1082
1121a071m155J1215K029j2120m81Q843m026j0348N882R592o770p413Q236N195
$$ plain form
1135 4608 -5982 -8624 4736 8262 -2950 -1342 10542 6514 -5977 984 12126 2695 -6318
1148 -6318 3334 6334 -10140 -13619 1179 854 -12724 -4897 11068 1594 -10882 3464 14061
1161 14061 -2194 -7066 11530 11530 -8493 -5402 12034 2243 -13644 550 11970 -7181 -14486
1174 -14486 6239 7049 -13974 -7170 15679 4140 -15158 1193 15639 -5328 -13943 10291 13846
1187 13846 -9339 -4898 16871 3597 -16275 689 13972 -9704 -17900 8818 10042 -15721
1199 -15721 -8279 18651 6241 -15600 2749 17845 -5357 -14607 9963 11180 -13221 -6360 16279
1212 16279 1465 -18436 1162 14987 -9531 -16101 11473 13117 -11773 -5702 17536 4692
1224 4692 -15495 302 12814 -7289 -12434 10579 9936 -11515 -3703 15183 173 -17615 -36
$$ packed form
1135D608j0590k642J3360L526j1212J608J1884m028j2491O961J1142r431r013
1148f318R652L000j6474l479J4798l25j3578P827J5965r474j2476J4346J0597
1161A4061j6255m872J8596%k0023L091J7436r791j5887J4194J1420j9151p305
1174a4486K0725Q10k1023O804K2849j1539j9298J6351J4446k0967q615K4234L555
1187A3846k3185M441K1769j3274j9872J6964J3283k3676q196K6718J224k5763
1199a5721P442K6930j2410k1841J8349J5096k3202r250K4570J217k4401O861K2639
1212A6279j4814j9901J9598J3825k4518o570K7574J644k4890O071K3238j2844
1224D692k0187J5797J2512k0103n145K3013o43k1451P812J8886j5010j7788J7579
$$ plain form
1237 -36 12239 -8123 -13679 8772 10822 -8656 -4031 12989 3805 -9876 2253 10070 -5694
1250 -5694 -8594 8957 7009 -9809 -3884 10719 -418 -14515 -2431 8123 -3668 -7879 6427
1263 6427 8249 -4046 -2432 6264 -203 -7296 1891 7309 -2390 -3960 7085 6606 -4976 -3774
1277 -3774 5571 969 -8093 -4183 1787 -2552 -5456 959 3417 -1061 -433 3757 611 -3408 1035
1292 1035 5696 2012 -805 3882 5611 -877 -4621 -381 1263 -3226 -4170 178 476 -2840 -2107 370
1308 370 -1118 -2599 775 2124 -1549 -1158 4891 5101 147 1405 6606 3501 -3600 -2605 912 -2779
1324 -2779 -5610 -1596 726 -3291 -3226 1073 -661 -3890 622 5085 775 -1709 4750 5947 -1116
1339 -1116 -1492 4643 2716 -3605 -1658 2277 -1866 -4813 254 1088 -3993 -2519 2746 -603 -5534
$$ packed form
1237c6J2275k0362n556K2451K050j9478M625J7020r184j3681J2129P817j5764
1250e694k900J7551j948j6818N925J4603j1137j4097J2084J0554j1791m211J4306
1263F427J822j2295J614Q696o467p093R187N418r699j570J1045m79j1582J202
1277c774R345m602r062L910N970m339k904O415K458m478O28M190l146m019M443
1292A035M661l684k817M687J729o488l744M240J644m489r44M348K98l316P33K477
1308C70j488j481L374J349l673L91O049K10m954J258N201l105p101R95L517l691
1324b779k831M014K322m017O5M299j734l229M512M463m310k484O459J197p063
1339a116l76O135j927o321J947L935m143k947N067Q34n081J474N265l349m931
$$ plain form
1354 -5534 -50 4459 -723 -1896 4709 5347 -822 -341 4300 972 -3778 191 2202 -3558 -4675
1369 -4675 1379 229 -5029 -1387 4486 734 -3268 2338 4567 -1583 -2548 3428 1787 -3319 -515
1384 -515 3198 -1393 -3906 1692 2845 -3162 -1935 3750 1132 -3350 451 4078 -1052 -2904 1993
1399 1993 1816 -3495 -1966 2681 71 -3055 1386 3951 -1714 -2654 2018 833 -3969 -1280 3442
1414 3442 861 -2147 2522 4435 -467 -1401 2570 520 -4300 -1813 1759 -1680 -3635 957 2316
1429 2316 -2082 -1954 2340 1021 -2099 809 4178 1329 -562 2747 2532 -2127 -2568 347 -1516 -4422
1445 -4422 -1521 2250 -248 -1338 2072 2321 -1289 -929 1600 419 -1856 755 2991 467 -443 1828
1461 1828 1275 -2598 -2464 -397 -1303 -2845 -602 1691 401 -239 1504 1694 -562 -642 1012 671 -379
$$ packed form
1354e534N484M509n182j173O605O38o169M81M641l328m750L969K011n760j117
1369d675O054j150n258L642N873l752m002N606K229o150r65N976j641n106K804
1384e15L713m591k513N598J153o007J227N685k618m482L801L627n130j852M897
1399A993j77n311J529M647k610l126M441K565n665r40M672j185m802K689M722
1414C442k581l008M669J913m902r34L971k050m820K487L572l439j955M592J359
1429B316m398J28M294j319l120K908L369k849j891L309k15m659m41K915j863k906
1445d422K901L771k498j090L410K49l610L60K529j181k275K611K236k524r10K271
1461A828n53l873J34K067r06j542K243K293j290o40J743J90k256q0J654l41j050
$$ plain form
1478 -379 799 2119 611 -614 -49 -547 -2571 -2653 -1340 -1072 -1065 266 1938 1454 1253 1214 932 331 -374
1497 -374 -58 513 628 414 693 475 -851 -1523 -1848 -1930 -2255 -1566 -206 1138 1545 1718 2232 1668 351
1516 351 75 101 -245 -532 -78 794 172 -591 -235 -260 -1669 -1805 -519 -324 -730 162 1883 1460 419
1535 419 770 890 -964 -1866 -287 490 -659 174 2253 1720 -435 -366 706 -1070 -2500 -438 752
1552 752 -1054 -869 1621 1537 -838 -662 1675 35 -2067 -121 1592 -455 -1143 1929 1962 -1132 -713
1569 -713 1784 309 -2301 361 3133 447 -1036 1571 1123 -2989 -3405 -193 -1081 -3857 -828 2930
1585 2930 506 -1027 3306 4167 -212 -213 3520 1385 -3146 -1314 2112 -1161 -3953 70 1634 -3448
1601 -3448 -3647 1085 860 -2713 -57 4946 2000 -1657 2206 3777 -1721 -2617 3196 2908 -2669 -1249
$$ packed form
1478c79J178J320j508j225N65m98k024q2J313K68PJ331J672m84k01l9k82o01p05
1497c74L16N71J15k14K79k18j326o72l25q2l25O89J360J344M07J73N14n64j317
1516C51k76K6l46k87M54Q72o22p63L56k5j409j36J286J95m06Q92J721m23j041
1535D19L51J20j854r02J579P77j149Q33K079n33k155O9J072j776j430K062J190
1552G52j806J85K490q4k375J76K337j640k102J946J713k047o88L072L3l094M19
1569g13K497j475k610K662K772k686j483K607m48m112m16L212q88k776L029L758
1585B930k424j533M333Q61m379jL733k135m531J832L426l273k792M023J564n082
1601c448j99M732k25l573K656N003k946l657L863J571n498q96N813k88n577J420
$$ plain form
1617 -1249 3090 -343 -5029 -925 2277 -2553 -4179 1243 1603 -3615 -1711 4797 2815 -1145 2718
1632 2718 5756 -299 -3607 1341 2653 -3522 -2834 2747 -248 -6248 -2830 2045 -2030 -3698 3253
1647 3253 5461 -1181 -1221 4604 2630 -2925 353 5354 -98 -4834 -247 1687 -4673 -4398 2728 2314
1663 2314 -4072 -1474 3845 -468 -4406 1959 6027 413 -1318 4598 3173 -4365 -2671 3572 660
1678 660 -4532 -185 2903 -3677 -6405 650 2474 -3473 -1186 5725 2082 -3858 442 5523 271
1693 271 -2127 4470 5039 -3270 -3942 1808 -525 -6164 -1412 4123 -1465 -5753 440 2606 -3330 -2230
1709 -2230 5992 4714 -2175 680 5425 122 -4529 1712 4636 -2439 -4172 1999 -16 -7044 -3329
1724 -3329 3883 573 -3625 1882 4780 -2098 -3498 3887 4229 -2285 -413 5618 597 -5766 -677
$$ packed form
1617a249M339l433m686M104L202m830j626N422L60n218J904O508j982l960L863
1632B718L038o055l308M948J312o175O88N581k995o000L418M875m075j668O951
1647C253K208o642m0N825j974n555L278N001n452m736M587J934o360K75P126m14
1663B314o386K598N319m313l938O365M068n614j731N916j425p538J694O243k912
1678F60n192M347L088o580k728P055J824n947K287O911l643n940M300N081n252
1693B71k398O597N69q309o72N750k333n639M752N535n588m288O193K166n936J100
1709b230Q222j278o889K855M745n303m651O241K924p075j733O171k015p028L715
1724c329P212l310m198N507K898o878j400P385L42o514J872O031n021o363N089
$$ plain form
1739 -677 3307 -2130 -3655 3342 3172 -4759 -3534 2786 256 -4449 921 5763 -137 -3999 2090
1754 2090 3209 -3025 -1435 5474 2796 -3793 -807 2889 -2460 -5443 1428 3641 -2805 -2604 3238
1769 3238 1295 -4497 -94 5342 1204 -2734 2159 3380 -3727 -4251 2145 1688 -3647 -864 3737
1784 3737 -534 -4499 855 3970 -739 -1603 3928 2854 -4041 -2723 2525 -136 -3758 903 4051
1799 4051 -1543 -3612 1697 2454 -2842 -952 4307 1398 -3547 -613 2615 -1975 -3595 2212 3161
1814 3161 -1628 -1226 3124 773 -3478 -106 3779 -190 -2807 1172 1714 -3551 -2728 2574 1898 -2339
1830 -2339 278 3608 -175 -3550 717 2796 -1442 -1985 2272 955 -3471 -1690 2677 211 -2266
1845 -2266 2103 3396 -1069 -2259 1538 1038 -2905 -904 2453 -52 -3275 -501 1576 -1604 -1852
$$ packed form
1739f77L984n437j525O997j70p931J225O320k530m705N370M842n900l862O089
1754B090J119o234J590O909k678o589K986L696n349k983O871K213o446K01N842
1769C238j943n792M403N436m138l938M893J221p107n24O396m57n335K783M601
1784C737m271l965N354L115m709q64N531j074o895J318N248k661l622M661L148
1799D051n594k069N309P57n296J890N259k909m945K934L228m590j620N807R49
1814C161m789M02M350k351m251L372L885l969k617L979N42n265Q23N302o76m237
1830b339K617L330l783l375M267K079m238n43M257j317m426J781M367k466k477
1845b266M369J293m465j190L797n00l943K001L357k505l223K774K077l180k48
$$ plain form
1860 -1852 2394 2732 -1025 -302 2414 553 -2499 -98 2243 -740 -2255 745 783 -2670 -1735 1996
1876 1996 688 -1537 343 2329 -741 -1808 1039 1775 -842 -612 1924 810 -2022 -426 1824
1891 1824 14 -1217 628 1268 -1618 -2087 710 287 -1381 -216 2211 370 -1281 709 1640 -504
1907 -504 -512 1731 1161 -1391 -981 887 -551 -1878 -54 916 -582 -1125 589 815 -677 -94 1528
1924 1528 637 -494 165 1076 -574 -1376 345 616 -767 -831 604 -255 -1203 -413 717 314 -347 822
1942 822 1478 -139 -333 822 384 -624 -18 832 -331 -1379 -352 173 -945 -977 358 228 -615 -317
1960 -317 728 413 -233 608 1192 95 -135 615 399 -829 -446 405 -310 -866 -541 -21 -703 -793 -123
1979 -123 541 86 271 1013 733 320 586 882 250 -103 294 204 -594 -592 16 -311 -877 -459 36 -233 -549
$$ packed form
1860a852M246L38l757P23K716j861l052K401K341k983j515L000L8l453R35L731
1876A996j308k225J880J986l070j067K847P36k617K30K536j114k832J596K250
1891A824j810j231J845O40k886m69K797m23j668J165K427j841j651J990R31k144
1907e04qK243n70k552M10J868j438j327J824R70j498n43J714K26j492N83J622
1924A528q91j131O59R11j650q02J721K71j383o4J435q59r48P90J130m03o61J169
1942H22O56j617j94J155m38j008O06Q50j163j048J027N25j118l2J335j30q43K98
1960c17J045l15o46Q41N84j097k30P50k16j228L83Q51p15n56L25N20o82r0O70
1979a23O64m55J85P42k80m13K66K96o32l53L97r0p98KO08l27n66M18M95k69l16
$$ plain form
2000 -549 312 366 160 321 761 528 264 396 507 118 -216 -18 82 -353 -457 144 -46 -500 -101 371
2020 371 -14 -217 256 397 -125 168 628 510 150 70 386 238 -16 -334 39 -107 -437 102 -160 -165 69
2041 69 161 261 -106 -13 408 -16 139 276 294 -273 -199 25 -34 -257 90 -226 -377 -92 184 294 -123 60
2063 60 14 30 -55 85 156 -130 -186 287 26 -96 -92 -237 62 -177 -83 -36 -228 -71 -9 101 -217 -100 -111 -1
2087 -1 -230 -3 191 211 100 261 83 164 -153 175 270 -55 -285 54 -34 141 -141 -127 128 -59 178 154 188
2110 188 -184 378 125 120 -84 -79 38 -523 -113 -105 -55 -165 26 32 -216 22 287 150 -23 28 151 -80 -85 -184
2134 -184 274 -6 6 391 155 -90 41 442 -27 -256 -197 221 -322 -641 -138 -6 -268 -59 387 372 -20
2155 -20 -48 229 76 17 160 52 -229 -416 -64 -288 -61 -377 208 200 -255 -24 163 -135 -75 -2 368 -168
$$ packed form
2000e49Q61N4k06J61M40k33k64J32J11l89l34J98J00m35j04O01j90m54L99M72
2020C71l85k03M73J41n22K93M60j18l60q0L16j48k54l18L73j46l30N39k62nK34
2041F9R2J00l67R3M21m24J55J37J8n67P4K24n9k23L47l16j51K85K76J10m17J83
2063F0m6J6q5J40P1k86n6M73k61j22Mj45K99k39R4M7j92J57O2J10l18J17j1J10
2087ak29K27J94K0j11J61j78Q1l17L28R5l25k30L39q8J75k82J4K55j87K37k4L4
2110A88l72N62k53nk04NJ17n61M10QN0j10J91Ok48K38K65j37j73N1J23k31nr9
2134a84M58k80J2L85k36k45J31M01m69k29N9M18n43l19N03J32k62K09M46j5l92
2155b0k8K77j53n9J43j08k81j87L52k24K27l16N85qm55K31J87k98O0P3L70n36
$$ plain form
2177 -168 -155 294 39 -315 289 492 258 -112 -6 119 -329 -438 11 118 -157 -150 275 199 -456 104 589
2198 589 61 -64 313 270 -435 -781 -176 -272 -415 -376 202 116 -247 204 268 66 -47 470 371 -343 -59 -98
2220 -98 -240 -278 -14 465 29 -532 118 43 -481 -222 484 487 -172 134 317 -83 -404 214 425 -83 -165 394
2242 394 34 -403 -51 174 -184 -553 8 156 -443 -439 275 414 156 503 908 394 -351 -147 231 -211 -522
2263 -522 138 190 -575 -372 12 -356 -246 127 718 65 -240 256 223 -480 -88 384 -25 -269 -27 207 -470
2284 -470 -575 112 625 191 -186 546 290 -799 -351 73 157 -94 385 814 -156 -455 276 206 -128 -154 401
2305 401 107 -1167 -421 124 -244 -110 503 768 -190 -374 318 187 -274 259 744 236 -393 -146 -87 -611
2325 -611 -525 376 526 41 -12 372 16 -658 103 791 156 143 268 160 -525 -353 513 485 -164 201 533
$$ packed form
2177a68J3M49k55l54O04K03k34l70J06J25m48j09M49J07k75PM25p6o55N60M85
2198E89n28j25L77m3p05l46O05r6j43L9N78q6l63M51O4k02j13N17r9p14K84l9
2220i8j42l8K64M79m36n61O50p5n24K59P06Lo59L06J83m00l21O18K11n08q2N59
2242C94l60m37L52K25l58l69N61J48n99MP14J39k58L47M05n14p45K04L78m42l11
2263e22O60N2p65K03L84l68J10L73N91o53l05M96l3p03L92M72m09k44K42K34o77
2284d70j05O87N13m34l77P32k56j089M48M24Q4k51M79M29r70k99P31p0l34k6N55
2305D01k94j274P46N45l68J34O13K65r58j84O92j31m61N33M85n08o29K47N9n24
2325f11Q6R01J50m85n3L84l56o74P61O88o35j3J25j08o85J72Q66k8o49L65L32
$$ plain form
2346 533 -360 -757 -319 605 68 -130 474 310 -844 -363 331 40 -305 834 701 -452 -602 204 143
2365 143 -363 -102 953 151 -623 -96 152 -463 -645 669 683 -320 -201 250 -450 -720 202 1092 203
2384 203 -546 577 415 -1065 -508 505 318 -202 351 421 -387 -673 379 496 -373 126 559 148 -961
2403 -961 -34 435 -165 -254 760 650 -707 -615 372 -23 -398 197 750 -23 -781 5 201 -603 -234 667
2423 667 466 -396 -148 283 19 -409 324 486 4 -310 152 109 -622 -230 599 20 -390 50 263 -320
2443 -320 -579 368 240 -67 235 525 127 -389 -42 609 77 -334 200 167 -339 -545 241 -259 -303 203 469
2464 469 163 -287 -22 197 75 205 206 579 -97 -84 166 -66 -134 -94 431 144 -111 270 172 -59 -102 202
2486 202 281 -157 -17 122 30 -348 -190 481 153 -356 186 146 -410 -288 153 121 -459 135 288 89 -133
$$ packed form
2346E33q93l97M38R24n37j98O04j64j154M81O94k91l45J139j33j153j50Q06o1
2365A43n06K61J055q02p74N27K48o15j82J314J4j003J19M51p00k70R22Q90q89
2384B03p49J123j62j480N57J013j87n20N53P0q08k86J052J17q69M99M33m11j109
2403i61R27M69o00q9J014j10j357R2R87l95l75N95N53p73p58P86J96q04L69R01
2423F67k01q62K48M31k64m28P33J62m82l14M62m3p31L92Q29n79m10M40K13n83
2443c20k59R47j28l07L02K90l98n16L47O51n32m11N34l3n06k06P86n00m4N06K66
2464D69l06m50K65K19j22J30JL73o76J3K50k32o8M0N25k87k55L81r8k31m3L04
2486B02P9m38J40J39r2l78J58O71l28n09N42m0n56J22M41l2n80N94J53j99k22
$$ plain form
2507 -133 272 529 41 89 479 -48 -702 -274 270 -245 -337 72 199 -140 -273 583 505 -28 179 402 113
2528 113 -241 115 344 -530 -477 118 95 -296 -136 420 -47 -348 322 306 -197 -336 339 -192 -500 -26 147
2549 147 243 -228 251 552 100 68 347 228 -400 -383 -7 -329 -655 -182 292 141 -10 540 486 177 404
2570 404 367 205 -214 -29 -28 -298 -347 -57 -113 -408 -225 210 142 3 180 260 -374 -85 -294 106 -185 -73
2592 -73 195 107 256 393 439 279 314 184 62 -259 -541 -486 -503 -276 -322 79 232 -92 487 54 -136 160
2614 160 135 113 43 -165 -200 -334 -200 -98 26 287 87 163 379 17 290 119 -111 -288 -315 -322 -208 -409 -182
2637 -182 -11 212 -90 262 67 231 324 67 101 -271 110 -264 -97 -173 -53 54 -178 135 103 379 181
2658 181 232 236 -230 -193 -213 -340 -174 -134 226 -206 -142 211 325 173 -20 61 -200 -285 -66 194 -382 -260 -9
$$ packed form
2507a33M05K57m88M8L90n27o54M28N44n15r2M09J27l39j33Q56p8n33K07K23k89
2528A13l54L56K29q74N3N95k3l91J60N56m67l01O70j6n03j39O75n31l08M74J73
2549A47R6m71M79L01m52l2K79j19o28J7L76l22l26M73M74j51j51N50n4l09K27
2570D04l7j62m19J85Jk70m9K90n6k95J83M35o8j39J77Q0o34K89k09M00k91J12
2592g3K68q8J49J37M6j60L5j30j22l21k82N5j7K27m6M01J53l24N79m33j90K96
2614A60k5k2p0k08l5j34J34J02J24K61k00P6K16l62K73j71k30j77k7pJ14k01K27
2637a82J71K23l02L52j95J64R3k57L4l72L81l74J67p6J20J07k32L13l2K76j98
2658A81N1Mm66L7k0j27J66M0L60m32O4L53J14j52j93Q1k61q5K19K60n76J22K51
$$ plain form
2681 -9 4 -292 -290 157 -95 -70 62 125 -152 -122 40 105 -377 9 126 -53 -40 183 372 115 34 499 234 -374
2705 -374 -130 212 -200 -673 -68 117 -200 -233 105 9 -247 8 432 -73 -387 362 447 -200 -347 46 -101
2726 -101 -331 -235 579 304 -149 -17 181 -287 14 268 195 -331 -540 265 55 -362 272 692 38 -245 200
2747 200 -25 -526 -414 296 343 -505 243 442 -427 -651 51 529 -90 -116 410 -79 -496 -420 365 -97 -449
2768 -449 332 618 -411 -588 374 74 -435 200 460 207 -409 40 328 -447 -134 228 424 -257 -456 113
2788 113 -218 -663 56 785 -179 -541 364 420 -540 26 816 314 -421 331 341 -512 -653 504 333 -246
2808 -246 -240 275 -219 -978 -160 260 -124 -335 499 286 -626 -328 337 358 -533 223 710 -355 -750 5 222
2829 222 -582 -290 577 175 -740 -74 191 -342 -521 684 664 -410 -230 293 119 -423 248 850 -12 -383
$$ packed form
2681iJ3k96KM47k52K5J32O3k77L0J62O5m82L86J17j79J3K23J89k57q1M65k65o08
2705c74K44L42m12m73O05J85l17l3L38r6k56K55M24n05l14P49Q5o47j47L93j47
2726a01k30R6Q14k75m53J32J98m68L01K54p3n26k09Q05k10m17O34M20o54k83M45
2747B00k25n01J12P10M7q48P48J99q69k24P02M78o19k6N26m89m17P6P85m62l52
2768d49P81K86j029j77R62l00n09O35K60k53o16M49K88p75L13L62J96o81j99N69
2788A13l31m45P19P29r64l62R05N6r60N66P90n02p35P52J0q53j41J157j71n79
2808b46ON15m94p59Q18M20l84k11Q34k13r12K98O65K1q91P56M87j065l95P55K17
2829B22q04K92Q67m02r15O66K65n33j79J205k0j074J80N23j74n42O71O02q62l71
$$ plain form
2849 -383 192 190 -686 -699 712 362 -320 116 309 -223 -976 -9 667 -41 -65 507 549 -633 -127 552 132
2870 132 -159 295 370 -468 -956 101 167 -240 28 762 162 -677 -237 243 -33 -250 431 513 -480 -707 109
2891 109 12 -280 246 743 34 -643 -21 296 -414 -415 452 315 -298 101 395 -5 -641 37 311 79 -302
2912 -302 399 154 -538 -456 302 113 -367 480 541 -311 -687 313 567 -201 312 583 69 -584 -339 7
2932 7 -192 -392 457 355 -519 -380 475 304 -261 194 652 -116 -526 49 209 -671 -447 643 320 -282
2952 -282 187 378 -306 -503 609 699 -336 -155 103 -301 -842 -73 531 20 -84 432 270 -283 -94 288
2972 288 354 -418 122 277 -366 -761 -191 201 -502 -172 563 122 -505 47 166 -36 -237 281 389 -399
2992 -399 -580 132 60 -154 380 625 251 -162 426 208 -264 -7 409 -103 -464 -356 84 -212 -223 327 554
$$ packed form
2849c83N75kq76j3J411l50o82M36J93n32p53R67O76p08k4N72M2j182N06O79m20
2870A32k91M54P5q38m88J057O6m07K68P34o00q39M40M80k76k17O81Q2r93k27Q16
2891A09r7k92N26M97p09o77O22L17p10jQ67j37o13L99K94m00o36O78K74k32l81
2912c02P01k45o92Q2P58j89m80Q47O1q52l76J000K54p68N13K71n14o53K45L46
2932Gj99k00Q49j02q74J39Q55j71n65M55M58p68m10N75J60q80K24J090l23o02
2952b82M69J91o84j97J112R0j035J81K58m04n41P69O04n11j04N16j62n53J89L82
2972B88O6p72N40J55o43l95N70L92p03L30P35m41o27N52J19k02k01N18J08p88
2992c99j81P12p2k14N34K45l74m13N88k18m72K57M16n12l61J08M40k96j1N50K27
$$ plain form
3013 554 180 -46 384 60 -121 -257 268 172 -282 38 -95 -270 -222 257 11 -31 293 158 200 -152 5
3034 5 5 -201 -365 110 -47 -241 -87 69 33 165 298 71 147 -137 -140 -182 -222 28 300 172 -43 64 60 238
3058 238 57 10 69 402 -82 -198 -178 -39 -139 -15 143 164 111 310 291 -87 219 351 139 67 -120 38
3080 38 -118 -316 142 -52 -116 -227 -86 -150 -32 82 219 48 -202 127 36 -4 7 82 -144 -20 157 147 -202
3103 -202 117 -14 9 -274 -258 41 -86 -52 76 9 -362 33 206 162 231 137 66 -298 1 219 137 -24 -298
3126 -298 88 108 155 282 214 -23 -154 99 195 -67 0 229 144 214 185 259 -281 -64 179 -109 -139 244 401
3149 401 -180 0 90 -231 -92 97 143 -75 19 55 -101 -256 28 168 -129 -109 127 110 -161 -19 103 187
3171 187 126 -33 261 46 24 62 128 164 -64 123 117 -237 -21 128 -218 11 -83 -114 -223 118 -37 117 -212
$$ packed form
3013E54l74k26M30l24j81j36N25r6m54L20j33j75M8M79k46m2L24j35M2l52J57
3034E%k06j64M75j57j94J54J56l6J32J33k27P6k84lm2m0K50K72j28k15J07mJ78
3058B38j81m7N9L33m84j16K0J39j00J24J58K1n3J99j9l78L06J32k12p2j87J58
3080C8j56j98M58j94o4j11J41o4J18J14J37j71k50L29r1m0J1P5k26J24J77j0l49
3103b02L19j31K3k83J6K99j27L4J28o7l71L95J73m4O9r4p1l64K99K18q2j61k74
3126b98L86K0M7J27o8k37j31K53R6k62O7K29q5P0k9P4n40K17K43k88l0L83J57
3149D01n81J80R0l21J39J89M6k18R4L6j56j55K84J40k97K0K36j7k71J42J22Q4
3171A87o1j59K94k15k2L8O6L6k28J87ol54K16J49l46K29r4l1j09L41j55J54l29
$$ plain form
3194 -212 66 73 -166 257 234 50 -42 -52 -36 -362 -15 -5 -96 -141 -27 -222 64 7 192 46 8 221 235 55
3218 55 184 99 108 193 74 16 -60 -281 77 -305 96 149 92 40 -39 77 21 18 31 -21 37 -132 165 103 -114 -78
3244 -78 -13 -123 -132 191 209 -74 -109 201 165 202 -30 198 62 -31 217 132 -63 -138 -253 310 -160 -164 44 20 30
3269 30 -143 133 -142 -203 291 245 -51 59 131 -119 -264 184 188 -128 138 47 -44 -220 45 83 -83 -251 78
3292 78 29 -8 -100 158 307 -20 56 195 -38 -86 9 -168 -182 -131 -63 -2 -323 221 76 -42 -300 -230 349 -172
3316 -172 -295 -41 129 -194 -301 343 143 -419 157 97 169 148 176 186 -322 -126 334 252 -337 -12 154 -162
3338 -162 -20 -28 548 -327 -114 35 160 -95 -14 164 -69 -305 208 100 -303 -168 22 156 -269 -322 264
3359 264 -26 -448 -237 128 7 -381 213 282 -147 189 320 34 -364 39 442 -189 -3 232 244 -356 -483
$$ packed form
3194b12K78Pk39M23k3j84r2j0J6l26L47J0r1m5J14j95K86n7J85j46l8K13J4j80
3218E5J29q5RQ5j19n8p6k21L58l82M01N3n7n2p9J16n6lJ3n2N8j69K97o2k17L6
3244g8O5j10rL23J8k83l5L10l6L7k32K28j36r3K48q5j95p5j15N63m70mK08k4J0
3269C0j73K76k75o1M94m6k96J10P2k50j45M48Ml16K66r1r1j76K65L8j66j68L29
3292G8m9l7r2K58J49l27P6J39k33m8R5j77j4N1O8O1l21N44j45j18k58P0N79n21
3316a72j23K54J70l23j07O44k00n62N76o0P2k1K8J0n08J96M60q2n89L25J66l16
3338a62J42qN76q75K13J49J25k55Q1J78k33k36N13j08m03J35J90J34m25n3N86
3359B64k90m22K11L65j21l88N94O9m29L36J31k86l98M03M03o31J86K35J2o00j27
$$ plain form
3380 -483 246 225 -350 60 409 121 -147 88 409 -229 -73 201 65 -118 -349 274 250 -308 269 184 -241
3401 -241 -480 329 168 -300 -11 309 140 -272 178 113 -93 -224 198 385 -467 36 132 85 -466 276 411
3422 411 -185 -434 121 199 -245 -51 543 152 -139 108 200 -262 -286 55 163 -480 -225 515 -353 -348 73 167
3444 167 -219 -316 411 113 -241 22 474 166 -325 -76 368 11 -399 16 98 -57 -360 144 133 -436 -83
3465 -83 122 -182 -357 138 463 -179 -14 454 240 -94 112 557 86 -382 -89 370 -36 -351 239 144 -354
3486 -354 -276 170 201 -61 31 461 72 -305 174 565 -120 -439 309 63 -216 -151 159 -135 -577 80 282
3507 282 -39 -280 333 94 -312 35 640 -34 -318 -16 276 -200 -336 256 417 -238 51 288 -36 -259
3527 -259 9 177 -471 -187 348 -22 -345 -261 382 524 -520 -51 121 -368 -98 308 98 -234 -304 233
$$ packed form
3380d83P29k1n75M10L49k88k68K35L21o38J56K74j36j83k31O23k4n58N77q5m25
3401b41k39Q09j61m68K89L20j69m12M50o5k06j31M22J87q52N03R6m7n51P42J35
3422D11n96k49N55P8m44J94N94l91k91K47R2m62k4L41J08o43K55P40q68NM21R4
3444A67l86r7P27k98l54K63M52l08m91K49M44l57m10M15Q2j55l03N04j1n69L53
3465h3K05l04j75M95L25o42J65M68k14l34K06M45m71m68K93M59m06l15N90r5m98
3486c54P8M46L1k62R2M30l89l77M79L91o85l19P48k46k79O5L10k94m42O57K02
3507B82l21k41O13k39m06L47O05o74k84L02K92m76j36N92J61o55K89K37l24k23
3527b59K68J68o48K84N35l70l23Q4O43J42j044M69J72m89K70M06k10l32p0N37
$$ plain form
3547 233 -129 -253 77 7 -118 -228 158 326 -205 -18 59 66 -225 -111 39 -288 -240 35 181 -169 67 503
3569 503 228 -208 289 112 -115 -271 261 162 -180 -101 114 -169 -349 73 317 -214 -171 202 243 -241 -327 -115
3591 -115 -62 -76 -95 153 -15 -172 54 17 160 42 152 284 -19 -124 272 119 -216 -36 9 -72 -64 110 -136
3614 -136 16 -67 35 113 18 174 234 -39 -30 -86 76 -168 -99 158 33 -164 6 87 -114 -38 -24 257 -479 -185
3638 -185 221 123 -240 -186 250 67 -37 112 144 -7 -239 106 -140 6 -54 53 140 4 -182 -96 113 76
3660 76 -55 76 -147 176 16 -218 -91 -142 215 -166 -50 -122 59 -190 80 247 56 42 -68 167 47
3681 47 -255 6 80 -187 67 -76 -107 -27 33 54 -19 -62 -22 167 12 87 -37 -20 -123 154 -1 212 -30 -50
3705 -50 -27 51 -350 -15 277 3 3 -25 51 -118 124 -152 12 9 65 -34 73 114 25 -139 115 34 -147 76 185
$$ packed form
3547B33l62j24L30p0j25j10L86J68n31J87P7Pk91J14J50l27M8K75J46l50K36M36
3569E03k75m36M97j77k27j56N32r9l42P9K15k83j80M22K44n31M3L73M1m84q6K12
3591a15N3j4j9K48j68j57K26l7J43j18J10J32l03j05L96j53l35J80M5q1QJ74k46
3614a36J52q3J02P8r5J56O0k73Rn6J62k44O9K57j25j97J70Q1k01P6J4K81p36K94
3638a85M06r8l63N4M36j83j04J49L2j51k32L45k46J46o0J07Q7j36j86Q6K09l7
3660G6j31J31k23L23j60k34J27n1L57l81J16p2J81k49K70J67j91j4j10K35j20
3681D7l02K61P4k67K54j43l1Q0O0K1p3m3M0J89j55P5j24J7j03K77j55K13k42k0
3705e0K3P8m01L35K92k74%k8P6j69K42k76J64lN6r9J07M1q9j64K54q1j81K23J09
$$ plain form
3730 185 38 39 -116 16 55 203 -219 36 -27 -126 61 143 71 30 38 204 -117 -132 167 7 -23 -99 38 285
3754 285 74 -132 130 -244 -144 -290 -37 -39 -178 -199 27 -129 262 273 160 -27 240 40 48 84 11 -8 -63
3777 -63 -201 -55 92 -113 148 106 -275 140 -280 -25 -168 84 152 159 135 -133 179 -228 -142 -50 62 67 -194
3800 -194 -14 1 -64 -248 -100 -203 -120 -65 93 -18 132 -83 178 58 -155 57 -31 -116 -317 10 -353 -302
3822 -302 -17 50 -331 -115 124 105 -385 58 -3 -17 49 -122 106 47 -58 -27 37 222 77 -28 143 -398 6
3845 6 111 81 3 -133 164 47 -87 250 -15 21 48 -39 -272 -154 42 -62 -305 -259 97 127 -157 39 -176
3868 -176 -144 -103 145 109 8 -314 75 -168 -271 -99 327 -31 150 95 180 -175 -46 15 33 -58 -291 115 -78
3891 -78 -525 240 161 -4 48 206 -63 -117 -12 175 88 -330 -39 74 -101 -135 309 -44 -269 -127 234 -46
$$ packed form
3730A85j47Jj55J32L9J48m22K55o3r9J87Q2p2m1QJ66l21j5K99j60l0p6J37K47
3754B85k11k06K62l74J00j46K53kj39k1K26j56L91J1j13j87K67k00QL6p3j9n5
3777f3j38J46J47k05K61m2l81M15m20K55j43K52O8Pk4k68L12m07Q6R2J12Nk61
3800a94J80J5o5j84J48j03Q3N5J58j11J50k15K61j20k13K12q8q5k01L27l63N1
3822c02K85O7l81K16K39j9m90M43o1j4O6j71K28n9j05L1O4J85j45j05J71n41M04
3845FJ05l0p8j36K97j17j34L37k65L6K7q7k33J18J96j04k43M6L56L0k84J96k15
3868a76L2M1K48l6j01l22L89k43j03J72M26l58J81n5Q5l55J29O1J8r1k33M06j93
3891g8m47P65p9j65N2J58k69n4J05J87q7m18K91J13j75l4M44l53k25J42L61k80
$$ plain form
3913 -46 -70 209 119 -54 15 82 77 116 11 130 -133 -421 18 230 -1 -35 70 146 -486 -263 156 4 -126
3936 -126 -57 184 -103 -284 44 -4 -152 -106 317 -27 -321 153 59 43 81 101 248 -26 -146 141 150 -259 11
3959 11 25 11 -213 -153 322 -272 -112 148 162 -140 -416 256 -85 -80 24 25 -176 -198 177 191 -118 -171 287 156
3983 156 -53 130 303 -391 -192 196 -176 -53 -3 306 -299 -140 -93 262 41 -300 10 61 -67 -119 165
4004 165 -402 -280 -203 263 106 -132 163 -285 -330 -151 255 245 -289 79 235 -128 -227 -129 116 2 -266 362
4026 362 85 -82 -252 311 114 8 -19 74 -94 -249 331 160 -444 55 367 264 -183 -65 201 -162 -14
4047 -14 178 395 -126 -97 39 -109 -60 -183 66 -7 -219 34 13 -194 -140 516 -78 -62 104 110 311 -232 104
4070 104 33 -156 -52 155 47 -417 -82 -77 -232 -302 -5 140 -142 -365 261 175 -125 125 393 34 -287 -10
$$ packed form
3913d6k4K79r0j73O9O7nL9j05J19k63k88M39K12k31l4J05P6o32K23M19j52j30
3936a26O9K41k87j81L28m8j48M6M23l44k94M74r4j6L8K0J47k74j20K87Rm09K70
3959A1J4j4k24O0M75n94J60K60J4l02k76O72l41NJ04Jk01k2L75J4l09n3M58j31
3983A56k09J83J73o94J99L88l72J23N0L09o05J59M7L55k21l41L10N1j28n2K84
4004A65n67J22P7M66j57k38K95m48m5J79M06j0n34L68J56l63r9R8K45j14k68O28
4026C62k77j67j70N63j97j06k7R3j68j55N80j71o04M99L12j03m47J18K66l63J48
4047a4J92K17n21K9J36j48M9j23K49p3k12K53k1k07N4O56n94J6J66OK01n43L36
4070A04p1j89J04K07j08m64L35Nj55p0K97J45k82k23O26q6l00K50K68l59l21K77
$$ plain form
4092 -10 171 42 -241 158 42 -99 -339 6 -29 -217 -75 140 -33 -119 114 283 -85 -119 170 144 -48 123
4114 123 -173 -347 -52 186 371 -180 -15 128 20 -7 20 253 -311 -101 57 100 -2 -51 40 152 -54 122
4136 122 371 -43 -123 1 70 41 91 88 156 10 -222 -9 230 -155 -81 61 31 -538 41 -45 -134 95 236 161
4160 161 -177 2 48 -7 31 12 127 -124 151 242 19 -143 -264 209 279 -136 220 50 46 -131 -108 -82 175
4183 175 -213 41 66 -143 122 149 70 113 304 116 -122 -80 237 -134 15 33 190 -238 -238 13 -124 191 -150
4206 -150 149 39 -115 -59 235 -102 110 392 -58 -122 34 88 62 -464 -93 82 24 176 170 47 -137 -105 -17
4229 -17 58 -1 -265 31 15 -233 89 161 75 80 92 -131 -217 82 128 119 -258 -188 182 -133 -120 -14 8 134 -151
4254 -151 321 -210 60 0 -117 -160 -150 -106 -4 -116 99 105 -81 -24 70 164 22 -100 -15 3 133 -44 0 -61
$$ packed form
4092a0J81j29k83L99j16j41k40L45l5j88J42K15j73q6K33J69l68l4K89k6j92J71
4114A23k96j74K95K38J85n51J65J43j08k7K7K33n64K10J58M3j02m9R1J12k06J76
4136A22K49m14q0J24O9k9N0lO8j46k32K13K39l85P4J42l0n69N79q6q9K29J41p5
4160A61l38J79M6n5L8j9J15k51K75R1k23j62j21M73P0m15L56j70mj77K3K6K57
4183A75l88K54K5k09K65K7p9M3J91j88k38M2L17l71J49J8J57m28%K51j37L15l41
4206a50K99j10j54N6K94l37K12K82m50o4J56N4k6n26L71J75n8J52oj23j84L2Q8
4229a7P5n9k64K96j6k48L22P2q6NJ2k23q6K99M6rl77P0L70l15J3J06K2J26k85
4254a51M72n31K70o0j17m3J0M4J02j12K15Oj86N7R4R4j42j22Q5J8J30j77M4o1
$$ plain form
4278 -61 11 192 53 -43 -35 74 120 374 -157 -95 74 26 227 -175 -160 173 25 179 -163 -102 -110 3 194 -82
4302 -82 104 -131 -8 -11 21 28 38 85 -183 -63 36 33 -35 26 0 140 -87 108 -39 -119 96 -19 -202 8 -7
4327 -7 40 189 -2 -106 -45 -151 -254 -338 -141 61 128 -93 169 342 343 136 -47 74 -129 105 -180 -252 0
4350 0 107 64 17 193 109 70 35 -175 -272 -168 39 116 -248 -15 208 241 97 125 -62 75 -50 127 117 11
4374 11 103 154 193 166 -103 -4 -10 -36 -210 42 70 -200 238 351 -297 129 130 -114 17 368 173 -148 0 261
4398 261 162 50 11 -66 117 40 202 111 -26 -9 3 -73 -78 -180 -16 209 72 -90 95 -127 -23 -55 242 -18
4422 -18 -1 209 -233 303 2 18 42 -57 -248 265 88 49 -183 149 -216 -176 386 84 94 22 171 62 159
4445 159 82 80 -70 71 -29 -107 -67 147 -111 -6 12 164 -202 29 -132 78 -84 -69 -333 294 -232 -313 -52
$$ packed form
4278f1P2J81j39r6QJ09M6K54n31O2J69m8K01m02J5L33j48J54l42O1qJ13J91k76
4302h2J86k35J23lL2PJ0M7k68J20R9lo8O1k6J40k27J95j47q0K15j15j83K10j5
4327gM7J49j91j04O1j06j03q4J97K02O7k21K62J73Jk07j83J21k03K34k85p2K52
4350@J07m3m7J76q4l9l5k10r7J04K07P7l64K33K23L3j44K8j87J37j25J77j0j06
4374A1R2N1L9k7k69R9ok6j74K52K8k70M38J13o48M26Jk44J31L51j95l21J48K61
4398B61r9j12l9p7J83p7J62r1j37J7J2p6nj02J64K25j37j62J85k22J04l2K97k60
4422a8J7K10m42N36l01J6K4r9j91N13j77l9k32L32l65M0N62l02J0p2J49j09R7
4445A59p7kj50J41j00p8M0K14k58J05J8J52l66K31j61K10j62J5k64O27n26q1K61
$$ plain form
4468 -52 157 17 -148 73 -7 -119 -83 149 -2 113 89 242 127 53 -6 142 -54 -47 284 12 -6 -126 47
4491 47 63 -54 87 -102 -38 -158 -33 23 -268 -62 129 -156 -190 75 259 79 -147 58 163 -74 -149 81
4513 81 107 -233 47 292 12 150 -2 15 -135 96 43 -25 -270 171 223 -124 -172 1 -66 -87 -113 -58 107 -40
4537 -40 -119 -170 -2 -255 28 179 297 -84 206 86 -28 -204 284 -41 -168 132 103 7 -159 147 305 98
4559 98 94 269 46 -315 -26 174 -89 -86 133 -47 -85 -48 16 -25 -168 -255 55 39 -80 62 271 -182 -14 44
4583 44 -18 44 -108 235 -122 -201 261 172 187 -31 -20 -61 -86 -207 212 145 -15 -97 195 -132 -214 -148 57 87 -119
4608 -119 107 -186 -266 -4 218 -47 156 136 174 -131 -220 -211 132 41 57 253 -53 -3 -193 108 -233 107 -19
4631 -19 -83 -47 -41 96 -191 15 233 67 28 -95 45 -59 -290 2 173 13 -216 -13 168 -74 -138 44
$$ packed form
4468e2K09j40j65K21q0j12L6K32j51J15k4J53j15p4n9J48j96PL31k72j8j20J73
4491D7J6j17J41j89O4j20J25N6k91K06J91k85l4K65J84j80k26K05J05k37p5K30
4513H1K6l40K80K45k80J38j52J7j50K31n3o8k45M41N2l47m8J73o7k1k6N5J65j47
4537d0p9n1J68k53K83J51J18l81K90j20j14j76M88l25j27L00k9r6j66L06J58k07
4559I8mJ75k23l61K89K00k63LK19j80l8L7O4m1j43q7L10j6j19J42K09m53J68N8
4583D4o2O2j52L43l57p9M62q9J5k18J1m1k5j21M19o7j60q2K92l27q2O6K05L0k06
4608a19K26k93q0K62K22k65K03k0L8l05q9RL43r1J6J96l06N0j90L01l41L40j26
4631a9o4L6OJ37k87K06K18j66l9j23J40j04k31K92J71j60k29K03J81k42o4J82
$$ plain form
4653 44 -151 6 299 179 -101 -120 -174 -42 -233 -58 40 -86 -71 129 -57 -12 -316 290 234 -48 -166 121
4675 121 -14 -138 -137 -37 94 -94 319 -177 84 226 119 255 2 51 182 -200 -242 277 4 -100 -257
4696 -257 -71 4 -329 -165 187 2 84 -39 55 -168 -417 196 9 -135 -126 -125 -244 174 -52 -65 112 -95 73
4719 73 74 125 -155 127 -17 -158 -32 19 -86 -130 -225 107 -38 -150 -28 -194 -38 36 -94 -30 -343 -57 65
4742 65 41 -211 -19 23 -128 215 39 -89 53 149 -79 58 78 -311 -113 -144 156 118 117 233 235 -77 -123 -293
4766 -293 41 5 -200 -25 -5 -17 130 164 -208 106 -67 96 58 210 -278 -145 101 68 -225 6 140 -5
4788 -5 61 221 100 90 -57 -29 -68 -96 135 8 -217 -58 23 63 -46 -160 -134 -56 117 131 25 -138 -62 -273
4812 -273 186 73 22 102 36 -122 230 -82 -74 175 302 -122 72 171 26 -28 -181 47 -109 -52 36 210 -30
$$ packed form
4653D4j95J57K93j20k80j9n4J32j91J75R8j26J5K00j86M5l04O06n6k82j18K87
4675A21j35j24JJ00J31j88M13m96K61J42j07J36k53M9J31l82m2N19k73j04j57
4696b57J86P5l33J64L52j85Q2j23R4k23k49O13j87j44RJj19M18k26j3J77k07J68
4719G3JN1k80K82j44j41J26N1j05m4r5L32j45j12J22j66J56P4j30O4l13K86J22
4742F5k4k52J92M2j51L43j76j28J42R6k28J37K0l89J98l1L00l8jJ16Kl12m6j70
4766b93L34l6k05J75K0j2J47L4l72L14j73J63l8J52m88J33K46l3k93K31J34j45
4788eO6J60j21j0j47K8l9k8K31j27k25J59Q1M0j09j14K6P8J73J4j06j63P6k11
4812b73M59j13n1Q0o6j58L52l12QK49J27m24J94R9j45n4j53K28j56N7Q8J74k40
$$ plain form
4835 -30 379 -119 112 22 -32 -158 99 -117 -158 20 -126 -205 -196 -108 -58 290 246 -84 36 54 86 -145 -87 55
4859 55 -63 154 -263 25 -438 141 -3 -173 132 -57 -127 45 -126 -187 80 52 -26 -8 -74 18 -22 -27 -298 -3
4883 -3 197 54 -4 -113 -142 -196 -166 -111 95 -112 -27 -36 -259 -168 -59 -75 79 240 75 -197 108 15 -210 97
4907 97 -24 46 -20 73 26 -178 148 33 -275 16 202 -193 -58 -104 34 44 87 37 146 -2 15 -17 5 -94
4931 -94 -116 33 52 -36 119 190 113 -31 115 94 97 -157 63 -122 2 216 -150 39 -150 41 -105 55 -81
4954 -81 -22 -123 181 113 -36 200 -25 -50 -65 -140 82 43 60 -72 102 39 88 -102 -59 60 -56 -10 81 66 170
4979 170 61 -8 56 60 13 331 -155 -49 -107 194 199 194 174 28 -118 -23 -96 176 81 63 -83 -147 -17 2 39 -68
5005 -68 45 208 261 173 -116 -2 -188 -58 27 125 13 -342 -32 -58 -53 -28 12 -64 -126 189 -61 -27 -200 -31
$$ packed form
4835c0M09m98K31r0n4j26K57k16m1J78j46p9RQ8N0L48m4l30J20J8L2k31N8J42
4859E5j18K17m17K88m63N79j44j70L05j89p0J72j71o1K67k8p8J8o6R2m0nk71K95
4883cK00j43n8j09k9n4L0N5K06k07Q5rk23R1J09j6J54J61j65k72L05r3k25L07
4907I7j21P0o6R3m7k04L26j15l08K91J86l95J35m6J38J0M3n0J09j48J7l2K2r9
4931i4k2J49J9q8J55P1p7j44J46k1Lk54K20j85J24K14l66J89j89J91j46J60j36
4954h1N9j01L04o8j49K36k25k5j5p5K22l9J7j32J74o3M9j90M3J19j16M6R1j5J04
4979A70j09o9O4Mm7L18m86J06n8L01Nnk0j46j46R5p3K72r5j8j46o4J30J9L7j07
5005f8J13J63N3q8k89J14j86J30Q5R8j12l55L10k6NK5M0p6o2L15k50L4j73J69
$$ plain form
5029 -31 132 -121 239 -34 -73 -100 -40 149 117 -45 -65 176 19 -12 -10 -67 1 289 257 -315 -162 -91 -6 -16 -75
5054 -75 128 -32 92 -38 -91 252 -248 182 -112 79 2 59 -154 -217 60 -18 8 44 47 212 -146 -82 200 -39
5078 -39 -65 -111 -44 90 -206 43 -21 -106 -84 55 101 137 -35 109 37 123 33 224 191 -80 -268 -153 16 -54 303
5103 303 64 -34 2 -121 43 -79 117 28 -34 212 101 138 -40 150 101 27 -159 -10 130 23 40 2 235
5126 235 -244 -104 -167 56 -73 65 -139 -115 2 84 58 -326 182 107 91 7 -296 -24 -41 -174 125 -305 25
5149 25 -172 57 148 17 90 98 50 62 110 12 -10 -89 -284 106 -316 -114 -223 159 13 -77 50 -295 -62 53
5173 53 -43 67 236 63 223 57 -145 126 -232 -118 223 -86 24 -131 12 209 -176 -25 177 -92 90
5194 90 141 -180 8 29 27 -106 -99 -87 64 -48 91 96 -191 128 -95 -59 -99 -42 16 24 -110 65 253 35 -47 80
$$ packed form
5029c1J63k53L60k73l9k7O0J89l2j62k0K41j57l1Kn7O8K88l2n72J53P1Q5j0n9
5054g5K03j60J24j30n3L43n00M30k94J91p7N7k13o3K77p8K6L6LJ65l58O4K82k39
5078c9k6m6O7J34k96K49o4q5K2J39M6L6j72J44p2Q6r0J91l3k71j88J15J69p0L57
5103C03k39r8L6j23J64j22J96q9o2K46j11L7j78J90m9p4j86J49J40j07J7l8K33
5126B35m79J40o3K23j29J38k04K4J17Q2k6l84N08p5j6q4l03K72j7j33K99m30L30
5149B5j97K29R1j31P3Qm8J2M8r8k2p9j95L90m22K02j09L82j46r0J27l45K33J15
5173E3r6J10J69j73J60j66k02K71l58J14L41l09J10j55J43J97l85J51K02k69J82
5194I0N1l21J88K1kj33PJ2J51j12J39Nk87L19k23L6m0N7N8Qj34J75J88k18q2J27
$$ plain form
5220 80 -140 248 -106 53 -18 -61 -82 -155 142 -133 -6 -46 -160 -107 -168 -122 37 -150 28 -100 -121 -44 -144 -98
5244 -98 32 -118 14 -109 -116 -77 -111 286 -58 124 1 -128 -51 132 19 53 69 -98 120 102 45 35 -96 -62
5268 -62 54 89 5 89 -196 0 -69 -43 42 41 279 135 -93 310 243 137 -37 157 63 -21 -117 -48 53 274 -28
5293 -28 -181 -59 -195 59 165 20 -126 -120 108 -184 215 101 81 82 17 137 -98 -98 91 135 265 180 28 -88
5317 -88 194 75 37 69 -46 -154 -3 223 173 -118 15 93 -118 1 -159 111 38 -78 170 87 233 -42
5339 -42 -173 -315 282 -37 -213 -62 -75 -177 93 -99 -50 3 3 -51 -31 98 57 -83 48 243 46 -10 -195
5362 -195 187 32 -155 -25 -42 -178 -82 268 -9 38 -19 -13 -36 7 44 71 2 -229 66 -80 -200 197 75 -49
5386 -49 -28 75 78 107 34 -18 37 209 -219 80 24 129 -79 29 -77 -90 139 -66 -85 -37 -57 99 -129 55
$$ packed form
5220H0k20L88l54J59p1m3k1p3K97k75J27m0j14N3o1M6J59j87J78j28k1P7j00M6
5244i8J30j50J32j23pL9l4L97l44J82j23j29P7J83j13L4J6j67K18j8n7j0j31L4
5268f2J16L5q4Q4k85J96o9K6Q5jK38j44k28M03o7j06j74J94r4q4r6O9J01K21l02
5293b8j53J22j36K54J06j45j46OK28k92L99j14k0Jo5J20k35%J89M4J30q5j52j16
5317h8K82j19l8L2j15j08J51K26n0k91J33P8k11J19j60K70p3j16K48q3J46k75
5339d2j31j42N97l19j76J51j3j02K70j92M9N3%n4K0J29m1j40J31J95j97n6j85
5362a95L82j55j87J30j7j36R6L50k77M7n7Ok3M3L7K7o9k31K95j46j20L97j22j24
5386d9K1J03LK9p3n2N5J72m28K99n6J05k08J08j06j3K29k05j9M8k0J56k28J84
$$ plain form
5410 55 1 -80 109 -56 90 140 59 91 -196 22 20 -161 100 -64 -53 -88 -171 -19 -7 -45 158 125 -29 30 212
5435 212 79 -55 -197 -47 242 -60 21 -4 -82 -203 -150 -287 161 28 -59 -238 -172 136 64 57 -227 23 -197
5458 -197 -60 -118 -2 118 108 152 -54 -87 150 135 123 223 -179 145 137 -101 49 114 50 -221 103 -158 102
5481 102 257 140 -24 198 79 -73 -62 -179 -3 -258 -97 260 116 -74 113 -44 299 -156 -248 164 -267
5502 -267 147 113 86 -121 19 63 -246 112 149 -89 19 -3 -120 92 -142 230 212 102 -1 -122 -165 -239 -47
5525 -47 201 10 21 -34 110 -50 -5 56 209 22 19 -19 -168 -54 -115 -183 -74 -48 -125 12 251 156 75 92 -95
5550 -95 230 38 -108 312 174 54 -182 57 88 52 -27 -100 -89 93 -260 49 -297 84 -171 65 226 177
5572 177 -7 -43 29 131 -202 -42 154 -171 92 -103 75 26 135 153 61 -104 57 -56 186 -239 -37 44
$$ packed form
5410E5n4q1J89j65J46N0q1L2k87K18kj81K61j64J1l5q3J52J2l8K03l3j54N9J82
5435B12j33j34j42J50K89l02Q1k5p8j21N3j37M48j33q7j79O6L08p2pk84K50k20
5458a97J37n8J16J20j0M4k06l3K37j5j2J00m02L24qk38J50O5o4k71L24k61K60
5481A02J55j17j64K22j19j52J1j17J76k55J61L57j44j90J87j57L43m55r2M12m31
5502b67M14l4k7k07J40M4l09L58L7k38J08k2j17K12k34L72j8j10j03j21m3p4J92
5525d7K48j91J1n5J44j60M5O1J53j87ll8j49J14o1o8J09K6p7J37K39r5q1J7j87
5550i5L25j92j46M20j38j20k36K39L1l6p9p3J1J82l53L09l46L81k55K36J61m9
5572A77j84l6P2J02l33J60J96l25K63j95J78m9J09J8r2j65J61j13K42m25K02Q1
$$ plain form
5594 44 69 -387 -13 -11 -47 246 -4 254 -114 -1 277 -73 2 -199 -243 122 174 -29 218 -19 -47 -85 -64 4
5618 4 62 -206 -7 27 276 13 -71 51 214 -289 -33 35 138 260 102 -111 -182 232 -55 84 84 -48 141
5641 141 -15 -124 281 -110 178 48 54 -86 21 155 -259 -60 51 191 125 -55 -225 -36 32 58 157 47
5663 47 59 45 91 -30 -74 60 120 95 -19 146 -30 -2 -11 169 74 112 19 -99 -137 85 -85 278 -152 -33 0
5688 0 134 -9 -61 48 -5 31 42 89 191 -44 -112 -38 35 -157 -180 -262 65 -202 132 127 -22 65 228 -74 135
5713 135 82 186 -68 36 131 -153 -129 -45 -79 -171 -384 -329 -2 49 -28 -131 15 -80 66 -3 0 -118 -75 -90 -110
5738 -110 -249 128 249 -205 -134 2 197 212 9 -5 -111 17 117 141 5 278 -4 -123 54 -140 145
5759 145 25 -53 -31 -45 -42 212 73 36 206 107 -236 -191 257 -202 0 107 -18 32 -96 -5 -146 76 89 203
$$ packed form
5594D4K5m56L74Kl6K93k50K58l68J13K78l50P5k01m4L65N2k03K47k37k8l8K1O8
5618DN8k68J99L4K49k63q4J22J63n03K56O8J03J22j58k13p1M14k87J39%j32J89
5641A41j56j09M05l91K88j30Oj40J07J34m14J99J11J40o6j80j70J89O8K6R9j10
5663D7J2j4M6j21m4J34O0k5j14J65j76K8rJ80r5L8r3j18l8K22j70L63m30J19L3
5688@J34j43n2J09n3L6J1M7J02k35o8P4P3j92k3q2L27k67L34nj49Q7J63l02K09
5713A35n3J04k54J04R5k84K4Q4l4r2k13N5L27N1p7j03J46r5J46o9Lj18M3j5k0
5738a10j39L77J21m54P1J36J95J5k03j4j06J28J00K4j36K73k82j19J77j94K85
5759A45j20p8K2j4LK54j39l7J70r9l43M5M48m59K02J07j25N0j28R1j41K22J3J14
$$ plain form
5783 203 123 254 70 -199 53 -40 52 64 12 261 74 -27 -35 269 -92 -122 -18 124 22 -91 40 -140 -147
5806 -147 90 1 -132 150 -35 109 169 -14 -126 -36 -130 -113 -137 164 -34 -50 -105 122 91 -155 51 -169 -64
5829 -64 89 -224 88 -43 25 144 64 -79 74 267 -93 239 81 444 -7 172 163 110 100 -302 -273 141 36
5852 36 86 62 -106 118 68 -23 148 -179 59 152 179 -423 -118 229 336 -3 30 204 -148 74 -38 43 25
5875 25 116 -32 115 7 -46 6 -104 -14 58 -48 -77 -17 20 45 -176 -300 -111 -154 -224 72 -120 214 97 23
5899 23 313 141 113 243 23 186 -100 -73 27 132 155 114 -56 64 -48 -122 28 39 81 134 8 -147 -98
5922 -98 -175 140 48 -198 205 -41 -361 202 97 -30 -20 46 42 267 -86 -103 -166 -181 115 -205 -18 42 10 24
5946 24 -135 94 237 101 -94 148 -166 -109 -82 162 43 -188 207 156 96 -48 -178 -117 -131 42 227 -13
$$ packed form
5783B03q0J31j84k69K52r3R2J2n2K49j87j01qL04l61l0J04J42j02j13J31j80p
5806a47K37q9j33K82j85J44O0j83j12R0r4J7k4L01j98j6n5K27l1k46K06k20J05
5829f4J53l13L12j31O8J19q0j43J53J93l60L32j58L63m51J79rn3j0m02K9M14j05
5852C6N0k4j68K24n0r1J71l27K38R3K7o02L05L47J07l39L3J74l52K22j12Q1j8
5875B5R1j48J47j08n3N2j10R0P2j06k9O0L7K5k21j24J89m3p0K96j92L34j17p4
5899B3K90j72k8J30k20J63k86K7J00J05K3m1j70J20j12p4J50J1M2N3j26j55M9
5922i8p7L15r2k46M03k46l20N63j05j27J0O6mK25l53j7o3j5K96l20J87O0l2J4
5946B4j59K29J43j36j95K42l14N7K7K44j19k31L95n1o0j44j30O1j4J73J85k40
$$ plain form
5968 -13 -93 54 -105 -156 128 92 108 -236 -107 6 -80 167 -34 -7 33 69 120 105 62 39 29 156 163 50 138 -16
5994 -16 -83 -74 -29 7 23 -149 58 -203 119 56 194 -155 175 58 -49 195 144 51 42 24 -107 -70 102 -2 57
6019 57 153 -18 58 103 106 -116 167 247 79 68 100 -68 -67 -105 -20 376 42 -118 149 -24 127 14 -150 81
6043 81 -43 64 63 48 48 -40 -93 13 59 177 132 -1 47 124 -110 -166 -207 -71 59 165 -91 -52 -215 11 66
6068 66 -306 -118 57 -49 -131 225 170 89 -101 15 131 40 298 -74 189 150 173 -44 3 -137 -21 131 65
6091 65 -51 -150 -15 -48 -200 92 -227 164 208 299 72 69 215 -94 150 13 -29 1 -120 -82 -139 -128 6 -8
6115 -8 -110 -95 -163 75 -115 -78 -102 148 213 -36 138 217 54 88 97 11 103 210 -43 -54 1 7 59 -113 -97 -54 -125
6142 -125 184 -33 -109 20 28 141 -25 -154 -251 136 213 -41 -131 177 329 -17 111 -25 -155 134 -37 18
$$ packed form
5968a3q0J47j59n1K84l6J6l44J29J13q6K47k01K7M0L6N1j5m3k3j0J27Pj13Q8j54
5994a6o7RM5L6J6j72K07k61L22o3J38l49L30j17j07K44n1r3rj8j31L7J72j04N9
6019E7R6j71P6M5Lk22K83Q0j68j1L2j68Jl8Q5L96l34j60K67j73J51j13j64K31
6043H1j24J07jj5%q8n3J06M6J18m5j33M8P7k34n6m1J36J30J06k56L9j63K26N5
6068F6l72J88J75j06q2L56n5q1j90J16J16r1K58l72K63l9K3k17M7j40J16J52o6
6091F5j16r9J35l3j52K92l19L91M4R1k27lJ46l09K44j37m2L0j21L8n7J1J34j4
6115hj02J5o8K38j90L7k4K50O5k49J74P9j63L4Rq6R2J07k53j1N5ON2j72J6M3p1
6142a25L09k17p6J29QJ13j66j29r7L87P7k54r0L08J52l46J28j36j30K89j71N5
$$ plain form
6164 18 21 -172 -118 -42 271 -142 201 87 -254 78 -50 5 -202 -187 27 22 -79 -193 -8 -10 -17 182 -93 129
6188 129 -43 -113 91 41 4 14 1 94 54 22 218 -127 198 44 -69 8 156 63 100 255 131 -253 -143 45
6212 45 -308 104 -10 46 248 -121 -7 54 74 -25 17 218 -257 29 201 -21 -22 -92 162 234 -21 -92 -53 -36
6236 -36 -212 33 64 98 -81 2 -220 16 66 8 16 -108 -122 -6 -139 177 146 -138 -81 172 213 -48 -204 103
6260 103 -52 -33 7 -16 -6 3 -173 -57 -14 67 19 -23 148 -166 -127 -17 -49 39 2 33 42 51 199 -142 -197 -124 17
6287 17 -188 286 48 -147 79 95 -45 114 -33 118 37 -167 176 -111 -119 15 -74 -61 -54 126 -115 -169 -90 -83
6311 -83 -120 111 122 116 -45 -125 -17 -249 31 -141 6 93 61 -37 -39 84 -215 -42 262 78 54 40 -31 62 -203
6336 -203 118 148 -64 -190 248 101 -104 -33 0 -80 -214 56 -35 -124 -104 1 -105 -48 -137 -148 4 -28 -311 -111
$$ packed form
6164A8Lj93N4P6L13m13L43j14l41L32j28N5k07J5K14nj01j14J85kpJ99k75K22
6188A29j72p0K04n0l7J0j3R3m0l2J96l45L25j54j13P7J48r3L7J55j24l84J10J88
6212D5l53M12j14N6K02l69J14O1K0r9M2K01m75K86J72k22jp0K54P2k55p1L9J7
6236c6j76K45L1L4j79Q3k22K36N0n8Qj24j4J16j33L16l1k84N7K53M1k61j56L07
6260A03j55J9M0k3J0Rj76J16M3Q1m8m2J71l14L9J10l2Q8l7L1RRJ48l41n5P3J41
6287A7k05M74k38j95K26J6j40J59j47J51q1k04L43k87qJ34q9J3PJ80k41n4P9P
6311h3l7K31J1oj61q0J08k32K80j72J47Q7l2r8kJ23k99J73L04j84k4j4p1R3k65
6336b03L21L0k12j26M38j47k05P1L3q0j34K70r1q9K0J05j06N7q9j1J52l2k83K00
$$ plain form
6360 -111 -217 -408 100 -13 -21 -75 21 -132 41 -197 92 -185 155 -49 85 -63 -28 20 -86 -49 -219 425
6382 425 213 -73 79 -12 -159 114 -108 103 -24 84 41 -125 -250 33 65 -184 14 39 -278 155 36
6403 36 -123 -180 99 87 186 16 -11 234 176 156 125 54 101 -1 -72 -177 -94 -38 -32 -41 54 -19 30 -73 12 -56 -181
6430 -181 106 73 307 238 111 21 158 50 135 -75 -19 -27 -64 -91 56 99 113 -7 -21 -171 -135 143 -143 -6
6454 -6 212 -1 -171 125 -8 -208 -7 81 95 249 -62 3 110 -96 -345 -133 57 14 -5 258 -4 57 27
6477 27 144 183 -26 111 54 65 42 142 204 114 221 -21 112 20 33 139 -220 -33 -247 202 109 48 30 -368
6501 -368 -193 52 -92 -87 -197 18 182 -3 42 9 -185 34 28 109 -471 94 110 -65 -142 -117 -112 -138 77 -110
6525 -110 38 6 -21 -109 85 -60 50 277 174 142 -173 14 94 46 91 -132 4 -29 -57 74 63 -238 -6
$$ packed form
6360a11j06j91N08j13qn4R6j53J73k38K89k77L40k04J34j48L5M8j06L7j70O44
6382D25k12k86J52r1j47K73k22K11j27J08m3j66j25K83L2k49J98K5l17M33j19
6403C6j59n7K79j2R9j70k7K45n8k0l1p1M7j02p1j05Q3N6OrR5p3M9j03Q5o8j25
6430a81K87l3K34o9j27r0J37j08Q5k10N6ql7k7J47M3J4j20j4j50L6K78k86J37
6454fK18k13j70K96j33k00K01Q8J4J54l11O5J07k06k49K12J90m3j9K63k62O1l0
6477B7J17L9k09J37n7J1k3J00O2r0J07k42J33r2J3J06l59J87k14M49r3o1j8l98
6501c68J75K45j44Nj10K15J64j85M5l3j94K19oQ1n80N65J6j75p7K5Nk6K15j87
6525a10J48l2k7q8J94j45J10K27j03l2l15J87Q0m8M5k23J36l3k8J31j1l01K32
$$ plain form
6548 -6 9 156 216 91 -6 -46 135 14 -132 -189 -263 34 102 77 -128 -75 45 106 162 12 -112 126 -19 181
6572 181 327 -57 30 -221 31 -114 -70 85 25 -103 -246 -53 58 -197 -7 -146 -63 95 -172 -125 217 -30
6594 -30 352 350 50 -201 -12 -27 -35 -61 206 35 172 30 61 240 -90 -86 36 -17 43 -9 -232 -94 69 -208
6618 -208 -26 24 -244 -39 32 -55 293 231 281 213 21 -129 49 -235 -71 24 -109 -71 196 34 -20 65 -5 -148
6642 -148 -223 -152 -89 -233 68 172 -40 -103 12 -136 -58 -90 -1 36 -1 13 150 64 -80 -23 -12 -115 -85 -35 11
6667 11 -228 33 -167 -175 -278 -108 19 -212 -55 227 -49 16 -20 110 90 -250 -24 -15 -225 102 67 -87 -93 160
6691 160 -113 141 -82 -118 -106 -99 -130 -232 -244 -66 76 72 -29 -3 44 91 145 22 75 -150 77 -103 -41 36 26
6716 26 -138 -130 -72 174 -102 -176 -148 -101 -85 -193 19 156 53 -119 -184 -40 31 -92 99 -260 125 -145 122
$$ packed form
6548fJ5J47O0j25r7m0J81j21j46n7p4K97O8k5k05N3J20O1N6j50j24K38j45K00
6572A81J46l84Q7k51K52j45M4J55o0j28j43J93J11k55J90j39Q3J58k67M7L42k47
6594c0L82kl00k51J89j5qk6K67j71J37j42L1J79l30MJ22n3O0n2k23J38J63k77
6618b08J82N0k68K05P1q7L48o2N0o8j92j50J78k84J64R5j33L8K67j62n4Q5p0j43
6642a48p5P1O3j44L01J04k12o3J15j48P8l2Q9L7l7J4J37q6j44N7J1j03L0N0M6
6667A1k39K61k00qj03J70J27k31J57K82k76O5l6J30k0l40K26Rk10L27l5j54oK53
6691A60k73K54k23l6J2Pl1j02j2J78J42mj01K6M7M7N4j23N3k25K27j80O2P7j0
6716B6j64QN8K46k76p4K8M7J6j08K12J37j03j72o5J44P1j23J91l59L85k70K67
$$ plain form
6739 122 48 60 -33 -89 -54 -133 2 38 -139 0 38 113 52 243 97 155 247 -166 -154 220 -17 108 97 -73 49
6764 49 116 -151 -157 -97 63 -208 -94 234 -49 -89 -40 167 -106 15 -90 -148 -83 -56 170 50 82 13 -147 -40
6788 -40 206 67 72 101 -6 -15 -144 184 -87 -100 -37 -126 72 -213 33 -207 72 -196 36 -21 130 -308 -188
6811 -188 146 38 98 350 -80 48 164 -41 -36 214 1 -78 177 -96 194 188 202 145 172 199 -49 150 62 -63
6835 -63 -43 180 77 -307 -147 64 0 -125 -238 189 113 32 -100 2 24 68 -188 -71 25 155 -24 200 49
6858 49 189 -143 12 -21 -311 349 -288 74 28 -7 -70 -249 61 85 86 -105 -22 48 -185 -1 77 95 -171 -50
6882 -50 -19 24 184 -250 -57 -72 -12 229 50 -39 -102 50 -42 37 36 -44 93 54 211 61 61 -37 185 148 256 -111
6908 -111 316 -225 95 -155 76 -158 -170 16 -65 -106 167 -192 63 24 6 -178 141 -111 153 -120 -143 29
$$ packed form
6739A22p4J2r3n6L5p9J35L6j77J39L8P5o1J91j46N8R2m13J2L74k37J25j1j70J22
6764D9O7k67oO0J60k71J14L28k83m0M9K07k73J21j05n8O5K7K26j20L2o9j60J07
6788d0K46j39NK9j07rj29L28k71j3O3q9J98k85K46k40K79k68K32n7J51m38J20
6811a88L34j08O0K52m30J28J16k05NK50k13p9K55k73K90oJ4n7K7K7k48J99q8j25
6835f3K0K23j03l84J60K11o4j25j13M27p6q1j32J02K2M4k56J17R6J30j79K24j51
6858D9J40l32J55l3k90O60o37L62m6l5o3j79L10K4Jj91Q3P0k33J84P8J8k66J21
6882e0L1M3J60m34J93j5O0K41j79q9o3J52r2P9jq0J37l9J57j50%r8K22l7J08l67
6908a11M27n41L20k50K31k34j2J86q1m1K73l59K55l9j8j84L19k52K64k73k3J72
$$ plain form
6930 29 -157 62 31 72 -110 41 -176 211 49 39 19 223 21 128 94 82 39 23 -6 -240 -8 56 -161 59
6954 59 -87 137 163 -197 -115 -369 -61 -49 -91 -5 -232 -190 -53 165 -4 130 -41 -99 -27 -156 256 -163 148
6977 148 -138 34 76 84 39 -79 -139 -163 184 170 23 -88 -140 -51 -60 -75 -50 -165 54 67 85 -28 61 152 -156 224
7003 224 100 -91 103 58 27 108 65 -152 239 19 -165 -125 -136 25 134 83 97 -305 -156 20 60 62 120 88
7027 88 7 -225 41 -37 -104 -20 -231 -59 -67 -136 309 -98 -74 -116 -23 84 -18 73 174 195 -239 19 51 -86 204
7052 204 -123 125 -106 -189 -138 255 -119 -40 -21 85 333 -66 49 143 -109 214 -92 -32 96 98 63 74 -122
7075 -122 -247 -39 -124 142 30 -115 -47 198 248 -20 -78 178 -86 -103 -5 189 -112 80 -55 32 265 45
7097 45 -31 81 65 235 17 90 -52 123 111 -125 41 -59 -19 -136 28 36 -42 -89 -133 -274 -10 297 -265 -83
$$ packed form
6930B9j86K19l1M1j82J51k17L87j62j0k0K04k02J07l4j2m3j6k9k34K32O4k17K20
6954E9j46K24K6l60Q2k54L08J2m2Q6k27M2J37K18j69J34j71n8P2j29M12m19L11
6977A48k86J72M2Qm5j18o0k4L47j4j47j11n2Q9rj5K5j15K19J3J8j13Q9R1l08L80
7003B24j24j91J94m5l1Q1m3k17L91k20j84M0j1J61J09n1J4m02J49J76M0KN8l2
7027H8q1k32K66p8o7Q4k11J72qo9M45m07K4m2R3J07j02R1J01K1m34K58L2j37K90
7052B04l27K48k31q3N1L93l74P9J9J06K48l99J15R4k52L23l06O0J28Kl5J1j96
7075a22j25K08q5K66j12j45O8K45N0k68n8K56k64j7R8J94l01J92j35Q7K33k20
7097D5p6J12j6J70k18P3j42J75j2k36J66j00M0j17J64Qp8m7m4j41K64L07n62J82
$$ plain form
7121 -83 1 -99 90 -67 195 -28 -8 -77 -49 -30 -110 134 93 -123 47 -40 136 -209 164 -81 253 72 -6
7144 -6 166 -14 219 2 244 256 6 74 -146 171 -77 77 268 11 18 108 161 16 128 -23 202 -234 -80
7167 -80 -267 164 66 145 125 -110 -5 -10 -142 -62 -53 -102 88 -127 206 220 -65 -123 106 34 53 -192 -33 68 -34
7192 -34 184 -40 35 -61 -82 -38 -42 -85 156 234 240 -203 111 -102 100 115 -116 10 -103 -65 62 -23 -185 135 13
7217 13 -125 -74 133 -100 -217 75 237 -165 44 -19 177 -79 -103 88 -37 133 114 8 -88 30 -28 31 -174
7240 -174 -85 -103 -16 283 -98 109 -162 17 133 0 -63 -53 50 23 -12 -107 -49 198 -262 -107 -83 145 119 138
7264 138 -33 -88 124 30 37 61 96 -38 80 18 152 -47 -39 -77 66 81 22 -45 35 -57 -85 -121 -3 -34 96 -127
7290 -127 -42 56 -232 -396 22 -167 -194 -211 -134 42 145 33 -74 5 55 -90 180 -43 -62 40 101 7 9 215
$$ packed form
7121h3Q4j00J89j57K62k23K0o9K8J9q0K44m1k16J70q7J76l45L73k45L34j81p8
7144fJ72j80K33k17K42J2k50O8k20L17k48J54J91k57PR0N3j45J12j51K25m36J54
7167h0j87M31r8P9k0k35J05nj32Q0Rm9J90k15L33J4k85n8K29p2J9k45J59J01j02
7192c4K18k24P5r6k1M4mm3K41P8Om43L14k13K02J5k31J26j13L8J27q5j62L20j22
7217A3j38N1K07k33j17K92J62m02K09o3J96k56k4J91j25J70j9j06r6J18n8N9k05
7240a74Q9j8Q7K99l81K07k71J79J16j33o3J0J03k7l5r5N8K47m60J55K4K28k6J9
7264A38j71n5K12r4PK4L5j34J18o2J34j99Ql8J43J5n9o7Q0r2k8l6J18l1J30k23
7290a27Q5R8k88j64M18j89k7j7P7J76J03j12j07P9N0j45K70k23j9J02O1r4KK06
$$ plain form
7314 215 104 -234 -9 42 -171 -3 -111 -70 -129 -29 -11 -8 -6 -15 229 11 -56 81 -5 107 104 102 -80 36 181
7339 181 -25 57 -92 106 -48 -101 -205 -87 -56 12 219 -149 31 -119 0 -58 -129 -274 67 -84 -30 45 -8
7362 -8 91 -94 93 65 -184 167 -38 -73 32 210 -35 -78 110 -179 -64 -75 29 119 315 12 -81 109 -46
7385 -46 -10 -169 9 -21 -198 -47 -110 43 78 -53 94 -35 -44 -100 40 -392 82 143 -23 -147 -4 97 -127
7408 -127 121 -33 -64 0 23 272 -79 -142 77 192 -29 129 -126 24 -205 -189 88 8 141 107 120 181 185 75
7432 75 173 -246 -21 19 -103 -127 -29 115 -38 -15 -68 -67 -5 -167 -13 51 -265 -57 263 118 -146 -41 125 94
7456 94 -73 166 25 56 40 8 108 -49 -100 -150 41 77 80 165 -124 13 146 -20 181 -10 17 -11 -69 -75 5
7481 5 30 12 -161 -259 98 136 215 105 103 -63 -25 -141 202 -152 -19 -168 77 98 -10 410 -99 228 173 111
$$ packed form
7314B15j11l38K25N1k13J68j08M1n9J00J8LKrK44k18o7J37q6J12lkj82J16J45
7339A81k06Q2j49J98j54n3j04J18L1O8K07l68J80j50J19n8p1j45L41j51N4P5n3
7362hR9j85J87k8k49L51k05l5J05J78k45m3J88k89J15j1J04R0J96l03r3J90j55
7385d6L6j59J78l0j77J51o3J53L5j31J47j29rn6J40m32M74O1j66j24J43J01k24
7408a27K48j54l1O4K3K49l51o3K19J15k21J58k55J50k29J6K77q0J33l4J3O1Mj10
7432G5R8m19K25M0j22k4R8J44j53K3n3JO2j62J54O4l16K08L20j45k64J05J66l1
7456I4j67K39j41L1j6l2J00j57n1n0J91L6LQ5k89J37J33j66K01j91K7k8n8oQ0
7481EK5j8j73r8L57L8P9j10kj66L8j16L43l54J33j49K45K1j08M20n09L27n5o2
$$ plain form
7505 111 10 -217 -176 -188 -27 -19 21 -30 170 -153 61 -2 -119 129 263 136 156 58 40 -78 125 -40 138
7528 138 147 33 -97 -238 154 62 -86 32 100 49 60 37 91 -25 -65 -187 -28 6 -49 -352 125 1 218 -82
7552 -82 -121 -48 -101 290 -33 76 116 -94 90 62 -75 88 139 40 31 120 66 -51 -82 -149 -21 -75 -172 -26 89
7577 89 -75 42 184 -113 175 -59 -51 -3 -139 -25 -155 14 -3 -105 -270 12 1 167 -131 -6 -191 177
7599 177 -150 27 95 76 -4 -206 80 302 -204 -159 11 -115 201 -47 -181 -31 64 -104 -30 -7 -80 -15 62
7622 62 98 42 -27 -44 -12 3 -210 24 121 106 141 248 218 -142 -119 41 -70 -73 152 120 43 -191 131 -64 141
7647 141 278 -92 79 -119 119 120 -16 68 209 62 -2 124 -77 -36 -40 59 -175 54 -14 -34 79 -30 75
7670 75 -30 18 251 -65 19 -81 -239 -226 156 -136 -74 -82 -31 -194 48 18 -178 -68 104 -44 -73 17 -33 -242
$$ packed form
7505A11j01k27M1j2J61QM0n1K00l23K14o3j17K48J34j27K0r8j8j18K03j65J78
7528A38Rj14j30j41L92r2j48J18O8n1J1k3N4j16m0j22J59L4n5l03M77j24K17l00
7552h2l9P3n3L91l23J09M0k10J84k8j37J63N1r9rQ9n4j17l1o7J28n4r7J46J15
7577H9j64J17J42k97K88k34QM8j36J14j30J69j7j02j65K82j1J66k98J25j85L68
7599A77l27J77O8j9q0k02K86K22n06M5J70j26L16k48j34J50R5j68P4K3p3O5P7
7622F2L6n6o9j7L2J5k13K34R7j5L5J07l0l60K3J60j11lK25l2p7k34L22j95K05
7647A41J37l70J71j98K38Jj36Q4J41j47o4J26k01M1mR9k34K29o8k0J13j09J05
7670G5j05M8K33l16Q4j00j58J3L82k92O2qN1j63K42l0j96J10J72j48k9R0n0k09
$$ plain form
7694 -242 185 -43 -23 77 46 -68 -6 -262 128 65 230 0 98 -74 -135 -97 254 -51 -19 67 -217 74 -137
7717 -137 -3 98 60 -120 -73 61 265 -200 16 -38 36 -113 2 183 -112 60 146 -13 29 37 -24 32 -206
7740 -206 185 -48 -103 131 -55 191 18 26 -58 -112 -4 85 91 -75 92 5 143 -114 119 305 10 -48 -120 52
7764 52 -30 116 372 -124 49 118 -186 135 100 -127 126 127 -24 -127 88 32 263 -7 261 8 72 62 124
7787 124 73 19 29 -283 70 -64 -65 -2 112 319 53 63 51 -134 106 5 72 1 42 -201 36 -102 -246 -47
7811 -47 -107 -12 -52 101 -303 -74 -49 -77 22 2 -4 29 -11 -4 81 -153 39 -172 23 -177 -1 -153 115 130 118 -12
7837 -12 -114 346 -54 -17 7 -279 -143 -76 -123 -16 -110 20 298 -75 -39 -279 -222 183 49 155 -189 97 85
7860 85 -18 -17 -172 -44 -1 -112 154 11 -304 6 50 -17 -35 -64 -193 -101 -93 -7 302 -30 29 -18 -134 15 46
$$ packed form
7694b42M27k28K0J00l1j14O2k56L90o3J65k30R8j72o1L8L51l05L2Q6k84K91k11
7717a37J34J01l8j80M7J34K04m65K16n4P4j49J15J81k95J72Q6j59M2Qo1N6k38
7740b06L91k33n5K34j86K46j73Qq4n4J08Q9Oj66J67q7J38k57K33J86k95n8p2J72
7764E2q2J46K56m96J73O9l04L21l5k27K53Jj51j03K15n6K31k70K68k53O4j0O2
7787A24n1n4J0l12L53j34jO3J14K07k66J0j2j85K40j01O7p1M1k43K37j38j44J99
7811d7o0R5m0J53m04K29K5k8R9k0oL3m0PQ5k34J92k11J95k00J76j52K68J5j2j30
7837a2j02M60m00L7K4k86J36O7m7J07r4J30K78l73L6k40N7M05j34J06l44K86j2
7860H5j03Jj55J28M3j11K66j43l15L10M4o7j8k9j29R2QQ6L09l32N9m7j16J49L1
$$ plain form
7885 46 49 34 -31 -120 65 -129 -120 39 76 -64 197 -90 114 -225 94 197 125 -78 6 -113 -30 -145 458 64
7909 64 54 34 161 238 12 184 158 -79 -82 -150 0 33 95 99 -148 -187 -33 -47 -170 -224 73 -100 100 32 -334
7934 -334 -50 -4 -28 61 80 -92 184 -4 -145 48 -232 -43 -80 26 54 21 -87 70 101 9 -147 173 122
7957 122 -138 -69 -142 -1 210 167 -198 -85 26 30 4 -212 140 53 61 105 58 35 50 51 -104 -113 -127 100 -326 -7
7983 -7 -4 -223 -111 -30 -63 126 331 165 29 -68 57 37 117 -24 -49 -48 -88 -47 29 148 12 -60 152 19 17 -299
8009 -299 18 -134 -8 -150 -20 168 155 41 337 -239 233 -195 -195 37 -22 207 -279 -129 -94 -121 -7 1 239
8032 239 -45 -171 82 74 -2 -112 143 103 11 -160 19 36 310 270 8 -71 10 -60 -36 4 -181 157 63 94 -196
8057 -196 -109 -259 64 59 -157 39 138 -331 12 92 -76 13 150 42 -36 110 35 -139 54 -26 61 -109 6
$$ packed form
7885D6Lj5o5q9J85j94RJ59L7j40K61k87K04l39L19J03p2k03Q4j19Q3j15O03l94
7909F4j0k0J27P7k26J72k6k37lo8J50L3O2Mk47l9J54j4j23n4K97j73K00o8l66
7934c34K84M6k4Q9J9j72K76j88j41J93k80J89l7J06K8l3j08J57L1r2j56L20n1
7957A22k60O9p3J41K11m3l65J13J11Mk6k16L52q7QM4m7k3J5Jj55rj4K27m26L19
7983gLk19J12Q1l3J89K05j66j36r7J25k0Q0j41k5Jm0M1P6J19j36p2K12j33kl16
8009b99L17j52J26j42J30J88j3j14K96n76M72m28%K32n9K29m86J50L5k7J14QK38
8032B39k84j26K53qp6j10K55m0r2j71J79J7K74m0k62p9Q1p0K4M0j85L38r4L1k90
8057a96Q7j50L23nk16J96R9m69L43Q0j68Q9J37j08p8J46p5j74J93q0Q7j70J15
$$ plain form
8080 6 138 -75 249 -33 -4 30 141 -121 -19 92 -81 191 10 -272 -11 17 34 -69 -84 -267 -66 71
8102 71 -165 -27 232 49 -88 62 -36 141 -195 -74 1 -117 -98 -15 199 -120 77 -34 122 -42 -76 -97
8124 -97 -124 -136 121 -81 -86 -155 47 227 21 22 -31 -79 18 -135 -261 -183 54 20 204 5 -177 40 -64 -224
8148 -224 -22 10 109 158 -75 188 -149 101 51 4 -180 29 95 101 -16 -147 -92 53 152 65 141 1 243 264
8172 264 -116 69 -109 -161 -41 -52 -93 -162 171 18 -27 71 172 -256 142 68 -134 212 -93
$$ packed form
8080FJ32k13L24k82K9L4J11k62J02J11j73K72j81k82K61K8J7j03j5j83K01J37
8102G1k36J38K59j83j37J50r8J77l36J21P5j18J9Q3K14l19J97j11J56j64l4k1
8124i7k7j2K57k02no9K02J80k06Jn3m8R7j53j26P8K37l4J84j99j82K17j04j60
8148b24K02L2R9M9k33K63l37K50n0m7j84K09O6Oj17j31N5J45R9q7P6j40K42K1
8172B64l80J85j78n2J20j1m1o9L33j53m5R8J01m28L98p4k02L46l05
8191i3
$$ Imaginary data points
##PAGE= N=2
##DATA TABLE= (X++(I..I)), XYDATA
$$ plain form
0 0 0 0 0 0 0 0 0 0 0 -8 8 -8 8 -16 16 -24 27 -32 40 -48 62 -70 83 -96 115 -134 154 -179 206 -237 268 -305
32 -305 346 -393 440 -497 557 -626 698 -777 863 -960 1066 -1176 1302 -1438 1587 -1747 1926
49 1926 -2122 2339 -2577 2840 -3137 3467 -3844 4271 -4767 5343 -6032 6863 -7890 9205
63 9205 -10943 13364 -16969 22922 -34456 64963 -316563 -687997 217033 408792 -935
74 -935 258419 878806 488200 -79707 169613 320917 -284119 -401860 123396 7230 -584637
85 -584637 -329085 202527 -107512 -423898 151819 480838 -56069 -260907 200152 164122
95 164122 -274180 -51294 408647 165763 -117588 202418 280216 -205974 -229880 246441
105 246441 159624 -301980 -170702 113008 -243609 -568601 -206027 90750 -102715 -50568
$$ packed form
0@%%%%%%%%%qJ6j6J6k4L2m0N1n9P2q8J10j32J53j79K11k49K88l33L85m43N05n73
32c05O51p39Q33r37J054j183J324j475J640j823K026k242K478k740L025l334L673
49A926m048M461m916N417n977O604p311Q115r038J0110j1375J2895j4753J7095
63I205k0148K4307l0333L9891n7378R9419l81526l71434R05030J91759m09727
74i35K59354O20387l90606n67907K49320J51304o05036j17741N25256j16166n91867
85e84637K55552N31612l10039l16386N75717L29019n36907k04838M61059l6030
95A64122m38302K22886M59941k42884k83351L20006P7798m86190k3906M76321
105B46441q6817m61604J31278K83710l56617l24992L62574K96777j93465N2147
$$ plain form
115 -50568 354363 360465 96774 236106 449824 199686 -25135 136404 78357 -367398 -491057
126 -491057 -219018 -204415 -371738 -166362 159883 98545 -47294 106564 233974 117508
136 117508 109187 272352 227959 10551 -23728 26372 -113560 -234322 -89214 51877 -47548
147 -47548 -129978 -15950 41044 -77033 -108438 25762 65178 -45834 -72159 10215 6413
158 6413 -34333 75504 217600 181908 99180 137228 111206 -88397 -181258 -60771 -39007
169 -39007 -182555 -168476 -9606 -44583 -174378 -57257 134668 87595 27822 176682 215286
180 215286 13971 -38069 104657 39730 -149875 -69085 72408 -89303 -223786 -22827
190 -22827 101358 -59220 -51043 183808 146016 -92191 -41532 108550 -45045 -172296 32249
$$ packed form
115e0568M04931O102k63691J39332K13718k50138k24821J61539n8047m45755j23659
126d91057K72039J4603j67323K05376L26245o1338j45839J53858J27410j16466
136A17508q321J63165m4393k17408l4279N0100j39932j20762J45108J41091r9425
147d7548q2430J14028N6994j18077l1405J34200L9416j11012k6325Q2374l802
158F413m0746J09837J42096l5692q2728L8048k6022j99603r2861J20487K1764
169c9007j43548J4079J58870l4977j29795J17121J91925m7073n9773J48860L8604
180B15286k01315n2040J42726o4927j89605Q0790J41493j61711j34483K00959
190b2827J24185j60578Q177K34851l7792k38207N0659J50082j53595j27251K04545
$$ plain form
201 32249 124316 -88518 -107723 113320 63380 -142208 -13296 186357 25478 -121423 64373
212 64373 125381 -107890 -119333 111469 64327 -136424 -23653 133131 -42577 -156992 53732
223 53732 118736 -90709 -78678 127577 41754 -156934 -27457 134603 -17270 -97864 105619
234 105619 141022 -70231 -58683 119384 29738 -135750 -11267 101225 -71129 -146263 34163
245 34163 54482 -113918 -57284 123500 46473 -84388 38954 130631 -17080 -62754 91888
256 91888 85060 -73068 -38141 78995 -17485 -125575 -16172 49832 -72797 -94296 37711
267 37711 32218 -73641 -13700 98074 39959 -21429 68233 102024 -3289 -26387 51276 19295
279 19295 -73384 -42482 11727 -51052 -94296 -24087 6426 -45546 -27996 49678 45927 4380
$$ packed form
201C2249R2067k12834j9205K21043m9940k05588J28912J99653j60879j46901J85796
212F4373O1008k33271j1443K30802m7142k00751J12771J56784j75708j14415K10724
223E3732O5004k09445J2031K06255q5823j98688J29477J62060j51873q0594K03483
234A05619L5403k11253J1548J78067q9646j65488J24483J12492j72354p5134J80426
245C4163K0319j68400N6634J80784p7027j30861J23342R1677j47711m5674J54642
256I1888o828j58128L4927J17136r6480j08090J09403O6004j22629k1499J32007
267C7711n493j05859N9941J11774n8115o1388Q9662L3791j05313k3098P7663l1981
279A9295r2679L0902N4209o2779m3244P0209L0513n1972J7550P7674l751m1547
$$ plain form
291 4380 40021 77077 33397 2371 31545 25649 -27442 -33832 -6203 -23265 -48883 -24468 -969
304 -969 -18936 -25016 -465 5317 -9078 -922 18587 17480 14671 26097 30463 20162 15586 15703
318 15703 5580 -7213 -12168 -16563 -23031 -26451 -27063 -25776 -19934 -13334 -9029 930 16809 24882
332 24882 27135 35835 40458 29078 15248 9506 -3611 -24897 -33486 -30578 -34944 -37536 -22961 -7433
346 -7433 -4931 1932 19433 26310 21214 24791 33077 26989 15521 12959 9170 -5882 -18670 -22122
360 -22122 -27145 -34855 -33114 -24045 -17847 -12881 -1054 12002 17149 18372 24397 30669 27792 19928
374 19928 18404 18790 7566 -6653 -9404 -11553 -25296 -33518 -25223 -21562 -28632 -20920 -85 3127
388 3127 -2798 11799 28200 17217 9256 27472 32306 10715 9058 25377 11364 -15995 -9346
$$ packed form
291D380L5641L7056m3680l1026K9174n896n3091o390K7629j7062k5618K4415K3499
304i69j7967o080K4551N782j4395Q156J9509j107k809J1426M366j0301m576J17
318A5703j0123j2793m955m395o468l420o12J287N842O600M305R959J5879Q073
332B4882K253Q700M623j1380j3830n742j3117k1286q589K908m366k592J4575J5528
346g433K502O863J7501O877n096L577Q286o088j1468k562l789j5052j2788l452
360b2122n023p710J741R069O198M966J1827J3056N147J223O025O272k877p864
374A9928j524L86j1224j4219k751k149j3743q222Q295L661p070P712K0835L212
388C127n925J4597J6401j0983p961J8216M834k1591j657J6319j4013k7359O649
$$ plain form
401 -9346 221 -26808 -42399 -19348 -16043 -40947 -29298 7112 3545 -9778 23430 49713 23937
414 23937 13581 44669 38821 -4728 -4093 17356 -14636 -50506 -25421 -9230 -42772 -39379 12811
427 12811 16404 -14539 10822 47975 16056 -12008 24785 34067 -16349 -22730 16030 -3742 -45903
440 -45903 -13911 25501 -6586 -20705 29459 34502 -18892 -13772 30263 2454 -39202 -3903
452 -3903 22468 -24590 -36907 18849 24896 -16198 8098 53844 17016 -26757 4948 17315
464 17315 -35281 -40452 12432 5041 -40211 -14626 27659 -1773 -19457 34087 55024 8688
476 8688 1350 33376 4440 -45685 -23995 6409 -25417 -39902 2817 11588 -24007 -9622 38427
489 38427 30827 3962 25146 34423 -11611 -35587 -9695 -6720 -28795 -11362 20280 5844 -15339
$$ packed form
401i346R567k7029j5591K3051L305k4904J1649L6410l567j3323L3208K6283k5776
414B3937j0356L1088n848m3549O35K1449l1992l5870K5085J6191l3542L393N2190
427A2811L593l0943K5361L7153l1919k8064L6793R282n0416o381L8760j9772m2161
440d5903L1992L9412l2087j4119N0164N043n3394N120M4035k7809m1656L5299
452c903K6371m7058j2317N5756O047m1094K4296M5746l6828m3773L1705J2367
464A7315n2596n171N2884p391m5252K5585M2285k9432j7684N3544K0937m6336
476H688p338L2026k8936n0125K1690L0404l1826j4485M2719Q771l5595J4385M8049
489C8427p600k6865K1184R277m6034k3976K5892K975k2075J7433L1642j4436k1183
$$ plain form
502 -15339 4754 20235 5037 7714 30275 22260 -8925 -17736 -15600 -28131 -31433 -9981 5458
515 5458 2602 1608 6589 6750 7220 15444 23102 24055 15477 -2687 -17457 -20821 -22058 -19342 950
530 950 19087 9709 -3006 3950 1033 -19344 -11269 18866 12742 -14434 -7031 4169 -22755 -29721
544 -29721 16726 36925 9256 14275 41070 8826 -33906 -3549 26729 -12051 -29100 11839
556 11839 -478 -63424 -47103 15933 3130 -20911 37851 66436 -2686 -25833 33850 26844
568 26844 -32619 3279 61354 235 -61592 -7401 17024 -53866 -45537 48705 34697 -47054
580 -47054 -13420 43794 -20822 -57577 37692 70425 -16304 -18153 57856 12769 -72243 -6361
592 -6361 69493 -3625 -48307 33555 32709 -77562 -63679 40923 12585 -55220 18415 73923
$$ packed form
502a5339K0093J5481j5198K677K2561q015l1185q811K136j2531l302K1452J5439
515E458k856r94M981J61M70Q224P658R53q578j8164j4770l364j237K716K0292
530I50J8137r378j2715O956k917k0377Q075L0135o124k7176P403J1200k6924o966
544b9721M6447K0199k7669N019K6795l2244m2732L0357L0278l8780j7049M0939
556A1839j2317o2946J6321O3036j2803k4041N8762K8585o9122k3147N9683p006
568B6844n9463L5898N8075o1119o1827N4191K4425p0890Q329R4242j4008q1751
580d7054L3634N7214o4616l6755R5269L2733q6729j849P6009m5087q5012O5882
592f361P5854p3118m4682Q1862q46j10271J3883J04602k8338o7805P3635N5508
$$ plain form
604 73923 -23959 -63519 39230 54102 -34583 54 91238 22287 -73940 -8985 42482 -45108
616 -45108 -60850 48501 42031 -67166 -43920 39330 -16300 -70396 30357 87557 -6141 -30391
628 -30391 56864 34485 -60050 -11082 78796 16307 -52586 11985 31513 -67856 -74981 27714
640 27714 25882 -46512 -3781 58931 -9455 -61032 18366 58359 -8610 -7189 63893 31633
652 31633 -52448 -24668 32194 -9705 -38022 25556 40819 -33548 -46754 9534 629 -40723
664 -40723 -376 48930 8295 -31693 2466 18754 -17553 -9452 43793 40289 -4914 -3589 13949
677 13949 -14887 -37520 -4312 20117 -5759 -22366 -4365 -4482 -27817 -17783 20457 30399 13505
690 13505 13043 20309 1590 -21154 -8431 14456 6038 -10485 -278 4704 -22957 -33567 1496
$$ packed form
604G3923r7882l9560J02749J4872q8685L4637R1184o8951r6227O4955N1467q7590
616d5108j5742J09351o470j09197K3246Q3250n5630n4096J00753N7200r3698k4250
628c0391Q7255k2379r4535M8968Q9878o2489o8893O4571J9528r9369p125J02695
640B7714j832p2394M2731O2712o8386n1577P9398L9993o6969J421P1082l2260
652C1633q4081K7780N6862m1899k8317O3578J5263p4367j3206N6288q905m1352
664d0723M0347M9306m0635l9988L4159J6288l6307Q101N3245l504m5203J325J7538
677A3949k8836k2633L3208K4429k5876j6607J8001j17k3335J0034L8240R942j6894
690A3505m62P266j8719k2744J2723K2887q418j6523J0207M982k7661j0610L5063
$$ plain form
703 1496 22300 1635 -101 27080 13713 -28080 -17883 20831 8336 -15986 12009 26910
715 26910 -19218 -37114 7493 16534 -19837 -1615 43074 9849 -40690 -9881 23154 -18132
727 -18132 -30318 30094 37276 -22577 -18843 31517 7004 -35211 10911 47284 -9757 -38549
739 -38549 13921 13385 -48251 -27262 41538 14903 -37674 4489 40107 -17914 -36563 33086
751 33086 42547 -19441 -7043 43477 -118 -54732 -5728 33101 -21973 -36029 29902 27040
763 27040 -39797 -21064 39755 8210 -35388 12988 42389 -18194 -35582 23236 22369 -30178
775 -30178 -6422 43683 4793 -38823 3257 27215 -22281 -27755 29242 24773 -27149 -12417
787 -12417 25876 -6174 -36150 5502 27553 -11853 -16033 25450 16487 -22833 -4140 28163
$$ packed form
703A496K0804k0665j736K7181j3367m1793J0197L8714j2495k4322K7995J4901
715B6910m6128j7896M4607R041l6371J8222M4689l3225n0539L0809L3035m1286
727a8132j2186O0412P182n9853L734N0360k4513m2215M6122L6373n7041k8792
739c8549N2470n36o1636K0989O8800k6635n2577M2163L5618n8021j8649O9649
751C3086R461o1988J2398N0520m3595n4614M9004L8829n5074j4056O5931k862
763B7040o6837J8733O0819l1545m3598M8376K9401o0583j7388N8818q67n2547
775c0178K3756N0105l8890m3616M2080K3958m9496n474N6997m469n1922J4732
787a2417L8293l2050k9976M1652K2051l9406m180M1483q963l9320J8693L2303
$$ plain form
799 28163 665 -24169 4881 17053 -17031 -19315 15739 12929 -14017 -1881 17628 -3508
811 -3508 -20140 2338 12629 -6587 -5748 15324 9077 -12149 -5813 6980 -4317 -13012 1956
824 1956 9950 -745 -2345 8702 7956 -2000 -1763 3153 -1704 -7960 -4724 -21 -724 -1580 2033 4994
840 4994 1255 -3903 -2861 1352 -765 -3506 2871 8784 2518 -3485 1577 2548 -7262 -8691 2012
855 2012 2875 -4552 1804 11974 4298 -4793 3645 6264 -8390 -11942 1904 1149 -10798 -2824 11437
870 11437 2875 -7628 4332 9105 -6053 -8045 8407 6885 -7125 196 13158 358 -11247
883 -11247 1353 6122 -10110 -10322 7128 5455 -8280 -37 12026 -459 -10967 842 4955
896 4955 -9764 -8532 8534 6448 -4883 4446 14763 2659 -6610 3512 5474 -8352 -8864 3847
$$ packed form
799B8163k7498k4834K9050J2172l4084k284L5054k810k6946J2136J9509k1136
811c508j6632K2478J0291j9216Q39K1072o247k1226O336J2793j1297q695J4968
824A956P994j0695j600J1047p46r956K37M916m857o256L236M703p03q56L613K961
840D994l739n158J042M213k117k741O377N913o266o003N062R71r810j429J0703
855B012Q63p427O356J0170p676r091Q438K619j4654l552J3846p55j1947P974J4261
870A1437q562j0503J1960M773j5158j992J6452j522j4010P321J2962j2800j1605
883a1247J2600M769j6232k12J7450j673j3735Q243J2063j2485j0508J1809M113
896D955j4719J232J7066k086j1331R329J0317j2104r269J0122J962j3826n12J2711
$$ plain form
910 3847 1128 -9058 -2125 5350 -2900 -7950 1825 4265 -3857 -1177 8450 6001 -1391 3256 6880
925 6880 -1259 -5862 -111 740 -5351 -3127 3458 1574 -2416 1363 2910 -2310 -4188 -394 -464 -3076
941 -3076 -382 3245 1456 324 2737 2526 -509 -564 985 -567 -1095 451 925 -510 -200 943 -1008
958 -1008 -2424 -524 286 -1379 -818 1691 855 -1103 -173 463 -1376 -2370 314 699 -1244 -91 3285
975 3285 2534 -161 1295 3420 780 -1848 77 1366 -1994 -3061 770 721 -3468 -2603 1200 -1088
991 -1088 -5105 -1301 2957 -678 -2109 3862 5393 -636 101 6961 4747 -2415 993 5387 -2050
1006 -2050 -7700 -1075 1223 -7431 -7218 3075 919 -8040 -1656 8020 605 -4941 6529 10818 -2226
1021 -2226 -3638 8784 5169 -8166 -1591 9154 -1802 -11148 1837 6397 -8711 -9013 7819
$$ packed form
910C847k719j0186O933P475q250n050R775K440q122K680R627k449p392M647L624
925F880q139m603N751Q51o091K224O585j884l990L779J547n220j878L794p0k612
941c076K694L627j789j132K413k11l035n5J549j552n28J546M74j435L10J143j951
958a008j416J900Q10j665N61K509q36j958R30O36j839r94K684L85j943J153L376
975C285p51k695J456K125k640k628J925J289l360j067L831m9m189Q65L803k288
991a088m017L804M258l635j431N971J531o029P37O860k214p162L408M394p437
1006b050n650O625K298q654K13J0293k156q959O384R676p415n546J1470M289j3044
1021b226j412J2422l615j3335O575J0745j0956r346J2985M560j5108l02J6832
$$ plain form
1034 7819 4299 -11597 -3606 9846 -2479 -11837 5578 13382 -2882 -3926 14090 8406 -10173
1047 -10173 -1832 12805 -2390 -14755 2127 7505 -13036 -13683 7901 4945 -12786 -617 16502
1060 16502 781 -11380 7440 14396 -5806 -6378 13807 6447 -14850 -5340 9938 -5196 -15178
1073 -15178 5836 12929 -8241 -9010 10658 4472 -13808 -2461 14098 -246 -11399 5953 11198
1086 11198 -7641 -7186 12562 7970 -10064 -1966 10101 -4438 -15257 669 7977 -7291 -8281
1099 -8281 8265 4965 -9733 -1679 12906 4694 -4191 7079 11541 -4658 -9591 2454 1716 -10310
1113 -10310 -6015 5899 -975 -11026 -2340 6450 -1387 -4968 7317 10255 -1413 -3472 6274 3749
1127 3749 -5549 -1223 8645 1824 -7364 -1053 5010 -4721 -9395 2462 5053 -7493 -8338 3554
$$ packed form
1034G819l520j5896P991J3452j2325r358J7415P804j6264j044J8016n684j8579
1047a0173Q341J4637j5195j2365J6882N378k0541o47K1584k956j7731J2169J7119
1060A6502j5721j2161J8820O956k0202n72K0185p360k1297R510J5278j5134r982
1073a5178K1014P093k1170p69J9668o186j8280J1347J6559j4344j1153J7352N245
1086A1198j8839M55J9748m592j8034Q098J2067j4539j0819J5926P308j5268r90
1099h281J6546l300j4698Q054J4585q212q885J1270M462j6199m933J2045p38j2026
1113a0310M295J1914o874j0051Q686Q790p837l581J2285K938j1668k059R746k525
1127C749r298M326R868o821r188O311O063r731m674J1857K591j2546q45J1892
$$ plain form
1141 3554 1738 -8938 -1039 12670 5676 -3630 6056 11708 -2747 -7225 7128 7177 -8896 -6458
1155 -6458 6882 -2943 -17030 -4392 8345 -5186 -11452 7546 11867 -6544 -4790 14568 7937
1168 7937 -9382 2099 14192 -3323 -13377 5933 10070 -11258 -8078 13535 3991 -17766 -4533
1181 -4533 12520 -5843 -16864 6966 14398 -8872 -7392 15656 7433 -13458 1940 18243 -3080
1194 -3080 -14707 9417 13146 -14119 -11846 13995 3916 -20764 -4526 15361 -4758 -15956
1206 -15956 9901 15753 -8602 -5890 17050 5046 -17229 -327 15842 -6427 -16482 10009
1218 10009 14542 -11994 -9842 14492 4693 -17620 -3060 13686 -4161 -12515 9568 12358 -9853
1231 -9853 -5831 14204 2290 -15983 289 15326 -3860 -12921 8200 11491 -10351 -9580 9152
$$ packed form
1141C554j816j0676P899J3709o994r306R686N652j4455m478J4353M9j6073K438
1155f458J3340r825j4087J2638J2737j3531o266J8998M321j8411J754J9358o631
1168G937j7319J1481J2093j7515j0054J9310M137k1328L180K1613r544k1757J3233
1181d533J7053j8363j1021K3830P432k3270J480K3048q223k0891J5398J6303k1323
1194c080j1627K4124L729k7265K273K5841j0079k4680J6238J9887k0119j1198
1206a5956K5857N852k4355K712K2940j2004k2275J6902J6169k2269j0055K6491
1218A0009M533k6536K152K4334r799k2313J4560J6746j7847q354K2083K790k2211
1231i853M022K0035j1914j8273J6272J5037j9186r061K1121L291k1842P71J8732
$$ plain form
1244 9152 2171 -12990 -1389 10309 -2989 -7358 9687 10215 -7400 -4335 10644 1133 -13599
1257 -13599 -1944 10439 -1319 -8281 5147 7843 -5770 -6162 4126 -178 -7778 434 7172
1270 7172 -2343 -5134 5448 6099 -5180 -3504 6664 3776 -5411 -1209 6193 1085 -3539 932
1284 932 2849 -3311 -4854 -1025 -2219 -5482 -942 4596 1332 -1794 2718 5104 -859 -3712 1665
1299 1665 4589 130 -1583 2902 3233 -1159 -1791 670 -1216 -3512 -1928 -710 -4074 -3782 1411 2423
1315 2423 -2283 -1101 4882 3317 -2455 27 5529 3537 -692 2728 4351 -1416 -3675 -609 -2094
1330 -2094 -6303 -2849 1804 -1984 -4741 1231 3970 -1940 -2643 4585 4223 -2108 -85 4865 1532
1345 1532 -1874 2256 3823 -1878 -2270 2047 -496 -6172 -2127 2685 -2570 -5182 1228 2956 -2969
$$ packed form
1244I152o981j5161J1601J1698j3298m369J7045N28j7615L065J4979r511j4732
1257a3599J1655J2383j1758o962J3428K696j3613l92J0288m304p600Q212O738
1270G172r515k791J0582O51j1279J676J0168k888r187M202P402n108m624M471
1284I32J917o160j543L829j194l263M540N538l264l126M512K386n963k853N377
1299A665K924m459j713M485L31m392o32K461j886k296J584J218l364K92N193J012
1315B423m706J182N983j565n772K482N502j992m229L420J623n767k259L066j485
1330b094m209L454M653l788k757N972K739n910p03P228l62o331K023M950l333
1345A532l406M130J567n701l92M317k543n676M045M812n255k612O410J728n925
$$ plain form
1360 -2969 -2387 3969 2990 -1298 2153 5108 -18 -2488 2759 1975 -4201 -2420 2787 -1033 -5764 -742
1376 -742 3126 -1880 -2867 3276 3281 -2295 -166 4049 -348 -3751 1076 2356 -3086 -3018 3045 1649 -3473
1393 -3473 -187 4257 -376 -3338 1514 2403 -2625 -1896 3510 1201 -2879 1148 3527 -1309 -3676
1408 -3676 1544 1330 -3846 -2054 3276 451 -3227 720 3066 -1323 -2604 2675 2284 -1690 777
1423 777 4138 1185 -2203 1148 1943 -3447 -4257 -85 -372 -4067 -1152 3191 1050 -995 2484 2845
1439 2845 -1228 -1434 2347 1371 -2169 222 3064 186 -2520 140 698 -3001 -2959 814 115 -1653
1455 -1653 882 3525 1049 -800 1301 1375 -1671 -1618 1118 901 -1335 455 2087 195 -1697 -560
1471 -560 -145 -2493 -2344 335 1084 27 1514 2825 1831 97 370 475 -1061 -1499 74 354 -417
$$ packed form
1360b969N82O356r79m288L451K955n126k470N247p84o176J781N207l820m731N022
1376g42L868n006r87O143Nn576K129M215m397l403M827J280n442O8O063j396n122
1393c473L286M444m633k962M852Q89n028P29N406k309m080M027K379m836k367
1408c676N220k14n176J792N330k825l678L947K346m389j281N279l91l974K467
1423G77L361k953l388L351P95n390q10M172k87l695K915M343k141k045L479L61
1439B845m073k06L781r76l540K391K842k878k706K660N58l699M2L773o99j768
1455a653K535K643k476j849K101P4l046N3K736k17k236J790J632j892j892J137
1471e60M15k348J49K679P49j057J487J311r94j734K73J05j536m38J573K80p71
$$ plain form
1488 -417 -342 291 -454 -1686 -1532 -1009 -1100 -522 1145 1983 2009 1859 2225 1476 -85 -244 -604 -945 -1014 -900
1508 -900 -83 -219 -668 -1147 -852 -1114 -1636 -834 225 1029 1323 2168 2499 1912 432 305 -2 -1525 -1796
1527 -1796 -574 -230 -861 -135 815 336 -837 -787 0 -1086 -1637 211 1195 383 319 1925 1339 -900
1545 -900 -772 1138 69 -981 962 2138 124 -899 1052 400 -2274 -2103 335 -601 -1833 -125
1561 -125 2194 303 -621 1330 1395 -1958 -1962 836 -56 -2222 418 3553 1309 -517 2109 2568 -1611
1578 -1611 -1485 1572 635 -2894 -1263 1124 -1529 -4088 -680 1324 -2037 -2275 2838 2958 -975 1110
1594 1110 5042 2024 -1317 1466 3046 -2618 -4503 292 415 -3597 -1608 2880 78 -3945 -599
1609 -599 2378 -1715 -2863 3363 4009 -1382 -524 4403 1971 -2744 706 4390 -705 -3716 754 1333
$$ packed form
1488d17P5O33p45j232J54N23r1N78J667Q38K6j50L66p49j561j59l60l41o9J14
1508i00Q17j36m49m79K95k62n22Q02J059Q04K94Q45L31n87j480j27l07j523k71
1527a796J222L44o31P26R50m79j173N0P87j086n51J848R84q12o4J606n86k239
1545i00J28J910j069j050J943J176k014j023J951o52k674J71K438r36j232J708
1561a25K319j891r24J951O5l353mK798q92k166K640L135k244j826K626M59m179
1578a611J26L057r37l529J631K387k653k559L408K004l361k38N113J20l933K085
1594A110L932l018l341K783J580n664j885M795J23m012J989M488k802m023L346
1609e99K977m093j148O226O46n391Q58M927k432m715L450L684n095l011M470N79
$$ plain form
1625 1333 -4571 -3960 2382 364 -4294 -1072 3443 -827 -3295 3051 5784 242 -39 5005 2319
1640 2319 -4503 -2145 2612 -1627 -5105 91 2525 -4040 -4960 2039 2287 -2907 757 6362 1636
1655 1636 -3222 1395 4568 -1577 -2854 3780 2761 -4773 -3619 1991 -1382 -5613 214 4530 -1133
1670 -1133 -3828 2237 2912 -3156 -1314 6226 3795 -2337 798 4569 -1743 -5156 1517 3241 -3670
1685 -3670 -3646 2689 -452 -6686 -2134 4297 344 -2737 3612 5256 -2120 -2679 4509 4099 -2202 646
1701 646 5539 -633 -6306 -982 1743 -4352 -4565 2979 2141 -5162 -2622 3978 483 -3473 3477 7668
1717 7668 331 -2569 3514 3067 -4475 -2261 4529 406 -5685 -1421 2103 -3762 -5531 2494 4263
1732 4263 -2418 -1492 4563 1399 -4644 311 5454 406 -2925 2854 3476 -4070 -3907 3100 1640 -4244
$$ packed form
1625A333n904O11O342k018m658L222M515m270k468O346K733n542k81N044k686
1640B319o822K358M757m239l478N196K434o565r20O999K48n194L664N605m726
1655A636m858M617L173o145j277O634j019p534J154N610l373m231N827M316n663
1670a133k695O065O75o068J842P540k431o132L135L771o312l413O673J724o911
1685c670K4O335l141o234M552O431l953l081O349J644p376n59P188m10o301K848
1701F46M893o172n673N324K725o095k13P544q38p303K540O600l495l956O950M191
1717G668p337k900O083m47p542K214O790m123o091M264L524n865j769Q025J769
1732D263o681R26O055l164o043M955N143n048l331N779O22p546J63P007j460n884
$$ plain form
1748 -4244 -16 4468 -1677 -5762 583 3254 -2859 -1966 4630 2783 -3787 -930 4263 -208 -3375
1763 -3375 2706 4649 -2382 -4459 1518 543 -5082 -1390 4763 719 -3686 1268 3979 -2115 -2644
1778 -2644 3869 3690 -2573 -1545 2792 -944 -5626 -241 3783 -1010 -2851 2910 2706 -3492 -1982
1793 -1982 4048 1883 -2943 782 3579 -1797 -4526 834 2407 -2387 -1184 3968 1690 -3762 -789
1808 -789 3214 -811 -3122 1979 3063 -2406 -3382 1902 991 -3103 246 4344 781 -2920 1099 2443
1824 2443 -2221 -2836 2560 1851 -2997 -1429 2587 -708 -3495 949 3639 -682 -1501 2446 1426 -3267
1840 -3267 -1774 2291 295 -2714 445 2674 -1327 -2912 1720 2482 -1118 -254 3041 691 -3036
1855 -3036 -948 1918 -1395 -2932 1144 1691 -2333 -1833 2113 848 -1420 796 3406 253 -1686
$$ packed form
1748d244M228M484o145m085O345K671o113Q93O596j847o570K857N193m471l167
1763c375O081J943p031k077N977r75n625L692O153m044m405M954K711o094n29
1778b644O513j79o263J028M337l736m682N385M024m793j841N761k04o198J510
1793a982O030k165m826L725K797n376k729N360J573m794J203N152k278n452K973
1808g89M003m025k311N101J084n469r76N284r11m094L349M098l563l701M019J344
1824B443m664o15N396p09m848J568M016l295k787M444K690m321q19L947j020m693
1840c267J493M065j996l009L159K229m001j585M632P62l600Q64L295k350l727
1855c036K088K866l313j537M076N47m024N00L946j265k268K216K610l153j939
$$ plain form
1870 -1686 880 1517 -1885 -1671 1831 1004 -2124 -806 1605 -877 -2356 673 1856 -953 -1048 1487
1886 1487 979 -1976 -542 2386 575 -1183 783 1986 -962 -1377 1040 836 -1376 -622 824 -517
1902 -517 -2199 -216 1253 -388 -486 1375 1724 -634 -260 1361 585 -793 328 1227 -577 -1649 -17
1919 -17 329 -1523 -790 735 322 -846 220 1349 109 -335 944 1316 -229 -507 456 397 -1141 -682
1937 -682 636 -222 -1200 -80 193 -541 -532 749 881 -231 444 1149 283 -415 133 849 -423 -724 194
1956 194 233 -971 -814 190 -1 -847 -88 455 -228 -488 672 1023 -12 -54 1135 677 -165 -164 639 -315
1976 -315 -898 49 27 -752 -723 -28 -307 -801 39 599 46 -173 658 880 414 116 808 493 -142 -45 -25
1997 -25 -493 -950 -189 -271 -734 -420 257 427 -571 149 560 146 -154 467 704 46 -19 446 146 -428 -225
$$ packed form
1870a686K566O37l402K14L502q27l128J318K411k482j479L029J183k809r5K535
1886A487n08k955J434K928j811j758J966J203k948m15K417k04k212P54J446j341
1902e17j682J983J469j641r8J861L49k358L74J621p76j378J121Q99j804j072J632
1919a7L46j852P33J525m13j168J066J129j240m44J279L72j545k78R63n9j538M59
1937f82J318q58r78J120K73p34RJ281J32j112O75P05q66o98N48P16j272l01R18
1956A94L9j204J57J004j91q46P59N43o83k60J160L51j035m2J189m58q42JQ03r54
1976c15n83R47k2p79K9O95k79m94Q40N60n53k19Q31K22m66k98O92l15o35R7K0
1997b5m68m57P61q2m63L14O77J70r98P20M11m14l00O21K37o58o5M65l00n74K03
$$ plain form
2018 -225 -3 -151 -739 -88 -135 -249 79 31 232 -185 95 525 81 -289 339 479 19 -114 25 -131 -357
2039 -357 -335 85 -265 -379 119 83 -219 -136 45 285 -180 102 300 -21 -330 -7 222 -103 4 91 -38
2060 -38 89 262 -69 120 198 -135 263 -31 -23 79 150 -46 45 78 -65 -197 75 161 85 -186 -229 139 -113
2083 -113 -2 77 72 18 92 173 -35 123 7 -48 -226 -132 -249 99 67 261 199 33 116 29 37 128 -339 -34 62
2108 62 61 155 72 247 -79 156 254 337 17 -82 3 101 -72 -240 -97 -88 161 169 159 -43 -56 186 58 -252 216
2133 216 145 -94 -315 76 -4 -29 -203 283 386 -89 299 617 64 -224 149 313 -220 -432 -58 143 -145
2154 -145 -224 240 438 247 234 215 -1 156 276 -96 -303 -247 244 141 -250 -102 143 130 -383 54 411 10
2176 10 -114 -5 34 -413 -273 258 -262 -267 129 273 -43 -211 348 188 -184 -315 -243 -99 -608 -347 325 30
$$ packed form
2018b25K22j48n88O51m7j14L28m8K01m17K80M30m44l70O28J40m60j33J39j56k26
2039c57K2M20l50j14M98l6l02Q3J81K40m65K82J98l21l09L23K29l25J07Q7j29
2060c8J27J73l31J89P8l33L98k94QJ02P1j96R1L3j43j32K72Q6p6k71m3L68k52
2083a13J11P9nn4P4Q1k08J58j16n5j78R4j17L48l2J94o2j66Q3q7QR1m67L05R6
2108F2jR4q3J75l26K35R8Q3l20r9Q5R8j73j68J43RK49Qj0k02j3K42j28l10M68
2133B16p1k39k21L91q0k5j74M86J03m75L88L18n53k88L73J64n33k12L74K01k88
2154a45p9M64J98j91j3j9k16J57J20l72k07N6M91j03l91J48K45j3n13M37L57m01
2176A0j24J09L9m47J40N31n20nL96J44l16j68N59j60l72j31P2J44n09K61O72k95
$$ plain form
2198 30 -43 358 202 137 -42 118 133 -216 -268 -143 -237 -609 -380 13 -142 -311 472 422 -314 -101 315 248 56
2221 56 47 375 -100 -377 -242 142 -434 -204 587 363 -273 31 313 -122 -451 -45 592 -6 -211 309 9
2242 9 -310 9 609 135 -283 296 159 -541 -981 -90 -221 -334 -328 404 -182 -612 -24 469 135 -18 546
2263 546 630 -196 -541 43 -118 -687 -71 474 -120 -568 202 467 -249 69 724 473 -344 -79 163 -95
2283 -95 -461 324 671 -35 -33 24 -162 -742 -498 547 108 -350 131 259 -385 -533 166 610 -139 -58 817
2304 817 387 -509 -381 426 237 -513 -24 141 -557 -689 98 283 -104 256 639 52 -572 -161 361 -177
2324 -177 -110 745 597 -411 -626 392 71 -535 92 692 17 -308 -109 -4 -700 -511 526 362 -177
2343 -177 28 341 -263 -778 200 847 -51 -376 228 122 -942 -601 432 84 -467 428 606 -520 -714
$$ packed form
2198C0p3M01j56o5j79J60J5l49n2J25r4l72K29L93j55j69P83n0p36K13M16o7j92
2221E6rL28m75k77J35L84n76K30P91k24o36L04K82m35l29M06O37n98k05N20l00
2242Il19L19O00m74m18N79j37p00m40Q91j31j13OP32n86m30N88M93l34j53N64
2263E46Q4q26l45N84j61n69O16N45n94m48P70K65p16L18O55k51q17K65K42k58
2283i5l66P85L47p06KN7j86n80K44J045m39m58M81J28o44j48O99M44p49Q1Q75
2304H17m30q96J28Q07j89p50M89J65o98j32P87J85l87L60L83n87o24M11N22n38
2324a77O7Q55j48j008k15J018l21o06O27O00o75l25J99J05o96J89J037j64n39
2343a77K05L13o04n15R78O47q98l25O04j06j064L41J033l48n51Q95J78j126j94
$$ plain form
2362 -714 301 419 -219 -41 817 18 -811 -303 373 -186 -168 612 628 -533 -566 261 193 -362 395 985 255
2383 255 -628 -46 203 -737 -235 986 553 -341 -131 332 -396 -732 205 648 -297 -270 732 114 -754 -314
2403 -314 744 -52 -351 384 561 -677 -383 445 646 -99 -56 702 -168 -712 -241 381 -296 -612 693
$$ packed form
2362g14J015J18o38J78Q58p99q29N08O76n59J8P80J6j161l3Q27o8n55P57N90p30
2383B55q83N82K49r40N02J221m33q94K10M63p28l36R37M43r45K7J002o18q68M40
2403c14J058p96k99P35J77j238K94Q28K01p45M3P58q70n44M71O22o77l16J305
$$ [...]
8191F
##END NTUPLES=NMR FID
##END=
