##TITLE=1H_IBDM0104A
 CDCl3, 8 sc, 
 2.4.2019
##JCAMPDX= 6.0         $$ Bruker NMR JCAMP-DX V2.0
##DATA TYPE= NMR FID
##DATA CLASS= NTUPLES
##ORIGIN= UXNMR, Bruker Analytische Messtechnik GmbH
##OWNER= root
$$ XWIN-NMR		Version 3.5
$$ Tue Apr  2 14:16:35 2019 Russian Standard Time (UT+4h)  she@DPX200
##.OBSERVE FREQUENCY= 200.1316
##.OBSERVE NUCLEUS= ^1H
##.DELAY= (6, 6)
##.ACQUISITION MODE= SIMULTANEOUS
##.ACQUISITION SCHEME= undefined
##.AVERAGES= 8
##.DIGITISER RES= 18
##SPECTROMETER/DATA SYSTEM= spect
##.PULSE SEQUENCE= zg30
##.SOLVENT NAME= CDCl3
##.SHIFT REFERENCE= (INTERNAL, CDCl3, 0, 15.7039)
##AUDIT TRAIL= $$ (NUMBER, WHEN, WHO, WHERE, WHAT)
$$ ##TITLE= Audit trail, XWIN-NMR		Version 3.5
$$ ##JCAMPDX= 5.01
$$ ##ORIGIN= Bruker BioSpin GmbH
$$ ##OWNER= she
$$ F:/spectra/data/she/nmr/H-F/1/audita.txt
$$ ##AUDIT TRAIL=  $$ (NUMBER, WHEN, WHO, WHERE, WHAT)
(   1,<2019-04-02 14:15:19.90 +0400>,<she>,<DPX200>,
      <created by zg, POWCHK disabled, PULCHK disabled
       configuration hash MD5:
       00 E9 B6 7A A2 85 ED C7 34 08 36 98 17 FE 4E 26
       data hash MD5: 16K
       7D 3A 14 B6 F4 A0 76 6A 15 D0 A1 42 DF BA AD AD>)
$$ ##END=
$$ 
$$ hash MD5
$$ A5 E8 B3 00 82 A8 CC BA 74 EF 16 52 0B 7E DE 27
##$RELAX= 
##$RELAX= 
##$RELAX= 
##$RELAX= 
##$RELAX= 
##$RELAX= 
$$ Bruker specific parameters
$$ --------------------------
##$DU= <F:/spectra>
##$EXPNO= 1
##$NAME= <H-F>
##$PROCNO= 1
##$TYPE= <nmr>
##$USER= <she>
##$AMP= (0..31)
100 100 100 100 100 100 100 100 100 100 100 100 100 100 100 100 100 100 
100 100 100 100 100 100 100 100 100 100 100 100 100 100 
##$AQSEQ= 0
##$AQ_mod= 1
##$AUNM= <au_zg>
##$AUTOPOS= <>
##$BF1= 200.13
##$BF2= 200.13
##$BF3= 200.13
##$BF4= 200.13
##$BF5= 200.13
##$BF6= 200.13
##$BF7= 200.13
##$BF8= 200.13
##$BYTORDA= 1
##$CFDGTYP= 0
##$CFRGTYP= 5
##$CHEMSTR= <none>
##$CNST= (0..31)
1 1 145 1 1 1 1 1 1 1 1 1 1 1 1 1 1 1 1 1 1 1 1 1 1 1 1 1 1 1 1 1 
##$CPDPRG= <>
##$CPDPRG1= <>
##$CPDPRG2= <>
##$CPDPRG3= <>
##$CPDPRG4= <mlev>
##$CPDPRG5= <mlev>
##$CPDPRG6= <mlev>
##$CPDPRG7= <mlev>
##$CPDPRG8= <mlev>
##$CPDPRGB= <>
##$CPDPRGT= <>
##$D= (0..31)
0 1.2 0 0 0 0 0 0 0 0 0 0.03 0 0 0 0 0 0 0 0 0 0 0 0 0 0 0 0 0 0 0 0 
##$DATE= 1554200119
##$DBL= (0..7)
120 120 120 120 120 120 120 120 
##$DBP= (0..7)
150 150 150 150 150 150 150 150 
##$DBP07= 0
##$DBPNAM0= <>
##$DBPNAM1= <>
##$DBPNAM2= <>
##$DBPNAM3= <>
##$DBPNAM4= <>
##$DBPNAM5= <>
##$DBPNAM6= <>
##$DBPNAM7= <>
##$DBPOAL= (0..7)
0.5 0.5 0.5 0.5 0.5 0.5 0.5 0.5 
##$DBPOFFS= (0..7)
0 0 0 0 0 0 0 0 
##$DE= 6
##$DECBNUC= <off>
##$DECIM= 24
##$DECNUC= <off>
##$DECSTAT= 4
##$DIGMOD= 1
##$DIGTYP= 9
##$DL= (0..7)
0 120 120 120 120 120 120 120 
##$DP= (0..7)
150 150 150 150 150 150 150 150 
##$DP07= 0
##$DPNAME0= <>
##$DPNAME1= <>
##$DPNAME2= <>
##$DPNAME3= <>
##$DPNAME4= <>
##$DPNAME5= <>
##$DPNAME6= <>
##$DPNAME7= <>
##$DPOAL= (0..7)
0.5 0.5 0.5 0.5 0.5 0.5 0.5 0.5 
##$DPOFFS= (0..7)
0 0 0 0 0 0 0 0 
##$DQDMODE= 0
##$DR= 18
##$DS= 0
##$DSLIST= <SSSSSSSSSSSSSSS>
##$DSPFIRM= 0
$$ [...]
##$SUBNAM2= <"">
##$SUBNAM3= <"">
##$SUBNAM4= <"">
##$SUBNAM5= <"">
##$SUBNAM6= <"">
##$SUBNAM7= <"">
##$SUBNAM8= <"">
##$SUBNAM9= <"">
##$SW= 24.9336934301222
##$SWIBOX= (0..15)
0 0 2 0 0 0 0 0 0 0 0 0 0 0 0 0 
##$SW_h= 4990.01996007984
##$TD= 16384
##$TD0= 1
##$TE= 0
##$TE2= 300
##$TE3= 300
##$TEG= 300
##$TL= (0..7)
0 120 120 120 120 120 120 120 
##$TP= (0..7)
150 150 150 150 150 150 150 150 
##$TP07= 0
##$TPNAME0= <>
##$TPNAME1= <>
##$TPNAME2= <>
##$TPNAME3= <>
##$TPNAME4= <>
##$TPNAME5= <>
##$TPNAME6= <>
##$TPNAME7= <>
##$TPOAL= (0..7)
0.5 0.5 0.5 0.5 0.5 0.5 0.5 0.5 
##$TPOFFS= (0..7)
0 0 0 0 0 0 0 0 
##$TUNHIN= 0
##$TUNHOUT= 0
##$TUNXOUT= 0
##$USERA1= <user>
##$USERA2= <user>
##$USERA3= <user>
##$USERA4= <user>
##$USERA5= <user>
##$V9= 5
##$VALIST= <valist>
##$VCLIST= <CCCCCCCCCCCCCCC>
##$VD= 0
##$VDLIST= <DDDDDDDDDDDDDDD>
##$VPLIST= <PPPPPPPPPPPPPPP>
##$VTLIST= <TTTTTTTTTTTTTTT>
##$WBST= 1024
##$WBSW= 4
##$XGAIN= (0..3)
0 0 0 0 
##$XL= 0
##$YL= 0
##$YMAX_a= 541013
##$YMIN_a= -773369
##$ZGOPTNS= <>
##$ZL1= 120
##$ZL2= 120
##$ZL3= 120
##$ZL4= 120
##$ABSF1= 10
##$ABSF2= 0
##$ABSG= 5
##$ABSL= 3
##$ALPHA= 0
##$AQORDER= 0
##$ASSFAC= 0
##$ASSFACI= 0
##$ASSFACX= 0
##$ASSWID= 0
##$AUNMP= <proc_1d>
##$AZFE= 0.1
##$AZFW= 0.1
##$BCFW= 1
##$BC_mod= 2
##$BYTORDP= 1
##$COROFFS= 0
##$CY= 11.3945322036743
##$DATMOD= 1
##$DC= 2
##$DFILT= <>
##$DTYPP= 0
##$F1P= 18.9103706918063
##$F2P= -1.10871071338519
##$FCOR= 0.5
##$FTSIZE= 0
##$FT_mod= 4
##$GAMMA= 1
##$GB= 0.15
##$INTBC= 1
##$INTSCL= 1
##$ISEN= 128
##$LB= 0.24
##$LEV0= 0
##$LPBIN= 0
##$MAXI= 10000
##$MC2= 0
##$MEAN= 0
##$ME_mod= 0
##$MI= 1.114404
##$NCOEF= 0
##$NC_proc= 0
##$NLEV= 6
##$NOISF1= 3.799351
##$NOISF2= 2.8
##$NSP= 1
##$NTH_PI= 0
##$NZP= 0
##$OFFSET= 15.70392
##$PC= 1
##$PHC0= -9216.562
##$PHC1= 18.40025
##$PH_mod= 1
##$PKNL= yes
##$PPARMOD= 0
##$PSCAL= 0
##$PSIGN= 0
##$REVERSE= no
##$SF= 200.130013532006
##$SI= 16384
##$SIGF1= 3
##$SIGF2= 2
##$SINO= 400
##$SIOLD= 16384
##$SREGLST= <1H.CDCl3>
##$SSB= 0
##$STSI= 0
##$STSR= 0
##$SW_p= 3612.71676300578
##$SYMM= 0
##$S_DEV= 0
##$TDeff= 0
##$TDoff= 0
##$TI= <>
##$TILT= no
##$TM1= 0
##$TM2= 0
##$TOPLEV= 0
##$USERP1= <user>
##$USERP2= <user>
##$USERP3= <user>
##$USERP4= <user>
##$USERP5= <user>
##$WDW= 1
##$XDIM= 8192
##$YMAX_p= 0
##$YMIN_p= 0
$$ End of Bruker specific parameters
$$ ---------------------------------
##NTUPLES= NMR FID
##VAR_NAME=  TIME,          FID/REAL,        FID/IMAG
##SYMBOL=    X,             R,               I
##VAR_TYPE=  INDEPENDENT,   DEPENDENT,       DEPENDENT
##VAR_FORM=  AFFN,          ASDF,            ASDF
##VAR_DIM=   8192,          8192,            8192
##UNITS=     SECONDS,       ARBITRARY UNITS, ARBITRARY UNITS
##FACTOR=    0.0002004,     1,               1
##FIRST=     0,             0,               0
##LAST=      1.6414764,     0,               0
##MIN=       0,             -773369,         0
##MAX=       1.6414764,     541013,          0
$$ Real data points
##PAGE= N=1
##DATA TABLE= (X++(R..R)), XYDATA
$$ [...]
2100C303o734q42R697J218r607r42O646j317l610N783K802q617m353P791M139
2115E357n245o96L393m224n234N957O931m467o353K417K378l428J305O333j712
2130B712q120L54O940K40l490K608K216n843k771P325L692n799j928M573j712
2145I97n308M581O863m919p074M328L957n814m00Q049j617r883J468Q346k689
2160H85n260N949K973r697k319J0650J844q390J357O165n827n532R587O177r592
2175a030m447Q204p3p259N178Q520p915q903P443O155o786j437P939l536r949
2190g896M526R808m653o281N252J521p982J089R830j051r012J614N660m146k306
2205d027P412J970q474j831O878Q42l878K643L015n242m047N463M319l421k488
$$ plain form
2100 3303 -3431 -4273 5424 6642 -2965 -3907 2739 1422 -2188 3595 6397 -2220 -6573 1218 5357
2115 5357 112 -584 2809 -1415 -6649 -692 6239 1772 -4581 -2164 214 -3214 -1909 4424 2712
2130 2712 -5408 -5054 1886 2126 -1364 1244 3460 -2383 -5154 2171 5863 64 -1864 2709 997
2145 997 -4311 270 7133 2214 -4860 -532 3425 -2389 -2789 5260 3643 -6240 -4772 3574 885
2160 885 -4375 1574 4547 -5150 -7469 3181 5025 -3365 -2008 4157 -1670 -7202 2385 8562 -1030
2175 -1030 -5477 2727 2654 -4605 573 9093 1178 -7725 -282 5873 -913 -2350 5589 2053 -7896
2190 -7896 -3370 6438 1785 -4496 756 2277 -5705 -4616 5214 4163 -4849 -3235 2425 -1721 -4027
2205 -4027 3385 5355 -3119 -4950 1928 2770 -1108 1535 4550 -692 -4739 724 5043 1622 -866
2220h66K335j144l296K223M631j335m914MK371o79n92K809P18m805k084M108K777
2237B261k528r36K752j700m180L092N776k406n087K734K857m140l99O509j86p182
2253b763L22N776k149m047N256K764p933k572P769J019o658J896N783o036n676
2268g249P830N101p523k440O729j920o526N060P854o327o548O019L283o015J163
2283a509P707m034q008M987O353m710l117N976p23p843K503P842k849o471L439
2298d57L085n292n34O399p48o171O63M753k305k279L977R39m492k93L835q0k320
2315a320J429J925k507j071K312J257j436q3P52p55r50P03P56N48n77j346o15
2332i78J000J77l77J222k01k942o27L240R17k303k06J229k218q51M326J328m365
$$ plain form
2220 -866 1469 325 -2971 -748 3883 2548 -2366 -2362 9 -670 -1262 1547 2265 -2540 -4624 -516 2261
2237 2261 -267 -1203 1549 -151 -4331 -1239 4537 2131 -2956 -222 2635 -1505 -1904 4605 4419 -2763
2253 -2763 -2441 3335 1186 -2861 2395 5159 -2774 -5346 2423 3442 -3216 -1320 4463 -1573 -7249
2268 -7249 581 5682 -1841 -4281 2448 528 -5998 -938 6916 589 -5959 60 3343 -2672 -1509
2283 -1509 6198 2164 -5844 -857 5496 786 -2331 3645 2922 -4921 -2418 5424 2575 -3896 -457
2298 -457 2628 -2664 -3198 3201 2453 -3718 -3055 1698 -607 -2886 1091 2030 -2462 -2755 1080 1000 -1320
2315 -1320 109 2034 -473 -1544 768 2025 589 506 1258 503 -447 256 1012 1560 983 -363 -978
2332 -978 22 199 -178 1044 843 -2099 -2726 514 1431 -872 -1078 151 -2067 -2918 1408 2736 -1629
2349a629r73L771q53k271L462K661n457k515N706J683m445N95L778l521l648N252
2365A596L152n708j662M704r94m357L322L455m990k909N324J274n278N92M807
2380B328k237m033M044L240m664j922N204K86m385J692L361l028k150M449J013
2395C198m296l44L742r17k563K311J439l851r25L781K33k961K03J349j712o65
2411a978K918J40k907j71J957n32J03J161o13k115R90J980k85n17J98l53q49J563
2429F90J567j311j105Q34m01o68J732L95k330p09K067J80j819Q84N76j834o40
2446a892K472M70k500j12J876j001p34K009K88k762J84L117l60k414J505J508
2462A654k405j59L320r2l539M62K750j105j413J906J64l034L60K921o33k536Q82
$$ plain form
2349 -1629 -2602 1169 316 -1955 1507 4168 -1289 -3804 1902 3585 -860 -265 3513 -8 -3656 1596
2365 1596 4748 -960 -2622 2082 1088 -3269 53 3508 -1482 -4391 933 2207 -3071 -2479 2328
2380 2328 91 -3942 102 3342 -1322 -3244 1960 2246 -2139 -447 2914 -114 -2264 2185 3198
2395 3198 -1098 -1442 2300 1383 -1180 1131 2570 -1281 -2206 1575 1808 -1153 -950 399 -1313 -1978
2411 -1978 940 1080 -1827 -1998 -41 -573 -470 691 78 -2037 -1047 933 648 131 329 -24 -873 690
2429 690 2257 946 -159 675 274 -394 1338 1733 -597 -1306 761 941 -878 6 582 -1252 -1892
2446 -1892 580 1050 -1450 -1562 314 -687 -1421 588 876 -1886 -1702 1415 1055 -1359 146 1654
2462 1654 -751 -910 2410 2318 -1221 -759 1991 886 -527 1379 1543 -1491 -1131 1790 1157 -1379 -497
2479d97J151k047n8K538m49l070P09K573j015j330J507K30j975O27K391m45j764
2496i24P34R58r29K86J636r68j585Q90J471r31n26J062q09j138R85J182j027j229
2514h62N41J76m33N96K65j237l95J094L16p93K66N53j144j26J650L10j310kQ55
2533C20K3k44R80o0j122J79J265k98o85N28k99j126N54J411r05j370N50N57r01
2552f43o9J037o58j244N72J157n39m27O17j98q05J247R50j162r10J222Q13j213
2570b53M63J104p58j238J098J248q08q94N07L85j177P91P32j168r51O66O01r23
2588e75J72O69q18r61P89J164r43p39Q71K05o39L16R37j8j318N05J155k99k93
2607A80M80k9n98L1Q81o9p47J37O60m84p05N83N76j188l15J030k54j321J31J483
$$ plain form
2479 -497 654 -1393 -1451 1087 638 -2432 -1723 850 -165 -1495 12 242 -1733 -1106 1285 840 -924
2496 -924 -190 768 -161 125 1761 793 -792 98 1569 638 112 1174 365 -773 212 1394 367 -862
2514 -862 -321 -145 -578 18 283 -954 -1349 -255 61 -732 -466 87 -1057 -1183 467 777 -533 -535 320
2533 320 343 99 1079 1019 -103 76 1341 1043 358 886 587 -539 15 1426 521 -849 -299 258 -643
2552 -643 -712 325 -333 -1577 -1005 152 -387 -814 -197 -395 -1200 47 997 -165 -1075 147 960 -253
2570 -253 210 1314 556 -682 416 1664 856 -38 469 854 -323 468 1200 32 -919 -253 348 -575
2588 -575 -403 266 -552 -1513 -724 440 -503 -1242 -371 -166 -805 -489 448 430 -888 -383 772 473 180
2607 180 660 631 33 64 945 876 129 266 926 442 -263 320 896 -292 -607 423 169 -1152 -1021 462
2627D62l30j470N74J131j235l50J438M69j754j39J686j29p93Q61Q16j297q41J896
2645I95P32j747J35J252q60j403J387J571j600j632J680J79j646M30J593r98j694
2662a626M54J523p97p32J194K1j575J59J880m8j021K05J007q65o70J539J036j318
2680C66q64J309K95r11J56J243o24j811M37J556m00j034N54N00j879m26K229K68
2698I64j889l74J406o91j321K054J345j943j809K284Q36j848O29K370j300k852
2714b139J969K684k279j361K747K97l596O65L911j108l500J893K116l369j167
2729b237L991N41m479l7L486j192k973L080K293m139j955M182J137l273Q33L023
2745B281k731k903L825K658l080j435K962n08k999J957L468k309l162K001J835
$$ plain form
2627 462 132 -1338 -764 367 -868 -1218 220 689 -1065 -1204 482 353 -440 421 1237 -60 -901 995
2645 995 1727 -20 115 1367 507 -896 491 2062 462 -1170 510 689 -957 -527 1066 68 -1626
2662 -1626 -1172 351 -446 -1178 16 37 -1538 -1379 501 453 -568 -363 644 -221 -891 648 1684 366
2680 366 -498 811 1106 195 351 1594 970 -841 -404 1152 752 -282 272 772 -1107 -1533 696 964
2698 964 -925 -1299 107 -584 -1905 149 1494 -449 -2258 26 862 -986 -357 2013 713 -2139
2714 -2139 -170 2514 235 -1126 1621 1918 -1678 -1013 2898 1790 -1710 183 2299 -1070 -2237
2729 -2237 1754 2295 -2184 -2221 1265 73 -2900 180 2473 -1666 -3621 561 1698 -1575 -742 2281
2745 2281 -450 -3353 472 3130 50 -1385 1577 1069 -1930 27 3495 1186 -1976 25 1860
2760A860k322k42K945p40l533L88K943o18j889J189N12k282n83K787P38j945m88
2777a280J407n62r66J399J760j374j739J070J358o13o16J848l3k413m88K414P72
2794A944j718k24J548j592k075K336K445k337k412J928L14k220J228L406k055
2809E16l969J892L077k389p79L747o15m886P89N687j057l762K206J946m138o37
2825b372N419L83n188L37L869k009k646M137J830n310j843N062o2l990J969L371
2841B957l748l479M402K766m507o73L945j203m213K623M173k444k926K561R65
2856A199l059P31M064j046l842J454K449j855p89K982J66m075m73L351P8j706
2872c71N28R63k462j201K719J891j848j488L08K67o37R02J842p55k335j10K000
$$ plain form
2760 1860 -462 -704 2241 1501 -2032 -1644 1299 681 -1208 -19 493 -1789 -2372 415 1153 -792 -1280
2777 -1280 127 -435 -1401 -2 1758 384 -1355 -285 1073 460 -156 1692 1659 -754 -1242 1172 1944
2794 1944 226 2 1550 -42 -2117 219 2664 327 -2085 -157 157 -2063 -835 2571 516
2809 516 -3453 -1561 1516 -873 -1652 2095 1480 -3406 -2617 3070 2013 -1749 457 2403 -1735 -2372
2825 -2372 3047 3430 -1758 -1421 2448 439 -2207 1930 3760 -1550 -3393 1669 1607 -2383 -414 2957
2841 2957 -791 -4270 132 2898 -1609 -2282 1663 460 -3753 -1130 3043 599 -2327 234 1199
2856 1199 -1860 -1129 2935 1889 -1953 -499 1950 95 -694 2288 2454 -1621 -2094 1257 1335 -371
2872 -371 157 1120 -1342 -2543 176 2067 219 -1269 -961 -694 -1331 -429 1413 658 -1677 -1787 213
2889B13M80n30P03J71j978p28K725J738k410r87J557m37j750J623K630j980l216
2906b176J795J938k214n41L027n80m078R71L322j265k470K642J310l893q26M580
2922A542J50l691R41K974k541k178M302K075m320j307L734m44l262K616L408l676
2938C23l208L359J818l205K48L120j878m085K860L364k849j893K606O7l403J292
2954a464L873j504l288J250K217j976l31K911j61l214L40K683m38j185J100O26
2970A439j942p25K484N59j860j78J159p18j387J199J412j113j424M94P34o83m29
2987i79J255R9j319q36J372O80p34j09R88l80j619J241K116q88j656J049P81j647
3005e86K90K481o68k609L76K116q24j643K170P54l230p05L251j31k249M54J949
$$ plain form
2889 213 693 163 866 1037 -941 -1669 1056 2794 384 -603 954 517 -1233 390 3020 1040 -2176
2906 -2176 -381 1557 -657 -1198 1829 1249 -2829 -1858 1464 199 -2271 371 1681 -2212 -3038 1542
2922 1542 1692 -1999 -1058 1916 -625 -2803 1499 3574 -746 -2053 1681 1237 -2025 591 3999 323
2938 323 -2885 474 2292 -913 -665 2455 577 -3508 -648 2716 -133 -2026 580 647 -2756 -1464
2954 -1464 2409 905 -2383 -1133 1084 -892 -1223 1688 1527 -1687 -1347 1336 898 -287 813 1439
2970 1439 -503 -1228 1256 1815 -45 -223 936 218 -1169 30 1442 329 -1095 -601 133 -550 -979
2987 -979 276 375 -944 -1780 -408 272 -462 -571 417 37 -1582 -341 1775 887 -769 280 1061 -586
3005 -586 -296 2185 1517 -1092 -716 1400 576 -1067 1103 1857 -1373 -2078 1173 1042 -1207 -753 1196
3022A196k197j460K843J218k979m17K544o39k039J744K143k377j602K767R01k595
3038i49L49K666j275k328J950J789k006r94K253j48k628P04K400j347j801J380
3054A5R24j867l99K042o3j961M02J343r71p06J371N30j345l26J207K18n06L48
3072B56N85q13m26P60M69m27k96K43M0k76K23J95P0o31l91M28K03m6n26K85k88
3093c63o81K81P54o2o50K33L77m80k85R85K56r94J94J151n77n92Q18P96j130l37
3113c06J189J79j321N16J037q81j051J189N58j193n43J144j98j262O60R31r78
3130c30o72P66L89j156M14J018o91q30O25R71q47k30J097O1j096L64J276o64p09
3149b44Q67J54p36k7Q41j77p75Q0M00k96l56N98k01n36L9K94l59k52M49l9j25
$$ plain form
3022 1196 -1001 -2461 382 1600 -1379 -1796 748 109 -1930 -186 1957 -420 -2022 745 1646 -949
3038 -949 -600 2066 791 -1537 413 2202 196 -798 1455 1307 -1321 -617 1783 436 -1365 15
3054 15 939 -928 -1327 715 652 -1309 -907 436 -535 -1241 130 660 -685 -1011 196 414 -92 256
3072 256 841 28 -398 362 831 404 108 351 391 115 338 533 603 -28 -419 9 212 166 -360 -75 -363
3093 -363 -1044 -763 -9 -71 -721 -488 -111 -591 -876 109 365 -629 -435 716 139 -453 365 1161 31 -306
3113 -306 883 1062 -259 257 1294 413 -638 551 1109 -84 -627 517 319 -943 -283 648 -330
3130 -330 -1002 -236 153 -1003 -589 429 -262 -1092 -467 504 -343 -573 524 585 -511 -147 1129 465 -244
3149 -244 623 777 41 14 855 678 -97 -17 383 87 -269 329 128 -408 -369 -75 -434 -686 -237 -276 -401
3170d01l21K66K49j92J35K07k83M56n9R1qK49j8k57K43J60j24q2J89j53m8j49
3192A50K18l86K79j38kl74o7K71n01O8K89km30L5L89l97Q2M78J10l59mL64P8l02
3216a51M79L10o08qM77R0l74L06M2l19k99O72j90p83M06L61m71m37O62J06o62
3237c91k28M98M8o50J53O47m74k10N04M3k50OM15j6m37O90M03m54p1K21K4l26
3259A45J25M43J16n46Q7M0q6l86L39J44n06k83Q4J81m30m1M20j77l07O7M39j56
3281b88k46L09M8k34J97N70r0l57K8O82k86o0J53K74n05j84N57K2m07k83M99k90
3303A09m25K23L28m83l66K92L83q23K62O51k55p23M14N40n42j31O17J96p07J48
3323b92Q45j29o16L29N78n94M5M46J80n13k55O07k27q09O53N81j034l52M71K95
$$ plain form
3170 -401 -722 -456 -207 -399 -264 -57 -340 116 57 148 140 389 371 114 357 517 393 311 500 347 299 150
3192 150 368 -18 261 123 121 -253 -320 -49 -550 -482 -193 -195 -625 -590 -201 -598 -516 -38 72 -287 -291 73 151 -151
3216 -151 328 638 30 22 499 589 215 521 563 244 -55 617 427 -356 50 411 -60 -497 165 271 -391
3237 -391 -619 -121 -73 -723 -570 77 -397 -607 -103 -60 -310 -304 111 95 -342 348 751 297 226 447 471 145
3259 145 270 713 829 283 370 410 324 -62 277 421 -85 -368 -284 -103 -533 -574 -154 -331 -638 -571 -132 -288
3281 -288 -534 -225 -177 -411 -214 356 266 -91 -63 619 333 273 426 700 195 11 568 590 183 -100 399 109
3303 109 -316 -93 235 -248 -614 -322 61 -762 -500 151 -104 -827 -413 127 -415 -546 71 267 -440 -292
3323 -292 553 424 -192 137 715 121 166 612 792 279 24 631 404 -405 248 829 -205 -557 -86 209
3343B09n62o2N20l45o81M20O92l75n05M46J65n00j08J149p2p98Q6P91k32m34P85
3364E89L38q32l97R95J77n79q5O16o31q12Q21N92r32m14P33k2r17J28J061m10
3384A9q02K38Q13r02j90J336j62q73j40J112n0p86P17N44r21m13J051M21r55L6
3404I3N34m61o98Q97Q15j198n10P62J87j022K90Q59l89j237L55R07l11n32N82
3423g7J45r75kJ267L9p17O2P14l98o73J303N54j061m15M59O48q04L05P07m81j288
3444f88M11J038p94m29Q88p4j377J73J516p1j351K13Q65j001n65J590M81j487
3462f62l41J305j24o02N18J104j067j208J469P87j193J46J014o62j336J082J193
3479A423r69r06N36O85j255j06J711m44j804K54J172o18o67J290L62j848q6J328
$$ plain form
3343 209 -353 -415 105 -240 -921 -501 191 -184 -689 -243 -78 -578 -686 463 391 -407 -321 470 238 -196 589
3364 589 927 95 -302 693 870 291 206 822 191 -621 200 792 -140 -554 179 157 -760 -632 429 19
3384 19 -783 -545 268 -634 -824 512 350 -523 -663 449 399 -387 330 874 -47 -460 591 1012 57 93
3404 93 627 166 -532 365 1180 -18 -528 234 421 -601 -311 548 159 -1078 -723 184 -127 -659 -77
3423 -77 68 -907 -909 358 397 -320 -258 456 58 -615 688 1242 181 -234 225 873 69 374 1081 600 -688
3444 -688 -277 761 -33 -462 426 352 -1025 -852 664 593 -758 -545 320 -681 -1246 344 825 -662
3462 -662 -1003 302 178 -424 94 1198 131 -1077 392 1179 -14 132 1146 484 -852 230 1423
3479 1423 454 -452 84 769 -486 -592 1119 675 -1129 -875 297 -321 -988 302 664 -1184 -1270 58
3497E8J80r29O82O99r13j009J441J169j184m09Q35k07p42M28J362o49j407L10
3515b85J031o68k78J041l11j423j93J463r1o79K01K76j035k10J221P13j274k94
3533g95Q53k33o33O48J457q49j496R07R56n40n38J345l59j457R6J759j23j234
3551b36O86K71j185n28J867K49j767k38J351p44r84J251J256j856r77J463N92
3568D71j546O63J628j112j377J024J481j064o31J204j57j401N43J808o22j516
3584f04Q18N28j232J44J314J06j790j85J418o04r74J143P27j534p55J331O53j200
3602f96j88J127o47r41J149J173n89r51N57K02n13L68J067j49j393J94J081m00
3620D51n03N88L15j213k91J045N57r98k70O03m33q46O68Q95o91j027O30P97q86
$$ plain form
3497 58 238 -691 -9 690 -223 -1232 209 1378 194 -215 620 413 -329 99 1461 812 -595 -285
3515 -285 746 78 -200 841 530 -893 -1086 377 286 -393 -192 84 -951 -1161 60 773 -501 -795
3533 -795 58 -175 -808 -160 1297 448 -1048 -141 815 275 -263 1082 723 -734 -638 1121 998 -236
3551 -236 450 721 -464 -992 875 1124 -643 -881 470 -274 -1258 -7 1249 -607 -1584 -121 471
3568 471 -1075 -412 1216 104 -1273 -249 1232 168 -463 741 584 -817 -274 1534 912 -604
3584 -604 214 742 -490 -346 968 1074 -716 -901 517 -87 -1061 82 809 -725 -1480 -149 504 -696
3602 -696 -884 243 -404 -1345 -196 977 388 -563 -6 196 -317 51 1118 969 -424 -230 851 451
3620 451 -52 536 851 -362 -653 392 949 -49 -319 284 -149 -995 -327 568 -123 -1150 -520 277 -609
3639f09J63R59p0j411K13J335m59o30P70O36j224m74J611N13j643J52J023n81
3657B74r16J214Q51j402p41J008L02r97J63J250j105j351J091J018j292j14J242
3674D95l23j397M78J616n71j130P52P72j150LJ489r1j473M68O62o10l59J046M90
3693A167j389p9R41n1q26J81N95p28o12Q47N59o42n55M05q2m28K19O34j00m83
3713d27q8M87k77N9M72J23n39l3N44Nj84P2L76m27l44L92M63l85m21M39o8m58
3735b19K21J77L28j017L4O18k52o99N06L40o41j46Q01J97n63p4P09k92n45O95
3755A78O72j017j63O28M03p73M0J128o63j072P67N45n01m82P55k81p31L00M48
3774A81k96n48P65Nq94N3J097n20l13p2Q45n07l07N55K84n73N9N96k73k36L74
$$ plain form
3639 -609 -446 513 443 -968 -755 580 121 -509 261 897 -327 -801 810 1323 -320 -168 855 274
3657 274 -642 572 1423 21 -720 288 590 -407 -244 1006 -99 -1450 -359 659 -633 -747 495
3674 495 172 -1225 -747 869 298 -832 -80 692 -458 -455 1034 943 -530 -62 600 -10 -369 677 1167
3693 1167 -222 -301 640 589 -237 -56 539 -189 -801 46 605 -37 -592 -187 -269 -697 -478 156 56 -427
3713 -427 -515 -28 -305 -246 226 349 -190 -223 321 326 142 214 590 163 -181 211 674 289 -132 307 239 -219
3735 -219 2 179 507 -510 -476 142 -110 -809 -303 37 -604 -750 51 248 -315 -389 320 28 -517 178
3755 178 850 -167 -330 298 701 -72 -32 1096 433 -639 128 673 172 -310 445 164 -567 -267 181
3774 181 -115 -663 102 107 -787 -734 363 -157 -470 -542 303 -204 -511 44 328 -245 -186 410 137 -99 275
3795B75L37m85k51N23O9m74L92R6m03k19L24J72j49o21M91P2p35K86R7j03r0k3
3817d19J22Or9L0J30J2J45o7K09J7q0J39K4N4O2P6j85p9j5K54K15n60J23K44j70
3842A88m49L03J42m60Q4N23n14l29K26L24k98k18K73K83o12K43L53p4l96N36K36
3863C64n19R4O44j16m94K18L74m04r6L51J41k41l58N55m53k81N9M21m75k53N21
3884E2k25m23J31L14j46m65M44L46l42k7N33j23k23P7M16k33q8N8K64n6k43N54
3906E95l64J9N5m0Lj89K9j58o0J27pJ14k06k73L7J30l7j66n7K66Q1l45J35O5Q7
3931a59J51J70ll91L08L09j49o5K27p7q8j38M04k23l38M24J09m35k33L82j75l33
3953c23J52K22q7l01J44J56j54j96K21J57j68n4L70k98k4J05J02j18n8M86q7j42
$$ plain form
3795 275 612 127 -124 399 468 -6 386 482 79 -140 184 356 207 -414 77 149 -586 -300 -203 -306 -396 -419
3817 -419 -297 -291 -390 -360 -230 -218 -73 -140 69 86 6 145 169 223 285 361 176 97 82 336 551 -9 114 358 188
3842 188 -261 42 184 -276 -192 331 -183 -512 -286 38 -260 -478 -205 78 -534 -291 62 -12 -408 128 364
3863 364 -155 -61 583 467 -27 191 565 161 65 416 557 316 -42 513 60 -221 -162 259 -216 -469 52
3884 52 -173 -596 -465 -151 -297 -762 -318 28 -314 -341 192 69 -154 -77 339 106 18 76 340 284 41 595
3906 595 231 250 305 265 268 79 108 -50 -110 17 10 124 -82 -355 -318 -188 -225 -391 -448 -182 -101 -446 -311 -246 -159
3931 -159 -8 162 159 -232 76 385 236 171 398 321 233 95 499 276 -62 362 471 36 -197 185 10 -323
3953 -323 -171 51 -36 -337 -193 -37 -191 -387 -166 -9 -177 -231 139 -159 -183 -78 24 -94 -152 334 247 105
3975A05p0N11m62oL18j29k25O0L53r7k96qMp8k02M30k52l45r0L34o8j94M8J74
3999a85j79O2J10J47j9j29K34R9R0j14K38j1n6m9J60k01p3J7J29k74K23L4M1l09
4023a5J00ok97p2K32Q6l35M9J15l4k19M9M04l02j46K40P7P8j06L62N3l32R2K27
4047C00j27J05L4k2k02q5L12N1l52j24L14j91j97K27J92l80j57J83O3l41K10K40
4069E3l08k30M27N6m40K58K17Q3m33R0P21l05k74K50K85m13n3N02p6l96n6M01
4091C59p6k17J41Q9k97m22J73L64k85J8L0k40k35L04K64j87k82N50j7n47K87P21
4113D95j07n78K27L13l83l2N09J65l75k55L61j89j3Q6J71k90k22L79R1o05J00
4134a52J87j54m43L50M92m18n83M87J94l14J48M17j20n15J86N05j38l52N81J2
$$ plain form
3975 105 35 546 84 78 396 267 42 102 455 358 62 54 58 -20 -222 208 -44 -389 -479 -145 -213 -407 -359 -185
3999 -185 -364 -302 -192 -45 -64 -193 41 140 230 116 354 343 287 238 398 197 124 141 270 -4 219 253 294 -15
4023 -15 85 79 -218 -290 -58 28 -307 -258 -143 -177 -396 -347 57 -245 -391 -151 -74 4 -102 260 313 -19 73 300
4047 300 173 278 312 290 88 3 315 366 14 -110 204 13 -184 43 235 -145 -302 -119 -56 -397 -187 53
4069 53 -255 -485 -58 -2 -442 -184 33 116 -317 -227 494 189 -85 165 450 37 -16 486 410 14 -42 359
4091 359 283 66 207 296 -1 -423 -250 114 -171 -153 -123 -363 -598 -294 -30 -217 -499 51 34 -513 -226 495
4113 495 388 -190 37 350 -33 -65 444 609 234 -21 340 151 138 224 395 105 -117 262 353 -252 -152
4134 -152 35 -119 -562 -212 280 -138 -721 -234 -40 -354 -206 211 91 -424 -238 267 129 -223 358 370
4154C70m19j24N50K44m45m2L00l74j51K85N05p25l11K84K33n44O2P08m60n80K8
4175f06O51j78l06N00o0m23J1N83J93o45J80K47k73r5O86M9l62k66M82K66n97
4196C7J63L86k50o21K41O44n36m24N78r0q10K06Q26k96n51L91K27o55j25Q47J06
4217B94r31L10M87J57o35O31J15o65M3N64J14o18K86N78n37n83M29P47l32p35
4237b81O18Km74o9O28k13r25L81L77l54j46O24P4q63L4O43m7j63J85L30n92o1
4259b92L95M98o77J6L63J27m61K55L19k00m42J66Q7j40p8L78j66o78K2M12Lk01
4281b94P7J28l20q0N05L1m03Q1J97P7k41K06M31j76m99L50L94m43n1N86k40m57
4303a41J29O48k85l62K86j15l80r6M77L5m18j32M50p8o43O53o4m59j67N70J55
$$ plain form
4154 370 -49 -173 377 621 176 134 434 60 -91 194 699 -26 -337 -53 180 -364 -302 406 -54 -634 -606
4175 -606 45 -133 -439 61 1 -422 -411 172 365 -280 -100 147 -126 -221 465 514 152 -114 368 634 37
4196 37 200 586 336 -285 -44 600 64 -360 218 128 -682 -476 350 54 -497 -106 121 -534 -659 188 294
4217 294 -637 -327 160 317 -318 313 428 -237 -194 370 484 -134 152 730 193 -390 39 786 454 -281
4237 -281 337 339 -135 -204 424 211 -714 -333 44 -310 -456 168 242 -621 -587 56 9 -154 31 361 -231 -292
4259 -292 103 601 -76 -60 303 430 -31 224 543 343 -99 67 154 14 -64 314 148 -530 -508 -96 -93 -294
4281 -294 -217 -89 -409 -489 16 47 -356 -275 -78 -1 -242 -36 395 219 -280 70 464 21 -30 556 316 -141
4303 -141 -12 636 351 -11 275 160 -220 -316 161 196 -222 -354 96 18 -625 28 -36 -495 -662 -92 63
4324F3n48K34L92k74l11L66O22m55j22M67l49k77K93O21l89m47J68L0j78P9M17
4345D02M8o05l1K75j87k34K16J27l31j52N12Pl73N6M10m67k3M21K94k75l41M26
4367A75O5o5o7J80Q9l50m3M44k58m4J77J2m29j72L92K15l60l38M95j12m15J13
4389b96M21k74l59J92M50n53J48K92m1k77J44M71l01k96N26N1l70l4L99J70o78
4410b15K37M15l83j63J52L30m80o7K23J79m30J12M16p07k3M87K6k08j68L74j20
4431a3l49K15L58l88j6L07J02k54j25M02O5l79N7L87j85m7J77Ol13K3J64j07l27
4454b40K79J79o61K42R2Q1j67J0JR7l49K70J44n7j41k8K62J46j94J5K84l98J36
4477CK9K86l71L67J71l18j34%M58k37j46k29L02k60JJ45J2k09j3J72j39l27L53
$$ plain form
4324 63 -485 -251 141 -133 -444 -78 544 89 -33 434 85 -192 101 722 333 -114 54 84 -94 -15 402
4345 402 450 -155 -186 89 -98 -332 -116 11 -320 -472 40 47 -326 -270 140 -327 -350 71 365 90 -251 175
4367 175 240 175 108 288 377 27 -16 428 170 126 303 315 -114 -286 106 321 -39 -377 118 6 -409 -296
4389 -296 125 -149 -508 -316 134 -419 -271 21 -20 -297 -153 318 17 -279 247 298 -72 -106 293 463 -215
4410 -215 22 437 54 -109 43 373 -107 -174 49 228 -202 -90 326 -381 -404 83 109 -99 -267 107 -13
4431 -13 -362 -147 211 -177 -193 114 216 -38 -163 239 304 -75 -18 369 184 137 314 320 7 30 194 87 -240
4454 -240 39 218 -443 -201 -109 -28 -195 -185 -184 -87 -436 -166 -22 -79 -220 -248 14 160 -34 -19 265 -133 3
4477 3 32 318 -53 314 485 167 33 33 491 254 108 -121 181 -79 -78 67 79 -130 -143 29 -110 -437 -84
4500h4Q8l40Q1L03O7k37J90N2k32J8M8L09j57j9K53k18j6j7J13J6j05J33k60R9
4524H5j4J52j33m42L00J87q6k98K23p6j10j68K53Q3j59j06K91p5qM0K04k63J21
4547AJ48N9q6r0Q5M8r5J56O1q7l2l4k00J73m6O9j13m7m7L1l9j47j5N8ok0j47J16
4575b46JJ66J16j78J19o6J68P3r9L1RO8P8K8m7m07L93K8j65j02L32k27j80J6O6
4600b5o5K3j10R7j15k3N1J26j83OJ23n4l6N3K19j06P6P8K7l3J9J51Q7k09q5J39
4626B31m3p9k5K59j73k19L3j5n3J26J03l67J65p4q4j0K26j83Q0r0R9k76J70J69
4650c0j58L02o3Q1k27K03J9Mm0j23J16L35k16J43k09M1l7k71K67k61L01k52Q0
4673Ej8k08K10j92P3j46J01J69j78m3Q1K1m7J88l93M80j03m4l0P8Q2l1K12N2m73
$$ plain form
4500 -84 4 -336 -255 48 115 -122 68 120 -112 -94 -46 263 106 87 340 122 106 89 202 218 113 246 -14 85
4524 85 71 223 90 -352 -52 135 49 -249 -26 -102 -212 -380 -127 -44 -203 -309 -18 -93 -101 -61 143 -120 1
4547 1 149 208 122 32 117 165 70 226 287 200 168 134 -66 107 61 130 17 -30 -77 -46 -85 -232 -247 -189 -195 -215 -362 -246
4575 -246 -245 -79 37 -141 -22 -88 80 153 54 85 94 162 240 268 221 -186 207 235 70 -32 300 73 -107 -91 -25
4600 -25 -90 -67 -177 -80 -195 -218 -167 -41 -224 -218 -95 -149 -185 -132 87 -19 57 135 162 129 148 299 386 177 92 231
4626 231 188 109 84 343 170 -49 -16 -31 -84 42 145 -222 -57 -131 -215 -225 1 -182 -102 -192 -93 -369 -199 -30
4650 -30 -188 114 51 132 -95 108 127 131 91 -32 84 419 203 346 137 178 141 -130 137 -124 177 -75 5
4673 5 -13 -221 -11 -203 -130 -276 -175 -6 -184 -227 -146 -125 -172 16 -377 103 0 -44 -74 4 86 55 267 319 -154
4698a54K11K70Pj50l7j03j40r9L94k07k16L13j90j88q1L55j77q9%N4j9o6L26k3
4722ij83nL63k21J93q3J65k16O2J74L7k20l3K56j37n2l4J43j04M4r5j88l2r3K07
4747f1J23n08J94K46k20j51K02K47n11L77K03qp9q2J77j98K19l15K57o4q1J14
4769H1J28r9r1K29p4l15J64J57l26P9j67J48r4jJ23j10Q9M3j6j06k63J63L40n5
4793B7j09j9n5J02N2K53n3k82L66m1j68J15J06o7k47J9J93J26n21K56P6j23K8
4816C4j54L7j91J32J03j23j38K67j43Qo9p2L01K0k89O5L64l79R2N98m76j31L11
4839A67Pk45R5K58k7l90p5L76N7l06L44j54j05n4r3L58l04j9j26Q5l50J05K35
4862a61q8N8K18K7j89J57L42k85k22L5L20j96P9K69q0l20J46OJ72l45K83j64j02
$$ plain form
4698 -154 57 327 334 184 147 44 -96 -195 199 -8 -224 89 -101 -289 -370 -15 -192 -281 -281 -227 -246 -312 14 -9
4722 -9 -192 -197 166 -55 138 55 220 4 66 240 277 57 24 280 143 91 57 200 96 140 45 -143 -175 -268 -61
4747 -61 62 -446 -252 -6 -226 -377 -175 72 -439 -62 141 133 54 -28 149 -49 170 -145 112 48 -33 81
4769 81 209 110 19 248 174 -141 23 180 -146 -67 -234 -86 -180 -181 -58 -168 -79 -36 -52 -158 -421 -258 82 27
4793 27 -82 -101 -156 -54 -2 251 198 -84 282 241 73 188 294 227 -20 -1 192 318 -203 53 129 6 34
4816 34 -120 -83 -274 -142 -39 -162 -300 -33 -176 -168 -237 -309 -8 12 -277 -212 152 -227 -135 463 -13 -144 167
4839 167 174 -71 24 282 255 -135 -210 166 223 -83 261 107 2 -52 -145 213 -91 -110 -236 -151 -501 -396 -161
4862 -161 -249 -191 27 54 -135 22 364 79 -143 -108 212 16 95 364 284 -36 110 116 288 -57 226 62 -40
4885d0j07L89p7k29k24J14L23m02Q2J53r2j86R5m5J65O1J21N4j56j31K05O5K5
4908A63j16R7l9j43K57R3j83kK22l08m5m7L97j61l28K58N3j70ln8K8k75J17J68
4932b5j8k07K86j2j64o9L01%j31n2L2J88j52N8M50m19N7j27J51j59J32J47l46
4955g9k2O1L12l87j15J90P3m50M02o9oN8j69J46p3j87N33l19O0j55K65j32o8o
4979a37K81j36k39L32O7o3m5Ll5k58K77N9m0J9j0K0l62J45J41Q6j77p8J1k4r7
5004b60K31j88J9R6m4K32j12MP8q3l6J46J05j37o1J99j47L8o8J04k4k89L88j78
5028A3j29K9r4K55l68k3K97j51j12j47M59j87j33L27J27j89j18K17J8j49R1J82
5050B15Qm62J81J25j01K54k26J69q9NJ65j04m6O6j97m9j4l8P7o9J50l13J24n0
$$ plain form
4885 -40 -147 242 165 -64 -288 -174 149 -253 -171 -18 -110 -296 -201 -246 -81 -20 101 155 -1 -132 73 138 163
4908 163 47 144 105 -38 219 312 129 127 349 41 -4 -51 346 185 -143 115 168 -2 -5 -63 -35 -310 -193 -25
4932 -25 -43 -250 36 24 -140 -209 92 92 -39 -91 -59 129 -23 35 485 66 123 -4 147 -12 120 267 -79
4955 -79 -101 -40 272 -115 -230 -40 33 -417 -15 -84 -90 -32 -201 -55 -128 -315 218 -101 -41 -196 69 -63 -131 -137
4979 -137 144 8 -231 101 168 105 60 63 28 -230 47 106 66 85 75 95 -267 -122 19 105 -72 -150 -139 -163 -260
5004 -260 -29 -217 -198 -102 -146 86 -26 -22 56 -27 -63 83 188 51 -10 189 42 80 12 116 92 -197 191 13
5028 13 -116 -87 -181 74 -294 -317 -20 -171 -283 -430 29 -158 -291 36 163 -26 -144 73 91 -58 33 215
5050 215 223 -239 -58 67 -34 220 -6 163 74 79 244 140 94 160 -37 -86 -100 -138 -61 -130 20 -293 -169 -219
5074b19J94K1k66m6L76r1n5J18J21p3j92J61R4%r8J27J40m49J13K84j34j25L41
5097C42j45l69J41J77m2k15J09j17J09j31L5J07j83mj1K6K13k35J41m0K2j43K98
5120H5J50j97j42K44K7q2K74j96j30P5Q0J24j87j23K12j90l9%R2r7k07Q9k4Q9
5144g3j91K77rl13JJ39o8K2K10n5M6j00J89k8J57L1l6j67P7p6J66k63J34R7J4
5169A81J07k52Q1L4j43r1J14j3j03L0o2k49K85q4jl7K90k65L0K69k52P1j2J25
5193E3L1J45k05J48K1k4j29R8Mp5R4J3q9M2k2o8k7j4O3j12P1l32K28nj1K4J4L5
5221b9k65K99r8p3J43J05j14J3J15k21P4K33j53R9M7J33j85O8k3l5K26p9l05M2
5245A7j02J76K5k51L7q9K12k98Q6k3P3j08J83l9J40k0l54L04n1J44p4J40pk17
$$ plain form
5074 -219 -25 -4 -270 -316 60 -31 -86 32 153 80 -112 49 143 143 45 172 312 -137 -24 260 126 1 342
5097 342 197 -172 -31 146 104 -111 -2 -119 -10 -141 -106 1 -182 -186 -197 -171 42 -193 -52 -92 -70 -213 85
5120 85 235 38 -104 140 167 85 359 163 33 108 188 312 125 2 214 24 -15 -15 77 -20 -227 -138 -162 -73
5144 -73 -264 13 4 -309 -308 -169 -237 -215 -5 -60 -14 -114 75 47 204 235 199 32 109 33 199 -64 70 167 181
5169 181 288 36 117 151 8 -83 31 18 -85 -55 -117 -366 -81 -165 -166 -203 87 -178 -148 121 -131 -60 -72 53
5193 53 84 229 24 172 193 169 40 138 142 67 161 174 85 127 105 37 10 -4 59 -53 18 -314 -86 -91 -102 -78 -64 -29
5221 -29 -294 5 -93 -166 -23 82 -32 -19 96 -125 -51 182 29 128 175 308 123 191 168 133 359 280 -25 17
5245 17 -85 91 116 -135 -98 -187 25 -273 -187 -210 -137 -245 -62 -101 39 19 -335 -31 -82 62 -12 128 121 -96
5269i6K41j20o0J11K96j57K8k87J04M9r1L3Mk6l27L95l3j45J34j57R8R2k13j3
5293a40K41k18ppJ75O1m4k5k5L0P7kj26K95r9p4o9J9N0J11j36o9p4k7K9N5o5n6
5321a20J80r9j3j18J21j51J86k30L51j31N6k8R6Q7l18K07Q8k91J01Q2R1k64L46
5344B29j22m5Q2j6q3j9j13J87J8j70n8K26k08j06L9mJ22k35L01q3k49O4K52l9
5368c0j72P7L64m52P8J23P4r9Q5M0J5j1K30k61J52j99l3R8J8q6k4p7P8j09J56
5393C5m1j27J71n9J5j84K23j22j86L75j82M7j32O6J41j26J56o9J92r8L7m1rO1
5417A43Jj87N0P5J58j64j94J64P9j71k4k4P7J05j67N7j12k6r0L3K93j27N5j74
5441a70J85j08Q9l2J69k45J34J99j47k8K90k36j39J92rj04j09J07kj76J94J10
$$ plain form
5269 -96 145 25 -35 76 372 215 243 -44 60 109 18 51 55 29 -298 97 64 -81 53 -104 -6 86 -127 -140
5293 -140 101 -117 -124 -131 44 105 61 36 11 41 118 116 -10 285 186 112 43 62 112 223 87 18 -56 -83 -54 1 -64 -120
5321 -120 60 -39 -52 -170 -49 -200 -14 -244 107 -24 32 4 100 187 -131 76 164 -127 -26 56 147 -117 229
5344 229 107 62 144 128 45 26 -87 100 118 -52 -110 116 -92 -198 -159 -163 -41 -276 25 -58 -307 -243 9 -30
5368 -30 -202 -125 239 -213 -135 -12 62 -37 48 88 103 92 322 61 213 14 -19 79 97 11 -13 -90 -12 -121 35
5393 35 -6 -133 38 -21 -6 -190 33 -89 -275 100 -82 -35 -167 -101 40 -86 70 1 193 95 132 91 82 143
5417 143 144 -43 7 82 240 76 -118 46 125 -46 -70 -94 -17 88 -79 -22 -134 -160 -250 -217 76 -51 4 -170
5441 -170 15 -93 -4 -36 133 -112 22 221 74 46 336 100 -39 153 144 40 -69 38 36 -140 54 164
5463A64j73k41K39K1k06P4M9j8J2n2J4k4M7k5O5m1J70P6j89J27r0Q1Lp4N0N9k70
5490a52L05J14j17Q7l40N5P8q1j29J97m0o1m6PP0j13O0NN9Q4ok01Q0Q6q1K0P6
5517A6N4K9j96K04q9j9j35L23q4K3q7Q5m4k3j6l9j7L6p7p0l4o1K80q5k48K55J
5544a8l14N47k94M0p9J79j2j03J58o9J20r1j82Q6L5R9J31j11p2j21J12k8k3lN0
5569C7j13J72j7p1q5M0r9j06L08k37K63l72J84J72o3q6J18k4n5J29j75Q8J04N4
5593A66k06K59m1j58mK13j18K91j75k39p1Q4k7N7J57k16q0K89m91J83K25k44P2
5616g4k4j7j30k9L25j99J35j34J11K63k60M4J6n4R8K52k48N0k8J13j02k54J75
5639B9P2j5j46j5nk6l7M9J3r4R6J33p4j27K11Pk25M5J45L5r5j06L85j09o9m0J27
$$ plain form
5463 164 -9 -250 -11 10 -196 -122 -73 -91 -79 -131 -117 -141 -94 -119 -54 -95 75 151 -38 89 -1 80 83 9 59 118 -152
5490 -152 153 267 150 237 -103 -48 30 -51 -180 17 -23 -84 -130 -123 -53 -166 -106 -101 -42 42 36 -165 -85 1 -80 -60 16
5517 16 70 99 -97 107 18 -1 -136 187 103 126 39 124 80 57 41 2 -15 21 -56 -126 -160 -221 59 -26 -274 -19 -18
5544 -18 -332 215 -79 -39 -118 61 49 -54 104 35 155 64 -118 -32 3 102 233 122 50 -71 41 13 -10 -13 37
5569 37 -76 96 79 8 -77 -37 -136 -242 66 -171 92 -280 -96 76 13 -73 45 21 -34 95 -80 8 112 166
5593 166 -40 219 178 20 16 229 111 402 227 -12 -83 1 -26 31 188 -28 -108 181 -310 -127 98 -146 -74
5616 -74 -98 -115 -245 -274 51 -148 -13 -147 -36 227 -33 11 27 -27 71 323 75 125 97 210 108 -146 29
5639 29 101 86 -60 -75 -80 -106 -143 -94 -81 -175 -79 54 -20 -147 64 71 -154 -109 36 71 -24 -130 255 146 77 37 164
5666A64p2kK13m7k17nJ27k49q3J88q7K26m18K38j5p0R5j23N8j33J97J4j60P3j20
5691b08K4J80n4K42j64o2J69N3j29jO3k9k4l2n1K43k37k1O0r0P9k9J98j77k07
5716b04J97K1k4%Q3l01J94l3N2J48j28j31j0l9J69K23N1l97O8L07j36j3O2o7J40
5741B32j19J1o5j48nK58j13k68K25M3P7j34P4o9j39N7j34j07K69j12J97j25m2
5764a37J68j16n2L13j02nq1J55p7M9J16j98l7j2P2P6j20O1j13J69m3r9J26j01
5788A2j0k32K89o8l05J18J35p0j85L37Lk42J33K50k69J89m8R0m2o4j2J08k37K84
5812A64j31J36j83L0J18j44mP7m6j19J04k18Q2p2J26j29J2K06L8r5m9K8p7j32
5836b78K34m6J59l3j21R8Lo2O2J23O9l0Q5j52O0j47n1J96k11K59K5r5j53k70K63
$$ plain form
5666 164 92 90 303 256 39 34 161 -88 -171 17 -70 156 -262 -24 -39 -109 -14 -137 -79 -212 -15 -1 -161 -88 -208
5691 -208 -184 -4 -58 184 20 -42 127 180 51 50 113 84 60 28 -23 220 -17 -38 22 -68 11 -18 180 3 -204
5716 -204 -7 14 -10 -10 73 -228 -34 -67 -15 133 5 -126 -136 -175 -6 217 268 -129 -61 246 110 97 159 92 232
5741 232 113 124 59 -89 -94 164 51 -217 8 51 128 -6 68 -1 -140 -83 -217 -324 -55 -167 30 -95 -137
5764 -137 31 -85 -137 176 74 69 -12 143 66 115 231 33 -4 -16 56 132 12 73 -40 129 86 -13 113 12
5788 12 2 -230 59 -9 -314 -196 -61 -131 -316 21 24 -218 -85 165 -104 85 37 127 85 21 9 117 -120 164
5812 164 33 169 -14 16 134 -10 -14 63 17 -102 2 -216 -134 -206 -80 -209 -197 9 47 -48 -97 -69 -146 -278
5836 -278 -44 -90 69 36 -85 13 16 -46 16 139 208 178 263 111 171 24 -27 169 -42 217 242 147 -6 -276 -13
5861a3P1l0%q0m2Q7j09N9q7R0qk7O4o6N4N0o6J11k28K27o0Q8L3l1R8r6k26J05
5889c2M8j09K97j72r3N1j24L8k5J48J1k54J93Q1J6L1j74R4o2K1J00k57l8K04Q1
5914G4Po8JR9q9J48j52PJ32k4q9j70K9J59P4j40mk06J90j23rL8rj62K36J7j44
5941a78J38j0k4J82k58L0K30N2j52J20j2j17J91m5Q8n4j66J1J25j46o7L7J56j23
5965Hj13N0N7K8jk23J97k24P5j13J75O2k69J56lP4j52K02n2O8J71p9k6J17k49
5990f4J17M3l07M28k39J50l27L11l9k56K78oj78J49j63J71l27K46M1j44K9j20
6012b07J1K58k8j26Q8kk45J89J54j62k8K40j9%m0k2M6R1P0j50j1k70L11o5jj40
6038e8L3K3K7q3R0n0n7K4k7j45K01j46N4k9J81q3j26K70o7J21k48K15Kk22K45
$$ plain form
5861 -13 58 28 28 -52 -94 -7 -116 -57 -144 -54 -62 -89 -25 -91 -37 13 -53 58 -170 57 -3 85 118 87 185 89 -137 -32
5889 -32 16 -93 204 32 -61 -10 -134 -96 -121 27 38 -216 -23 58 74 105 -69 25 -37 -16 84 -173 -211 -7 74
5914 74 81 13 14 113 24 172 20 27 159 135 46 -124 -95 64 138 -2 -6 -212 -22 -145 -154 -116 -125 -287 -51 -34 -178
5941 -178 -40 -50 -74 108 -150 -120 110 162 10 130 118 1 192 147 235 181 15 26 151 5 -62 -25 131 8
5965 8 -105 -55 2 30 29 -194 3 -221 -146 -259 -84 -22 -291 -135 -138 -64 -216 -14 -66 2 173 94 68 185 -64
5990 -64 53 96 -211 217 -22 128 -199 112 73 -183 95 89 -89 60 -103 68 -259 -13 28 -116 -87 -207
6012 -207 -196 62 34 -92 -4 -6 -251 -62 92 -70 -98 142 123 123 83 61 107 198 268 118 107 -163 148 83 82 -58
6038 -58 -25 -2 25 -58 32 -18 -75 -51 -78 -223 -22 -168 -114 -143 38 -45 -171 99 32 153 -95 120 122 -100 145
6063A45%M7j01L3k21K27j99l9J46M6q3PJ36j71P0r8m5M4L3J7j64J34O2n4K7K5
6089B4n0J52j1J6k14K58j45pR6k11J98K5l2r4Q3r6j30L2J81K1p9k28J70M3k11
6114b09P7P4r3N7j5k2Q8m8q3K40j7m6N4j60K13q2L4K62k79J33j13N4q2O5j78J48
6140G2j70J46K01k96J38k71L37k20J76p9p9M1j09R0k0r0M8m0L2J65j94J96l1J5
6164E8q4N3R7j29J12J2M5j13k4J14j03j12J89j96K23l39J69Q7o6j04j17K42Kj22
6188a06O2K0j12J60j12K06k77M00k68j59J33K2K53j19l2p4k1lJ73k4m1r8P2m5
6212A0J10j3j63L6K42j94m2k62K31J49n4P4n28K98K17j00j27K56k29j06J39N7
6234Aj18J08J42k30j41J33L39m0j69j04j03J16K28o2r7LP7j16K5L6N4j43j20J93
$$ plain form
6063 145 145 192 91 124 -97 130 -69 -108 38 84 1 8 144 -27 43 -55 -100 -56 -23 -6 -170 -36 26 -28 -1 24
6089 24 -26 126 115 131 -83 175 30 23 119 -92 106 131 99 5 88 -8 -138 -106 75 96 17 -211 -41 2 -209
6114 -209 -132 -58 -151 -94 -109 -131 -43 -91 -174 66 49 3 57 -103 110 28 62 324 45 178 65 119 37 102 -76 72
6140 72 -98 48 249 -47 91 -180 157 -63 113 34 -45 -4 -113 -23 -43 -133 -85 -125 -93 72 -122 74 43 58
6164 58 -26 27 124 -5 107 119 164 51 27 141 38 -74 115 -81 142 -197 -28 59 -7 -111 -228 14 16 -106
6188 -106 -44 -24 -136 24 -88 118 -159 241 -27 -186 -53 -31 222 103 71 -3 -24 -27 146 122 81 -17 55 10
6212 10 120 107 -56 -20 222 28 -14 -276 -45 104 50 124 -404 -106 111 11 -116 140 -89 -195 -56 1
6234 1 -117 -9 133 -97 -238 -105 234 194 25 -79 -182 -66 162 100 3 6 83 -33 -8 28 82 -61 -181 12
6258A2j25J70l11J77J7Q8j84K70j02r4R4m4K22l15M36k66n6M0j01K16k36J41N5
6281A04Kp6J50k13J57r5M6N0j70q1L10l7j95L2n4J21j40J48j68K30o8k2l8O0r4
6306d1n4P8j72K61Q5l4j9j52j9J25j00J49j14r6J21j40P6R3J47j43o1k3j0J35
6330I2Rk06J44N4r5%J18m2n03L47K0RK3N1j11J53j16J89j60J71o4j10N7l7R1J6
6356A00j15o6K60j83r6J54R2j05j20J14n2rj2n7P7j47J53j47O2k8J04n4K07j91
6380e9L5N9j32k5N4J65m2j93J90l1n7j8L06j49j57J52k34R5N2j48J48J20k35J32
6404B8j95o0L06j32J02kj67N8j43K0K71p2j7M1j5J7p4J5J24n3p2j5J48j65l9K69
6430A78j16q8J34k3k68J1J60m0Pq9N9R9P7j21kq9O9n0q8J34R2n2M9N1j17J26J1
$$ plain form
6258 12 -113 57 -254 -77 -60 28 -156 114 12 -82 12 -32 190 -125 311 45 -11 29 -72 144 -92 49 104
6281 104 106 30 180 -33 124 29 75 125 -45 -126 184 147 -48 -16 -70 51 -89 59 -109 121 53 31 -7 53 -41
6306 -41 -95 -17 -189 72 157 123 104 -48 -67 58 -42 107 -7 -103 18 -122 -46 47 194 51 -10 -33 -43 92
6330 92 101 -105 39 93 -2 -2 116 74 -429 -82 -62 -53 -30 21 -90 63 -53 136 -24 147 83 -27 30 -7 84 100
6356 100 -15 -81 179 -4 -100 54 146 41 -79 35 -17 -26 -38 -95 -18 -165 -12 -159 -97 -125 -21 -75 132 -59
6380 -59 -24 35 -97 -122 -68 97 55 -138 52 21 -36 -54 252 103 -54 98 -136 -41 11 -137 11 131 -104 28
6404 28 -167 -227 79 -53 49 47 -120 -62 -205 -185 86 14 -3 38 23 40 -34 -19 105 52 -20 -35 113 -52 -91 178
6430 178 62 -26 108 85 -183 -172 -12 -52 -45 -134 -75 24 101 -20 -22 -111 -42 -92 -180 -46 46 -6 43 94 -23 103 114
6457A14j3p9K3O8k07K86l3k19J64L0k27K77O3m06J78j02K24j73j30R3o3J13j18
6480a37JL05k46J7J34n9J35j74L6K4J01jl63J86J76k25J16J74j28r9K83k65K8
6503A9J42l26Q0K02J19l70J48Q1j27Q9j74J61k49J19k8l5K53p8j03O3M6q4L61
6526C09l98P9K36j21o4R5N4p9j73J28p4L7m7J72j12j42j8J78j0j00k6PJ8L4j03
6551a20l1J88k11Q5K8L3j6Q1j16P2O7J5j50J10O7j95K47j00J3J04k66J41N8M8
6575A52j68J01k04K4Q4M4l3Lj8n4j40n8L69m23K59J04J0l6q1R7l0k0Q7O8r4j5
6601B8p5J42r6M8N8j91R7M9J26j7k40J25Q6j46j08q1K84l16J36j75K41J65j23
6624A7R3j03qk6N1m3j20K71j27j9N1m0P4P0JK1o8j91K20j73n1J69j7q5j4O3k4
$$ plain form
6457 114 101 22 45 113 -94 192 159 -60 104 134 -93 184 247 -159 19 -83 141 -32 -162 -69 -132 -19 -137
6480 -137 -136 169 -77 -60 74 15 150 -24 12 36 137 136 -227 -41 135 -90 26 200 72 -27 256 -9 19
6503 19 161 -165 -85 117 236 -134 14 95 -32 57 -117 44 -205 -86 -114 -149 104 26 -77 -14 32 -52 309
6526 309 -89 -10 226 105 41 136 190 111 -62 66 -8 29 -18 154 42 -100 -118 60 50 -50 -76 -69 -51 -17 -120
6551 -120 -151 37 -174 -89 -61 -28 -44 37 -79 -7 60 75 -75 35 102 -93 154 54 67 171 -95 46 104 152
6575 152 -16 85 -119 -95 -11 33 0 3 -15 -69 -209 -267 102 -321 -62 42 52 16 -65 32 2 -18 69 137 43 28
6601 28 -47 95 -1 47 105 -86 11 60 186 169 -71 54 140 -6 -114 -195 89 -227 -91 -266 -25 140 17
6624 17 110 7 -1 -27 24 -19 -139 132 5 -14 37 -3 71 141 142 163 95 -96 124 -49 -100 69 52 -33 -47 16 -8
6651hJ08j19P2j77K54l19K5RJ84K8j10J7j20K00K1M4N6j29m9R9o8J53j33k09K57
6676H6j28K48k61Q5N7M7L0k8j56j1j67K01j72J49j66j2K93j16J2K5O3J8K1j56
6700c8o6L0J86k65J41p2P4Kq0K7J07r9Q6Q9k3k15LJ12m4j4N0P0L1m1j44R1m5l7
6728h4J32J0k20mJ22P2K0j20L0Oj04J2K74j33p7O5N1l2k5J94j39r9J45j65P5J73
6754A79k29M8R9N2j2j69o4k6J65q7o8K34k63L4p4R5rj3O3j4J9pk5K43k04j60K25
6781C2j13N5p7J41j43P5p9J58J3J31k50m2J42P0j46j08L7K23k11J5%J64j06r9
6805a18M8k6k1M7J73K6j18m4Q8j7L4r4O0o6P6J25l8j29N8q9N7j45K18k3P9k93
6831a32j3J38o2J7O8j32Rq1J14Lq3J70O6p7L5m6O2j94K03j12j50K47j68M74k07
$$ plain form
6651 -8 100 -19 53 -124 130 -189 -164 -155 29 57 -53 -36 -156 44 65 109 165 36 -13 86 18 171 38 -171 86
6676 86 -42 206 -55 30 87 134 164 136 -20 -31 -198 3 -169 -20 -186 -198 95 -21 -9 16 79 97 118 -38
6700 -38 -104 -74 112 -153 -12 -84 -10 -8 -88 -61 46 -53 33 122 99 -116 -113 -1 -45 -59 -9 61 92 51 -93 -2 -47 -84
6728 -84 48 58 -162 -166 -44 28 48 -72 -42 -36 -140 -128 146 13 -64 1 52 20 -5 189 50 -49 96 -69 6 179
6754 179 -50 -2 97 149 137 -32 -96 -122 43 -44 -112 122 -141 -107 -181 -86 -95 -108 -45 -59 -40 -47 -72 171 -33 -193 32
6781 32 -81 -26 -103 38 -105 -30 -109 49 62 193 -57 -99 43 113 -33 -141 -104 119 -92 -77 -77 87 -19 -118
6805 -118 -70 -96 -117 -70 103 129 11 -33 55 38 72 -22 38 -28 48 173 135 6 64 -25 32 -113 105 82 161 -132
6831 -132 -145 -7 -69 -52 16 -116 -107 -188 -74 -71 -154 16 82 5 40 -6 56 -138 65 -47 -197 50 -118 356 149
6856A49j19Lj0k9J86k51J3k9J27j00k1J92j59M1j14K84k74j09J40J14j64p4J10
6879i4J03P9o1j89O0K38j72K0j70K98J34j1q8q7j42K2Q6n3K26k82K84l64J58N4
6903D9nPj52q6K44j13O4o2m8J27j39o1K80j33j42J41j21L39J4k08Q6j7k47K59
6927G6j28K73r4k69K26j24J75Rm9l14J58J58k39K56k45J14Q1l9rj07J9j36K50
6950D2Q2o9m0mQ8l9O9m6o4N4j93R1K5j05J4K37j50N1j06J0L31l92O7k3K4O5l7
6977a8o1L23j11j91N0j32K74j7j40K06l40M5J40j17K3j85L20M4j04J11j75P2N3
7000G0oq1Q8o8L2R0j9J00k45o9J05K42l77K5J05J19l43L54k61L00k44M9o2O1J4
7025b1p6J62P8k72P9K89j18o4N8k03J57Q2O6k86R0L9M1p9R1j6J62l90K4k1k4J12
$$ plain form
6856 149 30 33 23 -6 180 -71 -58 -87 40 -60 -81 111 -48 -7 -121 163 -111 -220 -80 34 -130 -204 -94
6879 -94 9 88 27 -162 -102 136 -36 -16 -186 112 246 235 147 60 -82 -60 26 -27 199 -83 201 -163 -5 49
6903 49 44 51 -101 -187 57 -56 8 -54 -102 25 -114 -175 105 -28 -170 -29 -150 189 203 -5 81 64 -183 76
6927 76 -52 221 127 -142 84 -40 135 144 95 -219 -61 97 -142 114 -131 -17 64 25 16 -91 -72 -208 42
6950 42 124 55 15 11 99 60 129 83 19 73 -120 -29 -4 -109 -95 142 -8 43 -63 -53 278 -114 -47 -70 -46 19 -18
6977 -18 -79 244 133 -58 -8 -140 134 117 -23 183 -157 -112 28 -89 -66 -251 69 113 9 120 -55 17 70
7000 70 64 -17 71 3 35 125 106 206 -39 -108 -3 239 -138 -113 -8 111 -232 122 -139 161 -83 -34 -96 -35 -21
7025 -21 -97 65 143 -129 -50 239 121 57 115 -88 69 151 217 -69 21 60 101 22 113 97 259 -131 -107 -128 -152 -40
7051d0Q7k27J19o4J25k1p7K4N1l1P5o1R9O6j81J69l5j13N1L4l5q0O8J13q7Q4p9
7078C4K89l47k9J95r4j35J57p1J57j50L1L2j0j46J86p0j32J91k45K63p8K5j17
7101f4k4J97j85J04Rl9J30j2k40k8L7K81k75l5K25j34Q2J53k13%l1J33j28oj79
7126b42K89N5j53N1o3N6r0K21j38m6j7J26k06J97j00J07M7l8J45l04J15M0l2M8
7150F8l7J75m42K27j89M19nk50O7K1Q6j70Q4o4l6O8R8O4k36PM7k3O4r9R2J62k60
7177f2J29K9o0q8n6K80j59J16p9k6m1J79L7l11J76J02j39m4L2J11k8k47J52J25
7201A28j14l9l5K65m85L08j04K0O4N0n1j18J82p6K89m04J40J31k69J02Q8n2L1
7224E1O6M8K0r8j90P9o2M0L9j13J04K7n7k1J30J62k53j53Q5j17L16p1j06J06P1
$$ plain form
7051 -40 47 -180 -61 -125 0 -21 -98 -74 -23 -54 21 -40 59 125 -56 113 78 -35 16 50 15 -65 3 116 29 113 34
7078 34 323 -24 -53 142 48 -87 70 -1 156 6 37 69 59 -87 99 29 -103 88 -157 106 28 53 -64
7101 -64 -88 109 -76 28 37 -2 128 116 -124 -152 -115 166 -109 -144 81 -53 29 182 -31 -31 -62 71 -57 -63 -242
7126 -242 47 102 -51 0 -63 -7 -97 124 -14 -60 -77 49 -157 40 -60 47 94 56 201 -103 12 52 20 68
7150 68 31 206 -236 -9 -198 221 216 -34 33 54 140 -30 54 -10 -46 22 120 184 -52 -45 2 -21 43 -56 36 198 -62
7177 -62 67 96 36 -52 -108 172 13 129 50 24 -17 162 199 -112 64 166 27 -17 15 126 98 -149 3 128
7201 128 14 -25 -60 205 -280 28 -76 -56 8 58 7 -111 71 -5 284 -120 20 151 -118 -16 72 20 51
7224 51 117 165 185 87 -103 -24 -86 -46 -7 -120 -16 11 -46 -67 63 225 -28 -181 -96 -213 103 32 -74 32 103
7249A03or3q1L42j15r9K3j26L2L4k5J15o1p8P5j76P7J2L26k68p4oN0j17K18j17
7275c5j68R8J21k12J64j2j79L08k31J67q9j9J04M9p8K20k06M7p4PQ4O2j5j70K9
7300b8l2N7M0p5P0R8j68n8JR3o8j46L9K2M6k8M7m5OK2J23P9N6k93J54J33k61K35
7328A19p5J01j67k05K12j22n1L7J46J33j92mP6l1j86N2J00O5l6o7k7K65o7l1K5
7353G0nr4mp4J61m6J23j35O9q6j03M4m3QK31j15J10j31n9O2R4j70j83L73m8q8
7379c9R7n0K2Kj11L9j30p8L32j10J22k26J08P1k07K43L3m8j0q8R3lm4j47J93j47
7405h3J24Pm8m6L7q4K00j80J22j94j12K32K5j77RR3J36K4p2K38l02N3n3Q4Q5l7
7431H1q1J48J35j46j62J94j80J16r0m8J21j64j0O9P6k7J9N6p2J6j65J54o7L5l7
$$ plain form
7249 103 97 4 -77 265 150 51 74 -52 -20 14 -11 104 43 -35 40 -136 -59 -47 279 11 -63 -69 -19 -136 82 -35
7275 -35 -203 -105 16 -196 -32 -44 -223 85 -146 21 -68 -87 17 66 -12 208 2 49 -25 -18 66 128 113 -57 -28
7300 -28 -60 -3 37 -38 32 130 -38 -96 -95 -2 -70 -216 -177 -155 -109 -137 -90 -135 -129 -107 16 95 151 -142 12 145 -116 119
7328 119 44 145 -22 -227 -15 -137 -188 -151 -5 128 -64 -68 8 -23 -209 -157 -57 8 -28 -95 -122 143 76 45 70
7353 70 65 -29 -33 -107 54 8 131 -4 65 -21 -124 -80 -123 -115 116 1 111 -20 -79 -17 77 -93 -276 97 49 -39
7379 -39 58 8 30 32 -79 -40 -170 -248 84 -26 96 -130 -22 49 -158 85 118 70 60 -28 65 62 18 -129 64 -83
7405 -83 41 48 0 -46 -9 -93 107 -73 49 -145 -257 -25 0 -177 -168 -75 61 85 13 251 -51 2 -51 33 118 81
7431 81 0 148 283 137 -25 169 -11 105 15 -33 88 -76 -86 -17 59 32 51 107 35 51 -114 40 -27 8 -29
7456b9lP4M9jl8j90K57j44P0ql4J60n1r2PK5N0l0l0K3Qj5q4N4j28O8n6P7J49j92
7486e4J67j36l7J12j16Q2j84L41k24j52Q9L83k28J32k37K44j32j17K09o5j42K3
7508d2q2J69r1J88k53J37R3l23K9J99K0j65L42m3j03k12J68j28J3J60j38P5O1
7531G4j32%mr4L67k60J8O2o1J67J84o28M28k17K22k02J00J8j44k0J60m1NmP8Q
7557H4k11J52k88J69j48J63K9n8O4Q6m4j66K61K20l70K49j10J6j14n8J95j33J0
7580bl3J99q4m2r0K03k88J9J08KO3m8j07P9J84l24o3K11j07K70k79J4R1k24J31
7605a17P5R2J22j41p3J42J7p7k4J12k06J96l7j16l1P3k0RN1m4N0o4j9KJ36L4j50
7632hJ06k36J09J60j23kK5m4K8j7q8Q0m7p0K79k65J49o3lJ1J42m5j43K62k28O8
$$ plain form
7456 -29 -32 42 91 90 52 -138 119 -25 45 37 3 163 112 20 27 52 102 72 42 65 73 58 -26 28 -100 -32 -88 -11 138 -54
7486 -54 113 -23 -60 52 -64 18 -166 175 -49 -201 -112 271 43 175 -62 182 50 -67 142 77 -65 -42
7508 -42 -124 45 -46 142 -111 26 119 -204 -175 24 44 -121 221 178 75 -137 31 -97 -84 76 -62 13 74
7531 74 -58 -58 -62 -156 211 -49 -31 31 -30 137 321 -307 121 -96 126 -76 24 42 -102 -122 38 -3 2 -2 76 84
7557 84 -127 25 -263 -94 -242 -79 -50 -108 -44 42 -2 -168 93 313 -57 192 82 98 -16 -74 121 -12 -2
7580 -2 -35 164 80 38 -52 151 -137 -118 -10 -8 55 7 -100 -21 163 -161 -224 -13 -120 150 -129 -115 -24 -248 -117
7605 -117 -42 50 172 31 -42 100 117 40 16 128 -78 118 81 -35 -66 7 -13 -4 47 3 53 -11 -30 -28 108 142 -8
7632 -8 98 -138 -29 131 8 6 31 -13 15 -2 -90 -10 -57 -127 152 -113 36 -27 -30 -19 123 78 -65 197 -31 37
7658C7o0l3L4Q5j09Q1J40k34p3M2J51j3j60o8J73m9J23j27O6m0J4K35j37o8N3
7683F3R8p6q1P2k05J49j33j04K90L6r6J79j90p5J1q6K40j79J68l28K60j16L6o
7707g3R2M7M1l7j71J39Qm0k19L46k40R0R4M1l7N3j10m4J8P2k95J67LL4M3K01k07
7734A6j8R0j91JJ87j40n4K20j60M4q5J47j21J19l2j26L5J25j76L46j71k4o8P9
7758D3J90j37m1J48k28M6k7J14k39L60o9k32K14k83l7J09J91j33nJ9P7j80K0J35
7782E5k33J87j38L5K1J57j52J55k07P7J47l0m7k7O9r9J19k28J52j03L6r4k5J68
7806eNO5n1k24J99p5R8k26J57O2q2J49q2J16j65J36k9n2P5j73K60j93M1L6J75
7831B17j24m5l6J04j6m0j36k5j24L55j55R8m9M5j56J34j05p3O4m6O2J20r3j7Q8
$$ plain form
7658 37 -23 -56 -22 63 -46 35 175 -59 -132 -90 61 48 -112 -180 -7 -56 67 -60 6 -34 -20 215 78 10 63
7683 63 161 85 4 76 -129 20 -113 -217 73 109 13 192 2 -73 -62 -148 92 -87 81 -247 13 -103 -67 -73
7707 -73 19 66 107 70 -101 38 46 6 -213 133 -107 -17 77 118 81 134 24 -20 -2 70 -225 -58 -55 -21 22 223 16
7734 16 -2 88 -103 -102 85 -55 -109 111 -49 -5 -90 57 -64 55 23 -103 -68 57 -119 227 56 32 -36 43
7758 43 233 96 55 203 -25 21 -6 108 -131 229 160 -72 142 -141 -178 -69 122 -11 -16 3 80 -100 -80 55
7782 55 -178 9 -129 -94 -73 84 -68 87 -120 -43 104 74 27 0 69 -30 89 -139 13 -90 -54 -148 -173 -5
7806 -5 0 65 14 -210 -11 -86 12 -214 -57 5 -77 72 -10 106 -59 77 48 -4 71 -102 158 -35 6 42 217
7831 217 93 48 12 116 100 60 -76 -101 -225 130 -25 73 24 69 -87 47 -58 -131 -67 -113 -51 69 -24 -41 47
7856D7m7J50k28J03LJ2j50L02r9j12K32l22K04j25j4L01k05O4k15Q0o8J85l6n8
7880Dj06o4K23Q3l13J58r2L15r6p1r6n8J91q0J73j02k2j0J35q6j44K01k0Kk19
7905i4k1J57q8k0j18L7K48p1k15j8l9J81J36n8o4n1J24R4L2j30p2M5o4J25l6p9
7931e9L24m40J62K10j82J61k41P4N2q4J28k18L1J28J40m10K29pj01J48j64K62
7953A43n6k48L1K51O9k39J21M2k9q4k0p7K85j6K1k5k71K49k53K12r2o5L1R9j8
7978F1J56o7j48R1m8n4j22J08j28M1Q0j5Mk12L42j66j07J37m4J45j08R1j3r9J21
8003D6Q7m3n1O2j42J34j65K67l37L37j22j79J40K7m3kp7J6P3j65J76j90N5M3Q4
8028C1o4jk0o2PJ76k03k5J17p6J17J4J62k06j6k9n1K26j83R6P3m2j34J13J07o7
$$ plain form
7856 47 0 150 -78 25 28 40 -110 192 93 -19 213 -109 95 -30 -44 257 52 116 -99 -19 -87 98 62 4
7880 4 -102 -166 57 140 -173 -15 -107 208 112 41 -55 -113 78 -2 171 69 47 37 172 86 -58 143 123 125 -94
7905 -94 -115 42 -46 -66 -184 -147 101 30 -185 -203 -242 -61 75 17 -47 -98 26 120 152 22 -50 -5 -69 56 20 -59
7931 -59 265 -175 -13 197 15 176 -65 9 61 -23 105 -113 -82 46 186 -224 5 -2 -103 45 -119 143
7953 143 87 -161 -130 121 190 -49 72 114 85 1 -19 -96 189 173 194 169 -102 147 -106 106 14 -51 -20 79 61
7978 61 217 150 2 93 45 -9 -131 -23 -151 -110 -30 -45 -41 -253 89 -77 -184 -47 -91 54 -54 37 24 -75 46
8003 46 133 90 39 101 -41 93 -72 195 -142 195 73 -106 34 61 18 16 -61 -45 28 -137 39 -151 -96 -53 31
8028 31 -33 -34 -54 -116 -109 67 -136 -161 -44 -120 -3 11 173 -33 -49 -78 -129 97 -86 10 83 41 -93 20 127 60
8054F0lm5Rj9K54j37j71l7J21M5J21j58l9j3J87j73O3P3j07n7q0K96j52r6j04
8079a62K21j47J02k8M5o1R0k0l75M68k27L76l3j28j08j29J58j77R4J47K1K9p1
8102H5k74N5m4J04N2J28j45N5J3J07K6k23K26Oj39J70K2j61pq1K55q9j70Q6k10
8127a53Q1q5Q5j82P0J87M5Lj22Q4k6p7L07j69n7LJ21k02J48O5k91J49K41l84L33
8152A74j55J16j6L5j47r5O1O2R7j83j1J39J7r4M9j17p6J80n6k47L25o1r5M3J36
8177H1k5p9p3N4k30L17L3j15J54k16K05j36R7M9
$$ plain form
8054 60 57 12 21 2 256 119 -52 -89 32 77 198 40 1 -12 175 2 65 138 31 -26 -106 190 38 -58 -162
8079 -162 59 -88 14 -14 31 -30 60 40 -335 133 -94 282 249 121 13 -116 42 -135 -41 106 127 156 85
8102 85 -189 -134 -178 -74 -22 106 -39 16 29 136 162 -61 165 171 32 202 224 63 56 -25 230 141 -29 57 -153
8127 -153 -72 -157 -72 -254 -184 3 48 51 -71 13 -13 -90 217 48 -9 -6 115 -87 61 126 -165 -16 225 -159 174
8152 174 19 135 119 154 7 -88 -27 35 132 -51 -62 77 94 0 49 -68 -144 36 -20 -267 58 -3 -98 -55 81
8177 81 56 -23 -96 -42 -272 45 78 -37 117 -99 106 -30 67 116
8191A16
$$ Imaginary data points
##PAGE= N=2
##DATA TABLE= (X++(I..I)), XYDATA
0@%%%Qj6QqJ6j6K4l2L2m6O2o5P8r9J18j41J62j86K20k55K90l32L82m36M95n57
29b94O27p09P96q88R92j108J235j373J523j687J867k070K292k534K807l113L455
46A818l841M281m793N395o105O959q022R380j1173J3666j7366K3419l4959O4285
60D2944k63801n52512P25485M21356l33739J0848K31346m96765l33891O50735
70A02006M39007n31139l06269K80993l7719j43850M63414K06340o64005l38697
80e29919N49404K61047l07559M9295K18916l48247k61919M38622K70051l79507
90c9816j77166K63881L5448j31361J33828K2814k96178q986L42811L5230k33518
101e3013K028O2866j20059N5676K43276q4892l07397K1192K46921Q2275k4554
$$ plain form
0 0 0 0 0 8 -8 0 -8 8 -8 16 -16 16 -30 32 -33 45 -54 64 -77 85 -101 119 -136 154 -178 204 -232 263 -294
29 -294 333 -376 420 -468 524 -584 651 -722 801 -886 981 -1089 1203 -1331 1476 -1637 1818
46 1818 -2023 2258 -2535 2860 -3245 3714 -4308 5072 -6101 7565 -9801 13618 -21341 42944
60 42944 -220857 -773369 -47884 373472 39733 50581 281927 -214838 -548729 102006
70 102006 541013 9874 -296395 -15402 -53121 -196971 266443 472783 -191222 -529919
80 -529919 19485 280532 -27027 22268 241184 -107063 -368982 69640 339691 -39816
90 -39816 -216982 46899 82347 -49014 84814 107628 -188550 -197536 145275 180505 -53013
101 -53013 -50985 11881 -108178 -52502 190774 105882 -201515 -180323 66598 148873 124319
112A24319p3050k20696r1651K68787K28097r4459j23012o8055j64638L9720L88736
123B14098J18404l86859k12900J96927J07594P346J65350n6533m17591o3004M29936
134A02768J47721k13107j0024j606k90198L0644N03193N4287m90215o8418L26622
145I1667n8421j52164K69138N8518m46024m9468M83275N1067l53197M6974J68755
156A10120k37992n1238M02170N673m49944L6052L88914j04075k57768K00209R2510
167A34631l34422K1924M43795m3170m26940L6807K63183j07068o6351K49640n0914
178A21115l66677P0404L71303m8938k39135P2733L9848j88029J01152L34358r4290
189A73844l61916J7162K15867j7590r010J34334r8407k54160P5440K56322j2924
$$ plain form
112 124319 51269 -169427 -261078 7709 235806 141347 18335 -49720 -214358 -174638 214098
123 214098 332502 -54357 -267257 -70330 37264 44610 209960 153427 -264164 -327168 102768
134 102768 250489 37382 27358 25752 -264446 -233802 269391 323678 -166537 -234955 91667
145 91667 33246 -118918 150220 208738 -237286 -286754 196521 247588 -105609 -58635 110120
156 110120 -127872 -179110 223060 228733 -221211 -185159 203755 99680 -158088 42121 134631
167 134631 -199791 -177867 265928 222758 -204182 -167375 95808 -11260 -77611 172029 121115
178 121115 -245562 -175158 196145 147207 -91928 -19195 20653 -167376 -66224 268134 173844
189 173844 -188072 -170910 44957 27367 18357 152691 54284 -199876 -124436 131886 118962
200A18962j35357J484l0632p1625J31502J63757j18333j80903L7708P8694j560
211f303O3278M4245j34932r6434J12488Q5841n1354j0481P160p9192R158J45252
223H8726k228j49708K395R4271l9110j7274J10137l2318j67768M6972J70961n3613
235E1443j19087P2501L2183j13968N1322J62644r8295j85653R7215J38455r3399
246d639l2773J25439o9040j78696J15659J97678j13567j45508J08718M3823j28429
257h1335N9696J68867j13735j84634J16595J39213j04510l9346J20252n8774j53977
268a31688J08125J61150j13649j15717J08272L1822j18940M6320J33517r3928
278A5284j31222J05101R1952j02419k6808J01848l7567j03304P8403R2098r1747
$$ plain form
200 118962 -16395 -14911 -45543 -117168 14334 178091 59758 -121145 -83437 -4743 -6303
211 -6303 56975 101220 -33712 -130146 -17658 68183 16829 6348 13508 -65684 -56526 88726
223 88726 86498 -63210 -60815 33456 -5654 -22928 87209 54891 -112877 -65905 105056 51443
235 51443 -67644 4857 37040 -76928 -25606 137038 38743 -146910 -49695 88760 -4639
246 -4639 -37412 88027 18987 -159709 -44050 153628 40061 -105447 3271 47094 -81335
257 -81335 -21639 147228 33493 -151141 -34546 104667 157 -39189 81063 22289 -131688
268 -131688 -23563 137587 23938 -91779 16493 48315 -70625 -24305 109212 15284
278 15284 -115938 -10837 81115 -21304 -48112 53736 16169 -87135 -8732 83366 -8381
289h381n7549R1817J0409q4489L6536P4256o7328n4836Q2695K8770q0440K766
301b5774O7343l3067m6739N5473K3463o6202k452N9830j9361m3087L7114J9363
313B5904n0068L000N0837k4611m3328L9408K6843m5858l739M6046k0521m0061
325c6148M0451K8723n0460j0357N3865p154m3747K7351K6361m9214q778O5767
337C6660l89o3484J0870M2196l0875j8401N4080M79p0668P061O7512j2007m5626
350b2592K1254R500m4831J5020O9706j6807p0342P837L9836j3972J593M0746k3722
363A3226o4263K3039O7719r901m0393O038j902k3131L4524N4819l2437o6641O272
376c3031L7691N651J0639J3204m1542m5064L6067N6540j2582l8372q078m248K049
$$ plain form
289 -8381 -65930 25887 36296 -48193 -11657 62599 -4729 -59565 23130 51900 -28540 -25774
301 -25774 41569 8502 -38237 17236 40699 -25503 -27955 31875 12514 -30573 6541 25904
313 25904 -24164 -21164 29673 5062 -38266 1142 27985 -17873 -21612 24434 3913 -36148
325 -36148 4303 33026 -17434 -27791 26074 18920 -24827 2524 28885 -20329 -29107 36660
337 36660 36271 -27213 -16343 25853 -5022 -23423 30657 31136 -39532 -32471 35041 23034 -22592
350 -22592 -1338 8162 -36669 -21649 48057 31250 -39092 -31255 8581 -5391 -3798 36948 13226
363 13226 -51037 -27998 39721 29820 -10573 -4535 -6437 -29568 4956 59775 27338 -39303 -33031
376 -33031 4660 10311 20950 34154 -7388 -52452 -16385 40155 27573 -10799 -18877 -23125 -21076
389b1076M1716K8455m4591n4303J2130M1996J8997L661j4852m0485j4428M4552
401A772M0361j7312l7055j4183O538K5808L5187m094n1596l2138K6195M3121J6015
414C8619j3922l4093l0026J3029M7095K0152k9943l8724q116K3408L6569J6174
426D0222l0085n0386r576M2356M3904K369l4194l7512p966L3065M3997N243m2003
439e66m0420P596M5260L4433j0363m3882l6397Q345M9883M0195j5292n3528l2937
452d7673J7422M4351K9915j3021m9659l3747K5173N5495J8805l4112m5306j7209
464d9566K5251N2123K6964l5482n8524j2960L9341M3708J3435k7968m9175j4790
476d7643M5559M9513p299m3925l1801p79L3902N0845N898n9302m9369J9610M7831
$$ plain form
389 -21076 20640 49095 4504 -49799 -37669 4327 23324 26985 12133 -28352 -42780 1772
401 1772 42133 24821 -12234 -26417 -19879 5929 41116 37022 -14574 -46712 -20517 22604 38619
414 38619 24697 -9396 -39422 -26393 20702 40854 10911 -27813 -35929 -12521 24048 40222
426 40222 10137 -40249 -49825 -7469 36435 38804 4610 -32902 -40868 -7803 36194 41437 -566
439 -566 -40986 -33390 11870 46303 35940 -7942 -44339 -35994 13889 54084 38792 -14736 -47673
452 -47673 -30251 14100 44015 30994 -18665 -52412 -27239 28256 47061 12949 -32357 -49566
464 -49566 -24315 27808 54772 19290 -39234 -52194 -12853 30855 44290 16322 -32853 -47643
476 -47643 -2084 47429 40130 -3795 -35596 -36375 -2473 48372 54270 -5032 -54401 -34791 13040
489A3040K3522l809l2391m5892J810O2454L4457l8196m5874o839J3369L2451M3950
502E2052j3736p5701k9926N5752M9110m218j6876k6358l8679J6122P5789K0125
514F3456o6417m3293K1465K5469K2709K9772k5800q0912j1953P8965M3373l1507
526B5327k8552j6092k6405K2286P3625O054q0250l6337M2704L2509O680J1742
538C3291k5969o3298K559P9036L2060m4817l2980r15l027K1544M8074p069o6287
551b7798j9740M8838L2194r427j4260k1219k5138J7648N3297J0677m6250l4552
563c5730R779K6687K2386L595k7523l5339L090M1413L0125j4001m2881k6328J9241
576b5486M3229K1165j5027l4525l0669O825N2891L8148l2878n5736m855K9742
$$ plain form
489 13040 36562 32753 362 -45530 -43720 18734 53191 14995 -30879 -37718 -24349 8102 52052
502 52052 38316 -37385 -67311 -11559 37551 33333 16457 -9901 -48580 -32458 43331 63456
514 63456 -2961 -46254 -24789 680 23389 53161 27361 -53551 -65504 13461 56834 25327
526 25327 -3225 -19317 -45722 -23436 50189 56243 -24007 -60344 -17640 14869 21549 33291
538 33291 7322 -55976 -53417 25619 57679 12862 -20118 -21033 -24060 -2516 45558 38489 -27798
551 -27798 -47538 1300 33494 24067 9807 -11412 -36550 -18902 34395 45072 -1178 -35730
563 -35730 -25951 736 23122 26717 -806 -36145 -33055 8358 38483 24482 -18399 -44727 -25486
576 -25486 17743 38908 23881 -10644 -41313 -34488 18403 56551 23673 -32063 -36918 -7176
588g176K3183K1045K47n4312m5999M1967O8009l926m1143j4764j4683j1966M8531
601I013N4570m0716p3378J2696M8610k108k267K2100l1319n6000L5295P3856j8603
614C1749n7165J0963K0262k5112J2314N1789k3828o5798K2840O1299k0971l9505
626b1163K4608R976l8164J6209N7019k7787p0072K1264N8846j4006k8034K2023
638A0719p010m7587K2455P1417j3530p1196l197L9138l73K907L4029j8725p0202
651e1155J378P4609K2415l9480j4382J697k4602O214O2349J7268o5448l9244L5814
664a2567K9367o780Q086O490m2146l2450M3549M9958k2502l7859P152O126j7901
677b1477J5240L8870j6361m8212J0279L9548j2175k3269K4598J3796l5842p426
$$ plain form
588 -7176 16007 37052 37299 -17013 -63012 -21045 46964 43038 1895 -12869 -27552 -39518 9013
601 9013 63583 22867 -50511 -37815 10795 8687 6420 28520 -2799 -58799 -23504 50352 31749
614 31749 -25416 -14453 5809 -19303 -6989 44800 20972 -44826 -21986 39313 18342 -21163
626 -21163 3445 13421 -24743 -8534 48485 20698 -49374 -28110 30736 16730 -11304 10719
638 10719 3709 -43878 -21423 49994 36464 -34732 -37929 1209 836 3743 37772 19047 -51155
651 -51155 -49777 24832 47247 7767 -6615 -4918 -29520 -23306 39043 56311 -9137 -48381 -12567
664 -12567 16800 10020 18106 24596 -17550 -50000 -6451 43507 21005 -16854 -9702 -3576 -21477
677 -21477 -6237 32633 16272 -31940 -21661 17887 5712 -17557 7041 20837 -15005 -22431
689b2431M1422l83m1456J3270M3297k2223m1862K4366K9525k7080p912M0323r051
702A9805n7958Q867N9253l196l8439J0627R558l9246R33O4960Q208o5566j5891
715c8085L9514k64j3771L6934J3233o3839k9973N9978L6018l3414j0937J8205
727A3599k6865k8686M8318M7625l8480m5356K0728J6732k0787J4069L9441k4070
739A6268n5156J4945M5617j1110k2011K4745N043m6976o366N3950R970m2189K69
752a3001K9153k3522k9040M0888L6120l9312l0565L1731Q924l3882J6241M8945
764D2680k5090n5290K1347M1647k3562j4816M1893l651o3264L814O5874k621m7306
777a8345J6478K4062m5226j6865O5241J9732o2576j4535M3664j0992l1213M1961
$$ plain form
689 -22431 18991 18608 -22848 -9578 33719 11496 -30366 -6000 23525 -3555 -11467 28856 19805
702 19805 -38153 -29286 29967 26771 -11668 -1041 8517 -30729 -29796 35164 43372 -22194 -38085
715 -38085 1429 1165 -12606 24328 37561 -26278 -56251 3727 39745 6331 -4606 13599
727 13599 -13266 -41952 6366 53991 15511 -29845 -9117 7615 -13172 897 40338 16268
739 16268 -38888 -23943 21674 10564 -11447 13298 18341 -28635 -35001 18949 28919 -13270 -13001
752 -13001 16152 -7370 -36410 4478 40598 1286 -29279 2452 11376 -22506 -6265 42680
764 42680 17590 -37700 -16353 25294 1732 -13084 28809 25158 -38106 -34292 31582 28961 -18345
777 -18345 -1867 22195 -23031 -39896 25345 45077 -17499 -32034 11630 638 -30575 11386
789A1386L3745n6261l5947M9933K1385l8580J0028M0336l3994m8498L9401M6107
801C9041l2312k3201L2651m560m5143J8113N4473j5744m3927J2751J7782k5869
813a5945J085M4496k028n0087n665L2878J91j1885K0160N758l8185j5385L6105
826A493K2667j7868j1754N868r111j0832K1284K6509j3398l0544K2J7964J952
839D252j886J2768j067k7908q271K9619J3629k2114n560J6591j0956k1970K1752
852a121K7673k4788k5413K5251J2639l1837L12M0366p357m1411J3673L1551k5204
865e666j8632M2523J2244n0562p675M5321m650l1828K8464K5186m9574k5467N4941
878A4625K1028m5099j277L3060k8142l2938M8914L6884n1017l0740L8369N791
$$ plain form
789 11386 45131 -11130 -47077 2856 24241 -14339 -4311 36025 2031 -46467 -7066 39041
801 39041 6729 -16472 16179 11619 -33524 -15411 39062 23318 -20609 -7858 9924 -15945
813 -15945 -14860 29636 27608 -22479 -28144 4734 4925 -6960 13200 18958 -19227 -34612 1493
826 1493 24160 6292 -5462 406 -8705 -19537 1747 28256 14858 -15686 -15664 2300 4252
839 4252 2366 15134 14067 -13841 -22112 7507 21136 -978 -6538 10053 -903 -22873 -1121
852 -1121 26552 1764 -23649 1602 14241 -17596 -17284 23082 15725 -25686 -12013 19538 -5666
865 -5666 -24298 18225 30469 -20093 -27768 17553 12903 -18925 9539 34725 -14849 -40316 14625
878 14625 35653 -9446 -10723 22337 -5805 -38743 10171 47055 -3962 -34702 3667 9458
890I458l1999K5240L6745m3433m2218M1498L2236l2441n937L1656k0533l7908
902c7636L3822M1041l1611k9217K7582P572k8250J2841L3797k1451l3241K1293
914c458K2414k0630p534K2459n070k3079J0634J8346j4599j2122J5857N727j4457
927e512q64Q565n726l257J1469J647j1725l313M976L533O282K967j1905q851Q377
942c337P606L47N853k068k0242m469K4680R565j6214l260N465j4024l225K8892
956A5569P428l1959r911K1669p2j1183J8571O770l3945r579L6045P856k7007M713
970e035J7043k2193j2194L5791J1336l7605n826L1590n330k2127K0561J5880l2525
983a0634j0378L6911L452l2760O510K4141j8891j5661K9304O838l5112p06L3739
$$ plain form
890 9458 -22541 2699 39444 -3989 -46207 -4709 27527 -4914 -10851 20805 272 -37636
902 -37636 -3814 37227 5616 -23601 3981 11553 -16697 -3856 29941 8490 -24751 -3458
914 -3458 18956 -1674 -9208 13251 8181 -14898 -4264 14082 -517 -12639 3218 8945 -5512
927 -5512 -6376 2189 -3537 -6794 4675 6322 -5403 -8716 -3740 -207 6075 9042 -2863 -11714 -3337
942 -3337 4269 4616 10469 8401 -11841 -16310 8370 17935 1721 -1539 3926 -10098 -13323 15569
956 15569 22997 -8962 -18873 2796 2724 -8459 10112 16882 -17063 -26642 9403 17259 -9748 -5035
970 -5035 12008 -10185 -22379 13412 24748 -12857 -18683 12907 7577 -14550 6011 21891 -10634
983 -10634 -21012 15899 19351 -13409 -6899 17242 -1649 -17310 11994 18832 -16280 -16986 16753
996A6753o964k6190J4516J4391k4195m691L1283j144l1124N176K2512j0132r392
1009i201J8759n74k5255N640K6145o066j7265R227M528j5239N307K1308p662k0922
1023a1270O330J1895p344j7J0953q822j5441J0293J3643q897o196P236n278q655
1037a1570J2538J0495j4115q975J1651K247q059P301P080j3367o025J5548M660
1050I409j2578J064Q095q156l547J4764J806j7520L7J4329l851q623R707K204
1064G140j5796N31J7596k445j5022L853P413q614l38J4144l985j6652M733J3921
1078F479n780n635R410j500j3558N734J6098n476j2690O066N684p818K183J1615
1092A0812o076j3253O310R460n492l032O532l924r658O705J0099p005q234N976
$$ plain form
996 16753 9789 -16401 -1885 12506 -11689 -16380 14903 13759 -17365 -12189 10323 191 -9201
1009 -9201 9558 8984 -16271 -10631 15514 9448 -7817 1410 5938 -9301 -3994 17314 9652 -11270
1023 -11270 -4940 6955 -389 -406 10547 1725 -13716 -3423 10220 1323 -4873 2363 -2915 -11570
1037 -11570 968 11463 -2652 -11627 24 2271 -5788 1513 8593 -4774 -10799 4749 9409
1050 9409 -3169 -2105 5990 -2166 -5713 9051 10857 -6663 -6626 7703 3852 -4771 4936 7140
1064 7140 -8656 -8125 9471 7026 -7996 -4143 3270 -5344 -5682 8462 4477 -12175 -7442 6479
1078 6479 699 -4936 4474 2974 -10584 -4850 11248 5772 -6918 -852 4832 -2986 -803 10812
1092 10812 4736 -8517 -2207 7253 1761 -1271 5261 1337 -8321 -1616 8483 1478 -6756 -780
1106g80K092o501L394P528o519p821O244N782m854p16M715l415m382N818M996
1121E581n727k418M788n8l397L407K801n025k557N224J666m271n13K253j929j283
1137a458L012K01l768o28K440r2j194R21r64j824R93K890k17j620o68L27J098
1154e51J393N43j224n50N48M35J151J694k067k684J631K358p46r01P05j362j878
1171a505J673K646j991k656Q27M14j226J288J479k429k260J932J755p33k40P33
1187b93j342o12K204J306n21m28l31n34J644J642j439r57J589l84k136J850K896
1204D154l175k912L401Q72m469J028M633l686n198N054K963o860L9Q039k906q892
1220g915N586P598p366m234J0224L60j1623L440J2281n777r240R334N058j2961
$$ plain form
1106 -780 1312 -5189 -1795 5733 -786 -8607 -2363 3419 -1435 -2151 2564 -851 -5233 585 5581
1121 5581 -146 -2564 2224 2166 -1231 2176 4977 -48 -2605 2619 4285 14 -499 1754 -175 -1458
1137 -1458 1554 1755 -2013 -2641 -201 -293 -1487 -566 -1530 -3354 -2361 529 312 -1308 -1976 -1649 -551
1154 -551 842 1385 161 -389 159 594 1745 3439 1372 -1312 319 2677 1931 1030 1735 373 -1505
1171 -1505 168 2814 823 -1833 -1006 -592 -1818 -530 949 -1480 -3740 -1808 -53 -786 -1026 -293
1187 -293 -1635 -2247 -43 1263 742 314 -17 -551 1093 2735 1296 339 1928 1544 -592 1258 4154
1204 4154 979 -1933 1468 2340 -2129 -1101 3532 -154 -5352 -298 2665 -4195 -4156 3883 977 -7915
1220 -7915 -2329 5269 -2097 -6331 3893 4253 -7370 -3930 8351 2574 -6666 2668 7726 -5235
1234e235M02J5340l877j5074P334J1199j2337n958J6418J085j9108K781J6818
1247I788p589j2890J2913P308j8020l041J8916j238j6707P092J2786j3498p759
1260a1939J7510M762j8024J256J5298p270j1360J3480Q887j5645n203J4607l97
1273E962j1945O715R829j0836q097J0516L670q640J862O317p089o363Q116M421
1287D438o507L8L691n665k841P943K801n039N3Q11m689K512Q297k074o628L606
1303G47J284p454M527J2492o695j2944P529P474j0592k2J6082o460j9545Q639
1317d938J6027j2256p534J7684j973k3761P226K4516j1498j8408J7991Q482k6218
1330a4660R2L1873n843k9435J2875K1466k1859j1492L1540M674l4685L069K9907
$$ plain form
1234 -5235 -4833 10507 6630 -8444 -1110 10089 -2248 -8206 8212 9297 -9811 -7030 9788
1247 9788 2199 -10691 2222 9530 -8490 -11531 7385 6147 -10560 -3468 9318 -4180 -11939
1260 -11939 5571 10333 -7691 -6435 8863 1593 -9767 3713 12600 -3045 -8248 6359 5962
1273 5962 -5983 732 10561 -275 -8372 2144 5814 -2826 -964 5353 -1736 -8099 17 4438
1287 4438 -2069 -2031 1660 -4005 -6846 1097 3898 -1141 -1088 -277 -4966 -2454 5843 3769 -2859 747
1303 747 2031 -5423 -896 11596 4901 -8043 -514 6960 -3632 -3654 12428 5968 -13577 -4938
1317 -4938 11089 -1167 -8701 8983 7010 -16751 -9525 14991 3493 -14915 3076 11558 -14660
1330 -14660 -14568 17305 11462 -17973 -5098 16368 -5491 -16983 14557 19231 -15454 -12385 17522
1343A7522j2467k1853K4937J3982l3414q093L4108j573k9145J4135K2623k6716
1355e954j8467L2387J1570l0987o88K6573j3938k3789K4265K0662k6147j2637
1367a7150K3525j37k1501J3907K2095j9680j8933J9103R601j6487L929J7846j2923
1380C195j9654J4059J5169j0508m737R378o547j2405R815J2993o696o994J973
1393i59l879l061J0161N087p904l183J594m711K043J2769j176j2704J940O254
1407B271p454J724J6078m324j9498O186J4427j1060n510K0877r49k7715M081K5751
1421A4885r948j7496K0470Q373l1340m379L4370j462k8492J2484J9082k7945j3358
1434b4756L8334R239l7568Q9K9655j6761k2516L4308J9846m0642j4969L7243J696
$$ plain form
1343 17522 5055 -16798 8139 22121 -11293 -19386 14722 13149 -15996 -1861 20762 -5954
1355 -5954 -24421 7966 19536 -11451 -12139 14434 496 -23293 972 21634 -4513 -17150
1367 -17150 6375 6238 -15263 -1356 20739 1059 -17874 1229 10830 -5657 -1728 16118 3195
1380 3195 -16459 -2400 12769 2261 -2476 6902 355 -12050 -2235 10758 4062 -2932 -959
1393 -959 -4838 -7899 2262 7349 -555 -3738 -2144 -6855 -4812 7957 6781 -5923 -3983 2271
1407 2271 -5183 -3459 12619 8295 -11203 -5017 9410 -1650 -7160 13717 12768 -14947 -10866 14885
1421 14885 4937 -12559 7911 16284 -15056 -19435 14935 13473 -15019 -2535 16547 -11398 -24756
1434 -24756 13578 22817 -14751 -14662 14993 -1768 -24284 10024 29870 -10772 -25741 11502 13198
1447A3198k9917J8727K6726l3893k5614L7626J8477l3083j195K8623j9108k9022
1459b8455L0596K7578l2035j7750K8320j211k7843J7163K9776k4341k6814K3517
1471a499J4281k2324K075K4984j2919k5925J5931K0225j4959p197J7516l872k0573
1484a4256Q726J9066q047j0657R550J95j3318M330J3894k968q702J777j339m985
1498f734O557P632m952n027K05m459k20J2640L743j2814l639O285l963o50J5703
1513A0307J375k0940k515J6829j663q468J4324L956k5349l999K7661K441k1503
1526g544P275J3339k1213j0349L0322Q665l0368k723K3426j0420j8742K4398J5211
1539B1277l1369j0805L0472R9k6465J4222K3574k4863k0204K9864J2464k9375
$$ plain form
1447 13198 -16719 2008 28734 -5159 -30773 6853 25330 -7753 -8948 19675 567 -28455
1459 -28455 2141 29719 -2316 -20066 8254 7043 -20800 -3637 26139 1798 -25016 -1499
1471 -1499 12782 -9542 -7467 17517 4598 -21327 -5396 14829 -130 -7327 10189 6317 -14256
1484 -14256 -5530 13536 5489 -5168 4382 4577 -8741 -4411 9483 6515 -2187 -410 -1749 -6734
1498 -6734 -177 7455 2503 -2524 -2319 -6778 -6998 5642 9385 -3429 -7068 -783 -4746 -5396 10307
1513 10307 11682 -9258 -11773 5056 3393 -5075 9249 13205 -12144 -16143 11518 13959 -7544
1526 -7544 -269 13070 -8143 -18492 11830 20495 -9873 -12596 10830 410 -18332 6066 21277
1539 21277 -10092 -20897 9575 9674 -16791 -2569 21005 -3858 -24062 5802 18266 -11109
1551a1109N61K8993j2989k7160K0900K1847k3498j0738K6070k409k7941J1148
1563f325K7002j5938j9494J8992O599k3832L186K7236q406k5128R918J5234j4012
1576d968l595J9349k530k2615M136J7869m299p991R344n78j4740L528J6335k104
1590G141j0077L214J439o985L782J0920l505r376J275K361j765M059L974o707
1604b50m687M633M83l211N396K809r705k896R891k54p909N547O325j0351m291
1619h470J2220J274j1396M844J0830j0339r053J4048N639j4300Q43J4528q222
1632B446j4494J3242J2380j5090p009J5387j772j6161Q634J6698j3329j4009J3830
1645G53O369j4837K396J6312r000j7079J2223J3580j3175n394J4744k633j6375
$$ plain form
1551 -11109 -10548 18445 5456 -21704 -804 21043 -2455 -13193 12877 10468 -17473 -6325
1563 -6325 20677 4739 -14755 4237 10836 -12996 -9810 17426 9020 -16108 -6190 9044 -4968
1576 -4968 -8563 10786 8256 -14359 -10223 7646 3347 -4644 4700 4122 -10618 -7090 9245 7141
1590 7141 -2936 278 1717 -5268 -1486 9434 5929 -3447 -2172 189 -1576 2483 6457 -250
1604 -250 -4937 -304 179 -3032 2364 5173 -4532 -7428 2463 2209 -5700 -153 6172 -4179 -8470
1619 -8470 3750 5024 -6372 -1528 9302 -1037 -10090 3958 9597 -4703 -3860 10668 2446
1632 2446 -12048 1194 13574 -1516 -8525 6862 5090 -11071 -2437 14261 932 -13077 753
1645 753 7122 -7715 -5319 10993 1993 -15086 -2863 10717 -2458 -7852 6892 4259 -12116
1658a2116Q131J6622r930j1920J1470M886j2883K136J4217n860j3384Q034Q792
1671H195r936k932J1525k552j2177N224R644p003o404Q588J281r387J915Q519
1685D500m130o286N912L214o782l1O840k228m742M436K460n394M6O139j684m260
1701a990L277J903m816N40N431k082m579L040J823m335P01M771k969n340M145
1716d80K795m874k49N817k951o060M850M911n486k310O424r10o535L986N956m711
1732A73l935O212J151o505J918O861m179n693N762L121o697k57O871k469o885
1747d551M085M765n603k324O069p22o764K646N740m232l764N147J577o057J215
1762b773O225k815m998M312L468m807o05N441j568m876L359M182l871k547M153
$$ plain form
1658 -12116 -3985 12637 2707 -9213 2257 7143 -5740 -3604 10613 4753 -8631 -597 8195
1671 8195 -1741 -4673 6852 4300 -7877 -2653 6991 -12 -6416 2172 3453 -5934 -4019 4500
1685 4500 370 -5916 -4 3210 -3572 -3603 3237 1009 -3733 703 3163 -2231 -2185 3954 2270 -1990
1701 -1990 1287 3190 -1626 -1086 4345 2263 -2316 724 2547 -1788 -1087 3684 715 -4625 -480
1716 -480 2315 -2559 -2808 3009 58 -6002 -1152 3759 -1727 -4037 2387 1477 -5058 -1072 4884 173
1732 173 -3762 2450 3601 -2904 -986 5875 1696 -3997 1765 4886 -1811 -2068 4803 2334 -4551
1747 -4551 -466 4299 -1304 -3628 2441 1719 -5045 -2399 3341 -891 -4655 492 2069 -3988 -2773
1762 -2773 3452 637 -4361 -49 3419 -1388 -1993 3448 1880 -2996 363 4545 674 -1873 2280
1777B280L09m107J457L685l131l202L278J402l269q0K660j908k500K893K132l300
1793a401j126K265l00j334J946J268k716n87K797M2j257R54O24k050L38L064o5
1810B462k461j9J154n68L0J670j073k609P50J997r95p46P93j153j696J570K362
1827A468j591k071N85Q48m82P37J544j736j985J908K156q23m18P70j117j004K579
1844A368J864k150j999J489Q51j075J231O80k371k137K330K307j796j441K52l78
1860i75q63J763J497k078k356J141J971l81J6O44j704j451K496K626j182k371
1876a207M64J592l85M38J600j092k908J000K917p4k290j96M82n65M60J895j141
1893I90l020k28K817J58j471K60l38j926M44L738J63l645q90K636O35o38J384
$$ plain form
1777 2280 2589 -1518 -61 3624 493 -2709 569 1971 -1298 -1378 1282 -626 -3126 -233 1899 -1401
1793 -1401 -2527 -262 -562 -1896 50 1318 -1398 -1985 812 854 -403 551 1175 -875 -537 2527 2462
1810 2462 1 -18 1136 568 598 2268 1195 -1414 -664 1333 338 -408 385 -768 -2464 -894 1468
1827 1468 -123 -2194 -1609 -761 -1243 -506 1038 -698 -2683 -775 1381 558 140 910 -207 -1211 1368
1844 1368 3232 1082 -917 572 1423 348 1579 2259 -112 -2249 81 2388 592 -849 -597 -975
1860 -975 -1838 -75 1422 -656 -3012 -1871 100 -281 -265 379 -1325 -2776 -280 2346 1164 -1207
1876 -1207 -743 849 464 902 2502 1410 -1498 -498 2419 2345 55 -141 341 -224 236 2131 990
1893 990 -2030 -2258 559 717 -754 -494 -832 -2758 -2314 1424 1587 -2058 -2948 -312 323 -315 1069
1910A069J83k999o95L858K114k232k153J000l9q4K789P41l848k175K447J830n88
1927A218l59l5k243j710K995L121k465l390O77J772m44K05J755j275k996R69L722
1944A517r7k040r3J010o36K94K338m07k808m0L017L80k724L06J631j526j086L054
1962B090Q71m789j551M551J417l628m75K029k483j807M488L164n132l698L671
1977a282K153j826J461K492m153m323N580N244l764l278K874m46m016M025O187
1992F928m379p011L044M785l180j032M562j946p055K404O931k212n095K733J818
2007A295m681j68O364n53o773J911N267k563l992M572K903n374j194N600n8n481
2023b925J943N595k337m955K634L047l572n95N112m43o876k01N717M77l393J057
$$ plain form
1910 1069 1252 -1747 -2442 1416 3530 1298 -855 145 106 22 2811 3552 -296 -2471 -24 1806 1218
1927 1218 859 824 -1419 -3129 -134 2987 522 -2868 -2191 -419 -863 -658 1097 -178 -3174 -2205 1517
1944 1517 1420 -620 -713 297 -339 -45 2293 1886 -922 -962 2055 2435 -289 17 1648 122 -964 2090
1962 2090 2961 -1828 -3379 1172 2589 -1039 -1514 515 -1968 -3775 713 3877 -1255 -4953 -1282
1977 -1282 871 -955 506 2998 -1155 -5478 102 5346 1582 -1696 1178 732 -3284 741 6928
1992 6928 2549 -4462 -1418 3367 187 -845 3717 1771 -5284 -2880 4051 1839 -3256 -523 1295
2007 1295 -3386 -3554 2810 2257 -4516 -2605 2662 99 -3893 679 3582 -1792 -2986 2614 2556 -2925
2023 -2925 -982 4613 2276 -2679 -45 3002 -570 -1165 3947 3504 -3372 -3573 2144 2621 -772 285
2039B85J204m857j757O598L711n942l916L332R55k193L621L946n248o600M386
2054b475O965k470k763K968p73o145K683Q698j672p819J109M599l693j659P212
2069D765Q13r576j237P992j30o238L817M459p153m439Q154L269p652o18P263k868
2085F21p438N113P851n851n065O743J535q150J667R886k458q731K792N680n132
2100i37k011Q244J018j0359j493Q369J59m898L216K959p888l799Q898M431o632
2115g23k950M242j946m005N590O395n570p290L437N070k519l47M945j827p544
2130e042J218P910M89n238Q69K626m513k104O697L466o664l471M848J81m768L294
2146b02O036n282p252M728N177m463k224O735m26r519J625R604j640o961M264
$$ plain form
2039 285 1489 -3368 -5125 1473 5184 -758 -4674 -1342 -387 -2580 1041 4987 -261 -6861 -2475
2054 -2475 4490 2020 -743 2225 1452 -4693 -2010 6688 5016 -2803 -1694 2905 -788 -2447 4765
2069 4765 5578 -3998 -5235 2757 2627 -3611 206 4665 -2488 -6927 1227 4496 -3156 -3774 3489 621
2085 621 -6817 -1704 6147 296 -4769 1974 3509 -4641 -2974 6912 4454 -4277 -1485 4195 -937
2100 -937 -2948 5296 6314 -4045 -5538 2831 2990 -1908 1308 4267 -3621 -7420 1478 5909 -723
2115 -723 -3673 569 -1377 -5382 208 6603 1033 -6257 -2820 2250 -269 -616 4329 2502 -5042
2130 -5042 -3824 4086 4575 -663 206 2832 -1681 -3785 2912 6378 -286 -3757 1091 1272 -3496 -202
2146 -202 5834 552 -6700 -1972 3205 -1258 -3482 3253 2827 -6692 -5067 4537 2897 -4064 200
2161B00L862p768k200J0435K549r496p39P019l443n400Q120N798j0258n579Q790
2176A890K410p324K712P444p173q990P735Q000p090l737O924j451r337M484J0474
2191F971m602q150M446M069o473L02R249j095r781J259P634k654l535N719J974
2206E333q487j854P783J847n428P06L189m218l593N593M304m497l877K354P48
2221i7k603J907M159k431m622L94L519N31j391J665N92l942j596M807L072l274
2237F90k187K766n12l235K628N164k739n732K230L867l096j649N364j06p275k07
2253d029O851r66n078L520L079o856k585Q210J930p276K81O161m052n475P397
2268A112N294p840l770P369N38o570L883P323o179p492O515N153o164n70O677
$$ plain form
2161 200 4062 -3706 -5906 4529 7078 -2418 -3157 3862 419 -4981 3139 8937 -1321 -6900 1890
2176 1890 4300 -3024 -312 7132 -41 -9031 -1296 6704 -386 -4123 2801 1350 -7987 -3503 6971
2191 6971 2369 -5781 -1335 2734 -3739 -3437 5812 4717 -5064 -3805 3829 1175 -2360 3359 5333
2206 5333 -3154 -5008 2775 4622 -806 -100 3089 -1129 -4722 871 5175 678 -3199 -845 -97
2221 -97 -2700 -793 3366 935 -3687 -3293 226 757 -634 1031 1623 -2319 -3915 892 3964 690
2237 690 -1497 1269 757 -2478 150 5314 2575 -3157 -927 2940 -156 -1805 3559 3453 -3822 -4029
2253 -4029 2822 1856 -3222 298 3377 -3479 -6064 2146 4076 -3200 -2919 3242 -810 -6285 1112
2268 1112 6406 -1434 -5204 2165 2703 -3867 16 7339 1160 -6332 183 5336 -828 -1398 5279
2283E279l342q216M847P283m782m884N126P81o806J617Q320l054p385K722M707
2298B213l910j568N958K9o810R27N576j141l195L066J519m313m55M342K19l403
2314i46J103K020j901j576K512Q40k039l79Q87o04q79M60J190j31r98j213R6J413
2332a45K10q17M66J87k090pL303Q27k771n62K012q95q07L531J049m537j413M279
2350A820L12k986K223K060m689k299N606J906n333m83L858k190l519M378L138
2365C802n524k554N072O27m581K252L971m199l418N480K485n290o45N237j415
2380A300m345L509L591m571k344N396O69m842Q61L869k725k646L689J486m669
2395a772o33M166n18l219J543J836l320q24L626P37l384k99K256p65r48K490K64
$$ plain form
2283 5279 1937 -6279 -1432 5851 1069 -3815 1311 2092 -4714 -3097 5223 2169 -5216 -2494 2213
2298 2213 -1697 -3265 2693 2722 -4088 -3161 2415 1274 -1921 1145 2664 -1649 -2104 2238 2457 -946
2314 -946 157 2177 276 -1300 1212 2052 13 -366 521 -83 -962 -502 688 557 -441 -1654 -1558 -145
2332 -145 65 -752 -286 -99 -2189 -2196 1107 1934 -837 -1399 613 -282 -1089 2442 3491 -1046 -2459 1820
2350 1820 2132 -854 1369 3429 -1260 -3559 2047 3953 -1380 -1863 1995 -195 -3714 664 3802
2365 3802 -1722 -4276 796 1423 -3158 -906 3065 -1134 -4552 928 3413 -1877 -2522 2715 1300
2380 1300 -3045 464 4055 -516 -2860 2536 3205 -1637 -776 3093 368 -2278 1411 2897 -1772
2395 -1772 -2405 1761 1243 -1976 -433 1403 -1917 -2741 885 1622 -1762 -2061 195 -570 -1518 972 1236
2412A236k846K2K340K35p96P35q1j832R92K048p91j234M78k5r69J303R38j594
2430A59j345R33L36m56P04M27k011o48K167L32j868K77J091j165p89K573O64k833
2448a452O6K530p60j285J743P59k665J1L203j04k990O97K185j825r15K815j60
2465A853l444J36L222q80k424J519P60k675J31L178o38l062P75K189j267p05K357
2482A025k87k822P45K938m48j984J240P12j785M71K368p85k100P57J147q67j73
2499A52J233q15j716P20J822j007j346R01q4j130P03J321j117j398Q97P02n32
2516f94N05M19q78l55J219O52q16k4L11l70k14J530K19j523l01J053oj83K19q4
2536F79r35j21R67l6j077K75N9q96L89J310p07j716P38J175p93m13J143k06r77
$$ plain form
2412 1236 -1610 -1588 752 987 191 926 845 -987 5 2053 1262 28 506 481 -488 815 1753 159
2430 159 -1186 -253 83 -373 331 758 -1253 -1901 266 598 -1270 -993 98 -1067 -1856 717 1381 -1452
2448 -1452 -1386 1144 384 -901 842 1601 -1064 -1053 2150 2046 -944 -247 1938 113 -802 2013 1853
2465 1853 -1591 -1455 1767 887 -1537 -18 742 -1933 -1802 1376 738 -2324 -1549 640 -627 -1332 1025
2482 1025 738 -2084 -1339 1599 1151 -833 407 1119 -666 -195 2173 1388 -712 45 1192 325 152
2499 152 1385 570 -1146 -426 1396 389 -957 -56 -140 -1270 -567 754 -363 -1761 -864 -162 -694
2516 -694 -189 230 -648 -1003 216 868 52 28 339 -31 -245 1285 1504 -19 -320 733 727 544 763 679
2536 679 -256 -377 590 554 -523 -248 -189 -1085 -696 614 -93 -1809 -1071 104 -689 -1102 41 -165 -1142
2555a142P20J247q50l76O48J97o82Q50J032j280j149J440Q78j222j90Q82n08j306
2573h11Q31J389j108j502P56L87p29K27Q58q75j140J043O46o09oM63m17n55R70
2592a82J177r80r31J024O38o48n3J057l26j122O03J017k85q79K99L66p03k74Q36
2611F34j62j116oJ015p20p09O07O78q21m42R17R5j249K69J388j88j102N27J166
2630G81p65p13J575N10j643k19J905k86j144N38R62j382q36J540P17j738o43J292
2648D51j03j711J330J374j805j498J397J222j635m1J688o48j828Q68J847o28j162
2665h82J069O37j464K54J854m7j641K34J132o04q78J222P46j520j082J441L52
2682H23j022k9R57o09j740O98J657n08j408O92O86j415l64K199J86j743p95J953
$$ plain form
2555 -1142 -422 825 -25 -401 247 444 -238 612 1644 364 -785 655 1533 311 121 1003 495 -811
2573 -811 20 1409 301 -1201 -445 -58 -787 -560 298 -577 -1717 -674 -28 -637 -643 -180 -597 -1152 -182
2592 -182 995 15 -916 108 746 98 45 1102 776 -346 257 1274 989 110 409 775 72 -202 634
2611 634 472 -644 -650 365 -355 -1064 -457 221 -600 -1042 -125 -30 -1279 -1010 378 190 -912 -385 781
2630 781 16 -697 878 1388 -255 -474 1431 1145 1 539 1501 119 -717 823 1540 -198 -841 451
2648 451 348 -1363 -33 1341 -464 -1962 -565 657 -978 -1019 669 21 -1807 -939 908 280 -882
2665 -882 187 824 -640 -386 1468 1421 -220 14 1146 542 -336 886 1632 112 -970 471 823
2682 823 -199 -228 729 120 -1620 -922 735 227 -1181 -489 197 -1218 -1582 617 803 -940 -1735 218
2700B18K29j474J530J141j720j806K481J725k356k89K408r96k907J937K587k200
2716E08k082K289P21l116r0L910q30l866J187K608k323j616L717R03m595q7M248
2733A486n90l200K400K401l771j760M351J775l849q2L153j929k788L250K995l468
2749C74k491L024M82k872J280L349k570l497K014K572j872j144K321l18l457P54
2765b051L536p46k183R38R93j661k53K596O99k423n50J730m1o67R21J469j867
2782D40j658J217J671q57r63J085M8j946n30K488P51k295o11J726r50j603J783
2799b04K287k545k214J865J418j976N95L185j988l882K318L720j797k141L034
2814A675J80m635J318N254j119m503J466K761l177j523N100P19n974m50M714r81
$$ plain form
2700 218 447 -1027 503 1644 -76 -1882 599 2324 -32 -321 2087 1091 -1816 121 2708 508
2716 508 -1574 715 1436 -1680 -1770 2140 1310 -2556 -1369 1239 -1084 -2700 1017 1920 -2675 -2762 1486
2733 1486 896 -2304 96 2497 -1274 -3034 1317 3092 -757 -839 2314 385 -2403 847 3842 374
2749 374 -2117 907 1389 -1483 -203 3146 576 -2921 -907 1665 -207 -1351 970 652 -2805 -2051
2765 -2051 1485 739 -1444 -506 487 -1174 -1427 1169 1868 -555 -1105 625 584 -83 838 2307 440
2782 440 -1218 -1 1670 813 -150 935 983 -963 -1493 995 1746 -549 -1160 566 -384 -1987 -204
2799 -204 2083 -462 -2676 -811 607 -1369 -774 2411 423 -3459 -1141 2579 782 -1359 1675
2814 1675 1855 -2780 -1462 3792 2673 -1830 -364 2397 -780 -2303 2797 3516 -2458 -2908 1806 825
2830H25l217K942K179m788k202N265J140m492R20L487k904l453M506L451m305
2845f46k014M152R4m241K328M272k630l665K507K135l037J10L603j082m093R45
2861a262L189j512j570K284L62l842j77L591N54k618n3J282j476j038K639J770
2877B123k450j764J354J000m11P31J062j093k214P95K305L67j255J93J69j441
2893e29l42K278J114k603j602J751L99j840J159K288k152l034K031K607k016j106
2909a597K557k15l418P07M001j107k937K166J688l285p84M479O42m374M80L296
2925B299k018k566L887K138m471j787L898L40l605J770L318l770l103L535K537
2940B402l212j005L254j302l608K449L926k651k865K617R83k729N70L880j412
$$ plain form
2830 825 -2392 550 2729 -2059 -4261 1004 2144 -2348 -1428 2059 -845 -4298 208 3659 -646
2845 -646 -2660 1492 1586 -2655 -327 3945 1315 -2350 157 2292 -745 -635 2968 1886 -2207 -1262
2861 -1262 1927 415 -1155 1129 1491 -2351 -2528 1063 1617 -1001 -1054 228 -1248 -2286 353 2123
2877 2123 -327 -2091 -737 263 -148 583 1645 552 -1662 -867 1438 1805 550 743 912 -529
2893 -529 -871 1407 2521 -82 -1684 67 466 -1374 -215 2073 -79 -3113 -1082 1525 -491 -1597
2909 -1597 960 745 -2673 -1966 2035 928 -2009 157 1845 -1440 -2224 2255 2897 -1477 -997 2299
2925 2299 281 -2285 1602 3740 -731 -2518 1380 1720 -1885 -115 3203 -567 -3670 -135 2402
2940 2402 -810 -1815 1439 137 -3471 -1022 2904 253 -2612 5 988 -1741 -1171 2709 1297
2955A297l685J527K788j528j101K476l5l274K22L080k20k221P53J107j999n79
2971a392K242P50k118q35J314j79j005J182Q65j171j224O83J086l90l04Q21R4
2988D19j099l12J598N93j039l68R94k67j162R41J427q30j777P01J379j308m43
3005e53K051j79l085K86K651o88j876J210J168k709n28L094M11k932O75J880j124
3022b48j714K502J656l088o88K760M3k295J409J980k377j751K631J165k502k54
3038g71K395p86k584J672K127k066j619K091K55k177M05K319p79k367J151J413
3054F79j564o34K291q7j955K58J819m56j032J208M97j281m48J334M40q63L8M87
3072G31n06n06P46O70p47o67J80J68k75k8M25j20o37k00L57M75m25m08N08r2m89
$$ plain form
2955 1297 -2388 -861 1927 399 -702 1774 1739 -1535 -1313 1767 1547 -674 79 1186 -813 -1392
2971 -1392 850 1600 -518 -1353 -39 -218 -1223 -41 824 -347 -1571 -888 198 -192 -496 325 419
2988 419 -680 -992 606 1199 160 -208 786 519 -643 298 1725 895 -882 -181 1198 -110 -553
3005 -553 1498 1319 -1766 -1480 1171 483 -1393 -183 985 -1724 -2252 842 1253 -1679 -1004 876 -248
3022 -248 -1962 540 2196 -892 -1580 1180 1223 -1072 337 2317 -60 -1811 820 1985 -517 -771
3038 -771 1624 838 -1746 -74 2053 -13 -1632 459 714 -1463 -1058 1261 482 -1885 -734 679
3054 679 -885 -1519 772 685 -1270 -1012 807 351 -681 527 1024 -257 -705 629 1069 206 244 731
3072 731 225 -281 465 1135 388 -279 -99 69 -206 -234 191 71 -566 -766 -409 66 -359 -767 -259 -351 -840
3093h40K21J116k94q53M09P59l99k82Q81K84j143R1J009p0r98M71N33r03o33J256
3113F15J59j506J00J078n01j026J099P30j519m36J230Q4j343M64J211q26q94J349
3131F8O76j144o7J284j83j228P09J128j055l65J093q8j235M25J015n44p08K38
3149A9Q38q51n21O41k7p75J97O60o06l85M81K32n26%M55j79k18K97L41l06j03
3170c36N35J49j85O8l5K59l7J0J62o1L5k96o2J33j34o7j73o2j00j06O9J99m23
3193d58o1J67K3j53K20M0l38n0O39j24l19L48P06n47l07M70L54o60Q2O93k13l52
3215A60K17L60n56k99N67J2q45M09J00l24k80N03m6l96k12N61l04k58K62M26n76
3236e19K1N93Nm89K44N24k10k91L90L54m21M4M67k29m15J44N90m15l54K90J19
$$ plain form
3093 -840 -619 497 203 -650 -241 518 119 -163 718 1002 -141 -50 959 889 -109 362 895 -8 -641 615
3113 615 774 -732 -632 446 -55 -1081 18 748 -771 -1207 23 107 -1236 -772 439 -387 -1281 68
3131 68 744 -400 -467 817 634 -594 115 1243 188 -177 916 828 -407 18 1033 489 -219 19
3149 19 857 6 -515 126 99 -676 -479 181 -425 -810 -329 -97 -623 -623 -168 -347 -565 -268 73 -233 -336
3170 -336 199 348 163 231 196 455 418 428 590 529 564 268 206 339 205 138 -35 -97 -197 -303 -234 -35 -458
3193 -458 -519 -352 -329 -482 -262 -222 -560 -610 29 -95 -414 -66 640 93 -214 256 610 -50 32 725 512 160
3215 160 377 737 181 -118 449 461 -384 25 125 -199 -479 24 -22 -418 -630 -69 -373 -631 -369 57 -519
3236 -519 -498 95 100 -389 -145 379 169 -122 268 622 201 245 712 483 68 212 802 387 33 323 442
3257D42n09j61L90m0l28j62J26J3l06L21M9k69j12K72R2j12j59M66p0j36J58L01
3279B66j41k13L07J66l4kL22l98l23K06L35k14k12J50K50o60j15M14R2p13J62
3300c55K45q9m99L82M49l98n12N46K69m10k4O38L2p67M12P00n97k42Q29L27p90
3321A46j24R18l30p53L63M88q27k35P17N5o42j64M66k46m92L59O64o92n89M75
3341d43N31n86j45P64j87p14M20Q93p5r25N14M76q21K60Q55J25j021n1R18k06
3361E82n83K99L92q39m43P42M72j052K7O70m76p20M77R10q28o57O98L00o28J22
3381e35J113l18j136O62Q08p47k05J072O1j037j8J332l97r14L75Q01r02m67J006
3400E54L22j043n51R78k16q82O86P51q82o69N28M71m27j35P87l17p93L15J209
$$ plain form
3257 442 -67 -228 162 122 -206 -368 -242 -229 -535 -214 -165 -434 -546 -274 -182 -294 -453 13 -57 -193 -35 266
3279 266 125 -88 219 385 351 349 671 273 -50 156 491 277 65 215 465 -195 -310 104 196 -517 -355
3300 -355 -110 -199 -698 -316 133 -265 -777 -231 38 -372 -396 242 274 -493 -81 619 22 -220 609 936 146
3321 146 22 940 610 -143 220 708 -119 -354 363 418 -224 -388 78 -168 -660 -301 363 -329 -918 -443
3341 -443 88 -498 -643 121 -66 -780 -360 533 458 -467 47 523 -298 -38 817 942 -79 -130 788 582
3361 582 -1 298 690 -149 -592 150 622 -430 -403 267 -209 -929 -452 458 -370 -1027 -329 -29 -657 -535
3381 -535 578 260 -876 -214 594 -153 -358 714 775 -262 -280 1052 655 -259 116 917 15 -452 554
3400 554 876 -167 -718 260 44 -838 -152 599 -283 -952 -424 47 -380 -515 272 -45 -838 -523 686
3419F86m93n43K61N09p95j74J185M01j012q9O46k54m89P51M98r75p58O56Q03q58
3439d4j73O74n85r14M67J399o99j033P85K06j087J52J416k80j057L09J194p76
3457d6o20J359O14j567m41J347L73j070M32O41q91p69R91R82j345n06J206m05
3475B85j355R10J360r68j483P26P23j111J69J451k42j984M71J444l72o44R89L57
3493G26j342m82J918K87j290K59P16p96q15J549Q03j427o36Q98K42j161N15J107
3511A071r12j277O46Q63m64o51P81N2j331K97J352K5j173J86N22n05k59J220O53
3530A096j233o22J075K13p80N37J125r93j202Q50J185q13p82R96m3j532K77J594
3548I48j27j481J19P66q83k70J288N08j797l50J427O3j134J019J059j383j484
$$ plain form
3419 686 193 -350 -89 420 -375 -549 636 1037 25 -64 582 328 -161 590 1088 113 -645 11 814 -44
3439 -44 -217 457 -128 -1042 -575 824 125 -908 -123 83 -1004 -852 564 284 -773 -464 730 -46
3457 -46 -666 693 1307 -260 -701 646 1019 -51 381 1022 131 -638 353 1335 -10 -516 690 285
3475 285 -1070 -160 1200 232 -1251 -525 198 -913 -744 707 465 -1519 -1048 396 24 -620 369 726
3493 726 -616 -1098 820 1107 -183 76 792 -4 -819 730 1533 106 -530 368 610 -551 -36 1071
3511 1071 159 -1118 -472 391 -73 -724 57 109 -1222 -925 427 452 -721 -535 -13 -518 -777 443 1096
3530 1096 -137 -759 316 529 -251 286 1411 418 -784 66 1251 438 -344 652 609 -923 -646 948
3548 948 821 -660 -541 225 -658 -928 360 868 -929 -1279 148 211 -923 96 1155 -228 -1712
3565a712K025R62j382j57J495o70j747J468J475j065j385J106L12j384L92J696
3581A429p82j662N41J047r20n33J513N7k034M4J615j0j209O64P27j287o95J864
3599C69N98j055m47Q62q8o69O06J213j008r98O33P29p28J40P47l55j231J73J140
3618F31l00n75J23M98j029k17J051N24j004m96O08j01m16M31R96n99j080N96R50
3637E91n50l02J076j27j269K23J506k15j119M84N58j052m46J357M56j516m42J451
3655F64p38o84P33J079j461j075J304O96j297J61J171o52j259J106J255j112n36
3672f45J048m7j122O20J286n68j002M77N66o54l79J406O5j717K15R80k79o12M70
3691A08L90r47n65J109J99p85K39L95o39m26N66P41o11l45M96M6l25K67O20l76
$$ plain form
3565 -1712 313 1275 -107 -264 1231 561 -1186 282 1757 692 -693 413 725 -659 -267 1429
3581 1429 647 -1015 -474 573 -347 -880 633 690 -1344 -1300 315 305 -904 -240 487 -800 -1495 369
3599 369 967 -88 -535 327 239 -430 176 1389 381 -617 16 745 17 157 904 549 -682 -509 631
3618 631 331 -244 -121 377 -652 -869 182 706 -298 -794 -186 -287 -703 -272 724 125 -955 -359 591
3637 591 41 -261 815 688 -581 -358 1148 933 -186 298 856 -196 -642 715 1171 -345 -787 664
3655 664 -74 -758 -25 1054 -407 -1482 -178 518 -779 -618 553 -99 -1358 -252 1003 -109 -645
3672 -645 403 356 -766 -146 1140 572 -430 47 613 -41 -420 986 1051 -666 -451 529 250 -362 108
3691 108 498 -449 -1014 95 294 -491 -252 143 -496 -922 -356 385 -226 -571 -75 -29 -354 -87 533 157
3711A57m67J65O34k63J26R6j78l46N0N20J08n21j23J24O9l97J18N59l97n40M6
3732d60M88k51l03N43J8p35K38O18j18m11M93L12p31k01P79M47q53q3O69q0p27
3753c48P18O31q86m60Q91K8p25L2Q27p33q32O12O73o77l57O43j08q18L06R22m35
3774i6n57M42K00n92J37J017k25q35N77N01n30%N29P0n46J0M41J34o70L06J3k82
3796D4l04L88K5m08ON17n44m68N95K55l04l98M35j7k49N2M16k8m57L21K38R4k
3819B07Q9K8n1o8N2o6j3n4M7j08KM5O8q5j71j95M38O7n65NL43l00j91M48j8l28
3845c74j45O49k84k34K11K38j13k26M36M9l80J97O92m98k62M24K30o54k24Q39
3865E71j44n46O8K73j25l57K20K52o11k0P44l47o40J60M80l81J38K83o3l92Q2
$$ plain form
3711 157 -310 -145 489 226 352 448 270 -76 -26 494 602 81 -42 82 151 -246 -128 431 34 -506 -460
3732 -460 28 -223 -526 17 35 -700 -462 156 38 -373 120 432 -299 -500 279 726 -127 -210 459 379 -348
3753 -348 370 1001 115 -345 546 574 -151 -119 708 -25 -857 -245 428 -249 -606 37 -71 -889 -583 339 -96
3774 -96 -653 -211 -11 -603 -466 551 326 -509 68 569 39 39 568 638 92 102 543 677 7 313 326 44
3796 44 -260 128 153 -255 -249 268 -276 -744 -149 106 -198 -596 -161 -178 -427 -375 41 13 -444 -123 115 209 207
3819 207 296 324 273 205 257 191 178 124 171 63 65 110 178 93 -78 -273 165 232 -333 -328 15 -285 -476 -28 -46 -374
3845 -374 -519 130 -154 -388 -177 61 -52 -278 158 207 -173 24 716 218 -44 380 610 -44 -268 571
3865 571 427 -119 -51 222 97 -260 -40 212 -399 -419 325 -22 -662 -502 -22 -403 -265 18 -45 -437 -355
3886c55N08j95k19L94K55k01k08K66J55k50m0K55k4k40M5J74k79K39j97j32o6
3907a15J76j16k57J30j39J91j51P7j32K74k35J68K5j08K19k84K53R5k1M5J04l3
3929A66J7O1J46k1k33L06L7k65j19R6K01m71L3J23p7l47J36P2k48P9J07J12l19
3952d08R8K69j86j16L2M46k21k79M48J22l89L55J94k97P2M5P1K5p7K95n6n40R9
3975BM09l66k91K49R8k54l9J55j69j35J6R4r5j44L39n6j58n2M62j06k05J78L01
3998B33p2k85K83K19k90p2L42j01q3k4L38k98q4P1p2m1j06m3J68k91j02J98jr1
4022b04J32j42m9j27L52j67K08l31M46q4k73J31L27j03k42K65J86l0k27L33k08
4043A93j26J12K82k34p8O8J07m03ln5N0l41K64K57k47l98K72L75m39m18O72J07
$$ plain form
3886 -355 153 -42 -261 133 388 187 -21 245 400 150 110 365 341 101 146 320 41 280 83 -49 -115
3907 -115 61 -55 -312 -182 -321 -130 -281 -204 -336 -62 -297 -129 -104 -212 7 -277 -24 71 50 95 199 166
3929 166 183 244 390 369 136 442 479 214 95 191 392 -79 -46 77 0 -347 -211 -139 -387 -308 -201 -89 -408
3952 -408 -310 -41 -227 -343 -311 135 -86 -365 83 205 -184 171 365 68 140 185 256 281 204 499 443 -97 2
3975 2 411 45 -246 3 101 -153 -192 -37 -206 -341 -325 -231 -326 -470 -131 -187 -345 -397 65 -41 -246 -68 233
3998 233 161 -124 159 378 88 16 358 257 174 150 488 190 106 177 105 64 -42 -85 83 -208 -310 -112 -113 -204
4022 -204 -72 -214 -263 -390 -38 -205 3 -328 118 34 -239 -108 219 116 -126 139 325 295 68 401 193
4043 193 67 179 461 227 149 217 324 -79 -82 -137 -87 -428 -164 93 -154 -552 -280 95 -344 -762 -90 17
4065A7k55N7K82j13j35L55K45j63j26K03j58j08R5K18j05j10K8J64m10l4K18J38
4087C03l94j62K14N3m36J67K44j91n22N98J73m28J40L40m69J80J94M34l37k26
4107a25L53N4l58N6M82n7k99o0J65j45k8Q0K36n10ML62J23m41n3K35l47j01L68
4130fL07o02m2K24j09k14J34O63k33m92L85L72l22j91N62J71p04R9M07N3m72K17
4152B07K49n26o4O21j43m82j98M62l72L5L55R3m84l11M77J28k87n5M52k7o52Q2
4174d40P38k84j34P1K39l70L16L61Nn26J0K85j72j61M88K13n57l88N62p0n69K64
4196a19N48o98m50N69L26m25l25L87J96n10J54Q14m03n47J8P78k79j94N57J00
4216D97o59p6Q12k68m32L99M64n32n25P79K86p99k52O25l39m16K52O00m60n57
$$ plain form
4065 17 -238 -181 101 -12 -147 208 453 290 164 367 209 101 196 414 309 199 227 391 -19 -53 165 303
4087 303 -91 -253 -39 14 -422 -255 -11 -202 -724 -126 47 -381 -241 99 -370 -190 4 438 101 -125
4107 -125 228 282 -76 -20 462 405 106 46 211 66 38 118 354 -156 -152 210 333 -108 -161 74 -273 -374 -6
4130 -6 301 -301 -343 -119 -228 -442 -308 355 122 -370 15 387 65 -126 436 607 -97 2 409 462 -10 207
4152 207 456 -70 -134 487 344 -138 -336 126 -246 -211 144 237 -247 -558 -81 47 -240 -295 157 130 -522 -440
4174 -440 298 14 -120 -49 190 -180 136 497 502 -24 -14 271 99 -62 426 639 82 -306 256 186 -383 -119
4196 -119 429 -269 -719 -150 176 -249 -574 -187 9 -501 -347 467 64 -483 -465 313 34 -160 397 497
4216 497 -162 -238 574 306 -126 273 737 205 -320 459 745 -54 -306 319 -20 -436 -184 416 -44 -601
4236f01L70K78m46J0O25l32m67J13N66p6k87L87N2l88q3N15L88o94J65N30l50
4257B75l54M46M19p76j37J63Lk68K37L74k96n70J67M29j83k62L87j40m45Q3N71
4278A23J72n77N7L14k32l26P86L03o74k05L67L20n12K44L45k40m75L63J95k6o38
4299c16M91O9o54K48M29k4q37K28L53n08J64N32m0o57N3N91r7l83M86K74o87k3
4321c08O57K32o35JP20m62l68K97O69p41j96O38j13o00K14M04l40l46Q9L66m54
4342b76lL34r2m62N3M97j0m89N11k9j38k02L65K57l62n9J99M2L3J19K73l28l68
4365a35K54K59o9k2%m5l43M9K85j69j46J29k09j57pK63J62m37J48J27N0k59K04
4388f8K00k39j21K12J84k96L6N26j27m39R7M39q4l62K75J84l73o9M10p3m12j36
$$ plain form
4236 -601 -231 47 -399 -389 236 -96 -563 -450 116 40 -247 140 192 -196 -279 236 624 -70 95 625 275
4257 275 -79 367 786 10 -127 36 39 -229 8 382 86 -484 -317 112 -71 -333 54 -86 -531 -448 123
4278 123 295 -282 -225 89 -143 -469 317 620 -54 -259 108 428 -84 160 505 265 -210 153 348 322 -316
4299 -316 175 244 -410 -162 267 243 -594 -366 -13 -521 -357 175 135 -522 -469 122 25 -358 128 402 -285 -308
4321 -308 349 581 -54 -53 667 205 -163 134 803 62 -134 504 391 -209 5 409 69 -277 -188 178 -276
4342 -276 -279 55 -37 -499 -446 51 41 -448 63 34 -104 -306 59 316 -46 -105 94 136 169 288 561 233 -135
4365 -135 119 378 309 287 287 242 -101 -52 233 64 -82 47 -162 -319 -326 -63 99 -338 -190 -63 -13 -272 -68
4388 -68 132 -107 -228 -16 168 -128 -92 434 307 -132 -35 404 320 -42 233 417 44 -25 385 312 -100 -236
4410b36N92n96n5J92J91n35j31N26J00m42K25K03j47m10L48K89m33J09M17k35
4430b8k11N37J29j47k55R1K73k95J9J80O1m97L50mj80j95J93J39l87k56L78J27
4452B2k20j43R0J81j13J47J50k49j59K22J61M0j04J31r3p6k5M54j12j41K9j0j3
4475A69j08Q7j0j37p3K17j03l32K82J17j76j26J08j13r0L4J85k8j04o1L44k57
4497a75r8K94J19k27j16O85r0l76J07M09l10l49K97L66l51l46L17J29m14K57j70
4518d2J77l22K73kj18k73K09j59j9K10J33j79j54J52J29k01L9K26n2N0O1J06n1
4541A93o2K27j57r8P9J13j62O5j95K41k09j28J02J0k01n5R6O3j88R2p8K06n5j21
4565b22k7K03j9k21K77qj89L78l0j76r8K04K55j08M5J16q8k63J35J76j88rj85
$$ plain form
4410 -236 356 -240 -295 -103 88 -447 -578 -52 48 -394 -169 34 -113 -523 -175 114 -319 -210 207 -28
4430 -28 -239 298 427 280 25 116 389 94 113 293 354 -143 207 203 23 -172 21 160 -227 -483 -105 22
4452 22 -198 -341 -251 -70 -183 -36 114 -135 -294 -72 89 129 25 156 63 -13 -38 416 304 163 192 182 169
4475 169 61 148 138 1 -72 145 42 -290 -8 109 -67 -193 -85 -198 -288 -254 -69 -97 -201 -262 82 -175
4497 -175 -273 21 140 -87 -203 482 392 16 123 532 222 -127 170 536 185 -161 156 285 -129 128 -42
4518 -42 135 -187 86 84 -34 -307 -98 -257 -276 -66 67 -112 -266 -114 15 -186 -147 79 27 77 138 244 193
4541 193 131 358 201 103 182 295 133 198 3 244 35 -93 9 19 -182 -237 -141 -78 -266 -174 -252 -46 -101 -222
4565 -222 -249 -46 -65 -286 -9 -17 -206 172 142 -34 -132 72 327 219 264 380 292 29 164 340 152 143 -42
4588d2J55k59n7K74l7k34O4J72j77q7M4j05J56J28pl1j88J03J94j60J79Mk14K81
4612A56j31J32j71J68J5J13j63j33J36o2m1R5R7k55r1Q9j20Jl3J89j79n0J01J96
4636E9j86O1Q2p7j36K53j58R5M3K3J04r7o8N9R6j92K51j59O3%K02k66P7j95M1
4661b5Q9j46j09j07J72m7Mq3L0N5J21jn5j38J48k1K02j13l2Q4k50J39L8J53p9
4686B9J34j09O1q9K88j63k05rL97k86p9J01p0p2k1J3M8j05j42K10M0k99K80L4
4710a4k50J46J35l2k71J38M1J14P9K7K80k82p4J54K48l32m0K01j12k18j4J17O
$$ plain form
4588 -42 113 -146 -203 71 34 -200 -136 36 -141 -228 -184 -289 -133 -5 -12 -43 -231 -128 66 -94 85 89 -125 156
4612 156 25 157 -14 154 169 282 119 -14 122 60 19 114 211 -44 -135 -46 -166 -165 -198 -9 -188 -238 -137 59
4636 59 -127 -66 16 -61 -197 56 -102 -7 36 59 163 66 -2 57 153 -39 212 53 116 116 318 52 129 -66 -25
4661 -25 64 -82 -191 -298 -126 -173 -169 -252 -222 -167 -46 -47 -102 -240 -92 -113 89 -24 -56 28 -222 -83 -45 108 29
4686 29 163 54 115 26 314 151 -54 -63 334 48 -31 70 0 -72 -93 -80 -32 -137 -279 -69 -29 -328 -48 -14
4710 -14 -264 -118 17 -15 -286 -148 -107 7 86 113 393 111 37 191 439 107 67 268 156 -62 -76 41 47
$$ [...]
8191f3
##END NTUPLES=NMR FID
##END=
