##TITLE=1H_IBBPA2401X
 CDCl3
 8 sc, 
 25.1.2023
##JCAMPDX= 6.0         $$ Bruker NMR JCAMP-DX V2.0
##DATA TYPE= NMR FID
##DATA CLASS= NTUPLES
##ORIGIN= UXNMR, Bruker Analytische Messtechnik GmbH
##OWNER= root
$$ XWIN-NMR		Version 3.5
$$ Wed Jan 25 14:26:29 2023 Russian Standard Time (UT+4h)  she@DPX200
##.OBSERVE FREQUENCY= 200.13135
##.OBSERVE NUCLEUS= ^1H
##.DELAY= (6, 6)
##.ACQUISITION MODE= SIMULTANEOUS
##.ACQUISITION SCHEME= undefined
##.AVERAGES= 8
##.DIGITISER RES= 18
##SPECTROMETER/DATA SYSTEM= spect
##.PULSE SEQUENCE= zg30
##.SOLVENT NAME= CDCl3
##.SHIFT REFERENCE= (INTERNAL, CDCl3, 0, 15.7039)
##AUDIT TRAIL= $$ (NUMBER, WHEN, WHO, WHERE, WHAT)
$$ ##TITLE= Audit trail, XWIN-NMR		Version 3.5
$$ ##JCAMPDX= 5.01
$$ ##ORIGIN= Bruker BioSpin GmbH
$$ ##OWNER= she
$$ F:/spectra/data/she/nmr/H-F/1/audita.txt
$$ ##AUDIT TRAIL=  $$ (NUMBER, WHEN, WHO, WHERE, WHAT)
(   1,<2023-01-25 14:24:23.89 +0400>,<she>,<DPX200>,
      <created by zg, POWCHK disabled, PULCHK disabled
       configuration hash MD5:
       00 E9 B6 7A A2 85 ED C7 34 08 36 98 17 FE 4E 26
       data hash MD5: 16K
       3F 06 68 A9 25 C9 9C 8C E1 5E 61 0A 3E E8 BB EB>)
$$ ##END=
$$ 
$$ hash MD5
$$ 29 B9 AD 3E 90 6E 0A DB 61 34 65 D1 EA C1 5D 4F
##$RELAX= 
##$RELAX= 
##$RELAX= 
##$RELAX= 
##$RELAX= 
##$RELAX= 
$$ Bruker specific parameters
$$ --------------------------
##$DU= <F:/spectra>
##$EXPNO= 1
##$NAME= <H-F>
##$PROCNO= 1
##$TYPE= <nmr>
##$USER= <she>
##$AMP= (0..31)
100 100 100 100 100 100 100 100 100 100 100 100 100 100 100 100 100 100 
100 100 100 100 100 100 100 100 100 100 100 100 100 100 
##$AQSEQ= 0
##$AQ_mod= 1
##$AUNM= <au_zg>
##$AUTOPOS= <>
##$BF1= 200.13
##$BF2= 200.13
##$BF3= 200.13
##$BF4= 200.13
##$BF5= 200.13
##$BF6= 200.13
##$BF7= 200.13
##$BF8= 200.13
##$BYTORDA= 1
##$CFDGTYP= 0
##$CFRGTYP= 5
##$CHEMSTR= <none>
##$CNST= (0..31)
1 1 145 1 1 1 1 1 1 1 1 1 1 1 1 1 1 1 1 1 1 1 1 1 1 1 1 1 1 1 1 1 
##$CPDPRG= <>
##$CPDPRG1= <>
##$CPDPRG2= <>
##$CPDPRG3= <>
##$CPDPRG4= <mlev>
##$CPDPRG5= <mlev>
##$CPDPRG6= <mlev>
##$CPDPRG7= <mlev>
##$CPDPRG8= <mlev>
##$CPDPRGB= <>
##$CPDPRGT= <>
##$D= (0..31)
0 1.2 0 0 0 0 0 0 0 0.06 0 0.03 0 0 0 0 0.0002 0 0 0 0 0 0 0 0 0 0 0 0 
0 0 0 
##$DATE= 1674642263
##$DBL= (0..7)
120 120 120 120 120 120 120 120 
##$DBP= (0..7)
150 150 150 150 150 150 150 150 
##$DBP07= 0
##$DBPNAM0= <>
##$DBPNAM1= <>
##$DBPNAM2= <>
##$DBPNAM3= <>
##$DBPNAM4= <>
##$DBPNAM5= <>
##$DBPNAM6= <>
##$DBPNAM7= <>
##$DBPOAL= (0..7)
0.5 0.5 0.5 0.5 0.5 0.5 0.5 0.5 
##$DBPOFFS= (0..7)
0 0 0 0 0 0 0 0 
##$DE= 6
##$DECBNUC= <off>
##$DECIM= 32
##$DECNUC= <off>
##$DECSTAT= 4
##$DIGMOD= 1
##$DIGTYP= 9
##$DL= (0..7)
0 120 120 120 120 120 120 120 
##$DP= (0..7)
150 150 150 150 150 150 150 150 
##$DP07= 0
##$DPNAME0= <>
##$DPNAME1= <>
##$DPNAME2= <>
##$DPNAME3= <>
##$DPNAME4= <>
##$DPNAME5= <>
##$DPNAME6= <>
##$DPNAME7= <>
##$DPOAL= (0..7)
0.5 0.5 0.5 0.5 0.5 0.5 0.5 0.5 
##$DPOFFS= (0..7)
0 0 0 0 0 0 0 0 
##$DQDMODE= 0
##$DR= 18
##$DS= 0
##$DSLIST= <SSSSSSSSSSSSSSS>
$$ [...]
##$SUBNAM2= <"">
##$SUBNAM3= <"">
##$SUBNAM4= <"">
##$SUBNAM5= <"">
##$SUBNAM6= <"">
##$SUBNAM7= <"">
##$SUBNAM8= <"">
##$SUBNAM9= <"">
##$SW= 18.05172834244
##$SWIBOX= (0..15)
0 0 2 0 0 0 0 0 0 0 0 0 0 0 0 0 
##$SW_h= 3612.71676300578
##$TD= 16384
##$TD0= 1
##$TE= 0
##$TE2= 300
##$TE3= 300
##$TEG= 300
##$TL= (0..7)
0 120 120 120 120 120 120 120 
##$TP= (0..7)
150 150 150 150 150 150 150 150 
##$TP07= 0
##$TPNAME0= <>
##$TPNAME1= <>
##$TPNAME2= <>
##$TPNAME3= <>
##$TPNAME4= <>
##$TPNAME5= <>
##$TPNAME6= <>
##$TPNAME7= <>
##$TPOAL= (0..7)
0.5 0.5 0.5 0.5 0.5 0.5 0.5 0.5 
##$TPOFFS= (0..7)
0 0 0 0 0 0 0 0 
##$TUNHIN= 0
##$TUNHOUT= 0
##$TUNXOUT= 0
##$USERA1= <user>
##$USERA2= <user>
##$USERA3= <user>
##$USERA4= <user>
##$USERA5= <user>
##$V9= 5
##$VALIST= <valist>
##$VCLIST= <CCCCCCCCCCCCCCC>
##$VD= 0
##$VDLIST= <DDDDDDDDDDDDDDD>
##$VPLIST= <PPPPPPPPPPPPPPP>
##$VTLIST= <TTTTTTTTTTTTTTT>
##$WBST= 1024
##$WBSW= 4
##$XGAIN= (0..3)
0 0 0 0 
##$XL= 0
##$YL= 0
##$YMAX_a= 590662
##$YMIN_a= -965400
##$ZGOPTNS= <>
##$ZL1= 120
##$ZL2= 120
##$ZL3= 120
##$ZL4= 120
##$ABSF1= 10
##$ABSF2= 0
##$ABSG= 5
##$ABSL= 3
##$ALPHA= 0
##$AQORDER= 0
##$ASSFAC= 0
##$ASSFACI= 0
##$ASSFACX= 0
##$ASSWID= 0
##$AUNMP= <proc_1d>
##$AZFE= 0.1
##$AZFW= 0.1
##$BCFW= 1
##$BC_mod= 2
##$BYTORDP= 1
##$COROFFS= 0
##$CY= 11.3945322036743
##$DATMOD= 1
##$DC= 2
##$DFILT= <>
##$DTYPP= 0
##$F1P= 2.36226072786647
##$F2P= -0.459571619588291
##$FCOR= 0.5
##$FTSIZE= 0
##$FT_mod= 4
##$GAMMA= 1
##$GB= 0.15
##$INTBC= 1
##$INTSCL= 1
##$ISEN= 128
##$LB= 0.24
##$LEV0= 0
##$LPBIN= 0
##$MAXI= 10000
##$MC2= 0
##$MEAN= 0
##$ME_mod= 0
##$MI= 1.114404
##$NCOEF= 0
##$NC_proc= 0
##$NLEV= 6
##$NOISF1= 3.799351
##$NOISF2= 2.8
##$NSP= 1
##$NTH_PI= 0
##$NZP= 0
##$OFFSET= 15.70392
##$PC= 1
##$PHC0= -19105.39
##$PHC1= 2.800793
##$PH_mod= 1
##$PKNL= yes
##$PPARMOD= 0
##$PSCAL= 0
##$PSIGN= 0
##$REVERSE= no
##$SF= 200.130013532006
##$SI= 16384
##$SIGF1= 3
##$SIGF2= 2
##$SINO= 400
##$SIOLD= 16384
##$SREGLST= <1H.CDCl3>
##$SSB= 0
##$STSI= 0
##$STSR= 0
##$SW_p= 3612.71676300578
##$SYMM= 0
##$S_DEV= 0
##$TDeff= 0
##$TDoff= 0
##$TI= <>
##$TILT= no
##$TM1= 0
##$TM2= 0
##$TOPLEV= 0
##$USERP1= <user>
##$USERP2= <user>
##$USERP3= <user>
##$USERP4= <user>
##$USERP5= <user>
##$WDW= 1
##$XDIM= 8192
##$YMAX_p= 0
##$YMIN_p= 0
$$ End of Bruker specific parameters
$$ ---------------------------------
##NTUPLES= NMR FID
##VAR_NAME=  TIME,          FID/REAL,        FID/IMAG
##SYMBOL=    X,             R,               I
##VAR_TYPE=  INDEPENDENT,   DEPENDENT,       DEPENDENT
##VAR_FORM=  AFFN,          ASDF,            ASDF
##VAR_DIM=   8192,          8192,            8192
##UNITS=     SECONDS,       ARBITRARY UNITS, ARBITRARY UNITS
##FACTOR=    0.0002768,     1,               1
##FIRST=     0,             0,               0
##LAST=      2.2672688,     0,               0
##MIN=       0,             -965400,         0
##MAX=       2.2672688,     590662,          0
$$ Real data points
##PAGE= N=1
##DATA TABLE= (X++(R..R)), XYDATA
$$ [...]
2417a17M79k78o14N66M08k29p84P15L70o17l55O25N60j040j66R34K49r77P5N69
$$ -117 362 84 -530 36 444 215 -569 146 516 -101 -456 169 729 -311 -477 457 706 -271 -196 373
2437C73Kp06J22M80k95m20L47L55m01l33N06K66n60j44L87M11o35j70Q61Q1q91
$$ 373 375 -331 -209 271 -24 -444 -97 258 -143 -476 30 296 -264 -408 -21 390 -245 -415 446 527 -364
2458c64j59J150j46j057M41Q73l70r33N74N79n63m69N06M15n99m08P02K18n17
$$ -364 -523 627 481 -576 -135 738 368 -565 9 588 25 -444 62 477 -122 -530 172 390 -127
2477a27m63Q38J52p37q1O89j7r35O88M31l26o89N74P27o98m01N42N74q11n55Q72
$$ -127 -590 248 400 -337 -418 271 254 -681 7 438 112 -577 -3 724 26 -375 167 741 -70 -625 247
2498B47L46q48l16Q71J88j007J27P61j6r92L12O11j77o47M65O96n80o80M94O25
$$ 247 593 -255 -571 300 488 -519 -392 369 353 -639 -327 284 107 -540 -75 621 41 -639 -145 480
2518D80q01k07R19N8q84O7Q07j3p49K3P30p4q51O5R26j82r99O82N10l94j055P94
$$ 480 -321 -528 391 449 -435 -368 439 426 -323 -300 430 356 -495 -430 496 314 -685 -3 507 113 -942 -148
2540a48J001j025n52R40M65j220j50Q81L93p73j39P01O3q50K08O42j16o98K93
$$ -148 853 -172 -724 216 681 -539 -689 192 585 -188 -327 374 437 -413 -205 437 321 -377 -84
2559h4N57m52m45L93N62n90l87P21K68q98l22Q72L10j080R1J099l30j172M79J235
$$ -84 473 21 -424 -31 531 -59 -446 275 543 -355 -677 195 505 -575 -484 615 285 -887 -408 827
2579H27o32p87N62Q50q23p58Q52N32o03m77P49J57o67l94R07J29o44l21R74j11
$$ 827 195 -592 -30 820 -3 -761 91 623 20 -457 292 449 -218 -612 295 424 -220 -541 433 322
2599C22p91R5J226o99q69M74R41r07p96J210N11q79m26P68K89r32j09J240p9p98
$$ 322 -469 -374 852 153 -716 -242 699 -208 -1004 206 717 -162 -588 180 469 -463 -572 668 589 -209
2619b09j77Q69j28r11L56P81O2j327O19N44l66p49P80N78r06o20R56L70j113j87
$$ -209 -386 483 355 -556 -200 581 643 -684 -65 479 113 -636 144 722 -184 -804 152 522 -591 -778
2639g78J043M31j191j12R23j17q14K20J125m07r67M75Q05n97p05P48O94o36r20
$$ -778 265 696 -495 -607 316 199 -615 -395 730 323 -644 -169 636 39 -666 82 776 140 -780
2658g80Q25O94r51m65J330Q4j273jQ64J89j155L43J079n23r91M16Q42m99p29O37
$$ -780 45 739 -212 -677 653 737 -536 -537 327 516 -639 -296 783 260 -731 -315 527 28 -701 -64
2678f4O96o82n96N95N38p83k71J017L12j059j99R41J70j257L62J082l90j092M31
$$ -64 632 -50 -646 -51 487 -296 -567 450 762 -297 -496 445 615 -642 -280 802 412 -680 -249
2697b49P85m51p49O66Q20j100l46O08O46q07m73Q99N64j310k77J144K50j137O7
$$ -249 536 85 -664 2 822 -278 -624 -16 630 -177 -650 249 813 -497 -774 370 620 -517 -450
2716d50J133k75j249M82J205o62q59Q69N45q85p28J003O02j058k28R55M6j145
$$ -450 683 408 -841 -359 846 184 -675 194 739 -146 -874 129 731 -327 -555 400 446 -699
2734f99P1J180o7j047K52Q98l03j110N46R97l79j070Q71P96j063p59J219N43j171
$$ -699 -628 552 485 -562 -310 588 285 -825 -279 718 339 -731 140 936 -127 -886 333 876 -295
2753b95m96J439r8j261L3J230n9r03L7Q76l27r63L02J220l62j289O83R59p72r56
$$ -295 -791 648 550 -711 -678 552 493 -410 -373 503 176 -787 -485 735 373 -916 -233 726 -46 -1002
2773a002J101P28r84n14J031L71j320K4J350j72j142K29Q84l52j055O89R29n79
$$ -1002 99 827 -157 -671 360 731 -589 -565 785 613 -529 -300 584 232 -823 -134 795 216
2791B16p69M72O21m29q41P64P92r19p43Q35P78j209l20J311K98j705J72J482m21
$$ 216 -553 -81 540 111 -730 34 826 -93 -836 -1 777 -432 -752 559 857 -848 -676 806 385
2810C85j273O72J098o96r90P63P45q24n07Q12N83r26m66P47N17r36m85J082L40
$$ 385 -888 -216 882 186 -804 -41 704 -120 -627 185 768 -158 -624 123 640 -296 -781 301 641
2829F41j296m3J181L4j230K86J359o51j227R39P46q52p54J460Q8r48m76J304N7
$$ 641 -655 -698 483 517 -713 -427 932 281 -946 -7 739 -113 -867 593 681 -267 -743 561 618
2848F18j070J10Q79j37r59R2J084j03j164L40J198p58j066N40J282q05j251J144
$$ 618 -452 -342 537 400 -559 -467 617 514 -650 -310 888 130 -936 -396 886 81 -1170 -26
2866b6J119j604m59J421M96j564l1J460m64q58J86J024k45j034K02J096n79q13
$$ -26 1093 -511 -970 451 947 -617 -648 812 348 -510 -324 700 455 -579 -377 719 140 -673
2884f73M77J089p85j041Q98J089j335o05J196O58j549l86J474L09j673K03J398
$$ -673 -196 893 108 -933 -35 1054 -281 -886 310 968 -581 -967 507 816 -857 -654 744
2901G44r7j573M50J151m34j039N59J033n69q92P81O30o78r86J135P30j151n99
$$ 744 647 -926 -476 675 241 -798 -239 794 225 -667 114 744 66 -920 215 945 -206 -805
2919h05J252K84j392R3J399l69j035J72J150n99j014O84J163j172p02J056N32
$$ -805 447 731 -661 -568 831 462 -573 -401 749 150 -864 -180 983 -189 -891 165 697
2936F97q20p66J251M83j238l46J207N41j440l39J509r4j422L64J373m15j381M62
$$ 697 -123 -889 362 845 -393 -739 468 1009 -431 -770 739 645 -777 -413 960 545 -836 -374
2954c74J338q08j019Q65N48o48n52R57L01j033j36R16L07j172o9J215k00j296
$$ -374 964 156 -863 2 550 -98 -650 307 608 -425 -561 355 662 -510 -579 636 436 -860
2972h60M87J362p02j287Q50J272j098r62J234R97j763o24J666N86j762m19J562
$$ -860 -373 989 287 -1000 -150 1122 24 -938 296 1293 -470 -1094 572 1158 -604 -1023 539
2989E39K14j141k90J254J55j483J47J282k09j181K03J155l43j255O19J336j031
$$ 539 753 -388 -678 576 731 -752 -605 677 468 -713 -510 645 302 -953 -334 1002 -29
3006b9r50J234N78j222m55J322K82j542M85J053l91j301P74J225q20j079P15R48
$$ -29 -979 255 833 -389 -844 478 760 -782 -297 756 365 -936 -162 1063 243 -836 -121 827
3024H27p19j286J010J184r42j203R99J168j282j035J678O18j559l56J793j70j753
$$ 827 108 -1178 -168 1016 74 -1129 -130 1038 -244 -1279 399 1017 -542 -898 895 725 -1028
3041a028M47J419l46j337Q25Q72r51p42R06P66r96n69R35N56j345k21J153N82
$$ -1028 -581 838 492 -845 -20 852 -99 -841 65 831 -165 -734 201 757 -588 -809 344 926
3059I26j316n16J694Pj851K85J852l59j623O51J498j207j205J088J141r19r28
$$ 926 -390 -906 788 795 -1056 -771 1081 722 -901 -250 1248 41 -1164 -76 1065 146 -782
3076g82J029M79j050l49J178M82j267n46R41L47r92j21J426j77j454K72J335o45
$$ -782 247 726 -324 -673 505 987 -280 -826 115 462 -530 -651 775 598 -856 -584 751 106
3094A06j038J058J130j499q86J400M69j421j36J786P0j555k66J488k93j181K05
$$ 106 -932 126 1256 -243 -1129 271 740 -681 -817 969 1039 -516 -782 706 413 -768 -563
3111e63J605m00j542L19J498o49j206P22J694j165j756J291J245j486m92J509
$$ -563 1042 642 -900 -581 917 268 -938 -216 1478 313 -1443 -152 1093 -393 -885 624
3127F24M09j626n49J695o7j082K34J307n27j441L67J426n47r31P31J170j212j075
$$ 624 1033 -593 -1142 553 486 -596 -362 945 418 -1023 -656 770 223 -708 23 1193 -19 -1094
3145a094R04J088j044p64J463L80j492p34J723L87j760L41J808o80j827N89J506
$$ -1094 -190 898 -146 -910 553 933 -559 -1293 430 817 -943 -602 1206 526 -1301 -712 794
3162G94m45r51Q69O11q60j099Q93J189r67p14R57O50j590m79J629N51j642J59
$$ 794 349 -602 267 878 18 -1081 -188 1001 34 -680 277 927 -663 -1142 487 1038 -604 -445
3180d45J613r09j572Q25J695j026j044J111P54j281q45J336P93j101o23J126K42
$$ -445 1168 259 -1313 -488 1207 181 -863 248 1002 -279 -1124 212 1005 -96 -719 407 649
3197F49j387k54J640K05j356j38J575m81j621N55J831o25j747R97J114j285r09
$$ 649 -738 -992 648 853 -503 -641 934 453 -1168 -613 1218 593 -1154 -157 957 -328 -1237
3214a237J481J208j738n91J295L7j124j92J633J45j316l08J053K28j548L22J748
$$ -1237 244 1452 -286 -877 418 455 -669 -861 772 917 -399 -707 346 574 -974 -652 1096
3231A096m89j783Q73J530j191j313J451J264j751r28J594M97j665N3J683j49j555
$$ 1096 607 -1176 -303 1227 36 -1277 174 1438 -313 -1241 353 850 -815 -762 921 772 -783
3248g83J17J336m46j132N59J445o53j315K82J301o03j155J044J380j237j427J401
$$ -783 -666 670 224 -908 -349 1096 443 -872 -590 711 108 -1047 -3 1377 140 -1287 114
3265A14J006j733n01J979L58k080q6J719l33j341P47J393j106j052O47Q59n64
$$ 114 1120 -613 -1114 865 1223 -857 -943 776 443 -898 -151 1242 136 -916 -269 590 26
3282B6n98Q17N68p73r32P54P34r14n01J386N64j774l88J557M4j472O89J462j127
$$ 26 -572 245 813 40 -892 -138 596 -318 -819 567 1131 -643 -1031 526 570 -902 -213 1249 122
3301A22j292J343J078j542n52J165O10j438n14J614K02j196l65J254J57j277k49
$$ 122 -1170 173 1251 -291 -843 322 932 -506 -1020 594 796 -400 -765 489 646 -631 -880
3318h80J671o1j651L35J514m45j732O71J879j045j446J419R39j724n77J619M80
$$ -880 791 730 -921 -586 928 483 -1249 -578 1301 256 -1190 229 1168 -556 -1133 486 966
3335I66j640l0J437j00j453J4J563q4j491K07J563o89j346N44J825j013j557J077
$$ 966 -674 -704 733 633 -820 -806 757 673 -818 -611 952 263 -1083 -539 1286 273 -1284 -207
3353b07J463j311j181J565J117j577j163J815M58j555k45J321j3j171K7J231k00
$$ -207 1256 -55 -1236 329 1446 -131 -1294 521 979 -576 -821 500 487 -684 -657 574 374
3370C74j240O54J115n44j063O67Q38r99m92J154M28j503j45J494n6j575K41J482
$$ 374 -866 -212 903 359 -704 -37 801 -198 -690 464 892 -611 -756 738 682 -893 -652 830
3388H30j72j642M04J809p17j455N40J445q66j211Q70J463j126j234J031J003j021
$$ 830 658 -984 -580 1229 512 -943 -403 1042 176 -1035 -165 1298 172 -1062 -31 972 -49
3405d9r64J428N46j427k99J460j54j453O73J103o43j108Q33R18j098o25J211N67
$$ -49 -1013 415 961 -466 -765 695 541 -912 -239 864 221 -887 -54 864 -234 -859 352 919
3423I19j363m18J177N43j468l49J660L20j797k76K045r4j955L03J880m49k124
$$ 919 -444 -862 315 858 -610 -959 701 1021 -776 -1052 993 899 -1056 -753 1127 678 -1446
3440a446J001J728j125j237J102J188j097j263J235Q01j323m74J215N16j158m16
$$ -1446 -445 1283 158 -1079 23 1211 114 -1149 86 887 -436 -910 305 821 -337 -753
3456g53J236K29j252O1J249m8j401J07J672p68j639J337J205j575q95J801P87
$$ -753 483 712 -540 -479 770 722 -679 -572 1100 332 -1307 30 1235 -340 -1235 566 1353
3473A353k181j19J720K17j690l7J522p9j398J03J305r7j484J89J586l43j367O47
$$ 1353 -828 -947 773 990 -700 -737 785 706 -692 -589 716 619 -865 -676 910 567 -800 -153
3491a53J004l51j612J114J184j381q58J508N08j632k08J579k28j445P30J260j151
$$ -153 851 500 -1112 2 1186 -195 -1053 455 963 -669 -877 702 474 -971 -241 1019 -132
3508a32q30Q47Q80p66q49J050Q05q55j120R97R93j120j011J510J020j946o11J973
$$ -132 -962 -115 765 -1 -850 200 1005 150 -970 27 1020 -100 -1111 399 1419 -527 -1138 835
3526H35J82j960m6K190n38j550N59J339q93j138J046O91r24l84N73M83o85l71
$$ 835 1017 -943 -989 1201 663 -887 -328 1011 118 -1020 26 717 -207 -591 -18 465 -220 -591
3544e91R55K67r32m36J021K78j049K2J479m88j684M60J866r18j518J605J211j734
$$ -591 364 631 -301 -737 284 562 -487 -465 1014 526 -1158 -698 1168 250 -1268 337 1548 -186
3562a86j243J866N94j434o23J708K18j640k81J513K39j191l06J675k29j645J5
$$ -186 -1429 437 1031 -403 -1026 682 900 -740 -1021 492 731 -460 -766 909 680 -965 -950
3579i50J826j53j740P78J290p41j543J209J268j395o75J468L20j669l83J684M8
$$ -950 876 723 -1017 -239 1051 310 -1233 -24 1244 -151 -826 642 962 -707 -1090 594 642
3596F42j143J66J007k63j416L31J601m81j168M06J233o92j546J034J617j181j193
$$ 642 -501 -335 672 409 -1007 -676 925 444 -724 -318 915 223 -1323 -289 1328 147 -1046
3613a046J396O91j805m21J785L64j438J8J299o01r68K73J261k53r75L50N74o72
$$ -1046 350 1041 -764 -1185 600 964 -474 -456 843 242 -726 -453 808 555 -420 -70 504 -168
3631a68q32Q80J113q65q47R20N20j363l71J701M35j700j37J480l78j485O91J529
$$ -168 -1000 -120 993 128 -719 201 721 -642 -1013 688 1123 -577 -714 766 388 -1097 -406 1123
3649A123o61j397R43P71j146o00J135J096j143r28R65O05j179m64J450L92j387
$$ 1123 462 -935 8 779 -367 -967 168 1264 121 -807 158 763 -416 -880 570 962 -425
3666d25n64J466K9j634O62J681n33j684O40J245j048j163J624R73j512q35R57
$$ -425 -989 477 506 -1128 -466 1215 682 -1002 -362 883 -165 -1328 296 1269 -243 -1078 -121
3683a21N61r35j97J309M84j578m63J327K48j214J9J761m59j842M22J620r16j413
$$ -121 440 -495 -692 617 1101 -477 -940 387 635 -579 -560 1201 742 -1100 -678 942 26 -1387
3701a387J755J032j632j114J623M84j361p4J618j48j564k50J447K27j066O7J207
$$ -1387 368 1400 -232 -1346 277 761 -600 -674 944 796 -768 -1018 429 656 -410 -343 864
3718H64j58j577j53J742K3j605P26J451j250j527J189J272j213n28J423J61j732
$$ 864 706 -871 -1024 718 741 -864 -138 1313 63 -1464 -275 997 -216 -744 679 840 -892
3735h92L9J458l14p32L81P77n30j039N28R46n41m51N63M66r28j082J359J002j173
$$ -892 -853 605 291 -441 -60 717 187 -852 -324 622 81 -370 193 659 -269 -1351 8 1010 -163
3754a63o98J414K28j859j10K136k4j906O54J520j058j471J119J238q29r75J099
$$ -163 -861 553 781 -1078 -1188 948 924 -982 -328 1192 134 -1337 -218 1020 191 -784 315
3771C15M12j116n66J201Q37j177o82R82M83j479k67J800L55j783N2J805p30j834
$$ 315 727 -389 -955 246 1083 -94 -776 206 689 -790 -1057 743 1098 -685 -633 1172 442 -1392
3789a392J121J736j177j432J191J085j580q52J612R64j400q76J448K11j263n14
$$ -1392 -271 1465 288 -1144 47 1132 -448 -1300 312 1276 -124 -1000 448 659 -604 -1118
3805a118J911K64j393p04J554L63j786K20J628k66j550M62J264r21q69J347N55
$$ -1118 793 1057 -336 -1040 514 877 -909 -689 939 673 -877 -415 849 -72 -941 406 961
3822I61j326l01R75J64j055J31R76j38j127K21J078m58p34L14J221o20j417J091
$$ 961 -365 -666 309 473 -582 -451 525 387 -740 -519 559 101 -633 -319 902 282 -1135 -44
3840d4R92j154q97J430R77j779o15J413N95j706j56J703o4j507J48J283k70j127
$$ -44 948 -206 -1103 327 1304 -475 -1090 323 918 -788 -944 759 695 -812 -664 619 349 -778
3858g78N10J036k78j449O52J169p48r71Q53R70j365o02J372P36j647j58J489j50
$$ -778 -268 768 490 -959 -307 862 114 -857 -4 966 -399 -1001 371 1107 -540 -698 791 641
3876F41j519M12J365n10j364Q13J249j067j001Q88J236j141j034J012J011j045
$$ 641 -878 -466 899 389 -975 -162 1087 20 -981 -93 1143 2 -1032 -20 991 -54
3892e4j073J403Q77j275r45J638M62j626k69J827m79j348N93J285p07j117J002
$$ -54 -1127 276 1153 -122 -1067 571 1033 -593 -862 965 486 -862 -269 1016 309 -808 194
3909A94N68r43n32R98K20q35k95Q11K62q21k21J119J74j208j31J297Rj711L89
$$ 194 762 -181 -713 285 505 -330 -625 186 448 -373 -594 525 699 -509 -640 657 666 -1045 -656
3928f56J808p88j687J294J437j347j179J265R36j273q01J457K81j308j68J026
$$ -656 1152 364 -1323 -29 1408 61 -1118 147 1083 -190 -991 466 747 -561 -729 297
3944B97L49r45m02J031K82j051k2P81L82j464J93J353p39q47Q30Q27j057p58J567
$$ 297 646 -299 -701 330 612 -439 -461 320 702 -762 -569 784 45 -802 28 855 -202 -960 607
3963F07K10j537q5J737l26j617P83J096o82j145O94J014m69j071M03J203o66j081
$$ 607 817 -720 -805 932 606 -1011 -228 868 186 -959 -265 749 280 -791 -388 815 149 -932
3981i32O48J181r15j085J122R15j325p01J487L52j151l31J362k57q78M02Q13p44
$$ -932 -284 897 -18 -1103 19 934 -391 -1092 395 747 -404 -735 627 370 -508 -106 707 -37
3999c7n00Q40L66j050k14J042J41q49l80Q99L93j168k60J313L26j581l5J625j44
$$ -37 -537 303 669 -381 -595 447 588 -261 -641 258 651 -517 -777 536 862 -719 -754 871 727
4018G27j702N25J485o62j370J028J109j161q78J159O62j172n68J106K63q46k31
$$ 727 -975 -450 1035 373 -997 31 1140 -21 -899 260 922 -250 -818 288 551 -295 -526
4035e26Q06L63r77k03J003M4j099J73J137l25j405J012Q73r89r31J118Q73j200
$$ -526 280 643 -334 -537 466 510 -589 -416 721 396 -1009 3 876 -113 -1044 74 947 -253
4053b53n96J435J75j319j48J251J21j090j25R98M2j142J16J203j1j392M44R36
$$ -253 -849 586 761 -558 -706 545 666 -424 -549 449 491 -651 -535 668 657 -735 -291 645
4071F45m54j126Q46R43q28o92P96N13j167J1J252rj178o0R64j10j077N92R61n65
$$ 645 191 -935 -89 854 26 -666 130 643 -524 -513 739 730 -448 -508 456 346 -731 -139 822 257
4091B57q96O06O94n33p16N75J039r31r59R73M74j150l15J398K60j317j0J119k55
$$ 257 -639 -33 661 128 -588 -13 1026 95 -864 109 583 -567 -882 516 776 -541 -551 568 313
4110C13j061N70J050o54r50N34O48m10p04Q66Q04r96p76P93Q64j059m73J063L96
$$ 313 -748 -178 872 218 -732 -198 450 40 -664 202 1006 10 -766 27 891 -168 -641 422 818
4129H18j314m93J439m9r51L49J120o82j042L88Q90p84j96P35N21r19l90O00K94
$$ 818 -496 -989 450 401 -550 -201 919 237 -805 -417 473 -311 -507 228 749 -170 -560 40 334
4148C34l82m62Q71K75j032m36J055M84j052p8J341n09j439O12J365p90j018R16
$$ 334 -48 -510 361 636 -396 -832 223 707 -345 -423 918 409 -1030 -418 947 157 -861 55
4166E5P88j126q05J042P61q74k15P58J57q07k75M00P57m16m36O61l0r31j17J146
$$ 55 843 -283 -1088 -46 715 -159 -374 384 541 -266 -541 -141 616 200 -236 425 395 -536 -653 493
4186D93J11j107N27P36r87q75J035J040j279k4R40k99j431N03J229jq42K6O08
$$ 493 604 -503 24 760 -227 -1102 -67 973 -306 -330 610 311 -1120 -617 612 611 -231 -205 403
4205D03l34p74K64R19n2q27J35P70n58q37J122O92p89n65O56K47j162J8J414J11
$$ 403 69 -705 -441 478 426 -401 -266 504 -54 -891 231 923 134 -431 225 472 -690 -672 742 853
4225H53j247J40O81n87m99O79P50m88n99L19N57p77n24Q64R35j030q33O88O90
$$ 853 -394 -254 427 -160 -659 20 770 282 -317 2 559 -218 -742 122 1057 27 -806 -118 572
4244E72q83m91J370N25j361p45J524n0j319L57J351k88r92NO34k13l90M66N00
$$ 572 -311 -802 568 1093 -268 -1013 511 461 -858 -501 850 562 -430 -425 209 -4 -394 72 572
4263E72n37n62J23N63j36m56O34K69n96l98O56K84q26K88R59n46q98J69R74q18
$$ 572 35 -527 -404 159 23 -433 201 470 -126 -524 132 416 -410 -122 837 291 -607 -438 536 -282
4283b82k17Q99L64q55n42Q77K9m67r7O97O1p76k48P30L2n59K12Q52l77j046K10
$$ -282 -499 400 764 -91 -633 244 273 -194 -291 406 467 -309 -557 173 205 -354 -142 710 333 -713 -503
4304e03J030l01p01O55O80r36p50R85M61q60k39Q25J92p82m63J065pn91k16Q19
$$ -503 527 226 -475 180 860 -76 -826 159 620 -240 -479 346 538 -244 -707 358 351 -240 -456 363
4324C63L7j084K10Q59R8j078M04Q07q08m40N89O89p43k03P53j72r97K95P43R8
$$ 363 400 -684 -474 385 483 -595 -191 616 -192 -632 -43 646 -97 -300 453 281 -716 -421 322 420
4344D20p03kQ30l95o21K45O54j15o33J09P85m79o98N90O35l99p78O56L65q80j59
$$ 420 -283 -285 545 150 -471 -226 428 313 -320 -211 574 95 -603 -13 622 223 -555 101 466 -414 -573
4365e73R66O8j180N26O33n39l50N60L09n29j11L79K53m99k05M13M84o98m99R07
$$ -573 393 461 -719 -193 440 -99 -449 111 420 -109 -220 159 412 -87 -292 121 605 -93 -592 315
4385C15L53r99k90R86M96j326j43J272j03j311L53J135n51q34N89O05o44m15M19
$$ 315 668 -331 -621 365 861 -465 -608 664 561 -750 -397 738 187 -647 -58 547 -97 -512 -93
4404i3L59m24j09J57L56l31m44N82J84l49j73O87K0q75R4J184n51j051P86P27
$$ -93 266 -158 -267 -110 246 -85 -529 53 237 -112 -285 402 422 -453 -359 825 274 -777 9 736
4424G36r41m99J021K45q88l21J041K30r46j47P80J05n89k02N20L05o48l12P61
$$ 736 -205 -704 317 562 -326 -647 394 624 -322 -469 311 416 -173 -375 145 450 -198 -510 251
4443B51L81q70L9O97j76j042N38Q72p46o17R38J89p49k21J088k24r65M40O20l90
$$ 251 632 -238 -199 498 322 -720 -182 690 -56 -673 265 454 -295 -516 572 348 -617 -177 443 53
4463E3n60L82N49k96n40L27N22k75r62O29R24o85q16Q19O72q79m93P69N64r18
$$ 53 -507 -125 424 128 -412 -85 437 162 -800 -171 753 68 -748 71 743 -136 -629 140 704 -214
4483b14k71P62L8q13K68O75l83m81L13L12m5m25J14N13l77l50M43K37n73k45P00
$$ -214 -485 277 315 -498 -230 445 62 -419 -106 206 161 -264 -150 363 -14 -364 79 316 -257 -502 198
4504A98J83p45m0P65P5q89O3J027m43p13M15P02l74r96N62Q64o22m73L94M87m54
$$ 198 381 -364 -404 361 436 -453 -390 637 194 -519 -104 598 224 -772 -210 654 32 -441 -47 440 -14
4525a4n13O08N13o12m62Q49J08p84n3P32j21n18J37P01l04q11M30P42n54m38O69
$$ -14 -527 81 594 -18 -480 369 477 -307 -360 372 251 -267 -130 571 267 -544 -114 628 74 -364 305
4546C05J36o32j92N11L25o01k26O92J72q86j53R02Qp41m3R57l38r07P04O39m55
$$ 305 441 -191 -383 128 453 -148 -374 318 490 -396 -549 353 361 -380 -423 534 196 -711 -7 632 177
4567A77q17P46N95j024j63N63L45n84j42M34J44o08m9M98M49q11j24Q16j95o75
$$ 177 -640 106 701 -323 -486 77 422 -162 -304 130 274 -334 -383 115 564 -247 -371 445 250 -425
4587d25k3R88j34q60M94N10q49l17R84K37r36P4M55j01n39Q1P92j83n70L22L89
$$ -425 -448 540 406 -454 40 550 -299 -616 368 605 -331 -257 198 97 -442 -361 431 248 -322 0 389
4608C89l64o21L33Q84k73r02L75P13m27r94P43P23p60n31R71K09j019J71P44r0
$$ 389 25 -596 -263 621 348 -554 -179 534 107 -887 -144 579 -181 -712 259 468 -551 -380 364 274
4628B74o26M17K64l97j92K38K31o3j80N4J80k83l01M82M80n44l57O52J66r91j14
$$ 274 -352 65 329 -68 -260 -22 209 146 -34 20 200 -83 -384 98 578 34 -323 329 495 -496 -610
4649f10J307j53j143J03J073m71r37Q75P30p57n11M37N10n38j81L32L34k03l13
$$ -610 697 544 -599 -496 577 106 -831 44 774 17 -494 -57 453 -85 -266 66 400 197 -116
4668a16OJ84j63k60O67J40n30k07N08l3q05M85R29o20p91N94M42p29k16R81K4
$$ -116 -110 74 -89 -349 318 458 -72 -279 229 196 -609 -124 805 185 -606 -12 430 -299 -515 466 490
4689D90q42k27O73K08n22L8O08J74j007q9M14N33p65N3Q41mj017k9Q11j25o07
$$ 490 -352 -579 94 302 -220 -182 426 600 -407 -496 -82 451 -314 -261 580 576 -441 -470 341 216 -391
4710c91M89N65q50k41M14K20l37J53N77j64q64L09J78l6k97O34k3l37l80J2O83
$$ -391 98 663 -187 -428 -14 206 -131 22 599 435 -429 -120 58 22 -275 359 336 -1 -381 -369 314
4731C14k52m16N96M42q78o64Q42N52o90j08N05R0q09J66O26j57l45L73N0k42o55
$$ 314 62 -354 242 684 -194 -858 -16 536 -154 -262 243 333 -476 -310 316 159 -186 187 237 -5 -660
4752f60N27L54j16k43K71M02o90n75Q22N51q07r6P31j0j033J39Q99Q5q16R7P04
$$ -660 -133 221 105 -138 133 535 -155 -730 92 643 -164 -260 471 461 -572 -433 466 551 -265 -168 536
4773E36l97r11N67N55k04l64J49K42n61pL61L98m73J2J40J34m71n8P46J15p48
$$ 536 139 -772 -205 350 146 -218 -69 173 -388 -395 -34 364 -109 -97 43 177 -294 -352 394 509 -239
4794b39J6P05n71m55O55K91n29k14L56J68o60Q5P01K56n76k80L81J04m83J0O29
$$ -239 -223 482 -89 -544 111 402 -127 -341 15 183 -477 -392 309 565 -11 -291 90 194 -289 -279 350
4815C50J06p68J31M55j04n82L07P76o31m50M61K49o51k1O67J64n86j06L81n0n74
$$ 350 456 -312 -181 274 170 -412 -105 671 40 -410 51 300 -351 -372 295 459 -127 -233 148 98 -476
4836d76L74M37J17q00J30M44m3o47K77O40j53q74K32Q74m63o39O59K94m52l97
$$ -476 -102 335 452 -348 -218 226 183 -464 -187 453 300 -574 -342 532 69 -570 89 383 -69 -466
4856d66M95K28l28J4L22m9k85N8L1o7l0M2M49k13l81J91J59L1l73K47N79o42m08
$$ -466 29 257 -71 -57 265 216 -69 -11 20 -47 -77 -35 414 201 -180 11 170 201 -172 75 654 12 -396
4879c96O21o9n38j4Q11q8o73J25P63m86n09M60K91l04p8k0L50j58l59L61K96j73
$$ -396 225 156 -382 -396 415 327 -346 -221 542 56 -453 7 298 -6 -84 -104 246 88 -271 90 386 213
4901B13m95L47J54k81l16N39K41n41l16Q72k20o46M51L88l06p41P22N18p52l22
$$ 213 -282 65 219 -62 -378 161 402 -139 -455 417 197 -449 2 390 84 -657 65 583 -169 -491
4921d91O80K56n05k05L43K97m34l36L07N80n33l38M73L84p33j08P10l21m21K80
$$ -491 189 445 -60 -265 78 375 -59 -395 -88 492 -41 -379 94 478 -255 -363 347 26 -395 -115
4941a15M79l46l73M77J66m28j03L11Q8j38k14K86j15k18K19J03M6k49P1K97k28
$$ -115 364 18 -355 122 288 -140 -243 68 156 18 -196 90 -25 -243 -24 79 125 -124 -53 244 16
4962A6j10P4K70k41l90M30L66n72j69N21J88p15o8M42O4n36K03M92j98n55L98
$$ 16 -94 -20 250 9 -381 49 415 -157 -326 195 383 -332 -400 42 106 -430 -227 265 67 -488 -90
4983i0M67k02n51K99J98O1l98J96M58l59k91K26L67n29j31N25J42n99j06M24M3
$$ -90 377 175 -376 -77 121 182 -216 -20 438 79 -212 14 381 -148 -279 246 388 -211 -317 107 150
5004A50m99M25L43l28l45O0O02l44l93J95O30n35l75M33L67n35k61N80M15p14
$$ 150 -349 76 419 91 -254 -194 408 64 -329 -134 496 -39 -414 19 386 -149 -410 170 585 -129
5024a29m03R22k2p54J02O89j07o59J11N02m7k19P7J16j50k30j24N87k81k47K96
$$ -129 -532 390 368 -386 -284 405 298 -361 -250 252 205 -14 63 179 29 -201 -325 262 -19 -266 30
5045C0J95k21k15L04J19l75K1M07j43m18L02M32m52l32M05K12l11k14L13N7j52
$$ 30 225 4 -211 93 212 -163 -142 265 122 -296 6 438 -14 -346 59 271 -40 -254 59 116 -36
5066c6k63L89J04m04J5J18K54l46n1M36R6n44kN24J43p53K30M79l40k25L44J54
$$ -36 -299 90 194 -210 -195 -77 177 -169 -220 216 312 -232 -234 290 433 -320 -90 389 49 -176 168 322
5088C22o90R5O08j65l12O0M15p9n38J24M84k05k63r4M39l8m14M8P05l77p90N94
$$ 322 -368 -273 335 170 -142 -82 333 254 -284 -160 324 119 -144 -238 201 163 -251 -203 502 125 -665 -71
5110g1L68k19n48O60J58l66k65M35j1l05m0M11l4l59J58P3Nl36L58K55l20j92
$$ -71 297 78 -470 190 348 -18 -283 152 141 -164 -204 207 173 -186 -28 45 50 -286 72 327 7 -185
5132a85j0M08j37l87L72K66n70l29N93L43o36l1P36o8o82R2M90j01m18J07N52
$$ -185 -195 213 76 -311 61 327 -243 -572 21 364 -272 -303 433 365 -317 -225 265 164 -254 -147 405
5153D05k50m34J35L47J09l00l00O25l78k49J16K52j32j04K87K07o21o1N46n6l46
$$ 405 155 -279 -144 203 312 12 -288 337 -41 -290 -174 78 -54 -158 129 336 -285 -346 200 144 -202
5174b02L57L3k31m06N08J54k06j66K97J00m77q2J76K70Jj87J57J01n59j03P23
$$ -202 155 188 -43 -449 59 213 7 -159 138 238 -239 -321 -145 125 126 -61 96 197 -362 -465 258
5195B58L10p44q6N55k07m89K81M54k51k44L28o9l16j9K57J29l24J07J73N5k77
$$ 258 568 -176 -262 293 86 -403 -122 332 81 -163 165 96 -220 -239 18 147 -177 -70 103 158 -119
5216a19j18N64k7l67o9O26o29k07K78N38l65l79K73K39m41k27M12L45l19l79M06
$$ -119 -237 327 300 -67 -136 490 -139 -346 -68 470 105 -274 -1 238 -203 -430 -18 327 8 -371 35
5237C5R4j73j50M76J92o58M5K45J16l85P3M44j67k53R5K30n48J95L88M5m33j00
$$ 35 129 -44 -194 282 474 -184 -139 106 222 -163 -90 354 187 -66 29 259 -289 -94 294 339 -94 -194
5259a94M28j30l95R9N25k66l49n3O00j47k34J50K33Jm74J43K22j19l68M78L07
$$ -194 234 104 -291 -192 333 67 -282 -335 265 118 -116 34 267 268 -206 -63 159 40 -328 150 457
5280D57o22k56M62kl43J90N08j64m42o7M53j19k01J52J70j50k43J49K60k35k53
$$ 457 -165 -421 41 39 -304 -114 394 230 -212 -279 174 55 -146 6 176 26 -217 -68 192 -43 -296
5301b96N51o2k42j72J65L49k83l26O18j76m17k38P04L8l76K52K52j97k21R4J2
$$ -296 255 193 -49 -221 -56 293 10 -316 302 126 -291 -529 175 213 -163 89 341 144 -77 17 29
5322B9o2J04J12j63j86P0J92n3lq4J56j36r5l5K48J13n88L72L98m86l64M38L85
$$ 29 -33 71 183 20 -166 -96 96 43 40 -44 112 -24 -119 -154 94 207 -381 -9 389 -97 -461 -23 362
5345C62m66p4K30L18n32k8K62K9m75L07K40j39j96l1L16j3k40j18N55j50n38J90
$$ 362 -104 -178 52 370 -162 -190 72 101 -374 -67 173 34 -162 -193 123 110 -130 -248 307 157 -381 -191
5367a91M81l44l13M36L85o08l04O64J15n14k7M12k1l95KN60p5n22K04L39O6m79
$$ -191 290 -54 -367 69 454 -154 -458 206 321 -193 -220 192 171 -224 -222 338 263 -259 -55 284 350 -129
5389a29j05L66n2k84Q0L65j56n57M39K57j40l53M70k3m20K8K97Kj76K2L29k33
$$ -129 -234 132 80 -204 -124 241 85 -472 -33 224 84 -269 201 178 -242 -214 83 85 -91 -69 260 27
5411B7k12K63Q9j0j59J27j36N4l11K47J99k28j44L37J0l97Q1M37j82l81L5N64
$$ 27 -185 78 167 157 -2 125 -11 43 -268 -21 178 -50 -194 143 153 -244 -163 274 92 -289 -254 310
5433C10k52m00L20L68m61k99M75J29l06j44K73L21m68p3L59j1l26M2K99jl82L0
$$ 310 58 -342 -22 346 -115 -414 61 190 -116 -260 13 334 -134 -207 152 141 -185 -143 156 155 -227 -197
5455a97K93l0m25L33K77k65k30L47J44l62j96N15p2m06K1L59J8l29j25M83K05
$$ -197 96 66 -359 -26 251 -14 -244 103 247 -115 -311 204 132 -274 -253 106 124 -205 -330 153 358
5476C58m37k96O71J10m90o7M95k84k77K6K95n0m67L79L13l44RJ96j20q3j50J73
$$ 358 -79 -375 296 406 -84 -151 344 60 -217 -191 104 54 -413 -34 279 -65 -56 140 20 -63 -213 -40
5498d0J99k61L3pQ0j96K42M3M9m37K69K29k99k14L62K36l62n9N0J95m37N9M47
$$ -40 159 -102 -69 -76 4 -192 50 93 142 -295 -26 203 -96 -310 52 288 -74 -133 -83 112 -325 -266 181
5521A81j07j57l3L05r1m21J54L31L2k41k2J16m1j52N7J72j07j18K64K6k68%M42
$$ 181 74 -83 -116 189 98 -323 -169 162 194 -47 -69 47 6 -146 -89 83 -24 -142 122 148 -120 -120 322
5544C22k62k91J96K93j95n01N27O8l0m98L03L78m06p9J52K18j30k81K21N1k8j83
$$ 322 60 -231 -35 258 63 -438 89 157 127 -371 -68 310 -96 -175 -23 195 65 -216 5 56 28 -155
5566a55P7M56m98j15N43j7l70n6L50k09o4K36r3j45j99M19j16j33n1L17q9j16
$$ -155 -78 378 -120 -235 308 291 -79 -135 215 6 -58 178 85 -60 -259 160 44 -89 -140 177 88 -28
5588b8k0J45K28l89k30M17j8j60q4N66j68n32J38L39k12l85L84L21j62k94J51
$$ -28 -48 97 325 -64 -294 123 105 -55 -139 427 259 -273 -135 204 -8 -393 -9 312 150 -144 7
5609GJ36j25k60L52j05j10R6J24n3k13Q8L7J69j99l9L09j71j73N3M53l56l68N47
$$ 7 143 18 -242 110 5 -105 -9 115 62 -151 -63 -26 143 -56 -95 214 43 -130 -77 376 20 -348 199
5632A99O0l55k82M72J76m07L6M55k09m05Q2K66J01k94R7J14R7m97J23N06k83k00
$$ 199 259 -96 -378 94 270 -137 -101 354 145 -260 -178 88 189 -105 -8 106 203 -294 -171 335 52 -148
5654a48pL61l51k34L17K66m06K05J25j69k31J66L28j97k03L34J94n06N4J19K45
$$ -148 -155 206 -145 -379 -62 204 -202 3 128 -41 -272 -106 222 25 -178 156 350 -156 -102 17 262
5675B62k39j35J48J56k87q4L34J58m28m0K10K1l10p8O08j9o36L94J0K70o54L46
$$ 262 23 -112 36 192 -95 -179 155 313 -115 -155 55 76 -234 -312 296 277 -359 35 45 315 -339 7
5697GL13j84k39l7J80m4j10J87K05l42P0PK30m72K04L40m1m67J4K34R5m53K23
$$ 7 320 136 -103 -140 40 -4 -114 73 278 -64 6 13 243 -229 -25 315 274 -193 -179 55 150 -303 -80
5720h0N19m36l05J66L37k01r2L18l3j42j73R9K28k92M2R2J14k84j31M11K5k73
$$ -80 439 3 -302 -136 201 0 -92 226 193 51 -122 -23 205 -87 -45 47 161 -123 -254 157 182 -91
5742i1m5M00k68k17L37Q0k22p5K05J68n70l2M08K0j06jQ2j42j51M5L23j6j2k15
$$ -91 -136 264 -4 -221 116 196 -26 -101 104 272 -298 -330 78 98 -8 -9 73 -69 -220 -175 148 132 120 -95
5766i5L07k3n79L65K46l05n3J01L16m80j85M58J40l08p4K95K3k70L1K27j07k07
$$ -95 212 189 -390 -25 221 -84 -137 -36 280 -200 -385 73 213 -95 -169 126 149 -121 -90 137 30 -177
5788a77J01K99k84k64L56J02p8j91J03L66m73j51M09K08l21j47K92O0o35J08Q28
$$ -177 -76 223 -61 -325 31 133 55 -136 -33 333 -140 -291 118 326 5 -142 150 210 -425 -317 511
5809E11l52l61J94J84l12j53K60J90k33l7j31M30j90k73J98K71l0m68L25K53n65
$$ 511 159 -202 -8 176 -136 -289 -29 161 -72 -109 -240 190 0 -273 -75 196 166 -302 23 276 -289
5830b89m6N25M8n81R0M69o4m64K60N11m32k31L94lk80j06L35J73l50j85K42J95
$$ -289 -335 190 238 -343 -253 216 152 -312 -52 459 27 -204 190 187 -93 -199 136 309 -41 -226 16 211
5852B11l78N0L61mk54k50N43r0m70K26K48j05k38J31J64k08o0K43N0n12K10J63
$$ 211 -167 -117 244 240 -14 -264 279 189 -281 -55 193 88 -150 -19 145 -63 -123 120 170 -342 -132 31
5874C1K6j99j9K41J40m04q3K24J69m26K75K14j39k59L66J07l80m3L35K61n01j01
$$ 31 57 -142 -161 80 220 -184 -267 -43 126 -300 -25 189 50 -209 157 264 -116 -159 176 437 -64 -165
5896a65L61j73k20K46J81j63l21J26J38O7j87J15J50l6l62R8M36k59j39J04K70
$$ -165 196 23 -197 49 230 67 -254 -128 10 77 -110 5 155 119 -243 -145 291 32 -107 -3 267
5917B67m02j62M22J04m52Q3L42L2n28J24L99j54k17J77R6n3m01L30K59q4m46L28
$$ 267 -135 -297 125 229 -223 -140 202 234 -294 -170 229 75 -142 35 131 78 -323 7 266 182 -264 64
5939F4K50l76m40M47M47n96o9N22k5m62j4L20K5n27M25K31k58j38J42J99k85j19
$$ 64 314 -62 -502 -55 392 -204 -273 249 224 -238 -252 68 93 -434 -9 222 -36 -174 -32 167 -118 -237
5961b37K52M7J1l46M09K41o19p6N66Q2n53qN44j11n87M00K94j92m46K62M12l84
$$ -237 15 62 73 -273 136 377 -242 -318 248 330 -223 -231 313 202 -385 15 309 117 -329 -67 345 -39
5983c9j44J13J41j58j31M87j19l10Q0L12N2m15l1M25k8m37mM34j07m93N08K32
$$ -39 -183 -70 71 -87 -218 269 150 -160 -80 232 284 -131 -162 263 235 -202 -206 228 121 -372 136 368
6005C68m16l41M87K51o39R2L62j9m08P9M38q8m36K6M15P5m37qM32K0n82K56L92
$$ 368 -48 -389 98 349 -290 -198 164 145 -263 -184 254 166 -270 -244 171 246 -191 -199 233 253 -329 -73 319
6028C19k65k99J45N58p12pK68K02m23J38M65l24k63O4L22k33j17J39K91k73k57
$$ 319 54 -245 -100 458 -254 -261 7 209 -214 -76 389 65 -198 -134 188 -45 -162 -23 268 -5 -262
6049b62J13L71l84j30K00O09m91n02N87K00m57j61O23J16p36R3O52k26n13K93
$$ -262 -149 222 -162 -292 -92 517 26 -476 111 311 -146 -307 316 432 -304 -211 441 215 -298 -5
6069eK03q1n20N18k8R3l68K86J60l60m9L77r1j76r0L96k38l48n5O19j21l26K12
$$ -5 198 117 -403 115 87 180 -188 98 258 -102 -151 226 135 -41 -131 265 27 -321 -376 243 122 -204 8
6092HK37j99m95N02L57l67l46L58O9j21k55L97Q4l96q1L92J00n48J74L83k36j76
$$ 8 245 46 -449 53 410 43 -303 55 124 3 -252 145 229 -167 -248 144 244 -304 -130 253 17 -159
6114a59O1N80k93m57K08M25m38k41M94P6m45KK85K10n72O3M21N8m80j47N34j9
$$ -159 -98 482 189 -268 -60 365 -73 -314 180 256 -189 -187 98 308 -264 -201 220 278 -202 -349 185 166
6136A66m86K92K55j2m86J3N03k9m63J28N18m87k89L32L66m80l7L96j7m19K40J84
$$ 166 -320 -28 227 215 -271 -258 245 216 -247 -119 399 -88 -377 -45 321 -159 -196 200 183 -236 4 188
6158A88N3m83L10J53j25k59J32N38n03k72L02M58m19m95M06L02m08j63M69J00
$$ 188 241 -242 68 221 96 -163 -31 507 4 -268 34 492 73 -422 -16 286 -122 -285 184 284
6178B84o06J16M70r6l51K0M62m10N4j57N64l68l8N1K21j60l17K98K23k08k43K97
$$ 284 -322 -206 264 168 -183 -163 299 -111 -57 -214 350 -18 -56 -5 216 56 -261 37 260 52 -191 106
6200A06Ql03M9M29j82l25K49J77k18m74K78N69l48m93M77L97o62j20L89K51m36
$$ 106 114 -189 -140 289 107 -218 31 208 -10 -484 -206 363 15 -478 -1 396 -266 -386 3 254 -182
6221a82K2K32J18m13J14L52J59m58j97M26j5l73Q1M08r3m75K99J45l02j37L69
$$ -182 -160 72 190 -223 -109 243 402 -56 -253 173 158 -215 -134 274 181 -294 5 150 -152 -289 80
6242H0l1l04J49K48M8n27K62L98j67m53L36M26l38m64J11O64k81n01J89O28m58
$$ 80 49 -255 -106 142 190 -337 -75 323 156 -297 39 465 127 -337 -226 438 157 -344 -155 473 15
6263A5l70N41K59m71l06L84J09m06RM43j55l50M08P7k04j54J45L54k65l02K53
$$ 15 -355 186 445 -26 -332 52 161 -245 -236 207 52 -298 110 187 -17 -171 -26 328 63 -239 14
6284A4J16l24J48Q4K73m23k05L74J43o08J58M79q7m29K41M83m78l22M26K27k74
$$ 14 130 -194 -46 38 311 -112 -317 57 200 -408 -250 229 142 -287 -46 437 -41 -363 63 290 16
6305A6l43M38R9k63j13L06J85n56j37L50L20m46j39O53k00m06PM88p7m85L97J81
$$ 16 -327 111 210 -53 -166 140 325 -231 -368 -18 302 -144 -283 370 170 -236 -229 259 182 -303 94 275
6327B75l01m42N42J83k14k72L87m9k33m9L34l7l83K32K11M2m06L7M90k1o41L75
$$ 275 -26 -468 74 257 43 -229 158 109 -124 -173 161 124 -259 -27 184 226 -180 -143 347 326 -315 60
6349F0K40k32m44J66L86l11m7J88J15k49r9M38q9k62P1L07q6k43j53M23o9k56
$$ 60 300 68 -376 -210 176 -135 -182 6 121 -128 -227 211 122 -140 -69 238 152 -91 -244 179 110 -146
6371a46J40J68l18o3M24K14n05k9L02m1m87J7O30j65k62L1N32j96o53K17L57j77
$$ -146 -6 162 -156 -219 205 419 -86 -115 187 146 -341 -324 306 141 -121 -90 442 246 -407 -190 167 -10
6393a0l59L59K20j92n26L89M49l34k41K79L20m69j99M10P9l36N0K86K6l51J02
$$ -10 -369 -10 210 18 -508 -119 330 -4 -245 34 354 -115 -314 96 175 -161 -111 175 201 -150 -48
6414d8L24k45k77O10j33j48l42M50P6l54L6pJ58j40j83K31K52l72j47M38p0m96
$$ -48 276 31 -246 364 231 83 -259 191 267 -87 -51 -58 100 -40 -223 8 260 -112 -259 179 109 -387
6436c87N7O36k14l29K00L28m12m0R5K91l25m4J63K2j23j73K25K29n5k43J53J51
$$ -387 -330 306 92 -237 -37 291 -121 -161 -66 225 -100 -144 19 41 -82 -255 -30 199 144 -99 54 205
6458B05l71k9K13K23n52L56K25n1n40M27K23k28l46K75J26l20K40j7N5l03J50
$$ 205 -166 -195 18 241 -311 45 270 219 -321 106 329 101 -245 30 156 -164 76 59 114 -189 -39
6479c9L10k20k95m2N26j40k29N0J43j24k41L89K96m37k77L09K84l06k51N82r5
$$ -39 271 51 -244 -286 240 100 -129 -79 64 -60 -301 88 384 -53 -330 -21 263 -43 -294 288 193
6500A93n11L7M59j34k29Q2L30k30k14JN47k28l95L32M06k88l35J49J86k63k79
$$ 193 -318 -281 178 44 -185 -103 227 -3 -217 -216 331 103 -292 40 446 158 -177 -28 158 -105 -384
6521c84M69J69n37%L55Q8m02j8M62j65m92N62L9j69l6K4K65j07l49L14J04k28
$$ -384 85 254 -283 -283 72 160 -242 -260 202 37 -455 107 146 -23 -59 -35 230 123 -226 88 192 -36
6543c6j14K65J59o10K74L03m2l68j36N43q3m46J42O43m04m22L98P6K1l68M43j41
$$ -36 -150 115 274 -336 -62 241 199 -169 -305 238 155 -291 -149 494 90 -332 66 142 163 -205 238 97
6565I7k40j91N50n6l46J84K45j87k32K23J70p5m66K78M05k67l81L42J52j64k88
$$ 97 -143 -334 216 160 -186 -2 243 56 -176 47 217 142 -324 -46 359 92 -289 53 205 41 -247
6586b47J37L81l21k72M30qj70n5L64j17l54J20L40n3l43m3N46k52k30L4M03m7
$$ -247 -110 271 -50 -322 108 100 -70 -125 239 122 -232 -112 228 175 -168 -211 335 83 -147 -113 290 243
6608B43m43J63L58l79j17N42o4l57l0K37j49l49L11L01l29k27J54L91k99l82L61
$$ 243 -200 -37 321 -58 -175 367 303 -54 -84 153 4 -345 -34 267 -62 -289 -135 256 -43 -425 -64
6629f4O11o84k65K49L20j59l68M53K07k96l24N15k9l05M5L31j91j92K41Q7p2k68
$$ -64 547 -137 -402 -153 167 8 -360 93 300 4 -320 195 166 -139 -94 237 46 -146 95 182 110 -158
6651a58N6K58l0l55K39O0k19QK15J27l43m2K75P9m61N4N06p3n04J16M77j94k65
$$ -158 -102 156 126 -229 10 70 -149 -141 74 201 -142 -184 91 170 -291 -237 269 196 -308 -192 285 91 -174
6674a74K6M63k35m16L32J12n8j35n9L95p4l42O8K13k48J49qR0j71n6L54l2k76
$$ -174 -148 315 80 -336 -4 108 50 -85 -144 251 177 -165 -97 116 -132 17 9 99 -72 -128 226 194 -82
6697h2K03O2j82j69M53o0n83K42M21q9m09P8K40n0j70J30J68m8j89j93M26ll99
$$ -82 121 183 1 -168 285 225 -358 -116 305 216 -193 -115 125 75 -95 35 203 155 -34 -227 199 196 -203
6720b03J95M51k56l45J26K79k68j99L48j4k30%K11j35q7j3K37J4k27J45L5r8q2
$$ -203 -8 443 187 -158 -32 247 -21 -220 128 114 -116 -116 95 -40 -127 -140 97 111 -116 29 64 -34 -116
6743a16L09J4l22k12J08L80l40k08O35O8n05j66O91j33n28J35M19j3m68K12K22
$$ -116 193 207 -115 -327 -219 161 -179 -387 248 316 -189 -355 336 203 -325 -190 229 216 -252 -40 182
6764A82j34k04N4K34m8l47L41J54j55k58K33J45j79j37K73K09l98l10M74r5k99
$$ 182 48 -156 -102 132 84 -263 78 232 77 -181 52 197 18 -119 154 363 -35 -345 129 34 -265
6785b65M1L38O4k91P2M04m26k15L74J04k82nK29k5k37J6J15J09j44j43L11j14
$$ -265 -224 114 178 -113 -41 363 -63 -278 96 200 -82 -87 142 117 -120 -104 11 120 -24 -167 144 30
6807C0j88J4K67K44n61J36K23j45l22K67K86k56p6J09L4k64J57K37j07j94LL05
$$ 30 -158 -144 123 367 -194 -58 165 20 -302 -35 251 -5 -81 28 62 -202 -45 192 85 -109 -106 199
6829A99k97j66K33L49j97l77N5L50k04k94L20K95p5n91N13R5k64l71M87M07n67
$$ 199 -98 -264 -31 318 121 -256 -201 149 -55 -349 -29 266 191 -400 113 208 -56 -427 60 467 -100
6850a00r2M30j94l59J80L42j79k26O0M21k65k90k8K46M5k47J36K60j17j04L92
$$ -100 -192 238 44 -315 -135 207 28 -198 -138 283 18 -272 -300 -54 -9 -256 -120 140 23 -81 311
6871C11j69l48N8K45p4j15p3L27j7m49J78K24j44p4J37K72j93n81M97K85m25j1
$$ 311 142 -206 -148 97 23 -92 -165 162 145 -304 -126 98 -46 -120 17 289 96 -485 12 297 -128 -139
6893a39K31K80n64r4N01J0m53m3N53j04l71J20J62L3j27N2J34l36l4J23L29l19
$$ -139 92 372 -192 -286 215 225 -228 -271 282 178 -193 -73 89 122 -5 47 181 -155 -189 -66 263 -56
6915e6o3K40l3k77j43N05j2l11p1N93l20m67J08N68j82m61M38K47k09m29M99n8
$$ -56 -119 121 88 -189 -332 173 161 -150 -221 372 52 -415 -307 261 79 -382 56 303 94 -335 164 106
6937A06k06k61M67J55l05R6mQ7k16j63M42p4l42R7L47j46l28L5N38l87k10L25
$$ 106 -100 -361 106 261 -44 52 48 135 -81 -244 198 124 -218 -121 226 80 -248 -213 325 -62 -272 53
6959E3K68m43j35O22j5n81n0N67n5k89j74N31j31l72j71O13j24k57J79J21j31
$$ 53 321 -122 -257 365 350 -231 -281 286 231 -58 -232 299 168 -204 -375 238 114 -143 36 157 26
6980B6l86M01K84l55k32K75K65k99k50M57j21l88J03L90j99j07J42J12k6j95K7
$$ 26 -360 41 325 -30 -262 13 278 -21 -271 186 65 -323 -220 170 -29 -136 6 118 92 -103 -76
7001g6K25j01l65J45N12j25l90K30J91m12k80P36j84l6k92K85j28k12R7L37n8
$$ -76 149 48 -317 -172 340 215 -175 55 246 -166 -446 290 106 70 -222 63 -65 -277 -180 157 99
7022I9k41K13N8k05l3K19Nl03J86K26J3m21qK93N5n68J05N73k18k96L32K62k74
$$ 99 -142 71 129 -76 -109 110 115 -188 -2 224 237 -184 -192 101 156 -412 -307 266 48 -248 84 346 72
7045G2k34K33P9j27k12L22L1k72p5K30l6o1j00K73R5k61O4J75k07k43L14M1L5
$$ 72 -162 71 150 23 -189 133 164 -108 -183 47 11 -50 -150 123 218 -43 21 196 -11 -254 60 101 136
7068A36m87K57L69l96M5M49m7o56L4N28j1m81M1N00j73j70j33K68N5l18J03K23
$$ 136 -351 -94 275 -121 -76 373 326 -330 -296 232 221 -260 -219 281 108 -62 -195 73 128 -190 -87 136
7090A36N2m21J81K23o5l84K51J52k63j54K51N0j88r4M79j32k17J68J02j33j38
$$ 136 188 -233 -52 171 106 -278 -27 125 -138 -292 -41 9 -179 -273 206 74 -143 25 127 -6 -144
7111a44J25K90k90q6lL05j17m81L64M47n26l52O25K02n23o5L96J40m42NK74o9
$$ -144 -19 271 -19 -105 -108 197 80 -401 -37 410 -116 -468 157 359 -164 -229 167 307 -135 -130 144 75
7133G5k51PM16j68j79J11J23j63j28O5J46K6j49J28Pj84J11J05R2k95J2L11r9
$$ 75 -176 -169 247 79 -100 11 134 -29 -157 -92 54 80 -69 59 66 -118 -7 98 190 -105 -93 218 119
7156A19l23L5K60j41j97K25L47m72j89L44M5k53p4L82N2l00N2O1K28l28J86P0
$$ 119 -204 -169 91 -50 -247 -22 325 -147 -336 8 53 -200 -274 108 160 -140 -88 -27 201 -127 59 129
7178A29j34q1L3J47J20n25K54M11l39l49K47M62o31J47K64R9k98k19O78l03l49
$$ 129 -5 -86 -53 94 214 -311 -57 354 15 -334 -87 375 -256 -109 155 254 -44 -263 415 112 -237
7199b37L21J41l16j23J68J89L2l90J48L08m11l5J34M53l76l82K55M14k75j87K73
$$ -237 84 225 -91 -214 -46 143 175 -215 -67 241 -170 -205 -71 382 6 -376 -121 293 18 -169 104
7220A04J47m63J61J38N5l40K6M28k97k42K89j3rk56K77J66k68q3K75R3l46P5K91
$$ 104 251 -212 -51 87 142 -198 -172 256 -41 -283 6 -7 -16 -272 5 171 -97 -180 95 188 -158 -83 208
7243B08O7l41j34M31r9m09J26N67k12n07R5L71j91k21K86K82k82j13j6L94l91
$$ 208 275 -66 -200 231 132 -277 -151 416 204 -303 -208 163 -28 -249 37 319 37 -76 -92 302 -89
7264h9j34K50J58j57k46L19O3l74N5K24J26k30k5K73j52m00L99J68l63J9L30N4
$$ -89 -223 27 185 28 -218 101 164 -210 -155 69 195 -35 -60 213 61 -339 60 228 -135 -116 214 268
7286B68m18l8L67O3l96J1M42r0m29K27O0R5l88K37L9j11k07K20K37k60k26L88
$$ 268 -150 -188 179 242 -154 -143 299 209 -220 7 67 162 -226 11 50 -61 -268 -48 189 -71 -297 91
7308I1r7j25J02O6J39k22L7l0r1p0K94o7Q0k68P1K42j07l07L58P0o8l99L39K39
$$ 91 -6 -131 -29 37 176 -46 -9 -39 -130 -200 94 27 107 -161 -90 152 45 -262 96 166 98 -301 38 277
7332B77l54n5L16j97o3j53K64J59k53KK63j36j24K3J75q4l88N45k0k77j43K78
$$ 277 -77 -132 184 -13 -76 -229 35 194 -59 -57 206 70 -54 -31 144 60 -328 217 197 -80 -223 55
7354E5K70m32J02L73k19l57j05M42Q4m71J99K31j02j79Q3L32l99J52J07J41l95
$$ 55 325 -107 -5 368 149 -208 -313 129 213 -258 -59 172 70 -109 -26 306 -93 59 166 307 -88
7375h8N4j4J36r2j70K02J45l81q4N58K3k81j43J97P1l19lL32m3j92P2J7nj8J33
$$ -88 -34 -48 88 -4 -174 28 173 -208 -292 266 289 8 -135 62 133 -186 -189 143 100 -92 -20 -3 -8 -26 107
7400A07J06k85j36K17k1n6L7J96L9l21Q7k6K10l41N6L50j39k56J77K80m66p5L07
$$ 107 213 -72 -208 9 -12 -68 -31 165 204 -117 -30 -56 154 -187 -131 219 80 -176 1 281 -185 -260 47
7423D7R7l46P5J53l15R8J76J75k5k57P7R3M5l09L9K47O0m24K72J50l8k76J64L06
$$ 47 144 -202 -127 26 -289 -191 -15 160 135 -122 -45 48 93 -216 -177 70 130 -294 -22 128 90 -186 -22 284
7447B84k72k13K76M6l48M0L89j34j34p3J12J21k67R8L01l6k43J66k72K16j51M
$$ 284 12 -201 75 121 -227 -187 202 68 -66 -139 -27 94 -173 -75 226 190 -53 113 -159 57 -94 -90
7469i0K35j89j01P7J00J13k12QK17l85R7L31j40j52K84J10m39q4J63K81k15j94
$$ -90 145 -44 -145 -68 32 145 -67 -59 158 -227 -130 201 61 -91 193 303 -136 -220 -57 224 9 -185
7491a85L28J01j96l12M41J8k49j88L43L3j02j92N16k63k17l1J47R7k93K72J37
$$ -185 143 244 48 -264 177 195 -54 -242 101 134 32 -160 356 93 -124 -155 -8 89 -204 68 205
7512B05j97k15L42kj31j54J27k3mj73J69K06n0k90L39L4l48m9L36q0k55J37L22
$$ 205 8 -207 135 133 2 -152 -25 -48 -52 -225 -56 150 100 -190 149 183 -165 -214 122 42 -213 -76 246
7535B46k70k71L20J13p0j53N6O9l2j49K52Q7k17p9N4j7J55l32L32m1j26p8K15
$$ 246 -24 -295 25 138 68 -85 -29 40 8 -141 111 198 -19 -98 -44 -61 94 -238 94 53 -73 -151 64
7558F4j21j53K60K02m94Q0L70k9k34rJ91Q6n10J12K58o7k84K72K12j91k22J96
$$ 64 -57 -210 50 252 -242 -162 208 179 -55 -64 127 213 -297 -185 73 6 -278 -6 206 15 -207 -11
7580a1K38j70q6J4J45n3l60M11M8k67OK46j34j22k6J89L2j90J10J11r1k52K69
$$ -11 227 57 -29 -15 130 77 -283 128 176 -91 -85 161 27 -95 -121 68 100 -90 20 131 40 -212 57
7603E7J09l04j0N6K34j69k0%L41l43k40L46K65l94j20M19ll69j7L30j5m13K06
$$ 57 166 -138 -148 -92 142 -27 -47 -47 294 -49 -289 57 322 -72 -192 227 224 -145 -162 168 153 -260 -54
7626e4L93k17k10K58j26k4n7N0Q7O1k18M8M9l0N4j24K51l89J87K05k34kN0K49
$$ -54 339 122 -88 170 44 20 -37 13 100 161 -57 -9 40 10 64 -60 191 -198 -11 194 -40 -42 8 257
7650B57k36j60J52K45m00r2K48J10k39j29L77J93m20R8jJ65l01j16M91J04l61
$$ 257 21 -139 13 258 -142 -234 14 124 -115 -244 133 326 -94 4 3 168 -133 -249 242 346 -15
7671a5kK83k27l28K98P3j54j40K62J80k41j23K30N1l39J77R7p2l23K09K21N8k57
$$ -15 -17 266 39 -289 9 82 -72 -212 50 230 -11 -134 96 147 -192 -15 82 10 -313 -104 117 175 -82
7694h2R2J81j0k98J32K02l07k09M78n0m7l34M77k8l36k16N85j83l42L12J25j45
$$ -82 10 191 181 -117 15 217 -90 -299 179 129 82 -252 225 197 -139 -355 230 47 -295 17 142 -3
7716ck80K46O2r9R6M2Q4j74j22J55O0j94PJ52J0j12M1K88j55j20P6K35j70l68
$$ -3 -283 -37 25 -74 22 64 148 -26 -148 7 67 -127 -120 32 42 -70 -29 259 104 -16 60 295 125 -243
7740b43J93K85j83p9k6R9n2j26J18J55k8k63K89J06l65J33J69j41n3j20K12j6
$$ -243 -50 235 52 -27 -53 46 -6 -132 -14 141 113 -150 139 245 -120 13 182 41 -12 -132 80 64
7762F4k90K48O3q2k7J30J21l85O3n6K66k34j35L13l4l25K32J74J94j97j18J13
$$ 64 -226 22 85 3 -24 106 227 -158 -95 -151 115 -119 -254 59 25 -300 -68 106 300 103 -15 98
7784I8j19j12q0K54q9LK2N1r6N2Q0J00l23J68K27k35l95L17L46l9l52N8L47j82
$$ 98 -21 -133 -213 41 -48 -45 -23 28 -68 -16 64 164 -159 9 236 1 -394 -77 269 230 -122 -64 283 101
7808A01j76N4J45p6l08J93K07q5j37Q9K66r9k67J90N0l68J22K48P1k98n4K82j51
$$ 101 -75 -21 124 48 -260 -67 140 55 -82 7 273 174 -93 97 147 -221 -99 149 220 -78 -132 150 -1
7831aPj18L01j26l13L64o8j0j89J69J59m1m12K82O2j56j14L56l4k49RK96o9j88
$$ -1 6 -112 189 63 -250 114 46 36 -153 16 175 134 -278 4 66 -90 -204 152 118 -131 -122 174 105 -83
7855h3P5n0R3k39J49J49j60R4PKO1j53j01J68O0j81K11n2j48O5P0L8k86J30J75
$$ -83 -8 -58 35 -204 -55 94 -66 28 35 37 98 -55 -156 12 72 -109 102 50 -98 -33 37 75 -211 -81 94
7880I4k89J01K07Lj33j93K59J30l28J14J23p3p0L1J09r1j75R0K03m2j30j8K44
$$ 94 -195 -94 113 116 -17 -210 49 179 -149 -35 88 15 -55 -24 85 -6 -181 -91 112 70 -60 -78 166
7903A66j8m41J91O4M3k95K36M25l87j38K78j03m1J42N6j36j61J16M5j42O0J96
$$ 166 148 -293 -102 -38 5 -290 -54 371 -16 -154 124 21 -20 122 178 42 -119 -3 42 -100 -40 156
7925A56oj40j8J97o4k89P4K66L7l67J20K81L1m25J10L26k31j04L6Q9Q9j89j45
$$ 156 150 10 -8 189 125 -164 -90 176 213 -154 -34 247 278 -147 -37 289 58 -46 -10 79 168 -21 -166
7948a66J44P6j05LP8k3Lq6J47J14m01K27K53k40p4P7J10j74kJ81r1m6QK2n0q0
$$ -166 -22 54 -51 -48 30 7 10 -76 71 185 -216 11 264 24 -50 27 137 -37 -39 142 51 5 13 35 -15 -95
7974i5M5P8J0l25L47p4q1K3J26K3n1j13J56L4k22r1J59J48j55q2J33j20J18J21
$$ -95 -50 28 38 -287 60 -14 -95 -72 54 77 26 -87 69 103 -119 -210 -51 97 -58 -140 -7 -127 -9 112
7998A12m0k22K37j04j55J21o4J76o9O1l4J30j22j39K57mk57J24k8L0J29k93J16
$$ 112 72 -150 87 -17 -172 -51 -115 61 -8 53 19 149 27 -112 145 141 -116 8 -20 10 139 -154 -38
8021c8j12j05R2K45K26m27R3L0K82l33m3K01l6j33J08j4J47k23o3J16M2j93R1
$$ -38 -150 -255 -163 82 308 -119 -26 4 286 -47 -90 111 75 -58 50 36 183 -40 -103 13 55 -138 -47
8044d7J17j19j45K74R1j63q4K01%j86m3K86l8l92J95L10k58Q3n3N4L6k43J98l7
$$ -47 70 -49 -194 80 171 8 -76 125 125 -61 -104 182 144 -248 -53 257 -1 82 29 83 119 -124 74 37
8068C7q4j15K0K40o0k21J51J87O8m75K86J00k73j20L72J78m08J5L09j40K1m7O
$$ 37 -47 -162 -142 98 38 -183 -32 155 223 -252 34 134 -139 -259 113 291 -117 -102 207 67 88 41 47
8091D7O9r5J5qL8j11K35j61J93j89j03J15j0j81K15q2k4j20J22P2j54J26JL2k23
$$ 47 116 21 36 28 66 -45 190 29 222 33 -70 45 35 -146 69 -13 -37 -157 -35 37 -117 9 10 42 -181
8116a81K56j29Q8J10j50K12k43J22k8j81j2N4J56k0lOM4j57J34n2R7j98m1J52
$$ -181 75 -54 34 144 -6 206 -37 85 57 -124 -136 -82 74 54 51 57 101 -56 78 26 123 -75 -116 36
8140C6Q3j71P8n8J28k16j11K23OoK1K4J24j69m1m6J14qO3J38k75N0m9J97p0r7
$$ 36 119 -52 26 -32 96 -120 -231 -8 -2 -8 13 37 161 -8 -49 -95 19 11 74 212 -63 -13 -62 135 65 -32
8166c2j23L21r3j11k7J36j46p5K50j8j04n7J8O7n8J26K6K6k15l6K8L16k17k12
$$ -32 -155 166 73 -38 -65 71 -75 -150 100 82 -22 -79 -61 6 -52 74 100 126 -89 -125 -97 219 2 -210
8190b10M35
$$ -210 225
8191B25
$$ Imaginary data points
##PAGE= N=2
##DATA TABLE= (X++(I..I)), XYDATA
0@%%%%%%Qq%%Qj6J6k4L2m0M8n6P2q8J04j22J46j73K01k33K71l12L58m10M68n33
$$ 0 0 0 0 0 0 0 8 0 0 0 8 -8 8 -16 16 -24 24 -32 40 -48 56 -66 80 -93 108 -125 146 -166 192 -218 250 -283
32b83O04o82P68q66R72j084J210j351J503j667J844k042K259k493K750l029L335
$$ -283 321 -361 407 -459 513 -571 639 -712 791 -876 968 -1074 1185 -1308 1442 -1587 1748
49A748l674M047m460M918n429O005o656P401q261R264j0457J1906j3699J5981
$$ 1748 -1926 2121 -2339 2579 -2850 3155 -3501 3900 -4361 4903 -5554 6352 -7347 8634
63H634j9005K3203k9421L9545n8651J06281m25763o10223J368454J13699j029447
$$ 8634 -10371 12832 -16589 22956 -35695 70586 -355177 -965400 403054 516753 -512694
74e12694L51605P51751o23432m54136N03618K29804k65540j7680O7152k9771j995
$$ -512694 -161089 590662 -32770 -486906 16712 246516 -19024 -36704 30448 677 -1318
85a318l1904p5121J08831J48001p6404j43215P4743P853j92715J44694L66856
$$ -1318 -33222 -108343 488 148489 72085 -71130 3613 11466 -181249 -36555 330301
96C30301k77047m26873L76336L21210m42455q4572M37811j79831l61290L89163
$$ 330301 53254 -373619 2717 323927 -118528 -203100 234711 54880 -306410 82753
106H2753K58754m58742j84695L67008J32334k04887j03143R6922J17489o3662
$$ 82753 341507 -117235 -301930 65078 197412 -7475 -110618 -13696 103793 40131
116D0131j45102P8534J26040j40746o2773K53615J7148l63816l1152L66527K4017
$$ 40131 -104971 -26437 99603 -41143 -103916 149699 166847 -196969 -228121 138406 162423
127A62423k62835Q8342J64538k54114j32785L48102J05721l23274j1158K52553
$$ 162423 -100412 -12070 152468 -101646 -234431 113671 219392 -103882 -115040 137513
137A37513j01782j97511J29634J35193o6241m7274J1213J7075L038j10259k6359
$$ 137513 35731 -161780 -32146 103047 36806 -10468 745 17820 20858 -89401 -115760
148a15760K71366P0819l85898p6985L95967j8065l51411J76506K96556l10016
$$ -115760 155606 226425 -159473 -236458 159509 141444 -209967 -33461 263095 -46921
158d6921k23011L80786J20485l99731k8249L59763l1762k57606P0332J31638j00717
$$ -46921 -269932 110854 231339 -168392 -196641 163122 131360 -126246 -55914 75724 -24993
169b4993l5081J12339P51q1711j1351L2107N7815P275j31581k7600J95737J6274
$$ -24993 -60074 52265 53016 -28695 -40046 -7939 49876 57151 -74430 -102030 93707 109981
181A09981k10015M9960J75367j70331j29437K87873Q8544l36382l2634L04203
$$ 109981 -100034 -50074 125293 -45038 -174475 113398 201942 -134440 -167074 137129
191A37129n0886k43699J23476J83501j50784j19634J45086O0028j36073l2473
$$ 137129 86243 -157456 -33980 149521 -1263 -120897 24189 84217 -51856 -84329
201h4329J27886N7710r3126r5977M0507R8441k1368p1541O3451N5063j31899n1560
$$ -84329 43557 101267 8141 -87836 -47329 51112 29744 -41797 21654 76717 -55182 -106742
213a06742J85179L3469k06405J1022K01210o3737j73750R8190J15753j22770n3436
$$ -106742 78437 111906 -94499 -83477 117733 53996 -119754 -21564 94189 -28581 -82017
224h2017J43256J9570j46820k0152J28258L7537j01210n0652Q7621N1436r2493
$$ -82017 61239 80809 -66011 -86163 42095 79632 -21578 -72230 15391 66827 -25666
235b5666l9831J10603J6487j37874J6321J70108m4074j86098O7929J69624r6132
$$ -25666 -65497 45106 61593 -76281 -59960 110148 66074 -120024 -52095 117529 21397
246B1397j26774J26146P3756j49534k8161J48697p710j28877K8754J03328k5369
$$ 21397 -105377 20769 94525 -55009 -83170 65527 57817 -71060 -42306 61022 35653
257C5653p8993K744N7953J5621m9967j3136O6703o313j02963L0804J38481n2874
$$ 35653 -43340 -40596 17357 32978 -16989 -30125 36578 30265 -72698 -41894 96587 43713
269D3713j45901Q4537J26116j19558q8359J46163M0599j57200P114J51434m6587
$$ 43713 -102188 -17651 108465 -11093 -99452 46711 87310 -69890 -62776 88658 42071
280D2071j35018O5061J10271o0650q1766M4946N6962l3295m8715K9431N5385l6972
$$ 42071 -92947 -27886 82385 21735 -60031 -15085 41877 8582 -40133 -10702 44683 7711
292G711p3686N0680R5256o6935j03895Q9364R6740j11683p1587J32858L3819j46624
$$ 7711 -65975 -15295 79961 13026 -90869 -1505 95235 -16448 -88035 44823 78642 -67982
304f7982R397J46771m8762j31405P5437J01833q1547o6804P2619L6023n7903k1152
$$ -67982 -58585 88186 39424 -91981 -16544 85289 3742 -63062 9557 45580 -12323 -33475
316c3475M2479K1406l7640l6621M3156N5067n7091o4223P6262N8320r4590l6010
$$ -33475 9004 30410 -7230 -43851 -695 54372 -2719 -66942 9320 67640 -26950 -62960
328f2960J10787M275j19286L0983J17687o2043j04041Q4124Q0301r1552m9338
$$ -62960 47827 52102 -67184 -36201 81486 19443 -84598 -474 79827 -11725 -61063
339f1063Q8405K1004p6944l073O1629j954n1657q827M7775K4402n4979l6054P0324
$$ -61063 27342 48346 -28598 -31671 29958 28004 -23653 -32480 15295 39697 -15282 -51336 18988
352A8988L5704q8371k0415J03858o567j10386L9112J04028p0514q5227R0811N9546
$$ 18988 54692 -33679 -54094 49764 43197 -67189 -28077 75951 5437 -79790 11021 70567
364G0567r4113k7552Q5977J94o9563J7129N1480k0688l7143J2909L1082j004l7655
$$ 70567 -23546 -51098 34879 35073 -34490 -17361 34119 13431 -23712 -10803 20279 19275 -18380
377a8380r799M9463J0061o3675L712P6358k7390q4983N2998Q1053p7839o6118
$$ -18380 -28179 21284 31345 -32330 -28618 47740 20350 -64633 -11635 69418 -8421 -74539
389g4539R7537M4843j06951k1438J03497j150q7653K4063P1497l4035n7736K8468
$$ -74539 22998 67841 -39110 -60548 42949 41799 -45854 -21791 49706 15671 -42065 -13597
401a3597M4539j3740l5936K462L5556J608m6039Q01N8431j0561o3527K9378N8727
$$ -13597 30942 17202 -18734 -16272 19284 20892 -25147 -24346 34085 23524 -40003 -10625 48102
414D8102n6651n0402P5580L4999q3313r170Q2812j9928p7377M2442O7687m9754
$$ 48102 -8549 -58951 16629 51628 -31685 -40855 41957 22029 -55348 -12906 54781 5027
426E027n0176M9401L5582m5243l3507L6216M1709k4261m8682K3723N2570l9408
$$ 5027 -45149 4252 39834 -5409 -38916 -2700 39009 14748 -33934 -10211 42359 2951
438B951n8890O0094O2445p0779n3109P0746K9212p2728r873P1165J987n7003M793
$$ 2951 -55939 4155 66600 -4179 -57288 13458 42670 -30058 -39931 31234 33221 -23782 -18989
451a8989L6516j7294k4837K4421K4586j5710j9955K811P289k587k792J4128J6055
$$ -18989 17527 233 -24604 -183 24403 8693 -11262 -8451 -1162 -3749 -6541 7587 23642
464B3642k2078k8296K9816K4525m7485r850P0665l640q1802J7189P0625m0831
$$ 23642 1564 -26732 3084 27609 -19876 -29726 40939 37299 -44503 -27314 43311 2480
476B480n2971O3916M1505o6612l0904M8542J3172l1630l1K4479L304j6894j5438
$$ 2480 -50491 13425 54930 -11682 -42586 5956 19128 -12502 -12533 11946 15250 -1644 -17082
489a7082N394J9808l049j4804J9811J6564l6208k0997L7656J0136l3669J7918
$$ -17082 -11688 8120 5071 -9733 10078 26642 -9566 -30563 7093 17229 -16440 1478
501A478L9851m3371m6323N2503L3781o1686q046P8241o347q5783O344O9078j3449
$$ 1478 41329 -2042 -48365 4138 37919 -23767 -31813 46428 40081 -45702 -39358 29720 16271
514A6271m8265K6636M7242k5488n8806L440O2420J4694n6563p124O3271q871q0118
$$ 16271 -31994 -5358 41884 16396 -42410 -38970 23450 38144 -18419 -25543 37728 28857 -51261
527e1261J2137Q3649j0777o5593K3772M8954m2314m8287M3814M7414k8905k9110
$$ -51261 -39124 44525 33748 -31845 -8073 40881 -1433 -49720 -5906 41508 12603 -16507
539a6507K0012M910k5686L77K4828N379j0891m147L253l018j5020P07L0359O563
$$ -16507 3505 8415 -17271 -16894 7934 13313 2422 -1725 1528 -1490 -16510 -15803 14556 21119
553B1119l0526L659K5834l2009l0591N2916L4173n1825j7427M7585n919n1860
$$ 21119 -9407 -5748 20086 -11923 -42514 10402 44575 -7250 -24677 22908 16989 -34871
565c4871J2578N0113m462l1232M504J4050j8596k0780K1551L4674o170k9528l469
$$ -34871 -22293 27820 23358 -7874 -3370 10680 -7916 -28696 -7145 27529 21359 -8169 -11638
578a1638J0500r027n577K3979J7814k3078k0750J8191M775l0224Q426N1789n194
$$ -11638 -1138 -10165 -15742 8237 26051 2973 -17777 414 5189 -25035 -16609 35180 29986
591B9986n3808P317L8395k8787l0559N2477L7662n4800l9471M1868K6571l9220
$$ 29986 -23822 -16505 21890 -6897 -37456 15021 52683 -2117 -41588 280 26851 -12369
603a2369j6258M6295K1198m5414k8382L6874K1576m0274j2168N4927J4068o0833
$$ -12369 -28627 17668 38866 -6548 -34930 1944 23520 -16754 -28922 26005 40073 -20760
615b0760j8300N0179Q295m0086J0620M3124j6469m3742J1634L0971j4626j8707
$$ -20760 -39060 11119 19414 -20672 -10052 33072 16603 -27139 -15505 15466 840 -17867
627a7867K7519K3062l2044l0353K3328K0663k1501o88L6123o752n0062J149M3805
$$ -17867 9652 32714 670 -29683 -6355 14308 -7193 -7881 28242 21490 -28572 -27423 16382
640A6382n107l2320K2113L3028l1684l9806K5286L4128k1447j7236L2841J2094
$$ 16382 11275 -21045 1068 34096 2412 -37394 -12108 22020 573 -16663 16178 28272
652B8272m4921k0663L9822K3866k5775j2475K5679K909l6447o525M1871J1861
$$ 28272 -16649 -37312 2510 26376 601 -11874 13805 16714 -19733 -26258 15613 27474
664B7474l9130k887M0346j4499n0014K3841N0431k7445l5710L5285J8773m5956
$$ 27474 -11656 -14543 25803 11304 -38710 -14869 35562 8117 -27593 7692 26465 -19491
676a9491j1441M6541P840l7750n17L2367m081l5134N26L5629M752k9890J292L0461
$$ -19491 -30932 15609 23449 -14301 -14818 17549 13468 -21666 -21140 14489 19241 -10649 -9357 21104
690B1104j1041m0832J4722M8279j3529m4616K0294L7087l6223l4938M6240L1307
$$ 21104 10063 -30769 -16047 32232 18703 -25913 -5619 31468 -4755 -39693 6547 37854
702C7854m6086j6334M4472l455m7727J1966M5402q563l2542O099J8344j0924j6587
$$ 37854 -8232 -24566 19906 16451 -31276 -19310 26092 17529 -15013 -8914 9430 -1494 -18081
715a8081J4864K5683j1161l1060J0561K9213j9749k7108L3067K7527l9962k2418
$$ -18081 -3217 22466 11305 -19755 -9194 20019 270 -26838 6229 33756 -6206 -28624
727b8624M1676Q443m5856O519N1788j5169n0863J9912M0544k7279l0322L2577
$$ -28624 13052 21495 -24361 -17842 33946 18777 -32086 -12174 28370 1091 -29231 3346
739C346K3924l2100j8619K6983J4230k4254j4661K5873K1010k6906k6497L0070
$$ 3346 27270 -4830 -23449 3534 17764 -6490 -21151 4722 25732 -1174 -27671 2399
751B399K4926l8051j7253M9164Q783n6105K641N4864j6708m8475K9364M0573l5561
$$ 2399 27325 -10726 -27979 21185 29968 -26137 -23496 31368 14660 -33815 -4451 36122 561
764E61l1261L5104J8596l3456r316L2313N708l0136p201K6696Q345k5008p240
$$ 561 -30700 4404 23000 -10456 -19772 12541 18249 -11887 -19088 7608 15953 -9055 -16295
777a6295K8138N849l3676m653L8439N68m0827R360M3866k1739m4071L2325L9180
$$ -16295 11843 17692 -15984 -20637 17802 18370 -22457 -13097 30769 9030 -35041 -2716 36464
790C6464l9334k8510M4794J4868m8093l603M5778m484l8932Q499L1928j0073k7544
$$ 36464 -2870 -31380 13414 28282 -19811 -23414 22364 17880 -21052 -12553 19375 9302 -18242
803a8242Q282K6028o523k7256O502K9932r575l3196J6215L4658k4017l2157L2409
$$ -18242 -9960 16068 9545 -17711 -11209 18723 9148 -24048 -7833 26825 2808 -29349 3060
816C060K7343l8581j8905M2052Q973m2762J237M0664j0330l6202J6226L1473j9345
$$ 3060 30403 -8178 -27083 14969 23942 -18820 -17583 23081 12751 -23451 -7225 24248 4903
829D903k6265K0072K0871k1136j7875K2221J6606k3982j7011K5931J6064k9420
$$ 4903 -21362 -1290 19581 -1555 -19430 2791 19397 -4585 -21596 4335 20399 -9021
841i021j3301L4898R989l9571m655M1821k708m0985J1801L8985j9457l4966K3699
$$ -9021 -22322 12576 22565 -17006 -21661 20160 17452 -23533 -11732 27253 7796 -27170 -3471
854c471K9359k4812k2839K5235J7937k5458j5595K5654J3490k7216j1376K9230
$$ -3471 25888 1076 -21763 3472 21409 -4049 -19644 6010 19500 -7716 -19092 10138
866A0138P424l2089k467L4269l987l4662J0828L3513j7155l1112K3038K7592k8205
$$ 10138 17562 -14527 -16994 17275 13288 -21374 -10546 22967 5812 -25300 -2262 25330 -2875
879b875k2459L2389J7845l3938j3253L3889R290l2887n439L1343M196l1774l739
$$ -2875 -25334 7055 24900 -9038 -22291 11598 20888 -11999 -17438 13905 18101 -13673 -17412
892a7412L2097K473l3482P46L4681n344l5979J0863L4008j7459k8997K3436K3119
$$ -17412 14685 17158 -16324 -15578 19103 13759 -22220 -11357 22651 5192 -23805 -369 22750
905B2750k8336j6190K9308R215k8412j360K7832l806k6187O889K3311q844k0871
$$ 22750 -5586 -21776 7532 16747 -11665 -13025 14807 11001 -15186 -8297 15014 6170 -14701
918a4701J1664K1468j4018k3498J5319K4137j8459k3517K4372K2368l0973k0794
$$ -14701 -3037 18431 4413 -19085 -3766 20371 1912 -21605 2767 25135 -5838 -26632
930b6632L4296J5849l6383q130L7469J142l7215L341L2932o375k6556J0658K2395
$$ -26632 7664 23513 -12870 -21000 16469 17611 -19604 -16263 16669 10294 -16262 -5604 16791
943A6791j2943k0377J2555J8127j1500j4177J3478J3067j7687j4196K0781J3462
$$ 16791 3848 -16529 -3974 14153 2653 -11524 1954 15021 -2666 -16862 3919 17381
955A7381k3359q209K8444R63l5500M285L7863j0431l4627J9103K9507k7645k6565
$$ 17381 -5978 -14187 14257 15220 -20280 -15995 21868 11437 -23190 -4087 25420 -2225 -28790
968b8790L0140K2702k7210j5595K5242J0254k5215j1123K3731J4990j9738j4968
$$ -28790 1350 24052 -3158 -18753 6489 16743 -8472 -19595 4136 19126 -612 -15580
980a5580J9973J2243k5421j0883L0513J0125l0670l857K8464p218k8244J4926
$$ -15580 4393 16636 -8785 -19668 10845 20970 -9700 -13557 14907 7689 -20555 -5629
992e629K6147j7613j8217J9802P536k4542j776K5712K61k0663K788J5560q164
$$ -5629 20518 2905 -15312 4490 12026 -12516 -14292 11420 11681 -8982 -6194 9366 1202
1005A202j5844R005J9550m513j8706K827J7404q057k0495J4360K6576j5856k7233
$$ 1202 -14642 -5637 13913 9400 -9306 -6479 10925 2868 -17627 -3267 23309 7453 -19780
1018a9780J7815J9911k5144j3688L3203J0824l2878o474K6478l871k3099J1447
$$ -19780 -1965 17946 -7198 -20886 12317 23141 -9737 -16211 10267 6396 -16703 -5256
1030e256K2705j0184j9404O379J1883p932r363J2844J4376j2593j8348J1172J4998
$$ -5256 17449 7265 -12139 -5760 6123 -1809 -11172 1672 16048 3455 -14893 -3721 11277
1043A1277j5599r628K5140R480k9531r088K6826K093k5067P342K7834j0620k8636
$$ 11277 -4322 -13950 11190 20670 -8861 -17949 8877 10970 -14097 -6755 21079 10459 -18177
1056a8177Q314K2005r562j5778J4279J5865j4831j8377R623J6269q430j1437J3933
$$ -18177 -9863 12142 2580 -13198 1081 16946 2115 -16262 -6639 9630 1200 -10237 3696
1069C696J2425j9078j5661J8149J2210j6319j914K0640m760k4061N030J9406p189
$$ 3696 16121 -2957 -18618 -469 11741 -4578 -6492 14148 9388 -14673 -9643 9763 2574
1082B574j0102J4917O800j9938q743J5489N334j0207K652J2326n426j6931q59
$$ 2574 -7528 7389 14189 -5749 -14492 997 6331 -3876 -1224 11102 5676 -11255 -12114
1095a2114J5135N109j0562j271J3814m462k2911M726K7072m933k2158J2946J7437
$$ -12114 3021 8130 -2432 -3703 10111 5649 -17262 -12536 14536 9603 -12555 391 17828
1108A7828k2894j6542K4712J4024j9449n314J6627j685j8508M35J7657L783j2830
$$ 17828 -5066 -21608 3104 17128 -2321 -7635 8992 7307 -11201 -10766 6891 10674 -2156
1121b156k657J0901k423j5432L040J8488q19j5624L115J2114j0439j3780J4219
$$ -2156 -4813 6088 3665 -11767 -8727 9761 8942 -6682 -3567 8547 -1892 -15672 -1453
1134a453J6581j2717j2492J4061M556j9485q91K2124J492j6846K027J0151p807
$$ -1453 15128 2411 -10081 3980 8536 -10949 -11840 10284 11776 -5070 -3043 7108 -699
1147f99r837P699J2534j365j0891k534Q068k466j1145Q238J7079r380j6791R515
$$ -699 -10536 -2837 9697 8332 -2559 -5093 2975 509 -10636 -2398 14681 5301 -11490 -1975
1161a975R345j5089l095K1525J325j9403N73J2136p047q399J2505R989j0711q832
$$ -1975 7370 -7719 -10814 10711 12036 -7367 -6794 5342 -1705 -10104 2401 12390 1679 -7153
1175g153O579L813o413j429R620M554r141q603O727P266q911m402J4906M735j9967
$$ -7153 -574 3239 -3174 -4603 5017 9571 430 -8173 -1446 5820 -3091 -7493 7413 12148 -7819
1190g819n444K0202N29j9269P286J9765j2058j7901J2837J1665j3488n137J5267
$$ -7819 -13263 6939 7468 -11801 -4515 15250 3192 -14709 -1872 9793 -3695 -8832 6435
1203F435L278j2893l936P109L204l623j507N737L614r561p352J0051P367j0739
$$ 6435 9713 -3180 -7116 -7 3197 -426 -1933 3804 7418 -2143 -9495 556 7923 -2816
1217b816k717J4134j879j7820L503J6556o415j1806J2109Q321j6809o832J6219
$$ -2816 -5533 8601 6722 -11098 -7595 8961 2546 -9260 2849 11170 -5639 -12471 3748
1230C748M128j3237J733J1484m792j1015M341Q729j998n787J618N856j928q810
$$ 3748 7876 -5361 -3628 7856 3064 -7951 -3610 5119 3121 -2666 -1048 4808 2880 -5930
1244e930R96J1565q75j1739L526J1263q792j1243J2123R478j3091n845J3558J478
$$ -5930 -4934 6631 5756 -5983 -2457 8806 14 -11229 894 10372 -2719 -8564 4994 6472
1258F472j4368P72J3232j329j0057K629Q102m435q306N084R347m166q360M115
$$ 6472 -7896 -7124 6108 4779 -5278 -2649 5453 1018 -7288 -2204 7143 2977 -5383 -1268
1272a268P415o148p105P860P787q511o826R331M020j1567j741J3270L7j3060J892
$$ -1268 6147 -1 -7106 754 8541 30 -6796 2535 6555 -5012 -6753 6517 6554 -6506 -4614
1287d614J0445m283q287N852O886n842n577M336N008l342n463L900O880m447q180
$$ -4614 5831 1548 -6739 -887 5999 157 -5420 -1084 3924 582 -4881 -981 5899 1452 -6728
1302f728O241P474q214m964J0587K514j2431K91J1877k623j0376M554Q488o063
$$ -6728 -487 6987 -1227 -6191 4396 6910 -5521 -5230 6647 4024 -6352 -1798 6690 627
1316F27p073O875N215p388m228Q102L037q059k796P546K573p142j868P655J469
$$ 627 -6446 429 5644 -1744 -5972 2130 5167 -2892 -5688 1858 4431 -2711 -4579 3076 4545
1331D545q295q48R305J64j0118J434J1004l507j0628N166Q977o208p020P137M752
$$ 4545 -3750 -4598 4707 4871 -5247 -3813 7191 3684 -6944 -1778 7199 991 -6029 1108 5860
1346E860p660m000P248M194o997l999O511L483p706k529Q958J354r596O58R627
$$ 5860 -1800 -5800 1448 5642 -1355 -5354 1157 4640 -3066 -5595 3363 4717 -4879 -4221 5406
1361E406l226q849N443Q394o560o825O843M847p167k367P810J044p890n74P030
$$ 5406 2180 -6669 -1226 7168 608 -6217 626 5473 -1694 -4061 3749 4793 -3097 -3671 3359
1376C359J25o084l04N711P64o338j472P321Q10q784M60J0322k974j0926N729J0374
$$ 3359 3484 -2600 -2904 2807 3571 -2767 -4239 3082 3892 -4892 -4432 5890 2916 -8010 -2281 8093
1392H093q190q045R730N362j0228j934R592l76q462J962O893j761n510J452M071
$$ 8093 -97 -8142 1588 6950 -3278 -5212 4380 4004 -4458 -2496 4397 2636 -2874 -1422 2649
1407B649r85l773M09M656n72n850J170O515k786p416N325P340p681o621R411M257
$$ 2649 1664 -2109 -1700 2956 2384 -3466 -2296 4219 1433 -5983 -658 6682 -999 -7620 1791 6048
1423F048j0732r73J1840k146j0829M130Q835n102o501N748M777m672l540L193
$$ 6048 -4684 -5657 6183 4037 -6792 -2662 6173 1071 -5430 318 5095 423 -3117 76
1437G6K669k044l084J955M599k652o074L399O093n351n007P441L412r149r90R136
$$ 76 2745 701 -2383 -428 4171 1519 -4555 -1156 4937 -414 -5421 2020 5432 -3717 -4707 4429
1453D429k490q457N674P526p305n213P495K283p165j11P477j85o811n7N401M38
$$ 4429 1939 -6518 -844 6682 -623 -5836 1659 3942 -3223 -3334 4143 3958 -2853 -2910 2491 2929
1469B929n140p92O595J604q297k289Q755R72r545J766J0854m477j1413N508R559
$$ 2929 -2211 -3003 3592 5196 -3101 -5390 3365 4337 -5208 -3442 7412 2935 -8478 -2970 6589
1484F589o675o567Q717M231r233l008P766J400n745Q03N405j177n418k98M934
$$ 6589 -86 -6653 2064 6295 -2938 -5946 1820 3220 -2525 -1722 3683 2506 -2912 -3210 1724
1499A724J249m210J27N167j430p723J979Q185k925p430N980O375r099o169R372
$$ 1724 2973 -1237 -1110 4057 2627 -5096 -3117 5068 2143 -5287 693 7068 -2031 -8200 1172
1514A172M613q595j128Q495j301q753J101P360k14m660R79M116k122m882J480
$$ 1172 5785 -2810 -3938 4557 3256 -5497 -4396 2964 2750 -1910 -931 3185 1063 -3819 -2339
1529b339N195k30l720J437K629m084l298N015L821m459j814M786j487o904K755
$$ -2339 2856 2626 -1094 343 2972 -1112 -4410 605 4426 -33 -1847 2939 1452 -5452 -2697
1544b697P338k579o029M399M008o967m432P617M925n769l224N115J360o737j800
$$ -2697 4641 2062 -3967 432 4440 -2527 -6959 658 5583 -186 -3410 1705 3065 -3672 -5472
1559e472Q187L460o853l287O725M63q185P83R807n07q373J016N911l720n937N824
$$ -5472 2715 6175 -678 -3965 2760 3223 -4962 -4179 5628 5121 -3252 -2236 3675 -45 -5982 -158
1575a58O417m899n583L865K735n217j636O934K692o450k585N019P49o096J308
$$ -158 6259 1360 -4223 -358 2377 -2840 -4476 2458 5150 -1300 -3885 1134 1883 -4213 -2905
1590b905Q138o53p869K61O088k722n125N330O199n224n966L763L202m142j357
$$ -2905 5233 4580 -3289 -3028 3060 338 -4787 543 6742 1518 -4448 -685 2517 -1625 -2982
1605b982N802J949n433l201L293J689l076K97N267k23o688q18N257j19l923L428
$$ -2982 2820 4769 -664 -3865 -572 1117 -1959 -1662 3605 3382 -3306 -4124 1133 1014 -2909 519
1621E19M826m869n595M315L978m768q51O768K4p659l74N725o22m037L027M216
$$ 519 5345 476 -5119 -804 3174 -1594 -2445 4323 4347 -3312 -3686 2039 1417 -2620 407 4623
1637D623l452n001J393M266r64k876K325L845l912n334L166N101l148k876N430
$$ 4623 1171 -3830 -2437 1829 865 -2011 314 4159 247 -5087 -1921 3180 32 -2844 2586
1652B586J750p743j984P227J225n028J601M933l410n658K602M714j501k653K757
$$ 2586 4336 -3407 -5391 1836 3061 -1967 -366 4567 1157 -4501 -1899 2815 1314 -1339 1418
1667A418J746m059l347L146M283k150k872K888J304n054j848N874K281n101k19
$$ 1418 3164 -895 -4242 -1096 3187 1037 -1835 1053 2357 -2697 -4545 1329 3610 -1491 -1710
1682a710M616k134n687K874N970k405l692L154J797m932j355N144J753l260j354
$$ -1710 2906 772 -4915 -2041 3929 1524 -2168 986 2783 -2149 -3504 1640 3393 133 -1221
1697a221K402O6l282l93L787J574l484j489L552k57n079J627N982j786n255K388
$$ -1221 1181 1247 -2035 -2428 1359 2933 -551 -2040 1512 1255 -3824 -2197 3785 1999 -3256 -868
1713h68L802m378k557N212K481m486j364L774j94m077P41M633r2l843R0K615j247
$$ -868 2934 -1444 -4001 1211 3692 -794 -2158 1616 1422 -2655 -1914 2719 2627 -1216 -1126 1489 242
1730B42k602J909L860j423m244O08L472j737l215L465L571m334l200M109J437
$$ 242 -2360 -451 3409 1986 -2258 -1650 1822 85 -3130 335 3906 -428 -3628 481 1918
1745A918m278L33M752o06m276M35K967q05j903J618K206j680k418J189K140j467
$$ 1918 -2360 -2027 2725 2119 -2157 -1722 1245 440 -1463 155 2361 681 -1737 -548 1592 125
1761A25j526K245J949l244j875K877J279l336j37L775l17m428Q45L667j212l024
$$ 125 -1401 844 2793 -451 -2326 551 1830 -1506 -1643 2132 1815 -2613 -1768 1899 687 -2337
1777b337K174K732k781k379K585J452j799r69K153J225k510j431K243J557k374
$$ -2337 -163 2569 -212 -2591 -6 1446 -353 -1322 831 2056 -454 -1885 358 1915 -459
1792d59r00L075l9l481M83L285j111k971K182K221k652k018K507J526k110j069
$$ -459 -1359 1716 1677 -1804 -1321 1964 853 -2118 64 2285 -367 -2385 122 1648 -462 -1531
1808a531K180N44k482n95K705O47k329m22K264M72k611k28K851K9k904O90K869
$$ -1531 649 1193 -1289 -1884 821 1468 -861 -1283 981 1453 -1158 -1386 1465 1494 -1410 -720 2149
1825B149j363k839K091K555k643k145L147M42k808K33K723q93k316Q30J754p84
$$ 2149 786 -2053 38 2593 -50 -2195 952 1394 -1414 -1181 1542 649 -1667 -837 917 133
1841A33j228M66J429j4j883J28K189n10k337J448K293j878k376K309K143k546
$$ 133 -1095 -629 800 786 -1097 -969 1220 710 -1627 -179 2114 236 -2140 169 2312 -234
1857b34j341K497P34k678J25K231p58j754R02J186q36j228R91N74m94p65P21O20
$$ -234 -1575 922 1656 -1022 -897 1334 576 -1178 -276 910 74 -1154 -163 411 -83 -848 -127 493
1875D93o85r04J064J305j259j270J650J208k340m91K478N5k381O39K346j519j939
$$ 493 -192 -1096 -32 1273 14 -1256 394 1602 -738 -1229 1249 1304 -1077 -438 1908 389 -1550
1892a550J739J420j539r76J100K89p66n14Q55L56n44m23M73N64r38n01J125O64
$$ -1550 189 1609 70 -906 194 483 -283 -797 58 414 -130 -553 -80 484 -454 -955 170 834
1910H34j525p0J616l04j856J049J929j463j487J735J327k465o10K189L98k074
$$ 834 -691 -761 855 551 -1305 -256 1673 210 -1277 458 1785 -680 -1290 899 1297 -777
1926g77K80J364m00j307L29Q50K16q61n69Q93O87j530k87J768K52j949L93J501
$$ -777 -497 867 467 -840 -511 339 555 -306 -875 18 705 -825 -1112 656 908 -1041 -648 853
1944H53p26j088J019R47j066n39J184K59j263J11J002o9j051L42P95o23o88K08
$$ 853 127 -961 58 1005 -61 -600 584 843 -420 -309 693 624 -427 -85 710 87 -601 -393
1962c93R22k90p73J89O32j59r28M12J032m50r94P28N54q13m64J125K77p87K83
$$ -393 529 239 -534 -345 287 128 -800 -388 644 194 -800 -72 482 -331 -795 330 607 -180 103
1981A03K84m67j88M85L70l24j52J03l7l41m0L74M47p58k70O08j53q96J86R52J47
$$ 103 387 -80 -268 217 587 263 111 214 177 -164 -204 170 617 -141 -411 197 44 -852 -666 286 433
2002D33j045K61O42l25q95P04J115l77j084N33L33j89l90L79P41m39p19J43M37
$$ 433 -612 -351 291 -34 -929 -225 890 513 -571 -38 295 106 -284 95 836 397 -322 -179 258
2021B58l56j17Q38J36q81m33N51j30n17N22O39l19o82J94J27l19L0Q07K01m60
$$ 258 -98 -215 623 759 -122 -555 -4 -134 -651 -129 510 191 -491 -297 -170 -489 -459 348 549 89
2041H9n39JN26J35l24N54O48o42j037K61Q05k21l26N70N9j057k22P38L1q1L37
$$ 89 -450 -449 77 212 -112 442 1090 448 -589 -328 477 256 -70 500 559 -498 -720 18 49 -32 305
2062C05J04o62k49J43p2L80L40Jk35k49l75k6P45L20m11L75J26j053l57J032M23
$$ 305 409 -253 -502 -359 -431 -51 289 290 55 -194 -569 -595 150 470 59 434 560 -493 -850 182 605
2083F05n40K11N03q65n71L94N42M7k04J14l16j88k76R5M59N38k86p80L57Q3o73
$$ 605 65 276 779 -86 -657 -263 279 326 122 236 -80 -268 -544 -449 10 548 262 -518 -161 -78 -751
2104g51M46R34j3r46L79l9n84K47J112k14m19J30p7o63j8R47J13m33J47j55o55
$$ -751 -305 629 616 -330 49 10 -574 -327 785 571 152 282 205 -458 -476 471 584 151 298 143 -512
2125e12JK09K20M80n3o63l28M42l0l17P32O50o90o98M85N7n06O90Q24o77m22J57
$$ -512 -511 -302 -82 398 345 -318 -646 -204 -234 -551 181 831 141 -557 -72 -15 -521 169 993 316 -106 51
2147E1l7m90M14O92m6l57j80j87l26J70K34L14O2m06p00M02M68k42q6Q16pr93
$$ 51 14 -476 -62 630 584 227 47 -140 -466 -296 -62 252 314 -92 -792 -390 78 -164 -250 566 559 -434
2169d34k61Q73l17k77P85L27o45n77O14R7j17K52K43j58o55j46J67K01J68j65
$$ -434 -695 178 -139 -416 369 696 51 -526 88 185 68 320 563 405 -250 -396 -229 -28 140 -25
2189b5L34l2p31k69P36K21n36K46M07n47n73L80P76n03J05M38m7p24j5M60K95
$$ -25 309 277 -454 -723 13 234 -302 -56 351 -196 -769 -389 387 -116 -11 427 380 -344 -359 101 396
2210C96j46j02L74l82m26r9O33K2k47K1K58k43m81k4O34p2m42L17K89o02m14Q60
$$ 396 250 148 522 140 -286 -385 248 270 23 44 302 59 -422 -446 188 116 -326 -9 280 -322 -736 124
2232A24J84n92J2M09O6m36j39N98L04l35k74L52q3k78J5M24J18m80j87L84l37
$$ 124 308 -284 -272 137 203 -233 -372 226 530 195 -79 273 190 -88 -73 351 469 -11 -198 186 -151
2253a51l36M17M71l32o10N15j56k56P2O78J81q38L6O16k92l78L12M18n3k76q1
$$ -151 -487 -70 401 69 -541 -26 -182 -438 -366 312 493 -345 -309 307 15 -363 -51 367 314 38 -43
2274d3L54l05k31M21N03m72m96L48J61l35j00L49Mm92pM32j92j75K7N00l8o08
$$ -43 311 6 -225 196 699 227 -269 79 240 -95 -195 154 158 -334 -341 91 -101 -276 -249 251 213 -395
2296c95K03L48k01l32N03M20o92k73O40K61o45M5M67K84q10k13R11k49o71J84
$$ -395 -192 156 -45 -377 126 546 -146 -419 221 482 -163 -118 349 633 -177 -390 521 272 -399 -215
2316b15P61l60q17L86N42k87l91K63N54m74m70M21L79m63k95N91K17n47k04P23
$$ -215 546 186 -631 -245 297 10 -381 -118 436 -38 -508 -87 292 -171 -466 125 342 -205 -409 314
2336C14J06o11j1P33j42p70L07Q16p01m13N47K28m81l14M71L92o09k99M12L16
$$ 314 420 -191 -202 531 389 -381 -74 742 41 -372 175 403 -78 -392 79 471 -138 -437 -25 291
2356B91o96o2M85N04q35q3O23R9o74N0Q70k21o43K42P36n09n18M59N58p14l53
$$ 291 -405 -467 18 522 -313 -396 227 326 -348 -298 572 351 -292 -50 686 177 -341 118 676 -38 -391
2377c91N65K30n79k1K77J81n82l6N33Km80m7N25o2o31J61O59m37k03J49O55m04
$$ -391 174 404 -175 -196 81 262 -320 -356 177 179 -301 -348 177 115 -516 -355 304 -133 -336 -187 468 64
2399F4o74P58N56p69l28Q55J02q64L7O79j37o17J0P84k45o31L78L98k70o48M12
$$ 64 -610 148 704 -65 -393 462 564 -300 -263 416 279 -338 -328 456 211 -420 -42 356 86 -562 -150
2420a50N44l94p11N54O23m65n32O22L99p93j14R35r4p15J32N14q5o38K92M92k98
$$ -150 394 0 -711 -157 466 1 -531 91 490 -303 -417 518 424 -291 -159 355 270 -368 -76 416 118
2441A18m47L82L79k08o25M25L98n38n10P68L2m42l55P33K79q15P2Q14n4q60J98
$$ 118 -329 53 432 224 -401 24 422 -116 -626 142 174 -268 -623 110 389 -426 -354 460 406 -454 -256
2462b56Q08k62p66M65P08p85n05Q25K87o87l36N52N03p86j35N53J66p19m7P93
$$ -256 552 290 -476 -11 697 -88 -593 232 519 -168 -504 48 551 -235 -370 183 349 -370 -417 376
2482C76j71q76K88Q10k76p54N13O64n63p57P60O28p07n20Q31L97q92k07P65K88
$$ 376 205 -671 -383 427 151 -603 -90 574 11 -746 14 642 -65 -585 246 643 -249 -456 309 597
2502E97r86N9P11L3q26p5R69j81p20J79P83o70m50M49N88p22l63P97L05j018l7
$$ 597 -389 -330 381 414 -412 -487 482 301 -419 -240 543 -127 -577 -128 460 -262 -625 172 477 -541 -578
2523e78J033r6q05Q1R20l15o37J36P29k4r48M28P14m44q58N25R18o79p91Q41M78
$$ -578 455 359 -446 -365 555 240 -397 -261 468 444 -504 -76 638 194 -664 -139 779 100 -691 150 628
2544F28r67m54J176J26p57k01P34q3o55N5J058l92r48O48L62l94n48N64P64p08
$$ 628 -339 -793 383 509 -248 -449 285 202 -453 -398 660 268 -680 -32 330 -64 -612 -48 716 8
2564Hn75Q62J61n36m72R11L46j029k24R69L3j329N06J068m54r49N85N28l36q73
$$ 8 -567 295 456 -80 -552 359 705 -324 -548 421 454 -875 -369 699 245 -704 -119 409 73 -800
2584h00Q15O19o60n65P39K80p65j79O35N64q19n22R79J5o76K3Q61rj093L83O48
$$ -800 15 634 -26 -591 148 428 -337 -516 119 683 -136 -658 321 336 -340 -317 544 535 -558 -175 473
2605D73m16p13Q74N54r15o46J007K68q83k07J145k3r88n0Q70M4r05K00J029n12
$$ 473 57 -656 218 772 -143 -789 218 486 -397 -604 541 518 -470 -520 350 394 -511 -311 718 206
2625B06p32K17Q78l63p48O40Q46p37j059Q88N09p16n01J288K07j270j47J003m8
$$ 206 -526 -309 569 206 -542 98 944 207 -852 36 545 -171 -672 616 823 -447 -594 409 361
2644C61r51K86J046m48r76L74P70l76p06Q47M84p62o99P85N43o67l03Q69L26j325
$$ 361 -590 -304 742 294 -682 -308 462 86 -620 227 711 -51 -750 35 578 -89 -392 477 803 -522
2664e22k11J117J24j009M26R56o89r12L82Q90m12p14N10O91q28o29Q29O91r29
$$ -522 -733 384 508 -501 -75 881 192 -720 -338 552 140 -574 -64 627 -201 -830 -1 690 -239
2683b39l06P73L59j058l21J192L45j258J25J183m73j046M40R86m58o60L93O46
$$ -239 -545 228 587 -471 -792 400 745 -513 -388 795 322 -724 -284 702 244 -416 -23 623
2701F23p30p49R64N82r07k73R00J67j161j74J102L60j061k37J005k43j062M83
$$ 623 -107 -856 108 690 -217 -490 410 577 -584 -758 344 704 -357 -594 411 168 -894 -411
2719d11J111m85p62M91P70j001m65R78M98q96k92Q97R9j005j4Q30R8q61oR51j99
$$ -411 700 215 -547 -56 714 -287 -752 226 724 -172 -464 433 532 -473 -487 343 441 -420 -426 525 326
2740C26j078M02J243o37j082P39R38j066o96J274N99j365k31J108K4j147K09J120
$$ 326 -752 -350 893 256 -826 -87 851 -215 -911 363 962 -403 -634 474 498 -649 -440 680
2758F80j06j086n7R83J19j124K58J193l34j158L06J022q04p82Q01R23q77p43Q49
$$ 680 574 -512 -569 414 533 -591 -333 860 526 -632 -326 696 -108 -890 -89 834 -43 -786 63
2777F3Q29j436o6J079K3j159J15J273l24j185P90O76m71p26L01J072o49p76O51
$$ 63 892 -544 -610 469 492 -667 -552 721 397 -788 2 678 207 -519 -218 854 205 -571 80
2796H0R23j117o28P82Q61j287l36J449j46j207j14J470j87j334M93J044p57q07
$$ 80 1003 -114 -742 40 901 -386 -722 727 581 -626 -740 730 543 -791 -298 746 -11 -818
2814h18O09J010p91p21P90N37q21m42O97M97n83o13J004L00j016l65J421j24j196
$$ -818 -209 801 10 -711 79 616 -205 -647 50 547 -36 -649 355 655 -361 -726 695 571 -625
2833f25J77J353m96j393P59J241r03r52J033O42j294k85J073K89j090j40J081
$$ -625 -448 905 409 -984 -225 1016 113 -839 194 836 -458 -743 330 619 -471 -611 470
2850D70j26p98J43Q82j10r55j06J333l56j210O30J047p18j140J029J033j333n64
$$ 470 344 -454 -311 571 461 -494 -600 733 377 -833 -203 844 126 -1014 15 1048 -285 -849
2868h49J191M44j254k73J354m9j289K11J244l39r90K43J012l91r33L41J094m89
$$ -849 342 786 -468 -741 613 564 -725 -514 730 391 -599 -356 656 265 -668 -327 767 278
2886B78j053O17J158r74r91J374P26j852j97J484M04j561P8J364l76j331L97J275
$$ 278 -775 -158 1000 26 -965 409 1135 -717 -914 570 974 -587 -509 855 479 -852 -455 820
2904H20m49j227O54J113r21q57P04J051r58o21P75O18q86o60J265L98j152k99
$$ 820 371 -856 -202 911 -10 -867 -163 888 -70 -691 84 702 -184 -844 421 819 -333 -632
2922f32J347j49j220L66J192p35r84P54J103j096q43R51P51j104n21R73P14j288
$$ -632 715 566 -654 -288 904 169 -815 -61 1042 -54 -897 54 805 -299 -820 153 867 -421
2940d21m81J420M03j524j98J555n9j504J11J658l39j449K14J555p17j046P95J043
$$ -421 -902 518 921 -603 -801 754 695 -809 -698 960 621 -828 -614 941 224 -822 -27 1016
2958A016j000q06R68L54j016rQ70l1q56r0J050q5j028L73J149m04j592R75J163
$$ 1016 16 -790 178 532 -484 -493 377 346 -510 -600 450 365 -663 -290 859 455 -1137 -162 1001
2977A001r90j126J266J046j583p76J461O65j534k02J302L83j436j04J193K36j408
$$ 1001 11 -1115 151 1197 -386 -1162 299 964 -570 -772 530 913 -523 -627 566 802 -606
2994f06J5J128J35j408K63J142k34j412O12J281q56q26Q31P82j184n89J440M50
$$ -606 -591 537 672 -736 -473 669 435 -977 -365 916 60 -766 65 847 -337 -926 514 964
3012I64j568J4J239l9j567N82J414p17j131N70R76n75r96O49J125n59j579J143
$$ 964 -604 -590 649 610 -957 -375 1039 322 -809 -239 737 162 -834 -185 940 381 -1198 -55
3030e5R18j122r73J600P61j583o96J647L18j577K28J431n67j187N23J126p77r38
$$ -55 863 -259 -1232 368 1129 -454 -1150 497 815 -762 -534 897 330 -857 -334 792 15 -923
3048i23J129P38q42r77J024N49j073l92J274M35j271n74J520J02j502L7J906k69
$$ -923 206 944 102 -875 149 698 -375 -767 507 942 -329 -903 617 719 -783 -746 1160 891
3066H91k194O45J610q27j439J281J231j365j061J200P03r42n37J198N42j347k19
$$ 891 -1303 -658 952 125 -1314 -33 1198 -167 -1228 -28 675 -267 -804 394 936 -411 -630
3083f30P56L84r91m1J242j25j545M68J246n27j274R28J422j473j191J509Q63j568
$$ -630 126 510 -481 -522 720 595 -950 -482 764 237 -1037 -109 1313 -160 -1351 158 1021 -547
3101e47l44J777J89j971o9J564j15j148K78J360l25j605J34J756m20j301M88J788
$$ -547 -891 886 1075 -896 -965 599 484 -664 -386 974 649 -956 -822 934 514 -787 -299 1489
3119A489j338j457J102J405j085j053J628L73j831m82J673L74j395K20J429o20
$$ 1489 151 -1306 -204 1201 116 -937 691 1064 -767 -1249 424 798 -597 -377 1052 432
3135D32j489N35J321l54j165P04R57j092r61J016J346j170q85J253M82j738l70
$$ 432 -1057 -522 799 445 -720 -16 941 -151 -1112 -96 1250 80 -805 448 930 -808 -1178
3152a178J851N06j800K3J503o45j637P69J602n11j200M95J034j087q35Q65J305
$$ -1178 673 1179 -621 -598 905 260 -1377 -608 994 483 -717 -222 812 -275 -1110 -245 1060
3169A060r01r00Q17P58j396o48J766O96j753k31J460m92j436J017J349o59j330
$$ 1060 159 -741 76 834 -562 -1210 556 1252 -501 -732 728 236 -1200 -183 1166 507 -823
3186h23O63Q63j187o69J556O39j211n48P47N07j246k18J850Lj536j38J211N6j693
$$ -823 -160 703 -484 -1153 403 1042 -169 -717 30 537 -709 -927 923 926 -610 -748 463 519 -1174
3205a174P09J896q85j689Q81J265j053j245J730J049j904o33J607K13j547J5J698
$$ -1174 -465 1431 546 -1143 -262 1003 -50 -1295 435 1484 -420 -1053 554 767 -780 -765 933
3222I33m8j438l31J512k43r82J08J225o4j537J89J502m09j555J273J391j764j239
$$ 933 885 -553 -884 628 385 -597 -489 736 672 -865 -676 826 417 -1138 135 1526 -238 -1477
3240a477J900O88j753j37J687q0j636P2J542m07j141N13J281o16j501N33J392
$$ -1477 423 1111 -642 -779 908 828 -808 -736 806 399 -742 -229 1052 436 -1065 -532 860
3257H60o67r93P80J100j131j363J245J335j452o94J630L98j973r8J667J36j590
$$ 860 193 -800 -20 1080 -51 -1414 -169 1166 -286 -980 650 1048 -925 -1023 644 780 -810
3274h10M73J325p95j443Q78J211p03o64P51O12r78p49J003O87q05o09Q28O04j314
$$ -810 -337 988 193 -1250 -372 839 136 -528 223 835 -143 -892 111 798 -7 -616 212 816 -498
3293d98m40J650m2j359J84J502p71j659J396J246j271j085J588O13j387o55J526
$$ -498 -938 712 670 -689 -505 997 226 -1433 -37 1209 -62 -1147 441 1054 -333 -988 538
3310E38L97j361p9J120K48j478j25J539J59j585j64J650m64j465N74J654q59j496
$$ 538 935 -426 -505 615 863 -615 -740 799 958 -627 -791 859 395 -1070 -496 1158 299 -1197
3328a197J258J021j321q38J590O56j718l64J769k04j429K05J565k77j500P3J674
$$ -1197 61 1082 -239 -1077 513 1169 -549 -913 856 652 -777 -572 993 716 -784 -711 963
3345I63m57j583N60J735o89j703P86J654j216j479J656J011j657p34J421O07j415
$$ 963 506 -1077 -517 1218 529 -1174 -388 1266 50 -1429 227 1238 -419 -1153 268 875 -540
3362e40k77J496O6j472K20J155k98q92L12Q76m05j181Q88R32j002q37J382O78
$$ -540 -817 679 745 -727 -507 648 350 -542 -230 646 241 -940 -52 880 -122 -959 423 1101
3380A101j664l90J608K89j741J70J440k25j421M29J362n05j468O24J416r73j012
$$ 1101 -563 -953 655 944 -797 -627 813 588 -833 -404 958 453 -1015 -391 1025 52 -960
3397i60Q11J206j143j135J172J051j128q53J279P61j449n34J524J75j519M6J611
$$ -960 -149 1057 -86 -1221 -49 1002 -126 -979 300 1061 -388 -922 602 777 -742 -696 915
3414I15o34j524J129J016r51q85J265N68j324n69J368M98j381m65J499L24j371
$$ 915 281 -1243 -114 902 -49 -934 331 899 -425 -994 374 872 -509 -974 525 849 -522
3431e22l81J727J27j974J54J931l34k046P32J939r78j607J114J372j274j211J204
$$ -522 -903 824 951 -1023 -869 1062 728 -1318 -586 1353 375 -1232 -118 1254 -20 -1231 -27
3448b7J091j169p16J052L52j121l34J186L70j041k19J431k16j516L10J431n19
$$ -27 1064 -105 -821 231 583 -538 -872 314 684 -357 -576 855 639 -877 -567 864 345
3465C45j453R92J259j432j023J908P29j787o67K033j5j950L36J763l53j504J90
$$ 345 -1108 -116 1143 -289 -1312 596 1325 -462 -1129 904 889 -1061 -725 1038 685 -819 -629
3482f29J336r2j295N2J437q3j640L46J447n54j596R24J470j127j068J474P62j857
$$ -629 707 615 -680 -628 809 726 -914 -568 879 325 -1271 -347 1123 -4 -1072 402 1164 -693
3500f93k99J855l64j361N88J180p29j057Q77R43r05q29P30Q32p19r16Q65J077
$$ -693 -992 863 499 -862 -274 906 177 -880 -3 940 35 -794 -64 768 49 -867 -2 1075
3518A075r32j220J137J181j578q40J778N49j580n75J971j60j929M46J564n51j261
$$ 1075 143 -1077 60 1241 -337 -1177 601 1150 -430 -1005 966 806 -1123 -677 887 336 -925
3535i25R75P72q82o45P49O38n95o90Q34M79r31l83J042Q1j054j54J529j43j839
$$ -925 50 822 -60 -705 44 682 87 -603 231 710 -221 -604 438 519 -535 -689 840 697 -1142
3554a142N05J830p57j754J374J161j432j237J657R44j688n07J773J26j664j79
$$ -1142 -637 1193 436 -1318 56 1217 -215 -1452 205 1149 -539 -1046 727 853 -811 -990
3570i90J621K98j589n1J430j86j303m7J601P4j617K14J519o09j635J019J575j396
$$ -990 631 929 -660 -711 719 533 -770 -817 784 858 -759 -545 974 365 -1270 -251 1324 -72
3588g2j017J439O02j693k21J791Oj535K53J209l88j335O79J167k14j453L23J303
$$ -72 -1089 350 952 -741 -962 829 835 -700 -447 762 374 -961 -282 885 671 -782 -459 844
3606H44n69j443R31J625j142j279J009J001j618o74J938N05j523k89J166o4j370
$$ 844 275 -1168 -237 1388 246 -1033 -24 977 -641 -1315 623 1128 -395 -684 482 418 -952
3623i52M92J428n81j037J84J028n25q98R39J106j045r68P75O33j098n17J885J04
$$ -952 -460 968 387 -650 -466 562 37 -861 78 1184 139 -829 -54 579 -519 -1036 849 953
3641I53j445m82J558K0j516O33J416o36j413O43J019r64n66J015Q58j178r05R54
$$ 953 -492 -974 584 604 -912 -279 1137 501 -912 -269 750 -214 -780 235 1093 -85 -990 -36
3659c6Q34j042l91J274N36j730m68J505L62j547K61J628o61j847P77J439r45q95
$$ -36 798 -244 -635 639 1175 -555 -1023 482 844 -703 -442 1186 525 -1322 -545 894 -51 -946
3677i46J250J000j439j047J311M62r26j57J066Q6j141m28J015O27j155P8J303
$$ -946 304 1304 -135 -1182 129 591 -335 -492 574 660 -481 -909 106 733 -422 -344 959
3694I59m31j986O96J903p53j419J236J293j908j337J908Q68j442k47J595k73j457
$$ 959 528 -1458 -762 1141 388 -1031 205 1498 -410 -1747 161 1029 -413 -660 935 662 -795
3711g95j93J455J38j042O2J083l9j843J85J840O8j608K59J568j111j427J390J327
$$ -795 -988 467 605 -437 -375 708 669 -1174 -989 851 919 -689 -430 1138 27 -1400 -10 1317
3729A317j256r23J370K13j505j38J454J64j118K50P77n97q78O17J072o68n60M13
$$ 1317 61 -862 508 721 -784 -922 532 696 -422 -172 605 8 -870 -253 819 151 -409 4
3747DM37p76n40R51J036j088r55J358M52j675k59K174j14j930L68J704j113j476
$$ 4 441 -335 -875 76 1112 24 -931 427 879 -796 -1055 1119 1005 -925 -557 1147 34 -1442
3765a442J297J319j143j005R85Q50j215n64J220P13j175m67R56L50j367j63J598
$$ -1442 -145 1174 31 -974 11 861 -354 -918 302 1015 -160 -627 329 679 -688 -851 747
3782G47L49j915k4J868n15j862J027J886j202j783J258J265j320r13J475R09j643
$$ 747 1096 -819 -843 1025 510 -1352 -325 1561 359 -1424 -166 1099 -221 -1134 341 1250 -393
3799c93o27J327O55j368l97J525L62j571n71J492L51j626R3J763m21j504L49J487
$$ -393 -1020 307 962 -406 -803 722 1084 -487 -1058 434 785 -841 -748 1015 594 -910 -561 926
3817I26p67j055J061O18j044m33J020K43j052J03R94j67j205K48J014l22p42L63
$$ 926 159 -896 165 783 -261 -694 326 569 -483 -380 614 447 -758 -510 504 182 -560 -197
3835a97J049n88j283P58J306r47j112J129J015j484q62J660N48j649j01J299K85
$$ -197 852 264 -1019 -261 1045 98 -1014 115 1130 -354 -1216 444 992 -657 -758 541 826
3852H26j582N9J395l09j274M55J176m89j037M29J248p53q78P07J119j210q05J372
$$ 826 -756 -697 698 389 -885 -430 746 257 -780 -351 897 144 -734 -27 1092 -118 -923 449
3870D49N95j515l83J546j06j529M39J324n11j408J041J250j282r76R26J014q93
$$ 449 1044 -471 -854 692 586 -943 -504 820 309 -1099 -58 1192 -90 -1066 -140 874 -19
3887a9j029J112J065j182r26J111R22j387q25J618P14j708o10J897L6j726M38
$$ -19 -1048 64 1129 -53 -979 132 1054 -333 -1158 460 1174 -534 -1144 753 789 -937 -499
3904d99J328p22q71R14P32j033n18P93M19o60n26R85J00p92k82R65L24j080k89
$$ -499 829 107 -764 150 882 -151 -669 124 543 -117 -643 342 442 -350 -632 333 657 -423 -712
3923g12J418l6j632M35J800o97j835R85J607j274j463J478J224j675o42J304O66
$$ -712 706 670 -962 -527 1273 576 -1259 -274 1333 59 -1404 74 1298 -377 -1019 285 951
3940I51j199o36J409K97j119m48J119K36j109j01J138J76j201oJ191l49j236Q95
$$ 951 -248 -884 525 822 -297 -745 374 610 -499 -600 538 714 -487 -493 698 349 -887 8
3958HR29r73r24J277M39j293j16J569k14j507M79J301o59j380Q86R87o11r24L69
$$ 8 937 -36 -960 317 756 -537 -653 916 702 -805 -326 975 316 -1064 -178 809 198 -726 -357
3977c57J042o47q43O96J221q71j304Q84J203j257p19J169P01j444q7J194p7j135
$$ -357 685 38 -805 -109 1112 241 -1063 -179 1024 -233 -952 217 918 -526 -613 581 504 -631
3995f31M47R88p88p88R28M24q89l32R56L41j018k63Q16M10j096k51J249K41j265
$$ -631 -184 804 16 -772 156 580 -309 -641 315 656 -362 -625 191 601 -495 -746 503 744 -521
4014e21k91J597n6j766L86J791o18j583P83J376j132q37Q92Q27j081n93R91M46
$$ -521 -812 785 729 -1037 -651 1140 522 -1061 -278 1098 -34 -871 21 848 -233 -826 165 611
4032F11q13m46Q43M20r50l0M35L14q84mJ152j96j257N71J012q94p33J065P94j243
$$ 611 -202 -648 195 615 -335 -365 70 384 -500 -504 648 452 -805 -234 778 -116 -849 216 1010 -233
4052b33p35J297N28j374j66J358O3j449kJ368p3j110p0J353l47r80R0J246n53
$$ -233 -968 329 857 -517 -683 675 738 -711 -713 655 582 -528 -598 755 408 -572 -482 764 211
4071B11j161P77J053o94j094J001O20r64l63J208Kj144J9J005k93p98N20Q26l19
$$ 211 -950 -173 880 186 -908 93 713 -251 -614 594 596 -548 -529 476 183 -615 -95 731 412
4090D12j168M83Q56p20m19P51P33r88r63J136O59j032n16J533k7j516L3J420j95
$$ 412 -756 -273 583 -137 -556 195 928 -60 -1023 113 772 -260 -776 757 730 -786 -753 667 472
4109D72j152N02R53p46r49M85J085o06o32P29O97p00j072Q81O20m18q42J159L92
$$ 472 -680 -178 775 29 -920 -435 650 44 -588 141 838 138 -934 -53 567 149 -693 466 858
4128H58j363m54J511K9j201L18J136m23j413Q03Q43m43p30Q57K72r57n26J016
$$ 858 -505 -959 552 581 -620 -302 834 411 -1002 -199 644 201 -529 328 600 -357 -883 133
4146A33M16m98l80P53K86j232l47J204N82j253j35J349m54j517N94J476m30j184
$$ 133 549 51 -329 424 710 -522 -869 335 917 -336 -471 878 424 -1093 -499 977 547 -637
4164f37P15O77j051p31J107O95p97l30N70J05q08j4N83N02n08n28M11L28p52N8
$$ -637 78 755 -296 -1027 80 775 -22 -352 218 323 -485 -499 84 586 78 -450 -39 289 -463 -405
4184d05J040L3j103J2R13o71o71J146O77j237k43Q00R5j086O6J331m1q89j8M90
$$ -405 635 668 -435 -423 490 -181 -852 294 971 -266 -509 291 386 -700 -634 697 656 -233 -251 239
4204B39l98n14L96Q50j21q82L1N03q6p10P59R65r11p34N40M96q33j05J301j51
$$ 239 -159 -673 -277 573 452 -430 -399 104 18 -692 67 1032 121 -613 -73 423 -410 -515 786 635
4224F35j133J30P11l50p13Q64O71n75q78N00M96m04m54M99Q98p84p21M34R35q43
$$ 635 -498 -368 343 -7 -720 144 815 240 -638 -138 358 -46 -500 -1 897 113 -608 -174 761 -82
4244h2o12J197M58j335o94J359K91j156K34J333l55j384L72P10k48l73N85K89
$$ -82 -694 503 961 -374 -1068 291 582 -574 -340 993 638 -746 -374 336 88 -285 300 589
4262E89n97o77L77O89j45m69M25K53o35n37P38L33o36J79O97l39q87K38J046l74
$$ 589 -8 -685 -308 381 236 -233 192 445 -190 -727 11 344 -292 -113 584 245 -642 -404 642 268
4282B68o63N33N95j073k68O92L99m24l51N14J07q77kQ98J41o03j72R03k00j072
$$ 268 -395 138 733 -340 -608 84 483 59 -292 222 329 -548 -550 348 489 -114 -286 617 417 -655
4302f55J36J164l30j001P46R46j372n98J092N55n99o70R40k50n25j43R47J09n90
$$ -655 -519 645 315 -686 60 1006 -366 -964 128 683 84 -586 354 104 -421 -564 383 492 -98
4321i8r8N45r5n18P5O99J75r46J11N97n26n80P04O62p65l57O96P8r14J76O57J31
$$ -98 -196 349 254 -264 -189 510 685 -261 -150 447 -79 -659 45 707 -58 -415 281 359 -555 -379 278 409
4343D09p77R3N69j45n70K91M80N4q20K67O59k98q92L68R90o36o65P75L49p83j43
$$ 409 -368 -275 294 149 -421 -130 350 404 -416 -149 510 212 -680 -312 678 42 -623 152 501 -282 -425
4364d25Q51L7j048M35N92l96o60Q38L48p11m32N36M83n84m88Q53L17m60o24P02
$$ -425 426 463 -585 -150 442 46 -614 224 572 -139 -571 -35 448 -136 -624 229 546 86 -538 164
4384A64M72r29l90J088L74j191k59J296q0j437N90R67m64q35N20N42m43n94O38
$$ 164 636 -293 -683 405 779 -412 -671 625 545 -892 -302 665 201 -634 -114 428 -15 -609 29
4403B9K05j99l88M5O09m28l02M23K33m23j25M73Q7n60J21P28k86p18L74Q78q83
$$ 29 234 35 -353 -308 301 -127 -429 -6 227 -196 -321 152 239 -321 -200 528 242 -476 -102 776 -107
4424a07n58P26P23j111k52R44Lq45QR00J7p12p0M65L29p26k46Q77K39q97k36R65
$$ -107 -665 61 784 -327 -579 365 368 -477 -469 431 448 -264 -334 131 460 -266 -512 365 604 -293 -529 436
4446D36j86p93L68P42m21n11N04M47r72k21J002j03m63P3N91l01o34K73P23m09
$$ 436 250 -543 -175 567 146 -365 139 586 -386 -607 395 292 -171 -98 493 192 -442 -169 554 145
4466A45n65K05Q06m18p87M84P25m50q37O98P43j109n11J094O95j124m33J085k72
$$ 145 -420 -215 591 173 -614 -130 595 145 -692 6 749 -360 -871 223 918 -206 -639 446 174
4485A74o18J02R16l26n63J66N09l71l27K13M99k80n76M58L94n41j76O40K93q71
$$ 174 -444 -342 574 248 -315 -149 360 -11 -338 -125 374 94 -482 -24 370 -171 -347 293 586 -285
4505b85k41J069l1j064o0J270k33j040L69P96l54q76L43Q96n90m52O29M74n50
$$ -285 -526 543 512 -552 -612 658 425 -615 -246 550 196 -680 -337 559 -31 -483 146 620 70
4524G0m50O01K22n56l28N92K93p92k77J109L0q84K8P74k81o78L48O99m31n48O60
$$ 70 -380 221 443 -113 -441 151 444 -348 -625 484 514 -370 -342 432 151 -527 -179 520 89 -459 201
4545B01N1l68l13O59L91p54k63M98L07p01j77P02K98j068Q0J100l77j160P17Q08
$$ 201 252 -116 -429 230 621 -133 -396 102 409 -292 -469 233 531 -537 -457 643 266 -894 -177 631
4565F31m92o49N23O80o68o39O08N48o22j67M48N6o46j4M73M50p20j05O73o5o61
$$ 631 139 -510 13 693 25 -614 -6 542 -80 -247 201 257 -389 -403 70 520 -200 -305 368 303 -358
4586c58r4J077n66m90L50N57n49n46J019K60q69r1P96k98o35K37P46k06p36J84
$$ -358 -452 625 59 -431 -81 476 -73 -619 400 660 -209 -300 496 198 -437 -200 546 340 -396 -212
4606b12K28J66n74K35M91R1q36K06O95k91p91N71P63q91n15P86M69r77M6Q81j30
$$ -212 16 182 -392 -157 334 425 -411 -205 490 199 -592 -21 742 -149 -664 122 591 -386 -340 541 411
4627D11q45J62L26j23k12K35M96j81o66M30J05m77J39M85J87l61n82N45K48o06
$$ 411 -434 -272 54 -69 -281 -46 450 269 -397 33 138 -339 -200 285 472 111 -471 74 322 -284
4647b84j20R21K38j375K89Q69l18j094R48O88n95r01O58L09l51k10N30J78l80
$$ -284 -404 517 755 -620 -331 538 220 -874 74 762 167 -734 -76 233 -118 -328 202 380 0
4666@m16K44L55l28J53L07P0n19j82N41p5m39L22O79n04r55P87L02n97j75R39
$$ 0 -416 -172 183 -145 8 315 385 -134 -316 225 150 -289 33 712 208 -747 40 342 -255 -430 509
4687E09K32j076l01Q36Q8n50mN78K14j011k34R14K51n70K4N52k5j061K19O81J25
$$ 509 741 -335 -636 200 288 -262 -266 312 526 -485 -719 195 446 -124 -100 452 427 -634 -415 266 391
4708C91p06L63M56o38m13N21L57m43k3O27m23m64L34N06l53j02J34Q1m09k62L30
$$ 391 -315 48 504 -134 -547 -26 331 -112 -135 492 69 -395 -61 445 92 -10 124 205 -204 -466 -136
4729a36N19p2n84M02L17o65n12Q94M37o48k69O12m1q25K30P65r7m59M0M84m75
$$ -136 383 311 -273 129 446 -219 -731 163 600 -48 -317 295 254 -571 -341 424 327 -132 -92 392 -83
4750h3n83O18N10k41l30L02J96p20k00O69L73n47l07M50L25q77K0R02J47j049
$$ -83 -666 -48 462 221 -109 193 389 -331 -531 138 511 -36 -343 107 432 -445 -425 477 624 -425
4770d25J66N82j90q21M16P55j97m22R2P6k3n65N78M98o38k32M73K2m36%P82m3
$$ -425 -259 323 133 -688 -272 483 286 -136 -44 32 9 -556 22 520 -118 -350 123 145 -291 -291 491 448
4792D48q11j5O67l22l53N23M26n35k83K67J88n24PO18J14m10l44M30J20l35j47
$$ 448 -363 -378 289 -33 -386 137 563 28 -255 12 200 -324 -317 301 415 5 -339 91 211 -124 -271
4813b71N43K36q27k39R45k60m69K18P61o25n02L66L88l66k28N98J63p45j08N75
$$ -271 272 508 -319 -558 387 127 -342 -124 637 12 -490 -124 264 -102 -330 268 431 -314 -422 153
4833A53K00n47J13L52J04p06%O45j5o86L64M75k60q37L25Q26m43n69N43O67q55
$$ 153 353 -194 -81 271 375 -331 -331 314 299 -387 -23 452 192 -645 -320 506 63 -506 37 704 -151
$$ [...]
8191C3
##END NTUPLES=NMR FID
##END=
