##TITLE=1H_IBBC-2H
 CDCl3
 8 sc, 
 6.3.2024
##JCAMPDX= 6.0         $$ Bruker NMR JCAMP-DX V2.0
##DATA TYPE= NMR FID
##DATA CLASS= NTUPLES
##ORIGIN= UXNMR, Bruker Analytische Messtechnik GmbH
##OWNER= root
$$ XWIN-NMR		Version 3.5
$$ Wed Mar  6 13:22:04 2024 Russian Standard Time (UT+4h)  she@DPX200
##.OBSERVE FREQUENCY= 200.1313
##.OBSERVE NUCLEUS= ^1H
##.DELAY= (6, 6)
##.ACQUISITION MODE= SIMULTANEOUS
##.ACQUISITION SCHEME= undefined
##.AVERAGES= 8
##.DIGITISER RES= 18
##SPECTROMETER/DATA SYSTEM= spect
##.PULSE SEQUENCE= zg30
##.SOLVENT NAME= CDCl3
##.SHIFT REFERENCE= (INTERNAL, CDCl3, 0, 15.7039)
##AUDIT TRAIL= $$ (NUMBER, WHEN, WHO, WHERE, WHAT)
$$ ##TITLE= Audit trail, XWIN-NMR		Version 3.5
$$ ##JCAMPDX= 5.01
$$ ##ORIGIN= Bruker BioSpin GmbH
$$ ##OWNER= she
$$ F:/spectra/data/she/nmr/H-F/1/audita.txt
$$ ##AUDIT TRAIL=  $$ (NUMBER, WHEN, WHO, WHERE, WHAT)
(   1,<2024-03-06 13:20:51.59 +0400>,<she>,<DPX200>,
      <created by zg, POWCHK disabled, PULCHK disabled
       configuration hash MD5:
       00 E9 B6 7A A2 85 ED C7 34 08 36 98 17 FE 4E 26
       data hash MD5: 16K
       42 9F B2 B7 2B 6F 5D 7E 3D 0C 0F A8 AC FD 32 91>)
$$ ##END=
$$ 
$$ hash MD5
$$ 8D 7A 52 A5 82 6A C8 C6 C9 CA C1 25 DE 6C 86 51
##$RELAX= 
##$RELAX= 
##$RELAX= 
##$RELAX= 
##$RELAX= 
##$RELAX= 
$$ Bruker specific parameters
$$ --------------------------
##$DU= <F:/spectra>
##$EXPNO= 1
##$NAME= <H-F>
##$PROCNO= 1
##$TYPE= <nmr>
##$USER= <she>
##$AMP= (0..31)
100 100 100 100 100 100 100 100 100 100 100 100 100 100 100 100 100 100 
100 100 100 100 100 100 100 100 100 100 100 100 100 100 
##$AQSEQ= 0
##$AQ_mod= 1
##$AUNM= <au_zg>
##$AUTOPOS= <>
##$BF1= 200.13
##$BF2= 200.13
##$BF3= 200.13
##$BF4= 200.13
##$BF5= 200.13
##$BF6= 200.13
##$BF7= 200.13
##$BF8= 200.13
##$BYTORDA= 1
##$CFDGTYP= 0
##$CFRGTYP= 5
##$CHEMSTR= <none>
##$CNST= (0..31)
1 1 145 1 1 1 1 1 1 1 1 1 1 1 1 1 1 1 1 1 1 1 1 1 1 1 1 1 1 1 1 1 
##$CPDPRG= <>
##$CPDPRG1= <>
##$CPDPRG2= <>
##$CPDPRG3= <>
##$CPDPRG4= <mlev>
##$CPDPRG5= <mlev>
##$CPDPRG6= <mlev>
##$CPDPRG7= <mlev>
##$CPDPRG8= <mlev>
##$CPDPRGB= <>
##$CPDPRGT= <>
##$D= (0..31)
0 1.2 0 0 0 0 0 0 0 0.06 0 0.03 0 0 0 0 0.0002 0 0 0 0 0 0 0 0 0 0 0 0 
0 0 0 
##$DATE= 1709716851
##$DBL= (0..7)
120 120 120 120 120 120 120 120 
##$DBP= (0..7)
150 150 150 150 150 150 150 150 
##$DBP07= 0
##$DBPNAM0= <>
##$DBPNAM1= <>
##$DBPNAM2= <>
##$DBPNAM3= <>
##$DBPNAM4= <>
##$DBPNAM5= <>
##$DBPNAM6= <>
##$DBPNAM7= <>
##$DBPOAL= (0..7)
0.5 0.5 0.5 0.5 0.5 0.5 0.5 0.5 
##$DBPOFFS= (0..7)
0 0 0 0 0 0 0 0 
##$DE= 6
##$DECBNUC= <off>
##$DECIM= 32
##$DECNUC= <off>
##$DECSTAT= 4
##$DIGMOD= 1
##$DIGTYP= 9
##$DL= (0..7)
0 120 120 120 120 120 120 120 
##$DP= (0..7)
150 150 150 150 150 150 150 150 
##$DP07= 0
##$DPNAME0= <>
##$DPNAME1= <>
##$DPNAME2= <>
##$DPNAME3= <>
##$DPNAME4= <>
##$DPNAME5= <>
##$DPNAME6= <>
##$DPNAME7= <>
##$DPOAL= (0..7)
0.5 0.5 0.5 0.5 0.5 0.5 0.5 0.5 
##$DPOFFS= (0..7)
0 0 0 0 0 0 0 0 
##$DQDMODE= 0
##$DR= 18
##$DS= 0
##$DSLIST= <SSSSSSSSSSSSSSS>
$$ [...]
##$SUBNAM2= <"">
##$SUBNAM3= <"">
##$SUBNAM4= <"">
##$SUBNAM5= <"">
##$SUBNAM6= <"">
##$SUBNAM7= <"">
##$SUBNAM8= <"">
##$SUBNAM9= <"">
##$SW= 18.0517328524113
##$SWIBOX= (0..15)
0 0 2 0 0 0 0 0 0 0 0 0 0 0 0 0 
##$SW_h= 3612.71676300578
##$TD= 16384
##$TD0= 1
##$TE= 0
##$TE2= 300
##$TE3= 300
##$TEG= 300
##$TL= (0..7)
0 120 120 120 120 120 120 120 
##$TP= (0..7)
150 150 150 150 150 150 150 150 
##$TP07= 0
##$TPNAME0= <>
##$TPNAME1= <>
##$TPNAME2= <>
##$TPNAME3= <>
##$TPNAME4= <>
##$TPNAME5= <>
##$TPNAME6= <>
##$TPNAME7= <>
##$TPOAL= (0..7)
0.5 0.5 0.5 0.5 0.5 0.5 0.5 0.5 
##$TPOFFS= (0..7)
0 0 0 0 0 0 0 0 
##$TUNHIN= 0
##$TUNHOUT= 0
##$TUNXOUT= 0
##$USERA1= <user>
##$USERA2= <user>
##$USERA3= <user>
##$USERA4= <user>
##$USERA5= <user>
##$V9= 5
##$VALIST= <valist>
##$VCLIST= <CCCCCCCCCCCCCCC>
##$VD= 0
##$VDLIST= <DDDDDDDDDDDDDDD>
##$VPLIST= <PPPPPPPPPPPPPPP>
##$VTLIST= <TTTTTTTTTTTTTTT>
##$WBST= 1024
##$WBSW= 4
##$XGAIN= (0..3)
0 0 0 0 
##$XL= 0
##$YL= 0
##$YMAX_a= 66666
##$YMIN_a= -69398
##$ZGOPTNS= <>
##$ZL1= 120
##$ZL2= 120
##$ZL3= 120
##$ZL4= 120
##$ABSF1= 10
##$ABSF2= 0
##$ABSG= 5
##$ABSL= 3
##$ALPHA= 0
##$AQORDER= 0
##$ASSFAC= 0
##$ASSFACI= 0
##$ASSFACX= 0
##$ASSWID= 0
##$AUNMP= <proc_1d>
##$AZFE= 0.1
##$AZFW= 0.1
##$BCFW= 1
##$BC_mod= 2
##$BYTORDP= 1
##$COROFFS= 0
##$CY= 11.3945322036743
##$DATMOD= 1
##$DC= 2
##$DFILT= <>
##$DTYPP= 0
##$F1P= 15.7292609196834
##$F2P= 12.9074282941183
##$FCOR= 0.5
##$FTSIZE= 0
##$FT_mod= 4
##$GAMMA= 1
##$GB= 0.15
##$INTBC= 1
##$INTSCL= 1
##$ISEN= 128
##$LB= 0.24
##$LEV0= 0
##$LPBIN= 0
##$MAXI= 10000
##$MC2= 0
##$MEAN= 0
##$ME_mod= 0
##$MI= 1.114404
##$NCOEF= 0
##$NC_proc= 0
##$NLEV= 6
##$NOISF1= 3.799351
##$NOISF2= 2.8
##$NSP= 1
##$NTH_PI= 0
##$NZP= 0
##$OFFSET= 15.70392
##$PC= 1
##$PHC0= -24740.64
##$PHC1= 13.38731
##$PH_mod= 1
##$PKNL= yes
##$PPARMOD= 0
##$PSCAL= 0
##$PSIGN= 0
##$REVERSE= no
##$SF= 200.130013532006
##$SI= 16384
##$SIGF1= 3
##$SIGF2= 2
##$SINO= 400
##$SIOLD= 16384
##$SREGLST= <1H.CDCl3>
##$SSB= 0
##$STSI= 0
##$STSR= 0
##$SW_p= 3612.71676300578
##$SYMM= 0
##$S_DEV= 0
##$TDeff= 0
##$TDoff= 0
##$TI= <>
##$TILT= no
##$TM1= 0
##$TM2= 0
##$TOPLEV= 0
##$USERP1= <user>
##$USERP2= <user>
##$USERP3= <user>
##$USERP4= <user>
##$USERP5= <user>
##$WDW= 1
##$XDIM= 8192
##$YMAX_p= 0
##$YMIN_p= 0
$$ End of Bruker specific parameters
$$ ---------------------------------
##NTUPLES= NMR FID
##VAR_NAME=  TIME,          FID/REAL,        FID/IMAG
##SYMBOL=    X,             R,               I
##VAR_TYPE=  INDEPENDENT,   DEPENDENT,       DEPENDENT
##VAR_FORM=  AFFN,          ASDF,            ASDF
##VAR_DIM=   8192,          8192,            8192
##UNITS=     SECONDS,       ARBITRARY UNITS, ARBITRARY UNITS
##FACTOR=    0.0002768,     1,               1
##FIRST=     0,             0,               0
##LAST=      2.2672688,     0,               0
##MIN=       0,             -69398,          0
##MAX=       2.2672688,     66666,           0
$$ Real data points
##PAGE= N=1
##DATA TABLE= (X++(R..R)), XYDATA
$$ [...]
1118B141p106N068M218o334j067N606r33m262J861L095j937k526K087K569k753
1133b73k188L564J654m754m33N821j836o080M853M380p514j126Q395k862p062
1148e461O135M211p700p61P813k581o252N157L492o035o64N428j450l904K146
1163d26K552j958k223K019K227k673k113L721J255m670K26N413k290n223M951
1178G88L612p077n35P758l218o367O118L347p435J6O957k932n323M881K982n658
1194b086m24N205j558l730K414K424k234j882K147J877k721j717L740P88m691
1209b448P87M848k860m296M981K655o622K11P033l513n515O182K617p129P21O347
1225C999l261m564M784K295n263k06M777j636l615K501K201k290j664K289J621
$$ y = [2141, -4965, 103, 4321, -2013, -3080, 2526, 1593, -2669, -808, 2287, 350, -2176, -89, 2480, -273, -2461, 1103, 2757, -1997, -2430, 3391, 1555, -4525, 328, 4708, -2806, -3932, 4463, 1601, -5461, 674, 4885, -2815, -3576, 4237, 1656, -4596, 561, 4053, -1982, -2646, 2782, 1332, -2572, -426, 2126, 168, -2055, -36, 2191, -482, -2595, 1126, 2381, -2289, -2063, 3350, 1060, -4163, 788, 4400, -2677, -3212, 4546, 1328, -5039, 1079, 4426, -3009, -2993, 3964, 1032, -4291, 590, 3572, -2086, -2510, 2695, 1137, -2593, -179, 2245, 11, -1871, 276, 2153, -568, -2285, 1455, 2243, -2448, -1661, 3187, 327, -3969, 1012, 3667, -2955, -2744, 4289, 776, -4739, 1443, 4060, -3069, -2348, 3999, 738, -3826, 958, 3253, -2010, -2216, 2561, 925, -2690, -189, 2012, -278, -1942, 347, 1968]
1240A968k719j395L746M16m492J380M392l233l490M917J641n986P09O097l620
1255C31m735N908J939o641J167N746l438l832M614J868m767m9M369j499l394K374
1271c9K325k631j540K529J231k977q69L658j92m175J871L885l581k669M992P92
1287B610n461J409N149l576l770N303J414n980J258N126l382l375M301J507m434
1302a901P2L997j272l370K332K475k890j432K985Q24l123j66L453p89l753K300
1318b58L210l836j856M761n3m863J877M217l599k855M835R73n257J334M603l187
1334D6k971M091J296m149Q5L776j223l356K247K491l013j489L348M48l385M69
1350a289L394j370l192K600K488l773j164M456n93m230K210L339l452k083M266
$$ y = [1968, -751, -2146, 1600, 2016, -2476, -1096, 3296, 63, -3427, 1490, 3131, -2855, -2146, 3951, 331, -4404, 1504, 3443, -3198, -2031, 3715, 277, -3555, 1059, 2927, -1840, -1889, 2480, 981, -2413, -39, 2286, -345, -1885, 644, 1875, -1102, -1971, 1687, 1495, -2680, -809, 3076, -505, -3174, 1818, 2610, -2851, -1442, 3707, 131, -3639, 1664, 3078, -2902, -1644, 3482, 100, -3275, 1026, 2533, -1901, -1829, 2168, 896, -2474, -142, 2333, -557, -1989, 996, 1820, -1303, -1469, 1984, 1195, -2558, -258, 2952, -884, -2740, 2021, 1968, -2895, -1018, 3199, -400, -3255, 1580, 2553, -2704, -1370, 3233, 46, -2925, 1166, 2462, -1687, -1602, 2174, 951, -2405, -158, 2333, -680, -2169, 1179, 1627, -1758, -1289, 2105, 735, -2457, 143, 2631, -1142, -2306, 2150, 1557, -2673, -463, 2876, -576, -2659, 1607]
1365A607M28m492J235L990k839k752L751J233l927J89L689j234l235K342K539
1380B524l200j445L689P0l647J116L199k156k547K922J751l768l89M040j166l583
1396b590K531K590l312j284L608J55l765J085L507k428k627L420J237l771O8L622
1412B046j268l239K331K533l293j318L933j91l787J637L117k664k014L206R05
1427A934l461K46L397j480k896K518J869l095q26L129j24l036R83K963k023k429
1443b331L101J387l746J40L669j443l163K525K319l492j067L975n74l850K184
1458c66K762l126j396L435J41l222Q58K927j730k205K335J428k742m14K687k79
1474A093k700R44K547j782k255K737J441l658LL853j568l193K839K156l675p54
$$ y = [1607, 2035, -2457, -1222, 2768, -71, -2823, 928, 2161, -1766, -1577, 2112, 878, -2357, -15, 2524, -676, -2121, 1568, 1638, -2009, -893, 2306, 150, -2397, 525, 2276, -1492, -1881, 2159, 993, -2590, -59, 2531, -781, -2065, 1543, 1698, -2067, -982, 2525, 97, -2530, 890, 2127, -1644, -1576, 2046, 778, -2461, -130, 2403, -890, -2208, 1725, 1534, -2253, -616, 2501, -163, -2177, 1029, 1934, -1527, -1281, 2116, 636, -2260, 258, 2127, -968, -1794, 1335, 1211, -1825, -842, 2121, 98, -2331, 770, 2157, -1589, -1449, 2220, 777, -2386, 139, 2458, -1034, -2101, 1874, 1300, -2550, -366, 2396, -730, -2126, 1309, 1450, -1772, -914, 2013, 283, -1922, 413, 1841, -901, -1315, 1372, 1093, -1607, -663, 1884, 102, -2153, 584, 2025, -1633, -1630, 2223, 655, -2538, 301, 2457, -1218, -1972]
1490a972M060q04l791K505K548l564r04L548m84l020J371K223j825j632K224Q86
1506A369k309k56K425l44k281R06K190j504k097K497J476l507j10L808j665l209
1522b611L069J929l864l88L991j263l464K748K236l577n13L525r48k704J819J678
1538A663j973r99K034M87k064j11K029m03k077R13K004j497j856K355J364l328
1554a459K1L683j725l064L219J685l961L3L904j699l140K985J704l616j34L510
1570A946j481k381K145J226k066m70J778J58j612MJ757l18j789P59J827j457j717
1587a691K300J088l134M6L545j782k931L260J490m073M71L795k103k676L157J353
1603B115l547K22L228j660k154K234R41k193j01J642j75j333O8J515k48j745Q06
$$ y = [-1972, 2088, 1284, -2507, -2, 2546, -1018, -1922, 1626, 1142, -1878, -507, 1716, -109, -1741, 483, 1369, -940, -1196, 1229, 885, -1396, -490, 1700, 196, -1901, 596, 2072, -1435, -1545, 2263, 598, -2611, 458, 2387, -1477, -1865, 2126, 863, -2601, 147, 2383, -1194, -1707, 1818, 870, -1834, -15, 1663, -310, -1309, 725, 1212, -852, -963, 1066, 663, -1414, -501, 1503, 6, -1850, 505, 1869, -1459, -1438, 2245, 520, -2544, 675, 2360, -1601, -1568, 2336, 637, -2503, 482, 2186, -1430, -1564, 1946, 465, -1916, 229, 1455, -611, -1081, 697, 855, -757, -753, 1004, 686, -1103, -344, 1483, 26, -1691, 609, 1697, -1437, -1391, 2154, 372, -2559, 701, 2191, -1882, -1411, 2384, 281, -2395, 762, 2115, -1432, -1210, 2018, 358, -1796, 438, 1379, -814, -915, 727, 552, -781, -713, 802, 554, -1191, -385]
1620c85J834j550j511K254R22k992L42L265j840k731L251J260m012P03L619k385
1636D4k381L251Q39l368N90K896j744j855K266P61k117J01J599l95j079M5J335
1653G88k93j502O72J754j654j308K341N82k906N25L008j932k372L299R19l877
1669a956J030L319k481k092L359L86l176Q61K509j767j602K142N20k000K85J438
1685G75m53r95L04J037k36j330O61J668j627j206K361L17k817Q39K646k129j919
1702b104L108N89l538J152L059k589j731L210J68k978J193K173j802j243J921
1717E88M55j894K29J539o16j072M73R87m23j203P50J409j598r61K291J03k639
1734a582J195K294k204j417K837L11l231J260K642k515j474L169j87k741J234
$$ y = [-385, 1449, -101, -1612, 642, 1564, -1428, -1086, 2179, 339, -2392, 859, 2119, -1893, -1190, 2429, 44, -2337, 914, 1753, -1615, -1025, 1871, 127, -1728, 538, 1299, -818, -717, 882, 487, -592, -547, 788, 495, -1007, -335, 1419, -235, -1543, 798, 1380, -1526, -1001, 2007, 75, -2297, 1002, 1921, -1956, -926, 2393, -88, -2180, 1179, 1565, -1611, -750, 1759, -8, -1610, 532, 1052, -948, -663, 775, 322, -673, -369, 668, 432, -898, -237, 1431, -196, -1402, 959, 1276, -1541, -702, 1944, -185, -2104, 1004, 1593, -1945, -793, 2266, -323, -2054, 1156, 1324, -1654, -461, 1712, -90, -1333, 588, 1043, -851, -622, 917, 301, -771, -298, 689, 266, -937, -187, 1222, -376, -1337, 954, 1057, -1582, -387, 1907, -297, -1714, 1123, 1434, -1797, -537, 2105, -410, -1884, 1285, 1098, -1643, -409]
1749d09J919j827j019J941K69j660K62J426n72j132O76R13o01j027R05J069j537
1766d04p97K238j73k450J370J849k131j145K749k9k814J353K301k319j201K873
1782A270k63k501J273J714j801q65J777J67j548J82J428n14j174P11R11q47q43
1799i23J179P61j540l86K000l70k135J449J587k254o84K538l95k402J348J827
1815A600k134r29K571k65k321J293J576j699p85J686K19j485J89J278m62j206
1831h74Q54R70j122p55J270N20j617JJ754n81j834J490J336k184l46K327n73k009
1849a373J407J430j968o50K181k12k099J057J483j559p40J624J46j530K89J280
1865G66m53j308R53J070j336n20J538L8j554L11J551q26j434J453R30j956j52
$$ y = [-409, 1510, -317, -1336, 605, 874, -786, -524, 902, 330, -802, -126, 787, 186, -841, 64, 1133, -404, -1201, 1037, 864, -1586, -216, 1633, -498, -1643, 1106, 1077, -1737, -384, 1917, -402, -1603, 1270, 1007, -1494, -221, 1493, -308, -1173, 604, 771, -777, -595, 833, 319, -855, -144, 767, -80, -923, 256, 1017, -523, -909, 1091, 721, -1414, 35, 1622, -632, -1316, 1222, 827, -1575, -227, 1600, -534, -1463, 1108, 843, -1478, -185, 1391, -308, -1093, 593, 812, -673, -484, 794, 332, -874, -20, 950, -172, -927, 343, 863, -754, -753, 1001, 420, -1414, 76, 1412, -772, -1118, 1209, 636, -1373, 34, 1464, -504, -1154, 1027, 815, -1284, -227, 1256, -303, -1043, 581, 727, -803, -514, 766, 313, -995, -42, 1028, -308, -828, 710, 748, -806, -495, 1056, 230, -1204, 249, 1179, -777, -929]
1882i29K039p27j720J448J087j737m41J879k38j871R78J488j446p84J583J51j532
1899g72K84J395o99j161R71R68j424m37J589j05j490N88J336j056j001J430O03
1916A019j769J27J698p87j424J353Q68j590l33J630k51j566P52J368j345p99J632
1933E83J80j589L75J439p76j192J179Q18j444l70J655m03j473R00J049j195o19
1950h83J336J93j465K88J497q17j128J226O72j400k07J447k61j354O75J214j157
1967a24q43J509K65j699M26J523j018j096J356O80j690jJ615n22j394J112Q71
1984I70j356k64J247j21j188M29J107p25r67J058N90j323o2J260l06j150O88J049
2002I36j063p89J484K97j799N80J487j182r96J529L86j667J54J616q08j215J282
$$ y = [-929, 1110, 383, -1337, 111, 1198, -539, -980, 899, 661, -1210, -232, 1256, -190, -974, 609, 760, -772, -488, 907, 208, -953, 18, 986, -438, -875, 714, 609, -881, -293, 1043, -13, -1014, 416, 1019, -750, -623, 1075, 288, -1136, 217, 1085, -505, -838, 792, 541, -1025, -273, 1095, -250, -1049, 583, 763, -826, -451, 988, 212, -980, 199, 1017, -427, -797, 858, 455, -1018, -118, 931, -264, -883, 453, 646, -819, -531, 966, 149, -979, 247, 919, -481, -688, 759, 498, -856, -181, 1033, -124, -967, 542, 807, -892, -466, 1057, 39, -1057, 299, 979, -711, -712, 903, 381, -1013, 99, 970, -386, -650, 597, 476, -712, -283, 824, 99, -868, 190, 780, -543, -605, 655, 349, -801, -113, 936, -127, -916, 568, 865, -934, -354, 1133, -49, -1045, 484, 870, -797, -643, 973, 165, -1050, 232]
2019B32O47j475N8J224l78r89O14P54o41o70Q75M58j112j29J141k34j169N90J062
2038H58j004q74J522K76j758N41J590j251r74J645J97j585M22J422r54j004J286
2055C55M23j379J04J204n75p92O92M95o31m66P15M54j003n3J091k58j060N62J021
2074H99j024p49J430J80j641N52J499j356q87J723O3j643N78J324j038q11J378
2091D77K46j347L24J043o31o56P35K69n59k60N25L10p59k17J012j37j128O56R25
2110H28j055n67J334J79j604N84J473j342q46J712j1j691Q63J142j214n96J308
2127D97L5j241M23R53p45n02P28K20n96q3M79J86n54k14Q94q3j060N60R67j111
2147b47n40J356Pj540P11J350j445o85J753j02j643R43J111j354l59J313j63j087
$$ y = [232, 879, -596, -538, 686, 308, -681, -67, 687, 46, -624, 251, 709, -403, -532, 609, 375, -794, -204, 858, -146, -1020, 502, 778, -980, -439, 1151, -100, -1074, 571, 768, -817, -395, 1027, 73, -931, 355, 778, -601, -497, 707, 132, -660, 32, 527, -104, -570, 145, 599, -404, -457, 634, 376, -684, -122, 899, -125, -874, 556, 736, -905, -353, 1146, -210, -1097, 626, 689, -954, -376, 948, -90, -901, 477, 723, -624, -300, 743, 112, -544, 191, 460, -99, -359, 166, 476, -283, -500, 512, 375, -753, -97, 828, -227, -794, 540, 719, -885, -301, 1172, -170, -1016, 696, 685, -1006, -143, 999, -215, -811, 497, 532, -709, -286, 667, -78, -580, 148, 368, -228, -311, 168, 354, -200, -414, 480, 397, -663, -103, 864, -247, -787, 569, 576, -964, -253, 1097, -348, -1033, 720, 618, -1025, -82, 1029, -325, -684, 629, 466, -621]
2165f21N07P25p09l80O57J72n91o2M83K4m12j94Q26o2j036N85R10j135m23J458
2185G22k06j389P78J122j341n59J656k57j560R75J012j357k84J291k78r34N87
2202b2N52n90l66O55J35o09J4M09J61n45j47P78p6j021O57P73j081l75J403l24
2222C81j299R46Q84j269m50J546k98j406J014Q43j368j07J256l85r08O53M51o24
2240a40j90N30J04n50LM82rm96K4O52j56q12N57P62j122k95J337l81j118Q77P56
2261H15j354j46J382l86j213R75P11j243q1J224m40q20P28L61p08j39N53K4m30
2280a87p7N13p3n09J21N89k93o27N95N65r66j79J269n21j017R48O25j245lJ188
2300G16m43j063Q64N99j074j18J122n33p02P29L24n65j73N17P0m53r6N53p9m94
$$ y = [-621, -114, 611, -98, -478, 179, 351, -240, -302, 181, 205, -207, -401, 425, 363, -673, -88, 822, -313, -736, 722, 516, -873, -95, 1027, -314, -873, 783, 526, -1034, -59, 953, -404, -688, 603, 325, -609, -22, 530, -60, -426, 229, 364, -245, -231, 178, 339, -206, -353, 425, 349, -672, -15, 758, -323, -698, 705, 381, -918, 28, 912, -357, -807, 739, 441, -965, 49, 892, -476, -583, 673, 288, -620, 33, 484, -140, -330, 200, 304, -246, -243, 239, 230, -266, -242, 410, 254, -558, -1, 761, -361, -656, 681, 300, -818, 59, 815, -539, -685, 697, 311, -902, 73, 784, -459, -540, 684, 244, -576, 152, 513, -195, -334, 219, 243, -187, -264, 249, 176, -333, -212, 377, 84, -543, 52, 617, -349, -528, 741, 220, -797, 151, 776, -469, -472, 716, 273, -790, 74, 673, -401, -519, 603, 70, -632, 97, 421, -144, -317, 200, 270, -183, -279, 274, 195, -299]
2320b99K18N59m37n53O27M17r12n8J024m34r72R62N08j222J16J132n26q38Q16
2339A28M84j038j1J015m25o86O43L57o26j11N03o7m24kN15r9n24L08M80m99l08
2360c87O76J46q61J49Q69m90p56R06L54j091J31R45n22o97Q04K99q48kQ47k53
2380B19p63N99M41o69j39O10o4m62K3N13j80n36L83M74o31k75P16M6p28K24O76
2401D77m08o03P66K76r93J90Q90n45n85P82K06p61j5P19k27o35M22M57o21j96
2421d04O43k2n27J27N29k80m74M88L57o11j85P18p2p01L57M91n42l26P12K7p71
2442d66K05P81n18n05O81J96o88L7O72j92o12N01L77n61k95P28n7o82K83M46l64
2463c3l24M13L04o73oO89j83o71M86M53n75k02N24Q0o43J94O32m56m22N28K28
$$ y = [-299, -81, 478, 41, -512, 115, 532, -380, -438, 586, 152, -820, 142, 650, -572, -456, 676, 150, -688, 128, 612, -426, -437, 578, 153, -533, 110, 467, -159, -270, 233, 166, -258, -260, 255, 156, -368, -60, 420, -79, -387, 289, 435, -426, -277, 592, 102, -654, 252, 606, -485, -354, 591, 69, -628, 176, 475, -373, -375, 472, 219, -544, 55, 496, -173, -312, 298, 234, -228, -205, 308, 128, -408, -25, 449, -182, -457, 259, 305, -423, -199, 477, 69, -534, 232, 508, -485, -295, 595, 50, -535, 247, 453, -308, -323, 396, 169, -466, -44, 413, -208, -404, 239, 217, -310, -183, 346, 66, -408, 80, 437, -174, -359, 359, 287, -414, -57, 434, -108, -434, 278, 305, -466, -261, 520, 2, -503, 178, 374, -314, -277, 395, 203, -409, 92, 469, -92, -387, 341, 284, -398, -115, 331, -33, -357, 56, 360, -313, -319, 370, 187, -484, 2, 455, -120, -322, 202, 282, -361, -167, 465, 9, -413, 115, 343]
2484C43o09jN79j76n60L28N49o15k81P75q6o95L82N31m53l58N83J13o70Q7N81
2505C47k92n06N32K39n04n4M62m5n22J95M61k66m20N11K50o48O0N30j29o17L67
2526d9M32n69k25Q00j44p28L90N46o35k56O94O4p10K40N57m07l80M75K85n86K4
2547a82M37j21l61J20L59k42l74M19K50n55p7O91k57m48L76M05n51k52O44k5o78
2568d22M48M88o85k25P26j37n97K64M93m05k60M56J42n39J09L78j75k54J23K62
2588A90j64l03K77L40n31o9N97j97n13L58M38o19j53P28j09p83M91N47p15j48
2608c38P57j98n83L98K98l93k09M51km23J11L32k37j60J65K04j56j68J98K22l92
2629a23j23N74j33o10M69L91p03j00P45k06o84M96M88p95m6P77l31n21M83K58
$$ y = [343, -266, -267, 312, 136, -424, -96, 453, -162, -443, 332, 246, -449, -67, 464, 11, -347, 236, 349, -321, -234, 347, 55, -451, 81, 320, -184, -238, 224, 179, -343, -148, 313, 47, -373, 138, 388, -260, -200, 330, 201, -416, -49, 383, -186, -411, 389, 245, -483, -93, 453, -182, -438, 256, 320, -390, -150, 407, 0, -380, 95, 380, -206, -182, 255, 134, -227, -107, 252, 10, -364, 55, 305, -250, -327, 364, 107, -341, 35, 440, -111, -363, 281, 256, -422, 26, 514, -171, -396, 330, 193, -404, -140, 353, -52, -312, 144, 286, -253, -144, 234, 59, -195, -72, 190, 26, -277, 0, 340, -191, -260, 337, 140, -373, -15, 423, -196, -349, 379, 270, -513, -22, 525, -190, -338, 419, 221, -362, 36, 334, -59, -268, 183, 181, -242, -131, 201, -36, -196, -31, 173, 17, -151, 47, 269, -123, -246, 328, 195, -415, 54, 445, -258, -358, 387, 181, -503, -7, 481, -314, -360, 417, 86, -435, 48, 306]
2649C06m68o3M19%l66J17L40k17k69K07J50j58k28K71K09m59r1N65j37n70M45
2670CM36p16n5P24k48n38M59L63p11KP14l08n32N10K05n51L9M39j93k44J57K35
2692A90j76j74J55J65j55j56J81K55m39p5N03q3n96M58L55o94o8P30k94n86O02
2713I8K81o92L1O61l07m57N08K16n87J32L50k19j99J67J68j62j75J82J61k13j24
2734a80K56J39l79o4N28j39n03M44L25p18O6O74l54m93N42J91o79J35O04l85l86
2755c76N18J41n70J22L85k51j79K38Q3p5j40J54J85l44l0K01J55l98O2M33k35
2776G9m71M33L01o94P4O92l64m30O04J21o10J23N40l75l69M83J16n03R5L91k43
2797gk60L27n2n8n6J02J80k29j01K54P5l62P5L82k73l03M43J58o39J59O14m80
$$ y = [306, -162, -225, 194, 194, -172, -55, 285, 68, -201, 6, 156, -2, -230, 41, 250, -209, -300, 265, 128, -442, 3, 439, -277, -332, 392, 144, -394, 65, 428, -283, -281, 433, 125, -407, 103, 308, -243, -204, 235, 42, -202, -45, 190, 14, -160, -5, 160, 5, -151, 30, 285, -154, -229, 274, 191, -405, 53, 408, -286, -354, 376, 82, -504, 98, 379, -313, -282, 379, 72, -385, 123, 339, -248, -116, 234, 15, -184, -17, 151, -11, -186, -4, 157, -56, -180, 76, 215, -164, -228, 300, 161, -342, 102, 427, -291, -225, 449, 95, -398, 144, 335, -344, -209, 395, 10, -376, 142, 283, -287, -165, 220, -31, -210, 28, 111, 36, -104, 50, 235, -109, -139, 62, 217, -181, -119, 314, 79, -392, 41, 342, -352, -278, 414, 50, -380, 224, 345, -265, -142, 398, 23, -346, 137, 253, -250, -155, 236, -7, -267, 60, 8, -50, -106, -4, 176, -53, -154, 100, 175, -187, -112, 270, -3, -306, 137, 295, -344, -185, 429, -51]
2819e1l21N66P5n93J78M24l15k51M41O8l92O6L35j73j92K83J2j76j29J42J50j70
2841b3j75K91Ml78J78L57k96k43M32J23n56J82M90l54l80N56Q5o51K73L99l27
2862a3k73M02N4l61O3K97j80j57K81J2j45m4J24P6k19q1L03Nl47J98K62l51j99
2885b93M76l4m02J39M06l53k85O00On69K46M27l87k07L59N5l69P6L18k19k39L07
2907E8J11j94j16J61N6j46k2K25o4l14J79L22l24j06L20Ll84L07K05l08k42L94
2929A21P5n11J58M20l17j48L17J0k97J22K29j41k06K15J72k62j60L20J7k51K3
2950i4K14j09k31K48J95l62n9L74j32l21K87K44l37q8L21N2m12J58L35k96k14
2971b27L38M4l35P8K80j50k39K38J12k44q2L14L1k85O0K81j97j85J66J76l55J5
$$ y = [-51, -372, 194, 269, -324, -146, 278, -37, -288, 153, 221, -171, -105, 230, 57, -135, 148, 160, -16, -145, -3, 147, -23, -198, 93, 97, -281, -103, 254, -42, -285, 147, 270, -286, -104, 386, 32, -348, 208, 293, -358, -85, 314, -13, -286, 116, 170, -191, -128, 169, -11, -168, 113, 125, -20, -64, 60, 136, -83, -164, 139, 144, -203, -5, 257, -94, -293, 183, 149, -253, -114, 292, -61, -346, 254, 260, -309, -63, 364, -23, -230, 129, 184, -185, -109, 209, -10, -249, 58, 169, -25, -141, 20, 76, -70, -92, 133, 69, -245, -66, 256, -68, -174, 146, 149, -235, 72, 277, -31, -273, 121, 196, -315, -157, 263, -54, -202, 115, 125, -172, -50, 179, 38, -168, 47, 219, -43, -203, 117, 134, -117, -94, 120, 11, -220, 28, 223, -139, -198, 176, 44, -277, 10, 254, -83, -171, 150, 202, -210, -52, 283, -13, -227, 111, 155, -180, -102, 178, 28, -211, 27, 139, -105, -187, 127, 158, -127, -67, 214, 17, -168, -2, 174, -181, -166]
2993a66L47j57k05K01J28k38j22L26j7l04P8L25k25j50L16Qk95M1L17j94k13K51
3015E2J57l26r1L73r6k47J39K58k60r2K59Jk48k1L75k19j84K20J13k62J8K09R
3038A37k67Q9K07j87j70K93M8l47Q5K52o0l32K94J82l54J9L09m3l50J28L01l08
3060g4l3K60j24j70R7K16j31k41K68J15l34N8K10l3j87L2K47j66j77K54J13k91
3082i1m1K82j38k36K75J30k97k8L32j24k66K57J32l09K8K86j70j61J09J57j34
3103go7J76ok57J20K07r5j63N4J53r9k23K01J84l14K4L08j35k26K54J36m21N9
3126a37L54j64k83K71J64m09O5K32m6j96J66P0j46l7J47J10k05MJ35k0j46K3J50
3149A02m5k29J62K16l66j3M29k18l01M09N1m23Q0L53j85j97K82J33l38J3K32j39
$$ y = [-166, 181, 24, -181, 20, 148, -90, -212, 114, 97, -207, -129, 196, -29, -179, 137, 145, -150, -109, 208, 14, -199, 52, 209, -117, -208, 165, 69, -178, -39, 219, -41, -133, 126, 127, -121, -142, 233, 14, -170, 50, 163, -99, -81, 128, 137, -130, -41, 166, -21, -191, 102, 150, -197, -112, 140, 80, -252, 42, 224, -130, -111, 198, 155, -195, -67, 234, -74, -107, 153, 29, -141, -44, 172, 41, -200, 68, 183, -151, -93, 117, 84, -103, -71, 176, 10, -167, 87, 200, -91, -132, 150, 12, -224, 51, 181, -116, -144, 188, 64, -202, 55, 187, -122, -94, 192, 22, -139, -30, 127, -7, -74, 102, 96, -161, -41, 166, 71, -92, -38, 115, 16, -207, -6, 178, -136, -112, 196, 61, -165, 89, 225, -196, -137, 217, 53, -230, 41, 205, -204, -139, 93, 47, -149, 17, 87, -59, -96, 51, 161, -44, -40, 95, 75, -71, -48, 102, 57, -172, -10, 206, -160, -173, 256, 38, -263, 146, 197, -226, -146, 207, 22, -175, 107, 240, -98, -85, 147, 8]
3171Hj63K21K2j59RR6lj26M6Q3Rj69P8J30m2j92K00R7k62K1L08j76k24K93J25
3196B30m37J02L50k82j76L16nk93N6L18k03j24K49L1k39N5Q4M0r7j6J81j59p6
3219i5R7J24j66q1J94Q0k53n4L26j46k44L67M4m27K18L31l85p8K81M4k83O8K40
3242B02k20j46K73j8k07M6Q1k5k6l7J67k9k11N7K55j68q7J86J0k01LK91k10j95
3266b09K97Q5m10J63K73k62j13L01k9k51J15J98j88q8K41n8j15N4N5j31P2o8R0
3289B2L9j40j1J61n7j85K52j5k11R4K67j94k00K72J21m48J92K53k89q7L40j38
3311C8k10J40J42j44o9K53j22j06O1J23n5o8L3J6J6j35N9J62j72r7L10o5k64J42
3335a2J46k18j48L48K7l66J50L16l37o7L10q8k49K20Q7j47n7J57j9j78J38R3j32
$$ y = [8, -155, 66, 88, -71, -62, 34, 31, -95, -49, 34, 43, -126, -48, 82, 40, -152, 48, 145, -117, -96, 212, 36, -188, 105, 230, -207, -105, 245, -37, -213, 103, 98, -195, -139, 179, -24, -148, 101, 132, -107, -52, 32, 72, -25, -41, 140, -19, -95, 2, 126, -40, -121, 73, 153, -100, -154, 172, 26, -218, 149, 193, -234, -16, 315, -70, -148, 133, 177, -106, -38, 202, -18, -164, 109, 91, -116, -70, 11, -14, -40, -77, 90, 61, -150, -93, 162, -6, -93, 93, 103, -98, -95, 196, -14, -209, 88, 173, -237, -74, 199, -63, -176, 125, 96, -155, -40, 158, -30, -118, 123, 65, -50, 4, 59, -72, 0, -68, 22, 61, -79, -90, 71, 14, -171, 81, 66, -145, -51, 216, 22, -178, 94, 215, -233, -41, 212, -77, -164, 176, 38, -172, -32, 110, -34, -103, 150, 28, -78, -17, 106, 51, -17, 16, 32, 48, -87, -28, 134, -38, -135, 175, 110, -154, -12, 134, -84, -232, 116, 143, -223, -73, 243, -94, -161, 149, 61, -188, 32, 119, -28, -85, 72, 53, -125, 13, 106, -26]
3358b6n1M0R0l9q0oK00j39r7K06j9k28J49J97k12j46K83o6j81O2K74l51m5L46
3382A61q3k36J36J77k03J5J16k1j04N8N2m1r4R1L6q3j0J0Q8r6r3J45K2j42O5K02
3408A68j95p8K98q5k32J13J50j81r7K57k1k61J20J58k01KJ36n0p8J5J09o4p5Q4
3432hL5j4l2N8Q3j87j1J71o6j55J16J45k36jJ98r5j39J38J45k24n6K32k1k19K04
3457F1N0j56J6J40j15q2L4Q3l2r6J07M3n4q9J39j4j38O5J43r4j06O1J57k28J4
3482i1K26q0j00R3L1r0j03J97j9j52O5J49j50m6J19K4j46N2J07l3j11O1J19j69
3506d7l6J52k5j60J48K9r0p8J34O9k02O6J68j30j36Q2J45j39j4J64j9j58J00O8
3530I1j17k3P7K7j56K9J33j2j34Q4R5j70l6K08n4j33R4J62k04JQ0L8j66jJ81r8
$$ y = [-26, -77, -37, 53, 14, -66, -72, 128, -11, -108, 98, 79, -149, 0, 197, -15, -161, 122, 56, -125, -63, 211, -140, -185, 161, 78, -158, -22, 155, -48, -33, 83, 62, -42, 16, 68, 27, -67, 24, 60, -23, -33, -23, 65, -31, -124, 21, 43, -99, -34, 168, -27, -105, 193, 108, -124, -11, 139, -42, -139, 118, 97, -164, -44, 114, -87, -85, 51, 1, -77, -62, 47, -17, -92, -8, 27, 13, -19, 39, 122, -65, -76, 95, 29, -126, -10, 135, -101, -102, 96, 1, -138, 0, 145, -79, -135, 97, 76, -143, 61, 111, -45, -29, 111, -4, -86, -52, 31, -1, -97, 10, 53, -1, -90, 49, 35, -103, -38, 105, 11, -95, -34, 123, -105, -91, 135, 55, -45, 48, 79, -11, -114, 83, 64, -88, -23, 126, -24, -70, 49, 73, -73, -21, 86, 53, -58, 3, 122, -47, -83, 69, 44, -116, 32, 61, -29, -107, 27, 96, -106, -40, 128, -2, -138, -56, 89, -50, -64, 100, 81, -77, 23, 91, -26, -49, 28, 55, -101, -72, 61, 49, -85, -1, 94, -76, -112, 96, 42, -91, 3, 165, -39, -38, 42, 80, -86, -87, 94, -4]
3556dr1J07O6j61O0N0j0r6M0R4r1r5K68o3j92J70L6n3j09R2O2j60J4J93j32r0
3582i5J60l8j11J9J18l6l1o4J90r5j63J69O1j05rQ9J0r4k7J25r1o8J31M8j55R8
3608C6L2j9j18J53j3j52lJ79j6j81J53kj21L6J04j8j03O0N3p5n3O2P0j06qJ08
3634E8mo9J3P3o8j22J39M2j44L9J58r3j25K01o0j26L4J62j34p2J49%j21L9J57
3659A26j21m5P6KK9j12j1P7m8n6J62o8p3M2J45j07j25J71J8j95O6J95k45m0K23
3684H6qj41O2R7r6r3Q7L5o1M5J5r5L7P3rl5j1J2M1l6p8J13K2j72R4O6l0r4J11
3713C7O8k11N0J62j30j32K48n6j43O5Q7p5l7J57%j71NJ54p6J5j3KKm9M9L0j1q7
3741f0R0N4j33K6R5m3j24J99j7j86J04J68k08q9J94rj58N0J57k13N0J27o8o1K4
$$ y = [-4, -95, 12, 78, -83, -23, 27, 17, -79, -39, 55, -36, -131, 137, 74, -118, 52, 88, 35, -74, 18, 80, -80, -66, 127, -5, -95, 65, 27, -84, -65, 53, 17, -14, -78, 112, 17, -146, 23, 84, -21, -30, 59, 69, -25, -52, 73, -18, -86, 45, 93, -62, 36, 68, 49, -69, 84, 71, -81, -84, 95, 79, -102, 51, 49, -72, -36, 68, 50, -53, 7, 60, -15, -68, -6, 64, -42, -50, 58, 54, -15, -2, 71, 3, -119, 20, 62, -82, -43, 115, 22, -103, 98, 38, -88, -54, 108, -26, -98, 51, 51, -70, -31, 126, 5, -40, 36, 38, 67, -45, -56, 21, -27, -83, 79, 11, -62, -20, 125, 18, -107, 64, 82, -113, -47, 148, -97, -137, 86, 78, -63, -1, 96, 0, -93, -6, 29, -32, 13, 28, -67, -30, 43, 34, -1, -12, 0, 41, 5, -73, 40, 62, -110, -16, 50, 20, -74, 37, 105, -106, -56, 106, -24, -156, 92, 36, -107, -42, 45, -30, -67, 90, 90, -81, -76, 78, 2, 17, 4, 6, 8, -41, 8, 38, 27, -60, 30, 84, -49, -23, 72, 29, -95, 104, 87, -99, 5, 173, -35, -124, 70, 61, -97, -47, 110, -103, -53, 74, 6, -55, -31]
3766c1J07j35K2L9K4o3M7j2L4k9m6O0Nj06K5J83j49k2J49m4j25L8J74j51j17K44
3792A21l3j98J65J8j40k9R0J5n9K3O4o2p6P7J3qLJ6oM5n5j1Q0j05O1N7q4n2J99
3821A29p7j72O7J07j6j30J53o5j59J54J01j34oJ23l2j00J02n3L2p1K1K7m4OP4
3846C7k9m0JL4N1j33l1J71j23J0J51pj81R6J09j33r3K09o3j33Q2R2r3o1J82j05
3872@o0O3Pm4J9%P3n1n0P2j4J6n1N4l9n3k2J76j10p1R9M6j74O4J12q0n3J03mj17
3902h9M2J46j11n7J39k8o6l4J18r5K4L5nl8l3O0O8p2j9j2N2q1O3J03j31q1J77
3929G5j5j76J65P1k07%K31j18j19Q4J08j70KJ42l4j60J08P5o7QK2m9L9o6N3K3
3955B5q0J8O1kp5J8R5m5q3J31n7r7J39M0j68J8J31o4o7N1L2j27L6Q9k4p2L7J13
$$ y = [-31, 76, -59, -37, 2, 26, -37, 10, -2, 32, 3, -43, 17, 22, -84, -59, 124, -25, -47, 102, 58, -67, -29, 145, -6, -123, 121, 88, -110, 55, 73, -67, -96, -6, 9, -50, -27, 37, -25, -101, -24, -11, -19, -16, 0, -6, 39, -16, -27, 53, -52, 9, 66, -18, -70, 129, 52, -120, -53, 54, 38, -92, 61, -4, -163, -9, 92, -42, -48, 75, 43, -57, 45, -8, 24, -47, -26, 1, -43, -37, 37, 8, -32, -31, 3, 54, -79, -110, 61, -62, -52, 99, 92, -89, 7, 116, -17, -110, 99, 36, -97, -15, 77, -16, -77, 105, 0, -60, 3, 10, -34, -15, -15, 58, 7, -43, 29, 15, 31, -20, 34, -5, -58, -80, 96, -14, -85, 14, 60, -114, -50, 62, -18, -71, 32, 28, -89, -47, 99, -12, -69, 70, 42, -24, -58, 60, -35, -11, 24, 19, -19, -52, 8, 76, 4, -15, -27, 25, -56, 7, 110, -21, -102, 75, 60, -116, 49, 120, -87, -87, 144, 26, -93, -9, 99, -71, -69, 73, 39, -121, -13, 62, -5, 3, 25, -24, 15, -51, 2, 25, -55, -37, 24, 22, -53, -35, 60, 15, -68, 63, 6, -91, 48, 88, -80, -62, 69, 5, -62, -11, 21, -106, -70, 19, -5, -77, -40, 73]
3983G3j19RJ01o0j0jJ0k9PM0R0o4q4O1K6l6o8J14pj33R4J5r3lJ14m5q5Q5N0p2
4013b0JM1J2j11J07k2l0n5J46m6p0K1N1J2r5M3P6m3l9L6Nn8N3J6k1n0O1K2q3R
4043c1J25m1r8J40m8j10J0K0P0m1l9R4m5j16J25j3n3L7O0j07j0Q7J9p4oO3o4K
4071d4K3R0n2l1K5J01q9l8Q2n9m6P3N4p9m4L7L6q4M0M3n5n0J09j5p2L7O4jo4J8
4101IQm3rL5M1o6J8L6k8PJ3L4j01k1J08m3l5MJ23j32K4J5j2J3K0R5j26K7M1n0
4131EJ5pK0J6j01Q5K5q8K0J9k1k4M5O6o1n8R2l9n4L3K1J6m6L0J0k7n7O5J9n7O
4162c2R4m2q0R5Lq0K2O9j05M8L4K7n1n2J06r2m6M3M9l8L1Pn6O0k9JmKJQ2r2l4
4194e9L7N3j02L7O7m3p4Q7No3P1P6p9r7P2K5o8N8M0Kr7L9K5m6Q2m0rj3L3l4K9
$$ y = [73, -46, -37, 64, 4, -6, -7, 3, -26, -19, 21, 111, 47, -37, 24, 50, 14, -54, 60, 53, -80, 14, 29, -64, -67, 47, 2, -83, 2, 52, -20, -19, 22, 34, -77, 30, 8, -22, -77, 69, 23, -47, -26, 25, 37, -58, -15, 61, 18, -21, 15, 20, -38, 15, 31, 10, -40, 21, 43, -40, -31, 94, 53, -45, 95, 47, -63, -53, -33, 37, -4, -43, 51, 6, -110, 15, 2, -51, -14, 46, -61, -71, 16, 35, -39, -45, 18, -46, -44, -21, 69, 17, -14, 11, 112, 23, -15, 67, 8, -38, 35, 89, 10, -34, 3, 39, -45, -5, 38, -17, -67, 42, 27, -45, -8, 56, 55, -9, 9, 17, -26, -35, 0, 41, -25, -7, 29, 1, 8, 21, 55, -46, -67, 41, -2, -37, -33, 90, -42, -18, -3, -15, -2, 18, 113, -13, 14, 55, 5, 20, 13, 33, 49, -52, 33, 58, -30, -10, 9, -12, -36, 9, 75, 14, -44, 48, 9, -45, -12, 9, 25, -21, 9, 19, -8, -65, 0, 19, -38, -32, 62, 20, -60, 35, 38, -42, -20, 49, -56, -8, 26, 53, 2, -50, 56, -36, -82, -39, 10, -28, 3, 10, -46, 14, -15, -14, -18, -16, -15, 67, -25, -59, -22, 31, -71, -34, 33, -10, -84, 3, 8, -55, 16, 92, 13, -84, -12, 13, -55, 3, 43, 45, -52, -13, 12, -34, 48, 8, -1, -14, 19, -15, 14]
4225A4j8Kj7qq3J38j1q3J09M0o2k6K9Om8jJ48j11l7R9m0j07Q1M0j21O8m6M3k7
4254b9L0L5j5L4q6PQ6p1N1k0k3m1O6j2p1M4O7q2J5N7m6o7J9J07q6j7P9K4j13P9
4284B1M4n4n3O9J1k6PJ0l1j7M2jk1L0o0j1L1j4M3L8n7m6J35j19J5M4mq0O4L1j
4315D0q8P7m4l6M2P2j35N4R2k9r1L8M8k3k5nR8j05kL6llj1M1L4j73P4P2l3p2Q8
4346B8J9p4M1j1m2K5M4k1k3M3o7L4K4Km0j0ML5oK1n8Q1m5j9j3N6j2m5O3Jn2K1
4378DP1j02K7%K5j34J04O9j23O6L1j7q3M2O0q2L0N8m8l6N1KK0o5J8Nj2NP6Kn0
4409A4j9j6Q3r3P6J8q1J5Q4J9j13N2J0p7KP5n8%m8J2M8K2j6J4n8Q2k0kn2MM5o
4441A6n2J3N7k8L9J0l0n6R3l7p4L8O6Jn9M1K9j05j8N9J1o9O6J4n4l2J25o8k3L
$$ y = [14, -4, -2, -19, -27, -110, 28, 17, -66, 43, 83, 21, -5, 24, 30, -18, -19, 129, 18, -19, 80, 40, -67, 14, 54, -67, 1, -45, -2, -29, 1, 36, 21, 55, -31, -24, 62, -9, 42, 22, -1, -42, 24, 12, -59, -15, 52, -30, -15, 42, -4, -71, -52, 55, -31, -48, 31, 55, -58, 21, 65, 11, -42, 27, 38, 12, 19, 29, -2, -19, 23, 22, 1, 31, -29, -40, -9, -23, 20, 58, 1, -45, 90, -29, -14, 30, 26, -54, 10, 41, 40, -48, 29, -15, -51, -9, 63, -72, -18, 74, 45, -46, -8, 40, 17, -8, -13, 85, -20, -22, 14, 11, 8, -3, 38, 72, -101, -27, 45, 12, -60, 28, 47, -27, 14, 3, -39, -14, 30, 9, -14, 29, -38, -4, 20, 22, -18, -28, -24, 11, 5, 26, -32, 49, 4, -15, -28, 28, 16, -29, 34, 35, -17, 4, 75, -27, 0, 0, 25, -109, -5, 64, -59, 7, 38, 21, -62, -20, 40, -42, -12, 46, -2, -38, 13, 15, 35, -30, -12, -7, -19, -14, 62, 64, 14, -5, -21, 62, -31, 45, 63, -18, -3, 81, 100, -13, 39, 49, -28, -26, 49, -9, -9, -57, -45, 3, 25, 9, 23, -35, 47, 27, 25, -27, -23, 22, 16, -36, -23, 34, 6, 45, 55, 25, -31, 62, 25, -49, -11, 55, 56, -3, 38, 67, -38, -56, 3, 14, -55, 11, 25, -29, -61, 64, -4, -27, -24]
4471b4OJ2MMJ7NL1p7L7k3L9O1r5k4O7K8o5l7Q3n5J2jMl6K2M7n4K2k7L9k4K2K1
4504D1l0n9O4K6p0K4j5j7JM8m5R1r5O3Qo8j6P2kL0q2N2J3o5M3K6p2J4J3l7K0M5
4536B1ok4l2K9O1j08J8O7k5m6J2N7k3j8L3JK9n1Q3j23jN4Lm9NM1Mn8NP6q9K1O0
4569B7m0k8Q1KNm1J0Mm2M0M4n5l4M4m3K8j2RM8m2j1N8j8q4L7Mk3O2nk0j4l4R3
4602E0l1p4M6J3l3k7O0%p0O7pj4M1M3p2m3N0J9j3J8L3o4j5P7o2k5ON4k3l5M5J3
4634B7j4k1O2n0JmL5m1j06J21k5K2j3l5J04j06K5K4p4rR7L8j36K6N5k3L4L2p8
4663c2N1m2Q1j7l7J0O6m6j5o2Q2k6k7K5Ok9k2RK3m6RQ2l2m6L7m7QN7J6l8l3N4
4695A9ql6K2pK7rM1n0rK8j7K1j06J58o9p9Q5pN0j09K8L7o7KP2Km8N2k5ll9M4J4
$$ y = [-24, -18, -6, -2, 2, 19, 24, 55, -22, 15, -8, 31, 92, -3, -27, 40, 68, 3, -34, 49, -6, 6, 5, 9, -27, -5, 42, -12, 10, -17, 22, -2, 20, 41, 11, -48, 16, 42, -28, -4, -19, -36, -35, 13, -32, 59, -36, 27, 35, -33, -49, 23, 21, 51, -31, 21, 34, -31, 12, 38, -34, -20, -7, -44, -24, 21, 15, -9, -41, -12, 49, -59, -41, 26, 1, -45, -33, 24, 1, -17, 16, 17, 46, -5, 78, -45, -46, 8, 11, -38, -33, 8, 12, -46, -41, 35, -54, -33, 27, -13, -41, 40, 42, 47, 6, 16, 20, -22, 18, 62, 7, -27, 17, -26, 2, -10, -1, 47, 5, -6, 52, 34, -50, -13, -9, -32, 30, 25, 5, -9, -43, 50, 19, -55, -9, 4, -29, -56, 4, 4, -66, 1, -6, -20, 21, 64, -8, -51, -1, 18, 5, 23, 56, -8, -23, 54, -8, -33, -27, 27, 4, -31, 14, 27, 13, -8, 54, 4, 5, 1, 36, -5, -111, 10, -15, 7, -6, -41, 63, -43, -18, 6, -68, -77, 20, 58, -78, -52, 3, -20, 14, 46, -32, 19, -23, 58, 41, 4, 14, 80, 34, 19, -43, 39, 13, -14, 11, 17, -12, -34, -25, -2, -48, -39, 43, 11, -35, 2, -45, -37, 20, 36, -2, -35, 19, 11, -25, -3, -10, 17, 8, 49, -1, -10, 18, 1, 22, -84, 74, 5, -74, 11, 4, 54, -55, -27, 10, -57, -55, 17, 19, -29, 23, -2, -5, -44, 0, 14]
4728A4o9M4j7m0M0K3O2n6K5k2k2J5kK7Jk7L9p8O5m5JR4j27P0k1K5p7O9Kl4j5O9
4760C3o8J2N8k9l9K7P6j56O0J8j4J6O5m1l3L7J1n0J9oJ3m7pN9k9jJ0j5M5J9n0
4791gN8l6k8L7OJ8k8NJ2k6j8k5OoN1m7OL3j7k7mM2j4J8j0k1N6qk7N3m4j7J1M3
4825D5%o3O1j7j27Q1P2n4m1Q2m5m6O5N7p4o5J52o7j6N8k0p0l0P8On2%j6O5n1L9
4856Gk6j2MMj4L0lN0Mj11O8K3n8nJ16p6n2M6L3k3J5j7j1k1L1Lj4M0l8J6pJ5j9
4889bRl6o3R9j5Nm0P1k2l4LK8j3L0Qp0L4M1k2o9Q0m7K3m1L3M7q5K3KL3l9J2M2
4922B5k4m0O9J6o3M9k5K7k3m7M5Qm2M7l0l5j4R6o3j8Q3n6l6Q4K8k1o5jM2j7k6
4953b7N5m9NN2Kl4O1n8Op4P3j7j2o1O2nJ8oj1O7n7M0K0pq8Q0J6r7L3j8J6j4L7
$$ y = [14, -55, -11, -28, -68, -28, -5, 57, 1, 26, 4, -18, -3, -5, 22, 23, -4, 35, -43, 22, -23, -22, 72, -55, 15, -6, 19, -58, 11, 13, -21, -36, 33, -35, -23, 35, 6, -33, -6, 70, -86, -26, -8, -22, -6, 59, 18, -15, 22, 33, -17, 2, -4, 9, -38, -45, 14, -15, -16, -6, -21, 24, 43, -7, 51, 15, -13, 24, 30, 48, 20, 25, 37, 11, -7, -32, -26, -32, 19, -28, -22, 11, -6, -33, -37, 5, -9, 9, -1, -22, 34, 26, -1, 52, 8, -9, 2, 45, 45, -18, 43, 26, -101, -20, 52, -2, -43, 39, -6, -52, 13, 70, -4, -69, 83, 16, 0, 58, 38, -32, -62, 16, 22, -30, -30, -46, 19, -32, 7, -19, -31, -27, -23, -37, -7, -10, 40, 44, -67, 1, 24, -34, -39, 77, 1, -51, -5, 28, 5, 20, 3, -8, -29, 2, 5, -9, 31, -7, 9, 2, 17, -2, 7, -29, -92, 7, -8, -3, -43, 28, 6, -28, -25, 3, -10, 20, 28, -42, -8, 33, 11, -58, 22, -25, -2, -43, -10, 37, -48, -25, -23, 10, -29, -17, 25, 1, -39, 30, 46, -17, 32, 7, 34, 11, -36, 9, 17, -25, 22, -8, -43, -57, 39, -24, -42, 41, -15, -51, 33, 61, 40, -25, -26, 16, -1, -27, 28, -21, -16, 36, 38, 4, 65, 7, 13, -61, 12, -5, -17, -78, -16, -21, -3, -9, -20, 47, -10, 30, 50, 43, -45, 35, 51, -46, -13, -31, -15, -29, 8]
4986HJ9m4L5k3j4M9j0l0l3N8n3L0J5ljpN9m3J9q9M9L4k1J3k0QM0r5R2m9jmk3O4
5020B9m1J6%m3OJL2J8Oj9j8J7L1k5nl4k3Q2k6oM2j08Q1K5J2j17O2M2l5N4Oo0n2
5053e0Q8k4k6J0L6o3N5j8N5j8r4O4%nl3P2n0lj3Lqm3P7J6p0M8O8j07N1J9m7J9
5085IJ7K9j0m6K5jl5K1%l6KK7k6mRnO6J3p4O2r0nL8JJ0l0RN6o6K7jjk6M0J3k5
5121gOmMl8M9k3N4n7L0L9l5l7L0Rl3K9k8o6R1L9n3L2j3Pkn4J8j6lj7P7l5k0O9
5155D2k6j7n3N0M1m4J8j1j8%K7J8k9M3m0M0q1Q4Nn3J2M3j8l3QK0m7L9N0j01OJ6
5187iQ8q4j5M9Ko3M8Kj1n4N6N9r8pM9j5n1P5l0k5N5j5p7Q9l5R4p9J0N3o7l4M5
5219EM8l8lk5MM5n2PL4k8K6o7j8N3J9L2l8j3k7NQK8J9k3oK1k2j0M6jn9O9k1mk3
$$ y = [8, 27, -17, 18, -5, -19, 30, 20, -10, -43, 15, -38, -8, 7, 4, 3, -4, 55, 12, 31, -58, -9, 25, 4, 17, -3, 5, 45, -50, 42, -7, -8, -12, -35, 29, -12, 4, 4, -39, -33, -32, 0, 18, 24, 5, -13, 4, 35, 10, 5, -29, -52, 30, 4, -2, 40, -68, 13, 38, 50, -67, -5, 37, 2, 56, 62, 2, -50, 38, 14, -12, -2, 34, -29, 26, 8, 63, 45, -49, 15, 15, 10, -23, 49, -1, -4, -17, -14, -22, -65, 12, 28, -42, 6, 74, -33, 18, 37, -10, 9, 26, 55, 45, -1, 24, 23, -12, 9, 9, -27, -25, 2, -24, -28, -19, -24, 42, 55, -19, 43, -47, -52, -14, -13, -3, -33, -24, 32, -34, -7, -8, -9, -35, 5, 18, -7, -1, -5, -1, -39, 10, -13, 41, -16, 14, 53, 18, -19, 11, 20, -13, 16, -12, -78, 13, 52, -1, 31, 18, 25, 23, -31, -13, -29, -32, -49, 28, -7, -27, 42, 16, -1, -54, -4, 37, -7, 11, 0, -18, -18, 9, 27, -2, 41, 1, 41, -40, 44, 49, -4, 8, 51, 33, 0, 8, 28, -19, 20, 70, -31, -25, -9, 79, -5, -20, 29, 31, -32, 16, 18, 7, -47, 9, 68, -30, -37, 12, -3, -54, 21, -9, -34, 21, 6, -71, 18, -17, 77, -2, 8, 61, -6, -40, 5, 53, 15, 12, -13, -9, 36, -16, -9, 25, -3, 23, -44, -62, -9, 10, 42, 4, -9, -36, -31, -23, 5, 24, 1, -5, 16, -6, -16, 30, 29, -30, 39, 18, 14, -9]
5254iL7L3q9L8MK3n4PMM3k4l2KO2J9m4m7k5M8k0J3k6N0m6O0n4J9Op1P8L7n9N4
5287C7n5k5L0j1Q4p7J1L7J2k3J7l1k4oj5L3j7J8K3M4n7m4Q1n6n0K1J02n0p5R2
5317B6p8N2JL0q7M5K3j2J8o7L1m0L9L3l3K1m6J0L9m7K6L0j2m2K4O1m5p7Q1K9p
5348B6J3n1lJ6n0O2n6N4j3Rj9jJ8o3O0k5P0j05J22%j03N4k7j2L6JM5l6l7K2ll1
5380b7L8J1Lm4K6M4k2r6R1Lm1lM5l9K0K4k3J4j2l2kN3Mk0m4M2j8n3O4%L5l4p8
5413g1O8m8K1lL8M1o8P3J7m0o8M8K2k8jO1j02JP7m0k7j0JRpM1m3PK7K0j4MK3m6
5447a7N4q6L4K5n1K9J6N0m1l7K5kj3lO1q9M8K0j7J2L4j07R8o7J7l5N5j9K5k4j9
5478b4K0K1o1J4M8o%K5l0n4L1mL7q5M1L0N1o3lok7K8M6n1L2L5j1k0P0j02L6K3
$$ y = [-9, 28, 61, -28, 10, 14, 37, -17, -10, -6, 37, 13, -19, -17, 45, 64, 20, -27, -52, -4, -24, -11, -37, 13, -33, 27, -27, -8, -2, -73, 5, 42, -17, 37, -18, -43, -13, -24, 60, -17, -6, 31, 43, 20, 37, 6, -18, -24, -39, -6, -23, -5, 18, 62, 5, -39, 42, -14, -64, -43, 59, 9, -66, 26, -52, 0, 1, 31, -56, -11, 12, 0, 18, -49, -18, -58, -19, 14, -19, 2, -44, -34, 5, -42, -16, 14, 2, -40, -16, 45, 0, -77, 4, 33, 26, 39, -12, -15, 1, -49, 13, -43, 11, -2, 7, -12, -13, 5, -58, 2, -23, 47, -58, 64, 64, -39, 15, -12, -24, 12, 13, 58, 22, -15, 7, 4, -27, 11, 22, 25, -19, 7, 51, 29, -67, 24, 27, -14, -17, 28, -11, 9, 33, 10, 24, 12, -20, -22, 31, 35, 15, -29, 13, -5, -58, 6, 6, 41, 7, -71, -3, -51, -30, -33, 5, 46, -22, 51, 68, 28, -40, 8, 30, 2, 1, 62, -40, -39, 38, -2, -29, -39, -38, -29, -36, 5, -38, -31, -4, 16, 2, 6, 29, -17, 37, -49, -15, 10, -41, -12, 4, 54, 13, -24, 1, -1, -14, -17, 44, -45, 3, 23, 6, 18, 52, -55, 43, -24, -7, -42, 13, -6, 19, -5, -24, -4, 17, -44, -30, 18, 12, 12, 37, 7, -47, -16, -20, 17, -68, -27, 3, 54, -9, -12, -18, -45, -17, 29, -22, 10, 45, 34, 14, 84, -18, 18, 41]
5510D1k9j7P9o0mr%Mk6L4Kk8PpJ1J5l3j7M4l8J5L7k8j0J8O0n6j4J4k4j3l2O9N7
5544F2n7l5L4K2%o7J6P2p0K3K4j2J6mm3J5J2K1pl1k7M0j6KM5m4m0L7J0J0NK8o3
5577b2M3l0J4m0MM7J6m1K1j4j5M3k6M6o5J6l7P2k4N5k7J0l9L5l7k2M4l5L3j6l9
5608c0O2m7K5J1l2pk1J7lN2pn6L8k3O1o9oJ2J8PL8n4M2J4j6j5m4K0kqL9mj0mk9
5643c1O2m2j6M2J5k6m9K7J9p2M8J2J9k5L3Pj03P2Mk5K8K6j4j6rj6M2mKjJ1Ppj3
5677Gj5RqO4n8N7m6k2M7q5N7K6n3QJ8k7N8k8k2l5P0%l3n4N2J3m3N7j3l5Q7m1k0
5710hM6j4k9n0L6O1ro6O4o4P7l3j5mj5j4%K9K6J2nnJ7k4J5Mk5k0KK4l0L5k5Jj1
5745a7K3k4K2lnJ2J5j2LK2m9P4m6po6Q5n1O2m1j8ON5j15J00K4p6M9L5l8qj0Nk4
$$ y = [41, 12, -5, 74, 14, 10, 1, 1, 5, -21, 13, 15, -13, -6, -13, -2, 13, -20, -37, 7, -31, -16, 21, -7, -17, 1, 61, 5, -9, 5, -19, -32, -64, 5, 62, 5, -30, 4, 26, 26, -41, -25, 47, -23, 0, 24, 12, 28, 24, -19, -4, 8, 29, 22, -9, -36, 4, -12, -10, 35, -9, -49, -12, -2, 8, 13, 41, -22, 21, -9, 5, -35, -31, 16, 32, -9, 12, -2, -17, 26, 0, 46, -19, -3, -40, 32, 8, 63, 36, 46, 7, 42, 5, -17, 27, -8, 25, 9, -30, 32, -15, 10, 21, -11, -18, -39, -22, -25, 27, 20, -36, 2, -21, 40, -29, -35, -23, -5, 2, 40, -14, 28, 42, 26, 11, -33, -13, -15, -23, 16, 12, 2, -2, -31, 31, -11, -27, 15, 30, 4, -45, -18, 1, -71, -23, -11, 8, -17, 16, 23, -80, -8, -4, -29, -1, 25, 11, -5, -14, -30, 12, 8, 10, 9, 20, 27, 20, 7, -8, 1, -7, 57, -1, 56, 10, -12, 35, -50, 7, 33, -20, -12, 6, -21, 37, 9, -13, -48, 22, 22, -11, -65, -13, 0, -43, 14, 1, -34, 53, 12, -8, 38, 24, -5, -55, -19, 42, 33, -33, 31, -33, 44, 11, -4, -8, -23, -37, -37, -8, 18, 30, 25, 20, 37, 13, 28, 32, 7, -13, -11, 13, -17, 18, -7, -6, -17, 6, -18, 4, 1, -4, 8, 23, 11, 14, 36, -13, 61, 15, 8, -58, 27, -24, 38, -3, -21, -15, 40, -75, 25, 49, -27, 22, 57, 19, 11, 1, 6, -18]
5778a8J5M9o7j1O8j9m4N7p1N5m6k2J7M0N4p5L0l7L2oN2o0J9k4K3J6o5J28j18J2
5808a6M3k9K5o9K6pM0j7K0K1n3M4k6J1l4j7PJ8J9K4l3l7M1k5m0K9lO1j4Qj2k4
5840a9j1J9Ll8N8%Pj9l9O3l0l2J7m8N4N8k8K1m7oRqk6O5j6m4M7l3L2Kmr0Q2q6
5874h7O5l6P0P5r6k6O6k4L7m9o9M4J2J9J2n2L4lm2kM8lL5J5o5L1K8m3L6n8K6K8
5906B6k3J1no2Q2o6M3K4n9LPP5q7N6o9PMM7q7Q4J4lm5J8j3N4n4L2j8J0MK7N1q3
5940EJ0MK1n0rKnlL5J6n8N9j7p9J10j6Q5j34O4k5k3l2K9N9j22R2J1J5nl7j4N7
5972D5o4K1n1O0L4k7lJk5O0n2pM5n0Rj2K4k9lk4O5o5L4L2p3OqO1K8n6K4J8l9k
6006b3NKR3r5K2mmk6N0k7m6J39m9j2k1j9K3kk8L1l0j2K8l6j4O9n9O0o9j6M4J1
$$ y = [-18, -3, 46, -21, -32, 36, 17, -27, 30, -41, 14, -32, -54, -37, 3, 57, -18, 12, -25, 7, 1, 53, -7, 12, -12, 11, 27, -38, 90, -28, -16, 27, -2, 23, -46, -20, -27, 13, -4, 16, 37, -16, 28, 2, 13, -21, -38, -31, -13, 6, 30, -3, -40, 1, -24, -64, -35, -38, 23, 9, 17, 5, -19, -30, -11, -8, -46, 12, 12, 19, 0, -39, 24, -6, -38, -21, -69, -15, 43, 15, 36, -11, -17, -8, -16, -42, 23, 7, -37, 10, -23, 9, 11, 7, -83, -1, -87, -22, -58, 12, 87, -9, -35, 31, 7, 44, -5, -74, -30, -18, 1, 13, -39, -5, -8, -50, -52, -4, -7, 28, 43, -22, 9, 37, -6, 30, -28, -2, 26, 3, 14, 9, -53, 29, -37, 6, 30, -29, -26, -19, 56, -31, 25, -44, -37, -33, 14, -73, 11, 25, 22, -23, -5, -18, 36, -18, 14, -4, 6, 10, 37, 88, 5, 15, 19, 40, -10, -19, -17, -22, -25, 10, 26, -32, 27, 10, -69, 41, 25, 110, -24, 40, 15, -8, -40, -11, 48, -74, 18, 29, 44, 39, 2, -12, 45, -19, 2, -49, 11, 45, 18, 15, 16, -9, 51, -1, -8, 37, -13, -4, -16, 8, -21, -24, -48, 17, -48, -14, 18, -55, -49, -57, 4, 32, -24, 0, 18, -21, -23, -18, -16, 77, -18, 4, 0, -4, -30, 20, -7, -53, 86, 37, 25, 4, -15, 8, 6, -22, 9, -21, -33, -5, -41, -55, 14, -45, 15, -54, -70, -26, -15]
6038a5L2j2J4l2K9k3L4j8m1L2k1K2m2K6J6l2Rk3O9l4j4J0JQ3m5n2M2j7L6K5n0
6069IqJ0k3J2j3N5r4K2qK8K5k9%Rk8N0m6j4K2L5o0J1K7m1N7m8O0l9LK0k5O8qk0
6103A9j1J9J7k5pnk2l2J06m6J7m1L8o8M7Rlj1jo1J3K0O4m5j6K5mnj4O0o7P3j8
6136B5r1M8JK2J5J4k7k5qM4o6Q0k5J4n5k0M0L4l4k6J6N7Qk3n6M4K3l5N1m2Lrq
6169a1r1P1m9L9M3qN3j1l8k0K6K1rnK2OqLl6K9j13Q9ko1P2N6j48P5J2Q%p0K9k5
6203e1P2l6l3K8M7Ql7J7Rn9kK9J8l2O1j0m2lJ1KK8n6O2Qn0ONJ1m4M8M6l5m5Rl
6238a3n0J4N7m9J1l6M8M9m7lkpJ0J2O2n9J3o3L5M9o3L4L7m2L5k4mK1m7K6m9K8
6270a7J5nQNK7q8R2j7o0qO3n1j4M1k4l5O7l2qJ5L3M9k2l1j7k7k5P6j2K0q3J14
$$ y = [-15, 17, 5, 19, -13, 16, -7, 27, 9, -32, 0, -21, 1, -41, -15, 1, -31, -22, -45, 24, -10, -24, -14, -13, 70, 25, -27, 15, -2, 34, 59, 9, 1, 11, -12, 0, -13, 42, -52, -30, -38, -10, 15, -14, -14, -5, -33, 17, -29, -43, -21, 14, -46, -35, -8, -49, 8, -40, 20, -19, -16, 4, -21, 47, 39, 19, 8, 27, 44, 19, 12, 7, -15, -47, 59, 13, 30, -11, 27, -41, 6, 15, 12, 1, 0, -61, -48, -28, 36, -9, -25, 0, -4, -9, -23, 37, -30, 43, 25, -66, -18, -17, 5, 20, 34, 7, -18, -26, 18, -48, 32, 7, 21, -34, -54, -14, 20, -14, -40, -24, 33, 41, 18, -38, 6, 29, -6, 45, 3, 6, -3, -11, -102, -31, -80, -41, 2, -6, 47, 36, -2, -22, 4, 25, 16, 11, 33, 39, 31, 34, -2, 27, -86, 3, 1, -60, 12, 68, -80, -5, 7, 15, 15, -55, -26, -51, 21, -15, -48, -20, 27, 35, -2, 15, 24, -35, -37, -8, 10, -22, 39, 29, -13, -16, -5, -3, 25, -31, 31, 39, -11, -5, 0, 11, -33, 15, 61, 26, -19, -10, -13, -63, -49, 8, -41, -30, -66, -18, 31, -16, -19, -21, -28, -18, -6, 56, -3, 10, -53, -18, 31, -32, 2, 39, -3, 32, 8, 4, 25, -22, 4, -45, -17, -2, -7, 1, 6, 33, -55, 37, 20, -40, -48, 15, -36, -50, -9, -33, -68, -1, -33, -41, -26, 7, 56, 34, 3, -14, -41, -66, 10, -2, 18, -65, 49]
6302D9%o2J8K1L2q1M6k3qk4L8L8l9J0l7J0QK7K1jj5j7pp2O9k4n4M9N9J9r0O8j7
6335A1l0nK2N0o9K6o4N6rPP0j09R5m8k8J9K4K3o3O6n6jN6l6j3J0J7j1j9MkJ8k5
6368a4Nj6Kj5K2Q0j20M2k9J3K1J6lNJ1M7n8L1l5Rk2K3j0rLK8n5J5N7n7M1rm7O0
6402C2%o9J4N3r4N2J6oJK3k3ll5K5K3j8N2p6K7M1l5j4N1o8%R1n1M4l6j5j2l5N7
6435A2m4M6M2l6j2J6Pj07M4M5J8o2L5%Rmk1K5m5L9k0M7J6o8K7Ok2KpM5qj9J3o0
6469d1PM8Oo0N7l7O8j8L7m6qm7N7l4k5L3j4M8kl8j4K3K9n0QKJ5m2NJ0J5L2l9K1
6503Fq7O4kN5j9l2K7Qj9lK2ro1M2OL8Jj4rm9M4o3P3o2J9K6k7Lj6O1L2o4j6j2K8
6538il2N8J6k3jl3L8n0K7k6O2j7m0P6o5N9o1N3l1j7O7l4j8M0j6j9rL0o0N0j0l5
$$ y = [49, 49, -13, 5, 26, 58, -23, 23, 0, -8, -32, 6, 44, 5, 15, -22, -12, -4, 23, 44, 43, 28, 11, 4, -68, 1, -23, -77, -28, 31, 50, -40, 28, 11, -19, -24, -2, 48, -21, 5, -59, -3, -12, -5, 65, -44, 51, 3, -25, -6, 18, 41, -22, 44, -12, -13, 43, 7, -6, 4, 21, 10, -9, -5, -7, 11, -14, -9, -25, -23, -38, -16, 64, -56, -14, -43, -30, -9, 7, 4, 9, 20, 67, 9, 40, 5, 14, -8, 15, 5, -4, -1, 27, -28, -13, 44, -13, 28, 19, -28, 32, 32, -37, -23, 30, -64, -12, 4, -2, -1, 22, -1, -4, -39, -14, 9, -9, 43, -33, -6, 35, 0, -14, 37, -31, -31, 60, 9, 53, 17, 2, -10, -45, 12, -32, 14, 56, 20, 8, 24, 31, -76, -32, 13, 31, -31, 4, 4, 13, 9, -12, 13, -32, 7, -13, 34, 50, -18, 9, 15, -7, -5, -12, 33, 25, 6, 19, -41, -34, 14, 20, -40, 17, -20, 48, 30, 67, 21, 13, -34, 23, -11, -36, -3, -17, 31, 29, -9, -23, 0, 29, -21, -13, -11, 4, -38, -33, -23, -8, 24, -15, 6, -81, -17, -19, 36, 17, -15, 12, 20, 1, -2, 20, 11, -50, -8, -2, 36, 37, 23, 14, -35, 9, -54, 19, -43, -24, 2, -25, -22, -38, 23, 55, -9, -25, -37, -9, -41, 17, 33, 10, 9, -24, 14, -36, -9, -35, 27, 10, -30, 46, -19, 40, -21, 32, 1, -16, 51, 17, -1, 39, 23, 4, -5, 25, -35, 15, 5, -30]
6570c0J3N9m2mJ4m3J7L3p8J10p3K6J7k9m7O4jj9k7L4k5KN7n3M7qrJ5j1m3P6k2
6602B0lkJ7Kl7%nK5Rk3k3mM9n2L8oJ4l2kN9p7L7l2O8o1L1m1QKM1j5l7K4J8J6l3
6638gM5n1n9L7M2K7p1L1lM3n2L1l5j4N9K9m2k8J7j8K2Ll0K3L5k9mNk7k7N5Mj7
6671fj4L0J7m6M8n4N4q5O8o7M1jJP6k6l3j7QJ1N3o6J8n8R8m4L7m7j0M0l5M7n6
6703a8P4m6q4J05m3J7j1m6N3N0n1m1P9r1N1N1q6M7K5Ojo6N0k8Kj5L9Kk1J7J4j0
6735B4n0O0j3l7n0O3Ol3M5k2rjj0L3l4K3L3p7N6k0N1m9oL1j7K3Lk9nkM5jk0J1
6769B2rK0Mm2j5K2J6qOJ5l4L1K3qk5q0O3L6j5j0p3J4J9LJ9m8O5l3N8j1J7o6M2
6802A8m6%N9m0L8qj2J7l0M1J8K9p8jj9K3K9n4K8m2L8M0m1rO2q7K5j0k0K9n5K8
$$ y = [-30, -17, 42, 0, -4, 10, -33, -16, 17, -61, 49, -24, 2, 19, -10, -57, 7, 6, -13, -40, -6, -31, -29, 28, -25, 22, 14, 5, 20, 9, -34, 42, 20, 17, 15, 32, 34, -3, -3, -8, 17, 26, 3, -20, -24, 25, -27, 11, 5, 19, -13, -15, 44, -33, 4, -28, 40, -21, 10, -31, -23, -21, 20, 5, -32, -8, 10, 26, -7, 38, -13, -72, -35, 7, 34, -37, -6, -9, 34, -18, 13, -22, -36, 23, 52, 10, -18, -1, -19, 3, 6, -24, -1, 34, 5, 1, 6, -21, -48, 7, 11, -6, -20, 10, 27, -19, 29, -25, 29, -56, 12, -55, -14, -15, -14, 62, 36, 3, -14, -6, 5, 58, -8, 10, -48, 50, 6, 43, -4, -14, 26, -9, 38, -18, 56, 10, -74, 31, -12, 5, -6, -52, 1, 51, 0, -41, 38, -53, -2, 49, -37, 10, 35, 41, 40, -26, 24, -4, -2, -17, 22, 24, 3, 20, 34, 24, -26, 34, 21, -16, -66, -3, 3, -30, 15, -7, -16, -17, -27, 6, -28, -5, 28, -49, 7, -13, 38, -11, -17, 14, -3, 20, 23, -6, -11, -13, 32, 31, 11, 22, 13, 33, 37, -5, -20, 2, 18, 10, 16, 31, -3, 28, 51, 43, 18, -62, 1, 37, 22, 12, -61, -47, -28, -25, -6, -54, 11, -22, 36, 25, 42, -24, 18, -28, -28, 31, -9, 29, 21, 9, 26, -4, 37, 55, 84, 6, 5, -14, 9, 38, -16, 12, -30, 8, 48, 7, -2, 60, -27, -2, -12, -32, -3, -58, -30]
6834c0P5l1J4n3L7q0J09n0j9M8k6j0J2K8m9J24j13L2K4n7K2l6K8M1m7J9Pl5K0
6863Dk9J5K8j2K1Kq6L1O4l8k6NK4l8J01l5k9n0O9l6Pol1Q3l8K5l0M9l1j1jmk4
6896b7M5J0J9l8mo6J03J0o6K7n1O0m7QK2%J9q0jL9J0M0p4L5J3l2L9N8o0j5K8n3
6928b9nM3j6M9r5L4J0lJ5pm3J3K1J4KM2n3L9l9J1M8m7J7m2L9rq7P9j4lK9j5k8
6961c0L8j7kl4L9J9lLJ1k7OL2j0l4m6M0k3L4pM7qk6q0R3N5m9o6P2l1KK7n6L1K0
6995B0Om0mkl1PM4o2O7K9j06J07p6N7l6L8n2JRN6m6nL4Jk7k4Q1r8M9L5n5L8j3
7028BJ7m2LK2K1oOk0rj9n8Q9n2K8k0j4K6K3l4R0r8l0P8oL2J6j7n3N2Km4M4lmm9
7063b7M5L4q3J6L4L4l6L2k9k3kJ3rl0K3K4J3n0qJ8M3n3P4p3J3J8pj1m7L9K3k3
$$ y = [-30, 45, 14, 28, -25, 12, -68, 41, -9, -28, 20, -6, -16, -4, 24, -25, 99, -14, 18, 42, -15, 7, -29, -1, 40, -7, 12, 19, -16, 4, -25, -10, 18, 6, 27, 29, -57, -26, 38, 0, -26, -21, 3, -35, 66, 31, 2, -48, 21, -15, -8, -14, -45, 38, 0, 25, -5, 44, 13, 2, 1, -3, -27, 18, 28, 47, 9, 5, -61, 42, 52, -14, 13, -38, 22, -25, -17, 5, 5, 24, -56, -57, -18, -8, 32, -42, -7, 6, -26, 13, 71, 11, -4, 24, -29, -34, 9, -7, 42, -53, -19, -9, -12, 3, -4, -47, -34, -13, 1, 3, 45, -8, 31, -8, 3, 51, 4, 21, -21, 18, 9, -78, 1, -13, -16, 13, -2, -30, 8, -9, -11, -45, -6, 13, 10, 13, 24, -3, 3, 35, 25, -9, -55, -15, -38, -4, -11, 36, 28, 2, -78, 15, 70, 21, -45, 27, -4, -2, 25, -31, 0, 20, 26, -14, -18, -20, -51, -44, 0, -62, 5, 34, -72, 35, -41, 16, -20, 18, -34, -33, -24, 32, -14, -19, 15, 16, -11, -35, 46, -52, -3, 32, -23, 15, 2, 19, -23, -20, 2, 23, 17, 23, 3, -6, -25, -83, 6, -46, -18, -38, -52, -26, -3, -37, 53, -45, -75, 3, -3, 29, 45, 28, -25, 27, 29, -15, 29, 26, 22, -27, 18, 52, -31, -15, 19, 53, 17, 49, 20, -3, -5, 8, -1, -31, -8, 16, 29, -21, -29, -11, 32, -21, 53, -20, -7, 11, 4, -7, -54, -15, 8, -15]
7095a5mOO8nm2m3M0n6M3N4k3No1J6P6l2n5K5M1L0o2jj8j3P1No1M8l7m8K1J5MQ
7129@Pl3lJ8j6N0pm3L8j6J%M1m0nM5n5M3o7O1l1L3l1PM4n8JK2j7M3j6k5mpM4k5
7165ak5J0l2P7l7nL6j9k7j4L7k0L0k4OQJ5Nmn2M4L2k3Ml6P4j0k7jJ9k7k1J4J1
7199A7jl7P1j07P6l3k3J9K2jn6MO0J7j6nj1Ll5O4n7N7J5m4j4j9N3l5M0k9JL9m4
7232iL9J0n1J7l0O3J4o1L8l0nJ8j4K1J8m4n4M9N3j7q8J18o7M5M0p9m2N1k8L3j3
7263el8M0J6l5M4l3K2k4L1qKL2o0K9J2j3N2o2J0l4L2J5o1L2QJ0j9j9M5k0J2m6
7295c3J7RLl7N4j0pMp%m1P6n0L7K7q8K6L2k4k9P8k8l3M7l4Jj4J6Q9l0m0L8r7N2
7329Dj6P0l0l4j5J2J7L1j3ln2J8%J8l6J1J0oJ8M2j7kj1j7M8o0oJ0K4m2K4LMM3
$$ y = [-15, -19, -13, 55, 50, 8, -35, 5, -51, -8, 46, 23, 28, -33, -17, 59, 27, -28, -3, 38, 68, 6, 5, -13, -26, 45, 50, -11, 37, 0, -48, -27, -12, -8, 0, 7, -26, -29, -11, -27, 23, 16, -27, 11, -5, -4, -4, 37, -3, -8, 37, -18, 25, -42, 19, -12, 21, -10, -3, 41, -17, -16, 6, -11, 32, 16, -9, -13, -20, 24, -1, -26, -16, -48, 29, -8, -13, 23, 4, -23, -37, 0, -20, 10, -14, -8, 0, 15, 20, 16, -36, 8, 40, 17, 21, -15, 59, 49, 22, 21, 40, 13, -8, 6, 17, 16, -21, 50, -57, 19, -14, -37, -18, 4, 3, -53, -49, 11, 28, 12, 7, -4, -1, -36, 28, -29, 28, 43, -1, -15, -34, 19, -16, 24, -5, -4, 35, -9, 30, 40, -11, 6, -24, 39, 53, -8, 30, 0, -5, 13, -1, 20, 38, -6, -60, -11, 42, 25, -63, 55, -12, 33, 73, -6, -48, 3, -25, 8, -5, -43, -3, 13, -22, 22, -11, 11, -13, 18, 10, 12, 44, -16, 13, 25, 12, 64, 2, 12, -22, 10, 25, -36, -4, 4, 14, -5, -24, 21, 1, 13, -33, -16, -7, -4, -41, 13, 3, -4, 0, -7, -7, -48, 28, -22, 15, 42, -46, -20, 12, -12, -41, 37, 9, -24, 23, -11, -10, -24, -8, 81, 51, 11, 49, -48, 4, -12, 58, 28, -6, -21, -9, 8, 39, 26, 23, -29, -11, -11, 7, -29, -18, -8, -14, 4, 46, 29, 27, 16, -1, 47, -13, -19, -9, 15, -27, -3, 0, 4, 47]
7363D7l2o5J17j01N1MLk6K5m0m7P7j1n5J1J9J%L4Ql5J5Nk1j4j3K3k5N5m5K7j4
7395b2L8j0m7kQM6%j1O6l7k7j9K6rN6k2l4J0J1J7k9om%K3m2L1mj7L1J5j39O1L4
7429hJ5Mn1J0K1lK0pn9J27p1L0orJ5pk7J6m1J2N6n9K2l8N2qok4K5l8Pn2R1r6Q5
7464bPn0O1J1oJ5l4n8M7l4M5k0M1J8r2P6l8pN3m1k6mJ05n7pnL6m7oL5k1LQ8q4
7498Bl7O1njkl9JK4N7q6L0m6K6Pj5L8l1OJ2L0m2J4m9M3k1Q8p0K6k5j8lK8K2k7
7532bL6l7k1K2LoO4q2K2pL9mL7n3M7q3L8n7K3kpj4N2m2J3J0m3K8RL7k8O8l4k4
7566Bj4Nk%LJ1l4O0j6l0K6k0J4n8M9K8j4J9m3m3j7K8N1k2plJ2M4j2j7j5K1%L2
7600C8l0o0L9Lok3J1R4o5O1n1PK9o0M7k5jJ4J8l9Pk6K5j8mj4L1k0M4o2L0j4nP
$$ y = [47, 15, -50, 67, -34, 17, 21, 24, -2, 23, -17, -64, 13, 2, -53, -42, -23, -22, -22, 12, 20, -15, 0, 5, -16, -30, -43, -20, -45, 10, -35, -8, -22, 16, 6, -41, -43, -35, 11, 11, 0, 66, 29, 2, -17, 9, 0, 56, 34, 0, 10, 21, 38, 9, 3, -1, -1, 22, -20, 11, 7, -10, 21, 36, -103, -42, -8, 7, 11, -40, -30, -9, -12, 8, 1, -58, 69, -2, 28, 22, 13, 28, 21, -6, 10, -31, -19, 37, -22, 0, -38, 14, 6, 0, -24, 1, -37, -30, -82, 9, -87, -2, 5, -45, 16, 27, 21, 36, 2, -56, -9, -43, 2, -18, 23, 41, -51, 25, -13, -20, 33, -8, -34, -38, 67, 10, 3, -2, 34, -13, -19, 16, -5, -2, 86, 2, -35, 26, 21, 20, 18, -21, -20, 4, 61, -25, 5, -41, -15, -8, -23, 15, -16, -10, 2, 32, -10, 4, -45, -2, -23, 65, -5, 21, -4, -22, -25, 3, 25, -2, 34, -3, -24, -2, 1, -5, 59, -23, -1, -8, 31, 27, 64, 11, 58, -25, 13, -44, -21, -23, -30, -44, 8, -34, -21, -11, -54, -26, -17, 20, -8, 60, 26, 2, -12, -7, -9, -9, -6, 5, -29, 31, 15, -15, 11, -9, 5, -53, -4, 24, 10, 29, -14, -57, -74, -46, 5, -17, -24, -27, -15, 29, 17, 0, -15, 6, 6, 38, 8, -52, -13, -10, -16, -39, -28, 66, 1, 62, 11, 18, 47, -13, 34, 9, 8, 22, 40, 1, 8, -18, 7, -11, -15, -29, 2, -18, 26, -36, -6, -20, -25, -18]
7634a8L0m9L3k8n6Q7p2Q6j1j3lPqJ7K6m9K7m7M0l3N3LNk5K5pm9L6n8R2l7J7l0
7667iK0Rok1J2Qol7K6kmorN4j8o0Q9qm4m6N5k9O7l8jN1o8N6n8J0KM7K3p0N6l0
7703A5n5M1k5L4l0k9M8j2Q5l5j6m7L3ol4M3k0L1l4M8k7M2lj2l5Lo3M3O2p4K8N8
7735E7l9mpj2l7M6j2J3k5L9m5O0n3J7J8Mj6J9rm2j9O3qj6oK1j9J8J0k9J6Mk2K4
7769IJqM5j00N0l2L9L3m6L3l8k3O5o6L2LQ3r8J0OK6K0p8JLk3O1pk8J6k5L2m9Q8
7803C5m3j9J4lj1L3n8N0K7n2K4m1P0m3K0oL6J6Oj0J6n6j1M8J4q0O7p9L7Rj2K2
7835B0k3j0mK1l8L5K3k8N0n4l8j7O5j0l5N9l6PK7J5o8N2m3Nk4M2L6k5K5r3M9O
7867iLM5q2O9P5j03mK4l6M9Mm9J12n8m2Ol3K9L0m8l7M1k4K6j0k8LR0m5k3%J0N3
$$ y = [-18, 12, -37, -4, -32, -88, -1, -73, 13, 2, -11, -14, -7, -15, 2, 28, -21, 6, -41, -1, -34, 19, 22, 27, 2, 27, 20, -29, 7, -51, 41, 4, 21, -9, 11, 20, 14, -7, 5, 13, 7, -30, -4, -6, -10, -16, -25, 29, 11, -49, 40, 32, -12, -58, -3, -32, 35, -3, -4, 47, -21, 35, -23, -13, -11, 36, 59, -11, 45, 15, -40, 1, -24, 10, -20, -49, -1, -13, 72, 37, 21, -26, 7, 1, -33, 10, -10, 21, -13, 35, 8, 50, 47, 35, 0, 3, -60, -17, 45, -29, -1, 57, 18, 14, 7, -5, -42, 4, -8, 5, -20, 19, -26, 34, -19, -2, 16, 20, 4, 23, 14, -28, -47, 16, 8, -8, -14, 7, -12, 6, 16, -13, 3, 7, -15, 9, 10, 2, 47, -53, -3, -35, 4, 37, -9, 24, -14, -37, 28, -38, -6, -3, 80, -18, -8, -2, 24, 44, -34, -33, -30, -53, 8, 1, -27, -11, -36, -4, -53, 35, -8, -27, -13, -16, -27, 6, -52, -2, 25, -27, -3, -44, 26, -17, 3, -3, 33, 49, 55, 45, 61, 5, -6, 42, 56, -24, 43, -36, 1, 10, -2, 20, -3, -13, -17, 4, -34, 1, 24, -4, 46, -8, -46, -63, 2, -8, -43, 16, -20, -13, 14, 29, -39, 13, -30, -25, -49, -7, 29, 4, 29, -64, -15, -9, -6, 39, -43, 26, 101, -2, -6, 18, -18, 31, 35, -14, 98, 40, -2, 4, -29, 0, 30, -18, -55, -14, -38, -12, -22, -50, -47, 43, -2, -25, -25, -15, 38]
7900C8o5J8L2o3K5O9mp6L3l6OL5l5RL6p4P8qJ5l3nJ2mJ3p4K8M8j4K0k7Nj2jQm0
7935d3M8J4j4KqJ8l5K1j06P4Q2m7m3M9M3p2k7O8J1o6L8j5M3o3J2J6Npj5j2K9l
7967cm4N0L3n2OK3j8l0K5j9j8O2m7J9j6L4J9J8l1j2l8J9N3l7MP1o8K2Mj0l9L2
7999A2Qj6J7m5K3Rm2K0NJ9m6K7k9P5o0RLl8N1oj7OM6m9l0P4m2M1n0J7k6K9L3l2
8033dLk1J0K3MJ6o1J9N0n5j3O5qk8m3NQ2n0L6l8K4m5K8kn8J00j6Qk2j1k3L9l4
8066b0K8J2o6O4j0Om7N5o9Q3r6M6L2jj1m2M7J0o1P8Qj5k0k5K9k3K8q5Q0j9L8k
8098C2k9m6N3k1lK0k5Nk7K3MqQ9q0PQk4rN6n7jO2rl3L5n2M1Om9J5PO1o1J6k1j4
8134b9J6k1RK1jj7NK3q1J8O6k0jnjJ0k7K4M2k3m3L3L9j0k9Kj2M3l3J5j8K0j6P8
$$ y = [38, -27, -9, 23, -40, -15, 54, 50, -26, 7, -29, -23, 12, -23, -14, 22, -52, 26, 18, 33, 0, -5, 7, 3, 16, -58, -30, 18, 4, 24, -3, 2, -10, -11, -3, -43, 5, 19, 5, 7, -1, 17, -18, 3, -103, -29, 53, 6, -37, 12, 55, -17, -44, 24, 35, -31, 7, -8, 35, -28, -16, 0, 5, -2, -17, -29, 0, -3, -47, 3, 36, -16, -10, 13, -5, -35, -10, -29, -47, 15, -32, -13, -29, 5, 24, 42, 11, -1, -39, -20, 33, -4, 0, 71, 3, 25, 29, 19, -20, 12, 20, 4, 21, -24, -1, 8, -34, -14, -9, 10, -36, -9, -38, 37, -23, -14, -11, -49, 2, -4, -21, -15, 31, -18, -48, 26, -16, 25, -25, -8, -34, -5, 28, -4, -1, -22, -12, 11, 15, 31, -30, -11, 39, -16, -29, 36, 28, 0, -43, -38, 44, -6, 30, -8, 16, -29, -1, -3, -61, 39, 23, 31, 9, -2, -25, 14, -20, 8, 20, -46, 18, 8, 14, -33, 22, -47, 36, -60, -14, 18, 17, 6, -36, 11, 21, -40, 38, 46, 31, 11, -14, 15, -8, 20, -65, 15, -4, 34, 32, 3, -43, 10, -11, -14, 6, -19, -14, -41, -18, -14, -22, 67, -13, -6, 2, -22, -31, 25, -32, -33, 29, 20, -13, 22, -30, 11, 17, -32, -17, -10, 51, -10, 6, -15, -29, -13, -34, -25, -4, -5, -22, -17, 6, -75, -57, 9, -11, -12, -17, -18, -8, -35, -11, 31, 8, -35, -2, 37, 27, -2, 0, -12, 31, -2, 13, -5, 15, -1, 77]
8168G7n6k0QJ5o0J3l5Q1kj9Jl7R6j16M5K5Kn6J0K5l3N7l5
$$ y = [77, 21, 1, 9, 24, -36, -23, -58, 23, 21, 2, 3, -34, 62, -54, -9, 16, 18, -38, -28, -3, -36, 21, -14]
8191a4
$$ Imaginary data points
##PAGE= N=2
##DATA TABLE= (X++(I..I)), XYDATA
0@%%%%%%%%%%%%%%%%qJ6j6J6j6J6k4L2l2M0m8N6o4P2q8R6j04J20j36J56j80K00
38A04k24K50k74L05l42L81m21M63n11N65o24O88p56Q33r19J012j116J236j372
57g22J529j710J919k170K477k860L354m020M970o437R019j4861N0763r262j01387
72f9398R0126L6808r7455r473R3607l1807o4152N2837M4991o1748j3906N5423
84B5853l556m9648J5425M0535j8649m0424K7535L7875m2662l3965O0972J6005
96C5296p1437J2155P4916m2164o1430O7982L3549q7209K510Q6435m0744o6257
108e6398P0880L3431q0698K777P3372l1208n4740M7771L3126n3538j3225N0612
120B2162l058m4847J1869L8055j7112l4450K4505L3855l5743k7615N0440J1737
$$ y = [0, 0, 0, 0, 0, 0, 0, 0, 0, 0, 0, 0, 0, 0, 0, 0, 0, -8, 8, -8, 8, -8, 8, -16, 16, -16, 24, -24, 32, -32, 40, -48, 48, -56, 64, -72, 84, -96, 104, -120, 130, -144, 161, -181, 200, -221, 242, -269, 296, -328, 360, -396, 437, -482, 530, -586, 650, -722, 807, -903, 1016, -1154, 1323, -1537, 1817, -2203, 2767, -3670, 5349, -9512, 41251, 31989, -69398, 20728, 57536, -39919, -49392, 44215, 12408, -51744, 1093, 46084, -15664, -29570, 25853, 22297, -27351, -11926, 28609, 9960, -30464, -2929, 34946, -7716, -41681, 19291, 35296, -36141, -23986, 50930, 8766, -52664, 15318, 48867, -38342, -35832, 50603, 9859, -56398, 14482, 47913, -32785, -30008, 43364, 12156, -42584, 5187, 38313, -15225, -28450, 22162, 19104, -25743, -13874, 24181, 7069, -27381, -2876, 30979, -4764, -32379, 18061, 29798]
132B9798o1042J2113O0632l8161m7385N9790K3674p1751O151O9814l6745n3279
144d6391N9171K5730o7134M133N9742k7126m3431L9601K5304m2866r113M1336
156A8956k835l6679J1512L1499j7793k7793K3567K4534l2467j8643M3110N222
168B2190n0543J4701M8800l6280l5665N3041J4603n9991J0402N6398l4033m1661
180c8038N1239J8830n7277N954N0724k5673l6279L5821J9863l8252o489L6256
192A6679l710l2689J2017K8429j8519k3512K4734J8298l0938j0947L7691q11m1581
205b4859J7157L7897l4381k5478M6238O291m9462J3839M3731l1481l0637M3669
217A2524J2502m7412P287M2304k3271k9975L2163J6142l4140m438L2548m715k9977
$$ y = [29798, -31244, -19131, 41501, 3340, -44045, 15745, 39419, -32332, -26181, 43633, 6888, -46391, 12780, 38510, -28624, -24491, 35251, 8125, -35306, 4295, 29599, -13267, -22380, 18956, 16121, -20558, -9046, 22453, 4660, -23133, 434, 24968, -7499, -26142, 16968, 22190, -28353, -13652, 35148, -1132, -36797, 16244, 30847, -29144, -18742, 37656, 3623, -38038, 13201, 32031, -25246, -19292, 31432, 5759, -30520, 5301, 25164, -13088, -19577, 16679, 12969, -19720, -7703, 20726, 2207, -21305, 3429, 21727, -9211, -20158, 17533, 16722, -24859, -7702, 30195, -4186, -29664, 16574, 22865, -26597, -12758, 30973, -508, -31145, 12524, 25026, -22386, -15099, 27205, 3934, -26041, 6122, 22264, -11876, -16314, 16234, 11519, -18458]
230a8458J2366K6056j9844k0823K6000J3718l0980m989L4550n890l5143J9652
242c785L0386l3016j8159M1816J254m2686J6059L5726k9913k3571L8218Q183m0540
255b0028P433L6211k1056k6317K9278J4125l1480l124L0290n493k7413J3149K3822
268A9397k0354j7850K6466R498l0155J24L0600j0244k8664K0586K2593l0211j2028
281b0242L6100k131l5645J6490K8908k7118j7877L3224N545l4437P027L1300j8451
294B693k3890K6589J3216l0085k606K9263o726k6401J4564K1833k1624j5117K7409
307I118N874k9505M658K7897j4066k2898K1883J5728k7712o381L0658n085k9178
320a9009J6062K2679k4380j3366K8327L221k8856O553K6702j5743k1122K3609
$$ y = [-18458, -6092, 19964, 120, -20703, 5297, 19015, -11965, -16954, 17596, 11706, -23437, -3785, 26601, -6415, -24574, 17242, 18496, -24190, -8131, 27595, -2318, -25889, 12329, 20512, -20028, -12595, 23616, 2560, -23757, 5521, 19646, -11834, -14958, 15332, 9839, -17574, -4425, 19397, -957, -18807, 7659, 17157, -12998, -12874, 17726, 7482, -21182, -596, 21997, -8214, -20242, 15858, 13727, -21918, -5428, 23480, -3638, -21515, 11709, 17254, -17183, -10156, 21144, 2693, -21197, 5392, 18608, -11477, -14083, 15180, 8454, -17947, -3383, 18450, -3174, -18291, 9118, 14992, -14513, -9855, 18042, 3976, -18922, 2961, 18689, -9023, -15404, 15254, 10169, -19009, -2947, 19732, -4648, -18014, 10313, 13534, -15322, -8769, 17933, 2190, -18932, 4677]
332D677J2638k7967k092K8061p577k4956J5820J9481k2543j2170K7060K356k8368
345a5580Q211K4845j7054j8134K2841J0059k5561j525K6228p232k3752J5781J8279
358A7406k2168j0203K5200J618k5561O492K3586j4629j9360K1880J1838k6950
370a0851j726K7732q774k4071J7582J7548k3615q832K6869r95k6208J0962K1559
383A7180j8862j3691K2642N017k3103K276K1354q707j8593J4496J4172j9224p909
396a2952K1974R70k2366O344K1107j3465j7550K0516J1035k6066j206K7393j0072
409E662k3702J9506J5573k5271n808K6960m536k4649J3845J8764k0357r965K2822
422H844J236k1112N419J7880r892j4354J3260J0817j6573o559J9064P04k0207
$$ y = [4677, 17315, -10652, -12744, 15317, 7740, -17216, -1396, 18085, -4458, -16628, 10432, 12788, -15580, -7369, 17476, 422, -17712, 5129, 15188, -10373, -11898, 14330, 7098, -16654, -873, 17406, -4762, -14965, 10235, 11853, -13708, -7216, 16370, 1741, -17619, 4261, 16099, -10851, -12577, 15155, 6381, -17690, -108, 17440, -6175, -15007, 11862, 10867, -15341, -4379, 17180, -1682, -15373, 7269, 12286, -10817, -8541, 12813, 4106, -14487, 9, 14181, -5043, -12952, 9022, 9992, -12374, -6030, 15077, 1612, -15938, 4578, 15613, -10453, -11659, 15734, 5662, -18040, 1466, 17039, -8232, -14040, 12920, 8384, -16265, -2420, 16344, -4013, -13978, 8844, 10080, -11032, -5613, 12267, 2375, -11979, 1281, 12098, -4475, -11034, 8030, 8734, -11473]
435a1473N782J9198j2555j6130J9307J0190k4593p64K6465j0409k2575K0255J3964
448A6662k5658l193K6083p178k2487J5428J5507k0648o916K1712j553j9141P505
461c877J4842j0501j1009J2293Q420j4314n363J7024P53j8678N462J8261j2420
474H93j5212J8912R010k4097N7K5563j1283k1577K1036J2391k6053p55K5425r563
488D747j9964J6818J2372k0200l926J9977l621j6762Q627J1949j0707q210J1062
501B162N989j2230m181J4545P36j6751N068J6958j1962j3833J8568P622k2900
514a0209J304K3966j1900j9729K1068J0490k5920J136K4372j1646j8063J7979
526B848R530j9980j321J8618n161j4746R288J0208j0674o262J0543M291j0772
$$ y = [-11473, -5691, 13507, 952, -15178, 4129, 14319, -10274, -11038, 15427, 5018, -17557, 2698, 16662, -8996, -12189, 13894, 6716, -15771, -343, 15164, -5484, -12400, 9312, 7759, -11382, -3877, 10965, 464, -10545, 1748, 10168, -4146, -9509, 7515, 8268, -10410, -4948, 13313, 893, -14319, 4593, 13603, -10494, -10437, 15126, 3843, -17734, 3302, 15693, -10360, -11115, 14310, 4747, -15217, 1601, 13973, -6227, -10153, 9824, 6203, -10559, -1932, 10017, -690, -8900, 2162, 8151, -4079, -8260, 6285, 7021, -9730, -4662, 12296, 334, -13499, 5069, 12691, -10209, -8905, 15061, 3161, -16568, 4500, 14990, -10930, -9794, 14578, 2932, -15131, 2848, 12378, -7602, -8923, 9695, 4534, -10212, -924, 9284, -1390, -7652, 2891, 7182, -3590]
539c590l265J2808N77j5403M542J5896j1644j2886J7959O322k1841K593K2081
552A4149j2218j7501K0527Q696k4475K564K2663j2432j5876J8128P036j9031N85
565g185J6577o132j2682R197Q363j0191n048R995L147r937k181J1668M5j3893
579h257M774J4724j1506j1689J7757M931k1252M012K0392j3141j5463K0205O602
592A2089k3349L945K1011j3118j3918J8118N283j8126K345J4887o815j0661Q848
605E39O997r513m163R285K287r385j284J0457o92j2424M849J3065j0961j0205
619a1148J6940L618j9766N159J8394j3324j2987J9316M674k1424M755J8839j3052
632fj2323J7449L817j7261L268J3642p395r222Q821N852q926l430Q967J921r212
$$ y = [-3590, -6855, 5953, 6530, -8873, -4331, 11565, -79, -12965, 4994, 11316, -10525, -7932, 14149, 1931, -15570, 4957, 13653, -10822, -8258, 14405, 1973, -13903, 4225, 11261, -7770, -7185, 9392, 3260, -9422, -225, 8138, -2053, -7101, 2894, 6041, -3896, -6077, 5591, 5636, -8257, -3483, 11241, -265, -11954, 5803, 10734, -10518, -6506, 13886, 745, -14718, 5487, 12089, -11260, -7315, 13696, 578, -13340, 4778, 10061, -8065, -5720, 9167, 2352, -8309, 539, 7536, -1977, -6140, 3145, 5432, -3953, -5237, 5220, 4528, -7896, -3047, 10018, -943, -11148, 5792, 9410, -10356, -5197, 13197, -127, -13114, 6202, 10876, -10548, -5793, 13046, -6, -12329, 5120, 8937, -8324, -5056, 8586, 1191, -8031, 790, 6642, -2284, -5714, 3253, 5174, -4038]
647d038k87J0034j781j1259N508J1296j0909q549J5921K155j8422O173J6324j3650
661a484j0384J8217K553j9066N677J6330j2469j0175J6148K680j5714L845J2133
674H291p434q044Q438M796q469k928Q541J309r115O42R615l031r883O464R358
689H550j0807o309J4975N64j6594P056J4077j3679q247J7253N69j7274O577J3912
703A0623j2146q285J4954J711j4475M187J1255p482p158Q523M081q171k301Q289
717C605P32q881J324R151m149q854P323P222j0653m153J3496j014j4262P422J1867
732A0176j3100o041J5778p40j5040P067J1629j1372o734J3479J055j3070L851
745c062J0481p454o808Q668L528q489j517Q504j22q730K483Q731n319p674Q446
$$ y = [-4038, -4325, 5709, 3928, -7331, -1823, 9473, -1436, -9985, 5936, 8091, -10331, -4158, 12166, -1484, -11868, 6349, 8902, -10164, -4487, 11843, -626, -10801, 5347, 8027, -7687, -3842, 8291, 857, -7187, 1251, 6047, -2422, -5350, 3191, 4500, -4615, -3973, 5642, 2611, -7272, -808, 8550, -2257, -8566, 6409, 6973, -9621, -2565, 11512, -2167, -10414, 6839, 7408, -9866, -3289, 10623, -1523, -9808, 5146, 6857, -7618, -3431, 7824, 342, -6816, 1707, 5788, -2383, -4684, 3605, 4337, -4544, -3220, 5931, 1782, -7072, 251, 7473, -3180, -7333, 6163, 5149, -9113, -1691, 10176, -2924, -8965, 6813, 6073, -8967, -1900, 9729, -1643, -8377, 5102, 6157, -6913, -3062, 7419, -35, -6843, 1825, 5353, -3136, -4653, 3851, 3729, -5001, -2518, 6213, 894, -6780, 1666]
760A666N269j0878j811J2312k805j2202P945R440j2472m291J4425j967j3202P256
774a315R749j0607n166J2047N85j1558L640R690o836o574Q449L332q684r26Q414
789D240j071q488L282Q107o324o442Q996L550j0540J48J0977m097r859Q142P246
804G867j1359k798J2747k566j1623P189Q174r945m238J0948J97j0605L355R166
818F509o460o644Q627L432r142l57Q875k036q232M466P208o987n287R226J934
833E132j0167J682R544n237p741P953N076r974j517J0840k620r803O568P183r043
848b124l447R803P0r584L034Q522o032o641Q493L341r564O4R215l139p964N654
864b99O227p752l672R341M23r597L268Q266o151n816P893L118q965k13R043k923
$$ y = [1666, 6935, -3943, -5754, 6558, 3753, -8449, -504, 8936, -3536, -7827, 6598, 4631, -8571, -1315, 8434, -2173, -7339, 4708, 5293, -6265, -2625, 7065, 229, -6345, 2104, 5436, -3248, -4174, 4240, 3169, -5319, -2037, 6070, -254, -6696, 2300, 5850, -4690, -4542, 6435, 2338, -7521, 621, 7867, -3492, -6290, 6457, 3891, -7732, -543, 7631, -2314, -6552, 4396, 4593, -6012, -2657, 6509, 49, -6595, 2032, 5464, -3678, -4035, 4840, 2804, -5428, -962, 6246, -741, -6028, 3198, 5132, -5035, -3353, 6191, 954, -6787, 1166, 6242, -3732, -5249, 5591, 2971, -6832, -264, 6919, -2124, -5571, 4232, 4302, -5282, -2248, 6274, 242, -6399, 2094, 5435, -4129, -4065, 5150, 2011, -5953, -299, 5928, -1824, -5496, 3845, 4268, -5329, -2061, 6205, 54, -5762, 2131, 5249, -3716, -3929, 5114, 2191]
880B191q307N932O099q162k972R006o9q847L014Q067n778o244Q340L306r726N54
896c596R361m133p605O649M985q252k195Q921r99q670M267O806o552m153P739
911B573J451p573P05P432k855o784N127N380p366k866Q509j79q505K987P648n800
927a16o006Q366K958r843J062R582n056p246P917L881q774n61Q608k517p444N050
943a39N286o659k780P042L14o638J460N895k712n455M337M650o175k801P744J05
959C474q134L024P332n870n478Q163K587r796J495R306n625o831Q368L031r160
974d114P96Q113l537o304N547M042o442j620O566n53n671J892M823k785m429L768
990I2L918n420k793P179K88q022L065P190o100n063Q446J931r466K106Q883o030
$$ y = [2191, -6116, -184, 5915, -2247, -5219, 3787, 3718, -5129, -2115, 5952, 174, -6070, 2270, 5576, -4150, -3596, 5765, 1632, -5973, 676, 5661, -2591, -4786, 4135, 3136, -5534, -1267, 5539, -1013, -5166, 2573, 4024, -3549, -2844, 4588, 1733, -5051, 76, 5456, -1910, -4776, 3733, 3554, -4951, -1964, 5684, -116, -6122, 2244, 5202, -4641, -3579, 6003, 947, -6299, 1618, 5499, -3275, -3836, 4772, 2255, -5189, -139, 5147, -1512, -4292, 2750, 3064, -3574, -2114, 3781, 1069, -4386, -49, 4601, -1574, -4375, 3369, 3474, -4660, -1636, 5696, -174, -5652, 2511, 5098, -4698, -3203, 6103, 478, -6353, 2015, 5046, -4114, -3318, 4795, 1258, -5046, 501, 4543, -1899, -3519, 3047, 2494, -3177, -1285, 3538, 753, -3676, 92, 4010, -1410, -4203, 2976, 3264, -4758, -1693, 5497, -603, -5666, 2780, 4711, -4755, -2649, 6234, 204]
1006B04o251Q795K071r206J949P500m657n154N834K690o100n71N701j118m794
1021c107K175L994k668l542L417L444m840k558O650K28p657L065O945o363m563
1036e380Q413J110r234K786Q302o498n355Q947J175r013K860P044n393m025O113
1051A852J485n669K18M934j445m154K144L279k503l100L185K951m468k207O169
1066B671K16p266L122O610o329m055Q514L36q816L461P401o702m548Q685M44q625
1082d881L390O433n833l265O224O07n331J042M253j629l478K119L004k517k705
1097b567L110K442m254j809N705p3o842L180O230o545l602Q595l33q480M190O664
1113E611o975l471Q341j85p948L692N794n945k603O155j92m988J534L568j871
$$ y = [204, -6047, 2748, 4819, -4387, -2438, 5062, 405, -4749, 1085, 3775, -2325, -2896, 2805, 1687, -3107, -932, 3062, 394, -3148, 269, 3713, -1127, -3685, 2965, 3193, -4464, -1399, 5546, -817, -5380, 3033, 4143, -5091, -2305, 5997, -501, -5856, 3091, 4266, -4747, -1887, 5157, -236, -4261, 1852, 3337, -2332, -2114, 2820, 1375, -2779, -635, 2644, 141, -2959, 226, 3177, -1291, -3498, 2671, 2887, -4379, -1257, 5353, -976, -5031, 3483, 3819, -4997, -1536, 5865, -837, -5385, 3300, 3744, -4881, -1491, 4942, -891, -4156, 2068, 2675, -2656, -1614, 2639, 1010, -2468, -349, 2655, 138, -2567, 543, 2985, -1269, -3078, 2627, 2554, -4288, -1108, 5122, -1423, -5025, 3570, 3237, -5243, -1053, 5611, -1364, -4835, 3506, 3321, -4627, -935, 4859, -1086, -3689, 2466, 2274, -2714, -1180, 2388, 517]
1128E17k852K031K484k311k431L154K103m178j109N355n57o155L415N384o323
1143a473k928Q178r00p990M526N777p114k488P976r68p241M041N074n800k083
1158c413N920m27m784J980L172k037k386J943K184k295k264L143J758m283o94
1173b483N164j045n537L635M645o157k179P686j291p361M936M995p065j606P329
1188C666j598o292M070M201n501j672N502p21m451K123K952k326j974K123J945
1203B047k299j921L243J367m286o1M940j867m795L885L619n985j287P038j831
1218A807o586N078M137o898q29O982k121n493M174L425n137j197N099p67m274
1233b600K152K815k459j882K242J546k452j498L210J001m214N14M541k281m044
$$ y = [517, -2335, -304, 2180, -131, -2562, 592, 2695, -1483, -2592, 2763, 2206, -3949, -534, 4850, -1473, -4401, 3777, 2877, -5113, -587, 5190, -1924, -4412, 3564, 2596, -4645, -604, 4470, -1330, -3413, 2507, 2080, -2704, -724, 2448, 411, -1975, -32, 2152, -143, -2407, 736, 2494, -1789, -2483, 2681, 1636, -3901, -266, 4379, -1778, -3957, 3729, 2438, -4923, 13, 5008, -2057, -3663, 3666, 2068, -4224, -154, 4047, -1454, -3126, 2376, 1655, -2796, -673, 2279, -47, -2021, 102, 2047, -252, -2173, 1070, 2437, -1849, -1910, 3030, 1163, -3632, 253, 3872, -2113, -3400, 3638, 1807, -4779, 299, 4436, -2462, -3291, 3691, 1570, -3923, 251, 3676, -1461, -2658, 2441, 1674, -2600, -448, 2367, -92, -1974, 268, 1814, -638, -2136, 1074, 2075, -2139, -1625, 2916, 635, -3409]
1248c409M175K685n547n44O258k219n569M785L478o535m05O316k391m914M135
1263B99K889m872q16M670o99m024K045K906k559j812K592J274k664j050L231M35
1279A845m040J022M097k829l374M413J666n247L16N441k478m645M580K751n850
1294b332M5N687k476m306L965K409m394p70M288p50l801J786K990k679j883K972
1310G51J119l107m21L352k59l662J558L581l100k627M393Q65m856R91M488k745
1326C21l603M242J982n224J91N038k295l864L728K165m123m90L911o32l525J708
1342d70K954k641k072L181R70l418K6L326q80l392K058K923l236j958M262K94
1358A927m404J486L880k893k716L858J357m432L39M355k157l525L433K039m053
$$ y = [-3409, 766, 3451, -2096, -2640, 3618, 1399, -4170, 615, 4093, -2442, -2847, 3469, 1078, -3836, 299, 3188, -1684, -2500, 2170, 1471, -2553, -508, 2398, -161, -1973, 619, 1893, -771, -1821, 1410, 1845, -2195, -1173, 2924, 95, -3279, 1134, 2800, -2447, -2131, 3310, 832, -3813, 767, 3518, -2332, -2287, 3400, 924, -3382, 583, 2992, -1402, -2172, 2116, 1366, -2435, -649, 2341, -338, -2221, 751, 1870, -1237, -1658, 1694, 1435, -2227, -669, 2912, -188, -2815, 1578, 2443, -2413, -1422, 3066, 321, -3282, 960, 2942, -2282, -2091, 2947, 652, -3212, 516, 2681, -1442, -1932, 1979, 1347, -2178, -470, 2484, -157, -2229, 952, 1922, -1496, -1470, 1856, 976, -2416, -358, 2565, -671, -2629, 1633, 1927, -2477, -991, 2889, -4, -2720, 1138, 2495, -1937, -1598, 2757, 600, -2925, 508, 2547, -1506]
1373a506m34L845p51l454J778K902k704k063L591P93l767N14L466j577k937K583
1389B79K113l319j176L921m42l770J869K967k862j999L567P12l693M61L705j765
1405E68l109L029K002l693n61L795q18l450J829K858k869j988L641N82l921R99
1421a106L468k272k407K987J424l388k74L492q39l298K079K443k894j318L122
1436A219L44l180N32L064j567k782K651J967l505o07L772q43l415K024K852k979
1452d53j841L802L71m086J380L425k831k104L348P33l391L83L041j255k556K074
1468D0J863k566r86K865J1k650O17K619j350k456K228J942l301p66L820q89l485
1485b444K174K760l326j479L965p7l958J765L285l177j705L684J68l353J009K584
$$ y = [-1506, -1940, 1905, 1154, -2300, -522, 2380, -324, -2387, 1204, 1997, -1770, -1256, 2210, 633, -2304, 279, 2392, -927, -2103, 1818, 1376, -2394, -525, 2442, -420, -2419, 1148, 1860, -1833, -1372, 2333, 568, -2541, 488, 2490, -1203, -1764, 2031, 1213, -2237, -408, 2450, -419, -2407, 1234, 1816, -2105, -1106, 2362, 90, -2317, 670, 2094, -1294, -1568, 1924, 1085, -2213, -134, 2309, -585, -1903, 1219, 1563, -1617, -1085, 1979, 412, -2370, 281, 2248, -1257, -1864, 1908, 1065, -2350, -326, 2526, -453, -2294, 1508, 1879, -2207, -827, 2598, -233, -2337, 1011, 1744, -1647, -1264, 1777, 522, -2034, 40, 1903, -663, -1649, 1216, 1227, -1423, -806, 1813, 463, -1993, 235, 2177, -1124, -1890, 1930, 1041, -2444, -270, 2490, -836, -2315, 1650, 1573, -2385, -620, 2665, -512, -2217, 1467, 1635, -1718, -709, 1875]
1501A875j585j989K049J262k372o13K403r2k344O77K224j112k210K004J900l110
1517a033p46L766q13l615K420K601l517j216M013m62l867K094K882l313j311L618
1533A501k83l114J467K288k041j268K016P29j977l87K101j16k105O27K003j201
1549B40j964J860J717k901p34L624q65l544K593K532l752q35M137r60l595K396
1565e1K566l444r18L637p56l016J809J825k150q28J944K93j698j21J722q5j811
1582a082N78J904j064j833J842J512k759p11L470q64l466K597K361l900n11M088
1598B162j322l366K729K036l471m10L436j000k707K068J528k273m83J898q1j497
1614g53J17J403j74j630M92J808j111j752J908J264k685k97L269j047l156K665
$$ y = [1875, 290, -1699, 350, 1612, -760, -1373, 1030, 938, -1406, -729, 1495, 383, -1827, 177, 2077, -1033, -1779, 1987, 1174, -2441, -21, 2580, -937, -2153, 1860, 1398, -2469, -375, 2507, -806, -2117, 1501, 1218, -1896, -429, 1859, -182, -1450, 566, 1295, -682, -1069, 1032, 916, -1189, -562, 1441, 240, -1724, 136, 1853, -1048, -1782, 1842, 977, -2567, 26, 2558, -1194, -2029, 2108, 1148, -2447, -51, 2515, -929, -1847, 1790, 1034, -1982, -173, 1652, -498, -1326, 618, 911, -787, -908, 814, 729, -1082, -504, 1400, 336, -1497, 345, 1857, -902, -1613, 1857, 993, -2473, 124, 2485, -1415, -1926, 2162, 840, -2526, 203, 2239, -1232, -1642, 1794, 794, -1913, 155, 1683, -590, -1073, 825, 744, -753, -636, 767, 593, -1037, -545, 1263, 152, -1600, 308, 1572, -1113, -1410, 1859, 812, -2344, 321]
1630C21K104l826k19L878j624l057K904J598l400j10L127j131k442K069J244k225
1646g89k80J947l53j240K82J162j57j414L85J718j162j622J929J121k693n3K949
1663A730j177k806K618J818l732P1L696j850k643K998J128l177K85K802j407k008
1679a654K024J027k156j15J736m13j220M39R84k82j234M29J613j176j429J962
1695E35Q98k602K14K723j419k360K563J389l470K34L423j915k446K991R49l273
1711a566N85K623j525j686J957Q86k007K9J609l93j251N16R48m30j079O02J269
1728A087j163j306K033O06k561M48K550j648j920K592R27l165N15L065j934k078
1744a952K816P19l045P64K327j575j503J838O14j754JJ584m13j285O49R69o04
$$ y = [321, 2425, -1401, -1620, 2258, 634, -2423, 481, 2079, -1321, -1431, 1696, 565, -1877, 192, 1436, -789, -1069, 878, 525, -715, -433, 729, 572, -842, -457, 1261, 99, -1523, 406, 1527, -1166, -1219, 1730, 553, -2253, 365, 2183, -1549, -1478, 2218, 368, -2275, 723, 1851, -1326, -1041, 1761, 354, -1654, 370, 1397, -759, -874, 862, 449, -771, -332, 652, 370, -864, -435, 1178, 2, -1427, 535, 1433, -1169, -955, 1768, 349, -2011, 552, 1941, -1529, -1295, 2128, 213, -2233, 758, 1707, -1566, -981, 1642, 117, -1569, 388, 1274, -733, -704, 905, 512, -739, -223, 725, 295, -784, -182, 1087, -76, -1382, 651, 1257, -1304, -856, 1694, 46, -1874, 718, 1645, -1520, -1005, 2060, 126, -1952, 864, 1583, -1462, -698, 1629, 54, -1449, 389, 1003, -751, -750, 834, 421, -864, -215, 754, 150]
1761A50r29P97J004j118j033J908K71k332P38K186j814j528K561M46k804O33K630
1778A766j831j794K731M68k810Q32K215j602j263J778N66j665k2J518m88j207
1794h08O12R93p67q20Q27Q56j264n80J741Q8k144Q46K042j852j230K426J89k562
1812a407R66K098j786j393K437L13k565P09J992j489j125J747L73j549M2J408
1828G71l60j248O37J164r73q76J197N94j451k78J717l35j808J035J585j804r43
1845a376K353j19k218J033J823j757j077K143K60k179O82J811j421j119J643M25
1861I07j670Q7J454m26j270P74J066j101p76J410L74j510Q8J513m74j503J100
1878D3J262j776n91J996k61j956J133J398j618p60J836J02j841N32J711j272j067
$$ y = [150, -779, 18, 1022, -96, -1129, 779, 1050, -1282, -544, 1642, -172, -1700, 861, 1307, -1497, -864, 1766, -65, -1859, 872, 1340, -1470, -638, 1577, -25, -1288, 490, 1056, -609, -631, 887, 399, -808, -196, 797, 30, -790, 37, 893, -371, -951, 790, 878, -1266, -420, 1622, -230, -1460, 966, 1155, -1407, -441, 1657, -129, -1522, 915, 1228, -1337, -628, 1364, -125, -1250, 497, 870, -679, -637, 771, 411, -837, -200, 964, -9, -885, 312, 906, -545, -823, 894, 559, -1249, -214, 1371, -433, -1376, 977, 858, -1360, -327, 1496, -261, -1338, 805, 1065, -1114, -432, 1379, -42, -1161, 482, 907, -763, -676, 778, 352, -918, -144, 922, -179, -955, 455, 829, -681, -593, 920, 446, -1057, 43, 1305, -471, -1062, 934, 673, -1283, -150, 1248, -370, -1130, 706, 808, -1033, -501, 1210, -62, -1129]
1895a129J631M08j633J56J439m58j309Q48J057j203p59J490K12j623M38J352q37
1912H0j142J256Q07j578l12J823l75j697J160J141j525n29J593J5j596M92J515
1929A128j119j124J456N88j702J24J520n77j315R97J003j272n92J610j7j608O77
1946b23J277j152q61J375L10j392O5J418n21j395J154Q87j379l70J410K3j359
1963g33M31J270r21j025J426N40j720J28J600p78j240J185Q53j543l49J644k72
1980D96j503Q83J104j269n76J434P4j282K91J177o54r99R33O77j105l24J237j22
1998D72j205M20J143q09j043J335N88j666J57J691q34j289J310P45j602j11J667
2015I69o04j363J082R24j465k70J387k67j110M59Q74n87o71P28N65r72l21J136
$$ y = [-1129, 502, 910, -723, -567, 872, 414, -895, -47, 1010, -193, -952, 538, 750, -873, -435, 917, 80, -1062, 194, 1001, -577, -889, 934, 559, -1138, 22, 1163, -362, -891, 702, 717, -879, -387, 1128, 9, -1115, 341, 929, -773, -649, 871, 294, -1021, -24, 979, -293, -885, 725, 708, -900, -223, 1054, -98, -959, 416, 726, -666, -601, 817, 296, -1099, 55, 942, -437, -807, 603, 626, -733, -302, 968, 47, -978, 448, 988, -732, -604, 996, 218, -1022, 163, 1016, -527, -876, 768, 496, -1007, -124, 980, -289, -865, 569, 643, -639, -348, 829, 175, -824, 109, 786, -319, -643, 594, 472, -733, -313, 830, 21, -1022, 313, 901, -765, -608, 1083, 249, -1040, 270, 1015, -587, -698, 969, 365, -998, 84, 1008, -457, -727, 660, 393, -717, -258, 616, 29, -642, 86, 651, -321, -642, 494]
2033D94oj178M59J025p00j023J239N74j674J42J732r73j314J553N44j614J31J527
2051I38o64j245J111P97j374j67J323m34r94P17N62o71l96N83M11q05k96J052
2069D48l4j080L99J049q03q54J249N28j589J25J707r89j276J607N13j817L09J476
2087I68q76j070J212N73j398L7J220m90p54O42M46n96k72N31K53n69l20Q63O7
2106D67j098L83J005q23q02J215L83j494K03J566r73j233J714L84j778M91J438
2123A048j074q71J360K43j273J92J043n93o69P13L01o62j12N23J93n52k30P98
2141C78J09j084L61J086q27q25J297K33j445K79J472j037j059J608K72j748N51
2158c79J342j130p37J415J5j126L49R24n97o28P29K29o42j3M65J02n04j04N66
$$ y = [494, 488, -690, -231, 794, 94, -929, 310, 884, -790, -648, 1084, 111, -1203, 350, 894, -720, -589, 938, 274, -971, 140, 937, -437, -604, 719, 285, -709, 8, 570, -101, -497, 86, 497, -308, -604, 448, 414, -666, -267, 782, -21, -875, 374, 902, -687, -562, 1145, 156, -1120, 487, 1000, -817, -508, 968, 92, -978, 234, 807, -591, -554, 666, 176, -578, 64, 510, -86, -358, 173, 426, -143, -463, 400, 467, -631, -248, 757, -66, -868, 347, 730, -764, -561, 1005, 32, -1201, 513, 897, -881, -390, 1048, -26, -897, 463, 706, -567, -375, 668, 75, -594, 119, 420, -242, -354, 169, 362, -190, -420, 378, 487, -597, -236, 850, 23, -802, 495, 728, -717, -438, 1034, -3, -1062, 546, 818, -930, -379, 963, -167, -904, 511, 526, -600, -251, 673, 76, -552, 177, 406, -236, -249, 216, 318, -186, -290, 276]
2177B76N6r32L77R43q19p17J321R9j349L99J376j077r25J574J86j670O16J324
2195A058j215o50J369j66j138N31P78n77m75P02J40n45j21M90J05m48q0N80L4
2214C72q61L49Q77q76o07J268M0j367N37J140j068p08J452J19j517O57J182j224
2232b35n34J385j28j103N97N97o65l59O07J91o08k0M66N7n20J8N52n0p20L41Q30
2253F99q56n15J224p2j333P36J026j161m92J388j75j299O73J044j165m38J253
2270E37j70r83N90N87p29k37N94Q4m60o3M55L8n19P2N61k55n77L96O41p81m25
2291f44J163j59j124P48Q42j157l28J276k16j073N93Q87j088l34J139j82r70N87
2309d0N74p16j73N23P9m53q0M12R5n49J82O05m19m46N02M26p58k42J002k03j059
$$ y = [276, 332, -600, -223, 720, -99, -816, 505, 604, -745, -346, 1030, -47, -972, 602, 788, -882, -266, 1058, -157, -807, 562, 396, -742, -211, 567, -10, -485, 217, 357, -188, -309, 181, 286, -162, -242, 338, 372, -489, -140, 737, -139, -746, 522, 562, -805, -268, 872, -196, -904, 548, 667, -850, -193, 989, -235, -769, 616, 488, -615, -18, 579, -86, -445, 162, 353, -255, -275, 191, 248, -272, -254, 298, 248, -472, -131, 699, -157, -672, 552, 480, -853, -117, 909, -252, -744, 644, 469, -830, -157, 887, -278, -716, 537, 367, -616, -26, 561, -168, -405, 189, 273, -187, -250, 205, 243, -276, -204, 357, 102, -475, -79, 562, -219, -644, 519, 360, -764, -16, 826, -331, -659, 617, 401, -672, -79, 808, -280, -614, 525, 343, -627, -40, 534, -182, -355, 168, 247, -206, -286, 126, 221, -328, -146, 459, 40, -406, 96, 522, -236, -478, 524, 321, -738]
2330g38P45P78j185j54J106l15r30O95O16q68k86J034j86q67N76N47o93k09N97
2349B63M6m97p3M80l9n01K08N51m85m08O56J95o96l2Q54k98r27P54O03r94r6J039
2371F03l36r30P81M63q45j75Q27j12q04M42N42o48k12O00M9n07Q8M93j09n09K08
2392i1N67m93l79O25Q0o80P2P10l20o69O32M48r09K4Q78l26p43P17M04p84j28
2413c65P97k11o76L99M99n36k67O30j1o27J65M90j94n31L15N40n71k95P58k6o61
2434c78K78N95m47n01N94L22p83k3Q21l67o72O85K57o85p4O96n1o83L35N03m73
2455e1l31O53j1n76J29N51l17m16L93M25o43j65P67k09o38L74M56n20k39N35J31
2476B98n83R7N85k89n09M62L50o19k6N86j84n04K26N23m74m38P09R2o75K23N85
$$ y = [-738, 7, 785, -400, -554, 552, 237, -693, 2, 618, -250, -536, 498, 312, -555, 21, 568, -125, -334, 263, 309, -188, -261, 219, 180, -321, -113, 438, -47, -455, 201, 396, -300, -332, 522, 224, -703, 51, 654, -340, -436, 603, 267, -663, 118, 581, -264, -439, 388, 276, -528, -86, 456, -192, -404, 196, 245, -262, -174, 319, 210, -299, -91, 476, -17, -396, 229, 309, -371, -299, 411, 91, -578, 54, 502, -407, -383, 495, 169, -574, 143, 547, -237, -365, 432, 221, -455, -56, 443, -93, -360, 270, 259, -368, -203, 287, 93, -438, -123, 417, -154, -449, 309, 283, -378, -100, 495, 48, -453, 141, 463, -320, -343, 478, 111, -561, 124, 381, -304, -378, 318, 267, -416, -81, 422, -51, -382, 271, 260, -316, -187, 364, 47, -369, 24, 449, -194, -359, 408, 199, -439, -65, 391, -129, -368, 167, 298, -285, -188, 397, 108, -401, 61, 411, -208, -234, 352, 168, -336, -110, 413, -61, -499, 210, 302, -373, -150, 435]
2497D35m53m00N22K64n95n2O18k14m99M04L51n57j44N40m2m31J07M11k79l54M45
2518G7K32m88j56O75p2o39L13N07m52m39O92R5q02K19O76m96l98O31J04o13Q2
2539b52O44l32m91M85L04n61k7N40j10m29J27L23j30l95L37L12n34j37O41j97
2559A18n01L24M10m14l73O88J03p33K11P42o18l97P13J12p34K23N55m22l57M57
2579A07J92n25j4M62j56l50K42K42j11l45K49L60m62k39O94j17o13L17M90n30
2599a07l23O41J09p52K31O57n97l36Q17k3p50L99M30m11k94M86Q4m15L8L53k24
2620A3k54K46J61j43k48K05L02l89j72N37k2o30L28M86n34k44P12m6o89L09N60
2641D88o04l12P75o1p73M36M00n06r5M78r3l55K13K30k18j69J50J52j06j90J73
$$ y = [435, -18, -418, 104, 368, -227, -279, 339, 125, -374, 30, 381, -176, -320, 220, 178, -253, -146, 265, -14, -368, 77, 309, -179, -335, 340, 268, -371, -58, 449, -3, -442, 250, 345, -457, -238, 438, -58, -456, 175, 279, -334, -252, 392, 60, -431, 54, 358, -203, -230, 310, 200, -229, -102, 221, 91, -304, 33, 345, -189, -326, 315, 118, -383, -59, 351, -63, -436, 252, 355, -378, -167, 575, -43, -440, 273, 385, -349, -126, 429, 7, -350, 107, 299, -226, -240, 222, 66, -284, -42, 200, 89, -256, -7, 353, -109, -348, 346, 229, -384, -67, 423, -107, -430, 211, 320, -432, -201, 456, -141, -477, 340, 317, -433, -34, 396, -15, -309, 177, 261, -154, -116, 237, 13, -241, 5, 166, 23, -225, -20, 282, -107, -279, 258, 236, -394, -66, 420, -114, -358, 354, 308, -381, -72, 488, -116, -428, 347, 286, -487, -51, 349, -157, -252, 226, 133, -222, -9, 221, 3, -166, -16, 136, 30, -160, 13]
2662A3K28k68k69N07l2o08L70M73n48k23O81o6p07M13N55o40k47P72j86o65M53
2683FM57n95p3M19m4l34Q5K60j42k14J57J71j28j35Q3J81j88k03M93oo34M00M28
2706D44n77k60P29j63o72M51M52o14j74P32j96o52N09L67n73l0M75j54k70K68
2726I2R5j41k02J69J61j65j37K02J69l01j51M00K4n78K94M70n79j71P26j92o45
2747d60N53L65o90n9O83k38n75M81L26o07j1M95j92k96K29J37j22q6L7J53r9j81
2769a57K74J18l59n1M17j17m67L67L71o08j28P09k64n72N94K93o45j6N93k33m68
2790c49M45K58n14J9M46k74k74K64J55k55l3J10J06j64j13J94J57l60N9L58j29
2811A06m59L80L62n92q6O61k60n50O24K34o98P3N59l30l60L68L13n26RM15j98
$$ y = [13, 241, -27, -296, 211, 179, -429, -59, 414, -134, -357, 324, 258, -449, -36, 519, -121, -368, 404, 218, -447, 6, 463, -132, -205, 214, 170, -164, -79, 181, 39, -175, -18, 153, 25, -110, -27, 154, -34, -237, 256, 250, -384, 16, 444, -133, -393, 336, 173, -499, -48, 404, -210, -384, 348, 152, -500, 9, 376, -197, -227, 248, 94, -176, 92, 187, 46, -156, 13, 174, 9, -128, 74, 243, -58, -209, 191, 215, -363, -69, 401, -178, -349, 377, 185, -460, 93, 458, -232, -291, 392, 154, -421, 60, 386, -221, -232, 263, 71, -225, 4, 141, 19, -67, -30, 123, 24, -157, 117, 235, -124, -175, 242, 125, -342, 25, 396, -212, -340, 369, 105, -467, 127, 420, -225, -241, 352, 119, -349, 96, 354, -160, -141, 305, 31, -243, 21, 176, -79, -112, -2, 104, -60, -173, 21, 178, -182, -123, 235, 106, -353, 27, 389, -203, -289, 372, 112, -438, 186, 420, -278, -205, 354, 24, -336, 32, 345, -181, -172, 243, 45]
2832D5k72K41J15j76j4P7J08j08j61K76Pk97O8L08j76l32L38K17m63J5M93k29
2854H0m85N51K15n91O6N32l54l34M12J35l91pL27j15j79K16R7k62p2J93J07k38
2876i7l5K30N9l23N0M30l58k11M10N3l57%M33k64l06M30Q4m73J00M81l92k01L55
2899I8R3l04m1L52j28k90J97K38k50p9J87P1k65N6J67K0l15J23K96k76j76M01
2921A75M9m39J61L21k12k81L79N1l89P9M31l72k09L82J11m23J09K51j47j73J04
2942d2K66l14j06L18j0k26jK34l1k76J33K88l33r9L20j4l73J60L63k81j97L59
2964A38N7l97J15L65k61k63L27Q6k69M0K94j61k50K00J87k45j74L53Kk68M1K64
2986A81j41k48K16K01k86p7L60j19k99K17J98k67q3K18K4l14P8L44j94k39K86
$$ y = [45, -227, 14, 129, -47, -61, 16, 124, 16, -145, 131, 138, -159, -91, 217, 41, -291, 47, 264, -199, -184, 309, 80, -405, 146, 361, -230, -164, 368, 14, -320, 92, 227, -164, -171, 156, 41, -138, 78, 175, -87, -159, 34, 141, -97, -132, 98, 157, -166, -116, 314, -44, -255, 155, 208, -149, -149, 284, 20, -286, 144, 228, -245, -145, 336, -56, -257, 98, 191, -113, -154, 198, 70, -220, -23, 215, -35, -114, 73, 144, -121, -65, 102, 122, -193, -70, 226, -50, -226, 175, 224, -215, -54, 267, 55, -226, 153, 204, -185, -106, 325, -47, -256, 126, 237, -186, -77, 174, 27, -146, -42, 224, -90, -196, 122, 112, -114, -115, 119, 88, -188, -55, 233, -100, -199, 121, 107, -266, -106, 257, -24, -221, 138, 195, -202, -87, 278, 17, -246, 81, 167, -102, -62, 232, 71, -179, 21, 208, -37, -211, 142, 144, -124, -83, 181, 40, -208, 8, 209, -77, -154, 206, 87, -212, 5, 203, -64, -147, 71, 95, -219, -141, 203, 9, -230, 56]
3007E6Q3k69n8L45r7k30J49K45j95k83M17J2l86J69K71k03j33K17N7k81o1L40
3029A65p8l40K90J60k99k6K04Jk25J31K23j57k16K13J82l84M5L02j41k42K05J70
3051A83k48j34M05r3l26J81K38k44j28L27J0k92N6K09l3k99K59J10k25p1J60K3
3073F8j96M9J95p3j99J57J99l12m0L48j23l36K68K01k84q7L16J1l81J78K75m01
3095a67qK98p0k11J61J36o5k16J56J10j53m4J46J6k12R0J51r9j37J36J87l51K4
3118a22L55j97k80K64J81k92r3L78j12k39K03J64l45p8M21j83k03J73J52k46L4
3139f5J23Nj20oJ76L1j97j7J28o3j12J54J57k73r7L53r0k75J89K01k94o1L38r1
3163I4l24K27J92l33%L11j35k40K46P1j74k7J79J1j15pO7J6j12K6J51o9j70J33
$$ y = [56, 139, -130, -188, 157, 60, -170, -21, 224, 29, -254, 163, 175, -211, -42, 229, 26, -107, 110, 167, -114, -175, 165, 87, -253, 37, 197, -102, -128, 76, 77, -148, -17, 206, 49, -167, 46, 228, -156, -111, 191, 50, -192, 13, 183, -65, -199, 206, 113, -213, -32, 206, -38, -166, 161, 171, -121, -65, 144, 111, -188, 71, 181, -44, -115, 45, 68, -128, -79, 116, 43, -156, 1, 200, -112, -152, 196, 73, -263, 5, 206, -78, -165, 151, 162, -219, -41, 234, -167, -175, 123, 53, -158, 3, 139, 74, -142, 14, 124, -29, -73, 73, 89, -123, -33, 118, 19, -118, 18, 205, -146, -122, 233, 36, -244, 20, 201, -91, -184, 194, 82, -157, 46, 210, -135, -213, 208, 25, -178, -5, 147, -99, -65, 58, 63, -57, -63, 113, 144, -53, -70, 58, -5, -117, 37, 194, -79, -176, 177, 87, -188, 1, 202, -92, -153, 185, 94, -230, -3, 189, -144, -144, 167, 32, -208, 38, 109, -65, -92, 87, 98, -17, -24, 43, 59, -53, -27, 124, 55, -115, 18]
3187A8J57k53p2L48j14l20L17J73l92k6M27j82l08K80J02k73k2L37j86j88K04
3208B7Q1k05M4J23m7l3k8J44m7j18J5J54j18j24J53O3j89o3L06r8l32L60J24l56
3232a64N0K71j01k50K60J06k98L7K07r7j71K46L4k49P8J34q8l3oN7L2j09j9J94
3256A21j37j32K37L6k60L1L16j26l03K92J75l89L1K81j42k24K99P7k74k1K61j35
3278A4j97K17Q8j68k1J51p4n7N1K7L7j67K7J28o6j37J86O8k67O4K49j34k33K92
3302G8J70l96R4K97k50j88K76pk10R0K20j71k12K75L4j62LJ42p7m9O2K7%r4L4
3327a4J31r1j58J62Q9k47J20J93k41j45K74K4k58K2L67k81j41L22kk93J75J52
3349A60j96p5J65K6j44J7J46l3j44O7L6Jr6L6Q2o1j53K27K6k21O4K59j61j47K79
$$ y = [18, 175, -78, -150, 198, 84, -236, 81, 254, -138, -164, 263, 81, -227, 53, 155, -118, -140, 197, 11, -177, 27, 108, -97, -53, 70, 23, -10, -38, 106, 59, -59, -44, 110, -8, -132, 21, 84, -105, -168, 138, 40, -292, 68, 192, -164, -114, 157, 56, -194, 66, 172, -126, -89, 118, 21, -150, 96, 130, -119, -41, 93, 5, -28, -34, 23, 55, -54, -73, 121, -16, -148, 89, 125, -135, -104, 212, 86, -217, 75, 250, -139, -108, 173, 31, -193, 106, 183, -91, -112, 149, 14, -183, 34, 122, -46, -67, 84, 10, -47, 4, 31, 68, -99, -72, 56, -10, -147, 39, 107, -160, -96, 153, 19, -214, 78, 248, -148, -54, 243, -7, -195, 81, 74, -136, -46, 174, 3, -209, 66, 100, -62, -59, 83, 6, -43, 19, 46, 46, -48, -14, 117, 26, -132, 30, 119, -128, -8, 185, -56, -201, 73, 97, -161, -139, 228, -53, -194, 128, 126, -167, 8, 160, -36, -111, 54, 80, -64, -47, 99, 66, -78, -11, 25, 26, -70, -34, 48, -13, -166, 61, 87, -134, -70, 189, 28, -119, 160]
3374A60ol04J42K39k38j32K59l2k53J37J13j14j22J96Kj28L0J03r1n8M7J67j41
3397b4k3J00L7r2q7J87mk40Q7K59k62p1J92J3k11J31J56j53j58K66J5k77J70J54
3421A65j65p6J36k4p5kQ5Pj70J03J07j40OP4M5j05o7J50K7j86J17Q9j66q2K44
3446I7j7k21O7K39j51j29K13j0k32J57J60k12q8K40j8q2p9Q9K2j44J30O9j29o5
3470i4J10O9j71J7J44j0j89R6J27j02l9J21k4j56J64J8j24l1K43p6j70K0J81j13
3494A1j14J65j2q2J8N2M4j21jK08k25m1J82k8j27N0J08r0n0K3J61k05m7K38p9
3519C8j46J18N0q4n5J22L9j16j5J67j32p2J62M4j69k6J67r3m8K5J11j27r8K04
3543F6L2k29J50O9r1r0R4P6j18k0J50k6k09J61Q4j45q1J63J8j12J4J20j29l6J01
$$ y = [160, 154, -150, -8, 231, -7, -139, 120, 88, -165, -28, 85, -29, -151, 45, 47, -81, -51, 52, -39, -97, -50, 117, -24, -47, 53, 90, -2, -89, 98, 94, -146, -59, 200, -62, -133, 59, 72, -139, -8, 148, -5, -163, 103, 118, -159, 11, 165, 0, -76, 60, 36, -39, -41, 44, 51, -119, -16, 91, -49, -43, 31, 76, -29, -96, 54, 81, -105, 12, 101, -65, -147, 97, 80, -141, -74, 165, 14, -115, 98, 88, -144, 13, 173, -39, -127, 113, 95, 13, -66, 23, 45, -99, 31, 100, -29, -94, 16, 85, -86, -69, 75, 65, -124, -28, 99, -3, -42, 79, 55, -101, 63, 81, -43, -74, 169, 93, -77, -57, 124, 11, -103, 62, 50, -32, -14, 38, 82, -39, -40, 168, -57, -98, 84, 56, -71, -21, 87, -3, -53, -30, 131, -74, -121, 117, 38, -108, 10, 60, -24, -79, 43, 82, -34, -49, 118, -14, -86, 76, 120, -49, -75, 92, -1, -49, -24, 87, -40, -138, 66, 98, -131, 19, 88, -3, -93, 1, 77, -41, -61, 89, 63, -146, 15, 99, -46, -127, 36, 54, -58, -44, 76, -53, -89, 12]
3568A2N8j65M9J61q2p6R8J01j97m3J75m4j45O9J22j43k9Q2Op5L8Q9o5o9N0O6j14
3595g1J1R6k2p7K6J52j05j48J54Q3j90R1O7o1r1J12P1j64J1J69l0j95J10R5j43
3620d9RJ12l8j02J0J22p3l2L8K8m3n4N4N9j31N5J43j16p3J30P4j55j6J73j00r5
3646g0J51L8j61jJ20l4j21P0P5r4JP9n2m6L2JN0n6L2Q5m4n9M4jj45J09N0o4r5
3675a06Q4P9j37j1K11j31j14J75O5j61K1J11p3k8N6P1j75LJ71j05r4P7J4oj4m
3701b1O3m9j5L5N4o5n2J57o1j19J26O8k06J6J93r2j99J68P7j64L7J05m8j13J47
3726D2L7q5k4R0j14QP3P5o5n1k3J14j6j05M7P6j92P3J39m4j45J96K4k29O4J35
3752A00q3j25J38Q8k24R7J77j86j18J65j0n1k7Q7k4o8J15l1m7J6J3qP7j11N0N2
$$ y = [12, 70, -95, -46, 115, 33, -43, 55, 156, -41, -84, 91, 47, -98, -29, 93, -50, -79, 3, 9, -66, -28, 61, -4, -73, -23, 43, -71, -60, 36, 14, -63, -37, 115, 10, -138, 16, 99, -91, 0, 67, 6, -85, 27, 98, -66, -55, 114, 84, -111, -1, 94, -49, -40, 72, 34, -68, -58, 64, -9, -41, -3, 25, -18, -72, -18, 41, -90, -35, 108, -8, -81, 49, 123, -32, -48, 125, 25, -70, 81, 119, -42, -43, 77, 43, -78, -8, 67, -27, -26, 53, 1, -45, -13, -12, 38, -18, 14, 99, 55, -4, 40, 39, -106, 3, 53, -11, -106, -22, 57, -80, -91, 120, -11, -125, 50, 115, -46, -25, 86, 13, -15, 41, 112, -63, -60, 111, 6, -88, -11, 3, -3, -17, -21, 42, -7, -22, 13, 67, 2, -50, 107, 46, -73, 53, 121, -85, -69, 124, 32, -167, 1, 78, -86, -49, 56, 8, -105, 42, 79, -6, -30, 60, -54, -46, 27, 102, 37, -14, -37, 77, 61, -44, 3, 79, -113, -40, 99, 55, -90, 106, 130, -99, -35, 100, 17, -108, 30, 118, -106, -9, 168, -18, -136, 29, 19, -32, -59, 28, 4, -64, 51, 20, -27, -11, 2, -6, 71, -40, 10, 62]
3778F2q9pJ14q4r8J18j9j10N4J91j10j43J54J0j62R0J65j40m1R2j9r3R6Pm1k2
3804b5K4O0j11P1j2L0k3q5J18j3r6K7J15o5p0J82j13q7K7J72j10o9J12N4j95N9
3830b3N3l5o6J09O3j83J12k1kj7P%nJ9J2pl7N8p4Q4j03O5N5o5r7J04L1j07N2J37
3860A19j38j6J16kj46N2R2j25J4O2%r2P2K8o0l3K9R1q2k5K4j4J6%N4J7j27J1J65
3889A02j00j08J79p8k6j0J44r9o3R3Lj61J38J01j17l8P6K5j05O4P8j27M4LM8o1
3915Ej2OO0j15J9O6k5n4M2J6m0l5J52l6r2M5N3r5j0J10k3j33R7O8p5o0J46n7o8
3944d5j3P0l6J9J14j11j9J0P0j2m5JL7K4p6rL7m7LM4M3j71J38P6j47k1J27p6m5
3973f0K6R6n6o7R3K8j09M1J24q3k8J5P2j25J9L9Lo3M0Q2p2p8P1Jm5j9O4nn4P2
$$ y = [62, -27, -34, 80, -4, -102, 16, -3, -113, -59, 132, 22, -121, 33, 43, -119, -29, 136, -4, -45, 47, 28, -65, 31, 38, -3, -25, -1, 59, -52, 19, 7, 37, 14, -71, 47, 34, -62, -35, 80, 15, -55, 127, 14, -73, -46, 126, 16, -53, 59, 113, -82, -23, 30, -5, -71, 38, 101, -82, 30, 9, 7, -10, -3, -3, -8, 11, 23, 16, -21, 37, -37, 47, -56, 9, 64, -1, -98, 6, 37, -70, -18, 119, -19, -35, 81, 79, -67, -15, 77, -48, -34, 28, 28, -64, 8, 36, -24, -57, -28, 63, -19, -44, -20, -34, -18, -18, 36, 53, -74, -63, 102, 2, -106, 73, -5, -31, -41, 103, 4, -59, 34, 37, -124, 14, 115, -2, -40, 36, 61, -44, 20, 98, -29, 15, 18, 66, 5, -7, -1, 59, -56, -37, 29, 4, -50, -8, 8, -32, -67, 85, 49, -43, 2, 55, -40, -50, 60, 37, -96, 1, 69, -6, -66, 80, 23, -45, -58, 12, -24, -5, 109, -2, -21, -11, 59, 47, 2, 3, 40, 64, -12, -21, 16, -31, -28, 16, 59, -112, 26, 102, -45, -66, 61, -15, -60, -34, 62, 6, -61, 32, 60, -49, -8, 116, 33, 5, 20, 92, -33, -14, 25, 28, -35, 5, 87, 15, -63, 8, 9, -36, -55, 9, 4, -50, 22]
4003B2N3j08k1J40l9j31J00jk7KK9Mp3M7Q4m2j06R8Om7k1P1n0mM4N3j27M5k6L7
4033A2n8J5J01j1j16K5Q4p7J7M4j1m5O1Pk0n3N0N3j05J6L6j0j01J24m9K4JM2J2
4062F8j10L5M4l2J2j5M5q4J6R8p5l4K2J08j30j6J04m4p4R0M1r9J6N9K5p4J8L1
4090D5J7j71J25M3m0k7O6l3p9J2Q7o4l9R4Qo2O4L6n9o7M2m7L7k7P0lp4J2R7j21
4120e8L2J4R8r3qJ04l4r0R5n5QoL0l7l3R3m0Kj06J03J7q9L9K1Ml1L3L1o4M4K0
4151D4jj10L3J00l5o5N6L9n7LR7j22p2J06O6j41K4J02m2r8J31Mj44N9M7L6r1J2
4179a9J0K7pJ6Kj2J3Jk2m6K0L8l7k3LM1l2j1R8l9m1R5K8r2n3Q6m5p8J15rl0M2
4211C9n%k9l3P2l4j1oJ7rL%K9k1j7M2k4n5M2N4j23J7O7j4l5L9M9n6k0Q5m4p1P1
$$ y = [22, 75, -33, -54, 86, 47, -84, 16, 15, -12, -10, 19, 23, -50, -3, 81, 39, -67, 31, 37, -10, -31, 40, -10, -14, 30, 83, -44, 1, -25, 12, -46, -31, 70, 59, -57, -32, 52, -25, -8, 36, 25, -20, 41, 48, 28, -25, 25, 78, -27, -11, 25, 15, -86, 38, -11, 13, 14, 56, 68, -42, -7, 37, 5, 17, 2, 47, -37, -21, 77, 2, -32, -10, 98, -32, -48, 56, 12, -62, 28, 69, -30, -14, 45, 70, -4, 14, 45, 62, -109, 16, 59, 19, -8, 58, 25, -54, -42, 45, -19, -58, 36, 44, -18, 46, 82, 23, -44, -2, -49, -12, -39, 31, 28, -46, -34, 63, -58, -26, -12, 86, -7, -15, 89, 55, -35, 60, 5, 13, 7, 37, 0, -33, 60, 20, 22, -84, 19, 36, -53, -14, 7, 11, -20, 13, 44, -20, 24, 44, 43, -67, -34, 66, 31, -34, 22, 61, 4, 7, 104, -18, -90, 16, 82, -59, -35, 67, 25, -73, 58, 62, -82, -23, 24, 60, -31, -19, -9, 18, 11, 27, 29, 17, 30, 31, 9, -37, -17, 21, -16, -39, -36, 5, -27, -38, 60, 21, -20, 75, 103, 11, -42, 44, -1, -79, 36, 27, -3, 39, 34, 34, 5, -28, 44, 10, -1, -7, 10, 1, 4, 4, 33, 12, -5, 37, 13, -42, 0, 54, -69, -52, 15, 1, -34, 5, 54, -2, -22, 63, 19, -52, 19]
4244A9Qr5R1O7j10L7j8L2m7K6L2l1K3oJ2n0k9J1P5oq6R4q3j8K3O2k5j1M4K3r9
4275c5lJ02j01l9J01L6j34M6Q7q9%N5m8nj1O9M0q5j0K6km4L3O2m8k6k6O8n5O4
4305B8O3p6r7J43l7p9L0P0n1mL5Rq3O8N1q9NL8m7J6L7l4R1r9RM1l4M7l8J7Kl3
4337aO4k0n7k6J21j09k1Q4p9K2L0K7k6m0K8M9j18L4M4m5L4O2p3nL7m4P3n7j5O8
4367D1l2Mn5N4J3l1ON9q4P1Lj9j16J26j3r5K9Q9k0n9R1m0n8K5N0o8L7L0L0q1p
4398b0N6k0ok0J05j05l5R5l3jl8L0M6n5N6J6q4J4L7Oo7K1J08p9n6M2M1r0P2Qr7
4429e3O1J0l4qJ4M2o0M0Mlk1o4Q7N5n7j3MM9Oo3R5j05o0J15qo0%R3n7k5N2l4k7
4462b5J1J10r7J4O1k1p6K5P9n4j2J0J3l5Km4R6o2m8J05m3oK9O%o3O9L8p5j7O1
$$ y = [19, 27, -68, 23, 90, -20, 17, -1, 31, -16, 10, 42, 11, 34, 28, 40, -10, -39, -28, 47, 41, -45, 49, -34, -52, -29, 33, 8, -3, 41, 64, -35, -38, 64, -37, -76, 25, 61, -73, -27, 60, -29, -29, 26, -22, -27, -38, 31, 71, -14, -24, 2, 0, -44, -11, 51, 3, -23, -49, 19, -36, 28, 91, 15, -82, 61, 24, -55, -25, 45, -6, -10, 25, 34, -49, 19, 70, -19, -14, 24, -23, -7, 30, -4, 87, -12, -3, 38, 4, 51, 13, 30, 32, -1, 63, 43, -14, -40, 81, -28, -49, 35, -44, -22, 8, 35, 9, -31, -3, 46, -72, -38, 6, -39, -5, 57, -16, -21, 16, -28, 45, -12, -27, 41, 9, 13, -42, 12, 25, -6, 0, 59, -25, 46, 49, 30, -86, 40, 27, -68, -39, 50, 30, -29, 62, 22, -36, -11, 39, -29, 8, 38, 68, -13, -20, 36, 16, 10, -10, 95, -10, -45, 50, 17, 16, -22, 8, 54, -1, 55, 71, -13, 1, 38, 44, -23, -2, 106, 27, -29, 13, 54, -36, 36, 44, -53, 8, 18, -16, -24, -10, 32, -28, 12, 16, 13, -8, -72, 15, 70, 13, 0, 4, 53, 59, -4, 91, -14, -74, 41, 33, -27, -27, 66, 9, -16, 36, 2, -25, -14, 96, -1, 13, 74, 53, -23, 2, 81, 27, 15, 25, 38, 3, 5, -39, 57, -5, -53, 52, 9, 3, 32, 38, 38, -25, 44, 82, 7, -10, 51]
4493E1q3K5%K9m6LK2k2rP9o2J8J4Ln9K9K8l5J3j6JK9m3pQ1m4K6k2jl6%K9K2o2
4527d5N7L3j07L6P9l6lqO6j16L0N7n8K0N4Jl6j22R7j6lj0O1Q3j62P9L2j06K6O2
4557D5nn6k2L6O8j05O5M7j19mN0J7n7R4k2n6OK7K1n8k1R4l7MJ6j3k8JL8oK0l9
4589Ak2J5L9l2k3jJ6K8nn8K7Q0n6KqM8o4L9J6m3m8P8n4K0MqJ6m2N6J06j38K2J0
4622B1J7l0qNrl7L1J6m4L4K8q4NN0N2n1j4QL4j3N2M0r3k8K2M4k2l1K3m5L6RJ9
4655C7n4j6R2p5M1k4O1ll4pj2r8J02m6N3j1J4nJp0O1K6q5M8P1p2L3J9m0m6N7J8
4687C6pq0P2K6j14K8J10l5n0M9j7J6o1J9K4m3L7Rl9K3j6K9K4J0n0N1j1l5J01j63
4717e7K9M7J7l0Oj5Rj00J02ln8O0N4q0J7M1or2j7J10m1J4k1L6j5j8N1n2mK1m6
$$ y = [51, -32, -7, -7, 22, -24, -21, 1, -21, -30, 49, -13, 5, 19, 22, -37, -8, 20, -15, -2, -18, -17, 12, -31, -38, 43, -1, 25, 3, 2, -34, -34, -5, 17, -45, 12, 45, -62, -26, 53, 17, 14, 6, 72, -44, -14, 43, -15, 5, 59, 60, 24, -98, -1, -17, -20, -30, 31, 114, -48, 31, 63, -43, -17, 45, 40, -16, -38, -2, 66, -39, 26, 73, -46, -50, 0, 17, -40, 54, 32, -24, -18, 9, 30, -28, -49, 45, 8, 12, 28, 15, -13, -12, 26, 20, 40, 1, -21, -6, 33, 1, -22, -23, -7, 21, 16, -42, -15, 65, 9, 11, 3, 51, -13, 26, 42, -1, -49, 29, -25, -5, -1, -9, 7, -35, 21, 127, -11, 11, 21, 38, 8, 0, 5, -4, -41, -10, 6, -38, -4, 24, -60, -55, -5, 47, -4, -18, -10, 24, 11, 63, 103, 10, -18, 4, 48, 26, -5, 18, -27, 9, 18, 37, -17, -33, 59, -16, 25, 1, 62, 59, 25, 18, 6, -92, 10, -36, 17, 6, 20, 15, 16, -54, 7, 33, -52, -4, 67, -5, 28, 47, 7, -39, 18, 36, 29, -51, 21, 47, -67, -39, 71, 36, -14, 35, 18, 34, -27, -8, 16, -27, 10, 19, -20, 3, -13, 16, 40, 50, 0, 51, 40, 5, 106, -57, -28, 19, 36, 6, 12, -3, 6, -94, 8, 5, -53, 7, 61, -19, -2, 39, 33, -59, -76, 34, -7, 7, -14, 22, 7, -11, 40, -12, -16, 5, -41]
4748d1Q7p4J3L4K8p1R4qj17K2J0L3n3J41o4j19P0O7m5m5P0q3M8J8JJ1m2l4Q0j4
4778A7LlL6n5J3n8N6qo5P2k7m8L8J8J3k0N0m1J3L7Jk7j09J31k9Ln2J16j23K7J6
4809eL2l5OM0Jl5QJ1p1j9J09j1j9N1o8k4J1jP3l6k7P2q1jP3j02M9P0o4Nj7O3J6
4842G4r4J5K2Qp3L9J1k0N7o7j0J1K0k0j6J9PL7Pr0Q2J4j7m2P5o5JL5J3n7jQ4m7
4875A2j1nJ2n1K7N7o6oN6n7N3j6nk5MkJ8l2j2N7J8l3j8QO0r1QQ4m0k8L3J1r8Q1
4909Ck8N2J8n3K9m3O6J8j02J08m1Jk7Ml2K2lj1N6n8L1j2OM7o0M0m1k5P4N1o7n4
4941c1R1j9q8M9K7m3j9K4lm4R4j9M7p5L4kn2K2M2o8QL0Mk8nj5J8Mk8L7K1m9LJ32
4975I9j14K7pO0j26R8L0j25L0O1j8m5L5rn7JN4K0o5M9L3Mp5K3N4j8j9NR6j47L1
$$ y = [-41, 46, -28, -15, 19, 47, -24, 70, 62, -55, -33, -23, 10, -43, 98, 34, -85, -15, 52, 7, -38, 32, -51, -3, 15, 16, 27, -15, -49, 31, 17, 20, 17, 53, -2, 11, -47, 9, 1, -64, 8, -19, -67, -29, -11, 2, -18, 32, -9, 4, 41, 42, 15, -94, 37, 8, 11, -41, 75, -48, -21, -5, 27, -8, -2, 38, 39, 4, 12, 23, -48, -67, 42, 31, 12, 63, -5, -29, -18, -19, 54, 18, -9, 63, -18, -19, 54, -48, 1, 71, 7, 12, -5, 58, 74, -20, -5, 17, 25, -48, -9, 2, -18, 39, -28, -38, -27, -7, -27, -43, -24, -17, 20, 27, -63, 19, 33, 16, -26, 49, -16, -15, 20, 33, -24, -25, 59, 12, 1, -4, 8, -43, -16, 41, -25, -31, 25, -32, 21, 5, 0, -25, -21, -23, -5, -37, -49, 8, 26, -7, -25, -17, 43, -48, -40, 44, 4, -24, 9, 20, -78, 3, -25, 27, 45, -8, 21, -22, 44, 62, -40, 68, 27, 28, 1, 5, -27, -5, -8, -19, 37, -21, 10, -2, 4, 51, -9, 31, -10, -35, 39, 90, 23, -31, 60, 41, -47, 2, 29, -14, -33, -9, -12, -56, 38, 19, 66, -9, 25, 23, -29, -7, 35, -33, -25, 5, 9, -19, -24, -39, -21, -17, -45, -8, 13, -36, -33, 99, -15, 12, 5, 65, -61, 37, 67, -58, -28, 33, 15, -30, 5, -4, -61, -60, -6, 14, -51, -2, 31, 35, -40, -17, 37, 19, 0, 5, 101, -46, -15]
5006a5J5pp5M8O2l7q6J29k9km9N9m8k4O6QJ8m9O8j2k2N3k7m2j6K7J0o0ML6K2k5
5038@M4Lp5j4R2j5n2N9J5o4J8M5p6J3L6N2q1JJ5l8K4qJ4K9m9P1o6J2j2j1N6pj
5071C0k2k6L1m6Q9p1JP5m8l1M6k5j3O0k5pk8j5M4k2l4N0OK9m5O3j07M3L4j0m5
5102a9NN3k9l3l3P9n1QP2l0k4J2pJ5m2N3J6m7rJ8J3%k2k5L3OM8m1q3N5L3j4l5
5135b5L7O2j10O3K2k0j2l0L7n7K1JJ6K1k6k6K8nk8L9j8j5J9L6m6L6Mk2pJ7L7p9
5167c0Q8l7J9qk8M1k0p9R9l0k7K7qmL4k0l5QL6m7L4l2K4J6l4M3m1M6j1l9K3mn0
5200d6L8kK4Oq8P4nM3l1%L3J3j2j5j5J4J0nk9rL3Nk3m%k8M8l8M0n3N2m2j4M8n0
5235b8J0K7l0J6%O1q3O1lJ4m7K4M6m5m6J9N9r0L7Nl8K9M2J2j3j8J7l2n9K6K5J3
$$ y = [-15, 0, -7, -82, -34, 28, -9, -95, 34, 5, 3, -46, 13, -35, -59, 7, 15, 33, -16, 52, 40, 18, 71, 44, 2, -14, 13, 23, -37, -33, 3, 25, 0, 44, 47, -28, -42, 50, 35, -17, 42, 57, -7, 11, 56, -20, -7, 29, 81, 0, 1, 16, -22, 2, -6, 8, 37, -12, 59, -7, 5, -7, -18, 38, 31, 30, 8, -18, 13, -33, 56, -15, -14, 61, 13, -18, 28, 3, -10, 50, 25, 18, -10, -25, 19, -3, -37, 13, 19, 48, 3, 66, -41, 2, 36, 26, -19, -14, 39, 10, -23, -56, 23, -28, -20, 52, 22, -2, 10, 3, 18, -24, 29, 45, -2, -11, 7, 20, 20, -2, -27, 6, 12, 60, 19, -64, -9, 24, 10, -25, 12, 74, -36, 27, 49, 29, 17, -13, 24, -33, -12, -11, 5, 26, 0, -26, 2, -3, -31, 8, -10, -25, -6, 30, -16, 20, 24, 2, -5, 12, 49, -30, 58, 21, 40, 32, 4, 45, 25, -54, 45, 15, -12, 15, 7, 3, 37, 17, -18, -10, 26, -21, 13, -19, 5, 21, -13, 30, -11, 35, 24, -15, 8, 4, -46, -8, -10, 14, 20, -68, 6, 1, 44, 13, 13, 46, 59, 47, 32, 17, 31, 41, 36, 7, -2, 31, 36, 13, 9, 9, -19, 29, -9, 31, -22, 30, -12, -26, 22, -28, -18, 9, -21, -5, -5, 56, -27, 34, 31, 45, -2, 22, 68, 23, -23, -4, 55, -35, 2, 7, -31, -2, 40, 52, 39, 21, 38, 6, -53, -27, -2, 11]
5267A1j1K2j2Jqj0K1j8J7M6q5L9J1pk3J0J4l2K1Nk0QpL0n2M3L6n1n3L5M3n0Q6
5300F0o2o4R8Km1K6rk6M9k2j7L2mk2rL0qk9k1L4P4p2Qj1m0M4J5Nj9L4Rl4j0m4
5334d4O3k5k8N4J4l5J7J6ok8M7K5k7l4oJ3k0M3l3k5L8K0nn5Q0n6j7L0n6Q3m4R
5366Hj6oK0l6M4n9N5j3K3k0J7l6KnP9l6l9L6m5J5mM6L9q7j8M5n0LP0l5L8o6K5
5399fj7J0J8O%M5k8j1l6M3j7q0O2J7N1o7Jj1j2J6L3j8nN6m2j6L0J7l4Ok6R9q8
5432dJ3n8Q0m6j8M1O7p2J1k7L3n7Q3n7lP6p5O5k9ln1K6l0O6mnl7M1k1nM0K7p9
5465a2K8J5j3p5J00l4j3kmk5N1J3m0k0N2m8QkJ8jk8P9k6mj8LL6m8J4l7J00p7k0
5498c0R5l3k5J9n5M3Nnj8j5M1l0k9J4Q1l9oqpO4p7JN6o4MjJ2K9l5lL7j5K8l2J5
$$ y = [11, 0, 22, 10, 11, 3, -7, 14, -4, 13, 59, -26, 13, 24, 17, -6, 4, 18, -14, 7, 12, -8, 0, -7, 23, -29, 14, 50, -1, -54, -19, 24, -26, 60, -2, -66, 32, 34, -7, 19, 10, -16, 33, 11, -6, 26, 22, 0, -9, 21, 13, -16, -37, -3, 71, -1, 7, -4, -44, 0, 15, 20, 1, 35, 44, 10, 0, -44, 19, -6, -34, 20, 34, -1, 16, 32, 26, -2, 45, 70, 43, 9, 3, 16, -4, 39, 6, -19, 19, 39, 34, -21, 59, 3, -14, 16, -40, 43, -1, 8, -8, -14, 6, -30, 14, -45, 10, -3, 20, 0, 17, -19, -17, -22, 57, 21, -18, 18, -27, -12, -16, 30, 69, -18, -36, 9, -41, -38, 32, -3, 35, -31, -6, -23, -13, 5, 11, 11, 56, 28, 17, -19, 24, 7, -73, -11, 6, 57, -10, -9, -20, -32, -16, 17, -1, -6, 50, 8, -8, 22, 39, 5, 11, -15, 84, -4, 9, -49, 31, -15, -33, 8, 75, 3, 14, -13, 20, -37, 46, -11, -14, 62, -13, 52, 23, 20, -31, -5, -35, 31, 27, 22, -15, 26, 5, 0, 40, 67, -12, 16, 31, 18, -57, 43, 9, -4, -6, -10, -35, 16, 29, -11, -31, 21, -27, -19, -21, -3, -4, -32, 47, 21, 17, -1, 2, 38, -10, 4, -33, 67, -10, -30, 65, 32, 7, 26, -29, 14, 19, 14, -4, -19, 22, -8, -37, -23, 58, 19, 13, 5, -2, 62, -15, -14, 42, -22, -18, -19, -7, 22, -13, -16, 21, 6, 34, 2, 17]
5533A7j1M0n4M4l6K9j1m5O9k7JM4qn3QK0m8L3Qk3M5o7L6j7j7qM4MJ6p8M6K3l1
5566gL0J3n0K7Nl5J3qqJ0OJJ5m6O0l9J1mL5k8N4r0M4l4J7QLrNJ5Pj2j5L2m5L8
5602A9l7M5j2n1L0%%j1N7j2l5l7kP6o7O7p6L0L2k3kN0n0M5r9Q2K2m6L7j9j4K8
5634B7j9J2K2n0M5k7pj5LoN0%o6P6m8k8j3N1J8n2R9q2J3O3q1l6P1l7L1j1j8LL1
5667A9Km0J7Nl2L1rK9K1m0K2k6J5k9jK9J4l5M2J5m7k0J9j4M1l0L5j0l5K6J9Ml4
5700CJ6Mq0O7K2m1Kp0N5j7L8N9k8Kl9oQkJ3K2lk6o0J2N5n8O8l8mPK3l8pL0l4L9
5736fK9L2p8J7O2o2M6k7Lj7J5l3J2l2P2j4Qj8j8j6O3rj1k9j5O3J5o0j0N4k8oJ3
5769A5J1n3Q7r9K1oM9KJ3k9Jk7l4Q1p6M4l3Q3l3Kk6j1rM5kK5pq0N7m4NM0J6Ok7
$$ y = [17, 6, 46, -8, 36, 0, 29, 18, -27, 42, 15, 16, 60, 52, -1, 7, 27, -21, 12, 20, -3, 42, -25, 11, -6, -23, -31, 13, 17, 33, -45, 1, 24, -7, 23, 36, -14, 13, 18, -17, -4, -12, -20, -10, -4, -3, 12, -34, 26, -13, -2, -6, 29, 1, 55, -35, 9, -25, -8, 0, 3, -6, -1, 14, 21, 9, -6, 26, -19, 19, -18, 27, 15, -36, -6, -6, -6, -17, 40, 28, -7, -44, -46, 30, -37, 30, -46, -16, 16, -7, -9, 41, -9, 36, -63, 19, 41, -5, 32, 13, -1, 27, 8, 20, 42, -8, 37, 10, 3, -12, -9, -15, 35, 35, -31, 45, -3, -31, -44, 7, 25, -27, 72, -10, 3, 66, -15, -51, 20, -17, 14, 3, -15, -12, 19, 21, -19, -2, 3, -29, 2, -7, 22, 43, 3, 25, -1, 14, -15, -16, 13, 27, -8, 34, 49, 2, -18, 1, -13, 28, -2, 33, 23, -12, 14, 33, 37, 3, 19, 23, -57, 10, 32, -9, -7, -77, -22, -39, -1, 58, 30, 32, -7, -13, -5, -7, 6, 28, 25, -1, -61, -49, 6, -52, 16, -22, -26, -19, 4, -34, -41, -11, -45, -6, 23, 55, -23, -6, 56, -6, 40, 13, 16, -1, 14, -19, -7, -39, 33, 19, 27, 9, -9, -25, 38, 29, 18, -11, -26, 37, 52, -8, -18, 36, 8, 2, 15, 26, -27, 60, -39, -18, -24, 25, 27, 40, 11, 12, -15, -49, 32, -44, 0, -33, 50, 17, 19, -7, -18, -27, 18, 16, 41, 34, -46, 11, -33, -28, 12, 28, 34, 7]
5804GM1n2m7J06n4j9N2N1p1n1J4J7J5mj1RNJ1l1M7k4kk3J9j3j1M7J2nn1j3RM2
5837B2m5pKJ3N2n3P8n4k2L6pl8j0L2LJ2n6PN3j1l8kj9N1K3m4K3m8M1j4K0k8N1
5870B3n6j5L9N0n4P7r2N3%o2J6J6%ok7K3nRN0j20O5P4o4Oj2L2k6M3k1o6Rj6J36
5903G9q7nMK3m0O7j0mK3o5M7j1K9o8k2L0J8%j3M5j5j1Rl4K4N5q6O6p9L1jPm2K2
5937a4nKL5o5L3NNL5o6J8L8M2j13L2L3Rl1K0K3Mlk3j6N1m5M1l9KK1l1L5j4j3Q
$$ y = [7, 48, -4, -51, 55, 1, -18, 34, 85, 14, -37, -23, -6, 9, 5, -6, 3, 8, 19, -12, 35, 11, 9, -14, 5, -8, -19, 28, 40, 35, -16, -29, -20, 22, -23, -30, -28, -15, 37, -16, 62, 8, -14, 22, 15, -23, -33, -1, 2, 14, -42, -35, 18, 7, -31, -33, -52, -1, 22, -22, 1, -47, -6, -20, 0, -28, 23, -33, -48, -9, 41, -13, 64, -28, 25, 25, -37, -21, -5, -5, -11, -38, -15, -20, -11, 39, -81, -16, 58, -6, 0, -12, 20, -6, 37, 16, -50, -41, -57, 79, -8, -13, -9, 14, -26, 41, 31, 27, 50, -15, 32, 21, 50, -18, -40, -10, 8, 8, -5, 40, 25, 14, 23, -11, 13, 68, -18, 48, -31, 0, -1, 6, -36, -14, -19, -17, 18, -47, -14, -9, -4, 31, -35, -17, 21, 63, -50, -18, 15, 24, -7, 13, 36, 40, 37, 14, -2, 49, 4, 45, 6, 8, 29, -2, 33, 19, 6, 14]
$$ [...]
8191A9
##END NTUPLES=NMR FID
##END=
