##TITLE=1H_IBBC 2702
 CDCl3, 8 sc, 
 28.2.2020
##JCAMPDX= 6.0         $$ Bruker NMR JCAMP-DX V2.0
##DATA TYPE= NMR FID
##DATA CLASS= NTUPLES
##ORIGIN= UXNMR, Bruker Analytische Messtechnik GmbH
##OWNER= root
$$ XWIN-NMR		Version 3.5
$$ Fri Feb 28 14:19:16 2020 Russian Standard Time (UT+4h)  she@DPX200
##.OBSERVE FREQUENCY= 200.1315
##.OBSERVE NUCLEUS= ^1H
##.DELAY= (6, 6)
##.ACQUISITION MODE= SIMULTANEOUS
##.ACQUISITION SCHEME= undefined
##.AVERAGES= 8
##.DIGITISER RES= 18
##SPECTROMETER/DATA SYSTEM= spect
##.PULSE SEQUENCE= zg30
##.SOLVENT NAME= D2O
##.SHIFT REFERENCE= (INTERNAL, D2O, 0, 15.7039)
##AUDIT TRAIL= $$ (NUMBER, WHEN, WHO, WHERE, WHAT)
$$ ##TITLE= Audit trail, XWIN-NMR		Version 3.5
$$ ##JCAMPDX= 5.01
$$ ##ORIGIN= Bruker BioSpin GmbH
$$ ##OWNER= she
$$ F:/spectra/data/she/nmr/H-F/1/audita.txt
$$ ##AUDIT TRAIL=  $$ (NUMBER, WHEN, WHO, WHERE, WHAT)
(   1,<2020-02-28 14:18:12.71 +0400>,<she>,<DPX200>,
      <created by zg, POWCHK disabled, PULCHK disabled
       configuration hash MD5:
       00 E9 B6 7A A2 85 ED C7 34 08 36 98 17 FE 4E 26
       data hash MD5: 16K
       05 AE AE 38 80 13 01 3D 63 F0 AA 28 AC D4 58 5D>)
$$ ##END=
$$ 
$$ hash MD5
$$ D1 AF F5 15 8C E0 CE 5F C6 73 AA C2 AC 34 B1 AE
##$RELAX= 
##$RELAX= 
##$RELAX= 
##$RELAX= 
##$RELAX= 
##$RELAX= 
$$ Bruker specific parameters
$$ --------------------------
##$DU= <F:/spectra>
##$EXPNO= 1
##$NAME= <H-F>
##$PROCNO= 1
##$TYPE= <nmr>
##$USER= <she>
##$AMP= (0..31)
100 100 100 100 100 100 100 100 100 100 100 100 100 100 100 100 100 100 
100 100 100 100 100 100 100 100 100 100 100 100 100 100 
##$AQSEQ= 0
##$AQ_mod= 1
##$AUNM= <au_zg>
##$AUTOPOS= <>
##$BF1= 200.13
##$BF2= 200.13
##$BF3= 200.13
##$BF4= 200.13
##$BF5= 200.13
##$BF6= 200.13
##$BF7= 200.13
##$BF8= 200.13
##$BYTORDA= 1
##$CFDGTYP= 0
##$CFRGTYP= 5
##$CHEMSTR= <none>
##$CNST= (0..31)
1 1 145 1 1 1 1 1 1 1 1 1 1 1 1 1 1 1 1 1 1 1 1 1 1 1 1 1 1 1 1 1 
##$CPDPRG= <>
##$CPDPRG1= <>
##$CPDPRG2= <>
##$CPDPRG3= <>
##$CPDPRG4= <mlev>
##$CPDPRG5= <mlev>
##$CPDPRG6= <mlev>
##$CPDPRG7= <mlev>
##$CPDPRG8= <mlev>
##$CPDPRGB= <>
##$CPDPRGT= <>
##$D= (0..31)
0 1.2 0 0 0 0 0 0 0 0.06 0 0.03 0 0 0 0 0.0002 0 0 0 0 0 0 0 0 0 0 0 0 
0 0 0 
##$DATE= 1582885092
##$DBL= (0..7)
120 120 120 120 120 120 120 120 
##$DBP= (0..7)
150 150 150 150 150 150 150 150 
##$DBP07= 0
##$DBPNAM0= <>
##$DBPNAM1= <>
##$DBPNAM2= <>
##$DBPNAM3= <>
##$DBPNAM4= <>
##$DBPNAM5= <>
##$DBPNAM6= <>
##$DBPNAM7= <>
##$DBPOAL= (0..7)
0.5 0.5 0.5 0.5 0.5 0.5 0.5 0.5 
##$DBPOFFS= (0..7)
0 0 0 0 0 0 0 0 
##$DE= 6
##$DECBNUC= <off>
##$DECIM= 24
##$DECNUC= <off>
##$DECSTAT= 4
##$DIGMOD= 1
##$DIGTYP= 9
##$DL= (0..7)
0 120 120 120 120 120 120 120 
##$DP= (0..7)
150 150 150 150 150 150 150 150 
##$DP07= 0
##$DPNAME0= <>
##$DPNAME1= <>
##$DPNAME2= <>
##$DPNAME3= <>
##$DPNAME4= <>
##$DPNAME5= <>
##$DPNAME6= <>
##$DPNAME7= <>
##$DPOAL= (0..7)
0.5 0.5 0.5 0.5 0.5 0.5 0.5 0.5 
##$DPOFFS= (0..7)
0 0 0 0 0 0 0 0 
##$DQDMODE= 0
##$DR= 18
##$DS= 0
##$DSLIST= <SSSSSSSSSSSSSSS>
$$ [...]
##$SUBNAM2= <"">
##$SUBNAM3= <"">
##$SUBNAM4= <"">
##$SUBNAM5= <"">
##$SUBNAM6= <"">
##$SUBNAM7= <"">
##$SUBNAM8= <"">
##$SUBNAM9= <"">
##$SW= 24.9337058887773
##$SWIBOX= (0..15)
0 0 2 0 0 0 0 0 0 0 0 0 0 0 0 0 
##$SW_h= 4990.01996007984
##$TD= 16384
##$TD0= 1
##$TE= 0
##$TE2= 300
##$TE3= 300
##$TEG= 300
##$TL= (0..7)
0 120 120 120 120 120 120 120 
##$TP= (0..7)
150 150 150 150 150 150 150 150 
##$TP07= 0
##$TPNAME0= <>
##$TPNAME1= <>
##$TPNAME2= <>
##$TPNAME3= <>
##$TPNAME4= <>
##$TPNAME5= <>
##$TPNAME6= <>
##$TPNAME7= <>
##$TPOAL= (0..7)
0.5 0.5 0.5 0.5 0.5 0.5 0.5 0.5 
##$TPOFFS= (0..7)
0 0 0 0 0 0 0 0 
##$TUNHIN= 0
##$TUNHOUT= 0
##$TUNXOUT= 0
##$USERA1= <user>
##$USERA2= <user>
##$USERA3= <user>
##$USERA4= <user>
##$USERA5= <user>
##$V9= 5
##$VALIST= <valist>
##$VCLIST= <CCCCCCCCCCCCCCC>
##$VD= 0
##$VDLIST= <DDDDDDDDDDDDDDD>
##$VPLIST= <PPPPPPPPPPPPPPP>
##$VTLIST= <TTTTTTTTTTTTTTT>
##$WBST= 1024
##$WBSW= 4
##$XGAIN= (0..3)
0 0 0 0 
##$XL= 0
##$YL= 0
##$YMAX_a= 318216
##$YMIN_a= -277851
##$ZGOPTNS= <>
##$ZL1= 120
##$ZL2= 120
##$ZL3= 120
##$ZL4= 120
##$ABSF1= 10
##$ABSF2= 0
##$ABSG= 5
##$ABSL= 3
##$ALPHA= 0
##$AQORDER= 0
##$ASSFAC= 0
##$ASSFACI= 0
##$ASSFACX= 0
##$ASSWID= 0
##$AUNMP= <proc_1d>
##$AZFE= 0.1
##$AZFW= 0.1
##$BCFW= 1
##$BC_mod= 2
##$BYTORDP= 1
##$COROFFS= 0
##$CY= 11.3945322036743
##$DATMOD= 1
##$DC= 2
##$DFILT= <>
##$DTYPP= 0
##$F1P= 16.9975609425685
##$F2P= -3.02152046262296
##$FCOR= 0.5
##$FTSIZE= 0
##$FT_mod= 4
##$GAMMA= 1
##$GB= 0.15
##$INTBC= 1
##$INTSCL= 1
##$ISEN= 128
##$LB= 0.24
##$LEV0= 0
##$LPBIN= 0
##$MAXI= 10000
##$MC2= 0
##$MEAN= 0
##$ME_mod= 0
##$MI= 1.114404
##$NCOEF= 0
##$NC_proc= 0
##$NLEV= 6
##$NOISF1= 3.799351
##$NOISF2= 2.8
##$NSP= 1
##$NTH_PI= 0
##$NZP= 0
##$OFFSET= 15.70392
##$PC= 1
##$PHC0= -9794.246
##$PHC1= 23.80082
##$PH_mod= 1
##$PKNL= yes
##$PPARMOD= 0
##$PSCAL= 0
##$PSIGN= 0
##$REVERSE= no
##$SF= 200.130013532006
##$SI= 16384
##$SIGF1= 3
##$SIGF2= 2
##$SINO= 400
##$SIOLD= 16384
##$SREGLST= <1H.CDCl3>
##$SSB= 0
##$STSI= 0
##$STSR= 0
##$SW_p= 3612.71676300578
##$SYMM= 0
##$S_DEV= 0
##$TDeff= 0
##$TDoff= 0
##$TI= <>
##$TILT= no
##$TM1= 0
##$TM2= 0
##$TOPLEV= 0
##$USERP1= <user>
##$USERP2= <user>
##$USERP3= <user>
##$USERP4= <user>
##$USERP5= <user>
##$WDW= 1
##$XDIM= 8192
##$YMAX_p= 0
##$YMIN_p= 0
$$ End of Bruker specific parameters
$$ ---------------------------------
##NTUPLES= NMR FID
##VAR_NAME=  TIME,          FID/REAL,        FID/IMAG
##SYMBOL=    X,             R,               I
##VAR_TYPE=  INDEPENDENT,   DEPENDENT,       DEPENDENT
##VAR_FORM=  AFFN,          ASDF,            ASDF
##VAR_DIM=   8192,          8192,            8192
##UNITS=     SECONDS,       ARBITRARY UNITS, ARBITRARY UNITS
##FACTOR=    0.0002004,     1,               1
##FIRST=     0,             0,               0
##LAST=      1.6414764,     0,               0
##MIN=       0,             -277851,         0
##MAX=       1.6414764,     318216,          0
$$ Real data points
##PAGE= N=1
##DATA TABLE= (X++(R..R)), XYDATA
$$ [...]
$$ plain form
2821 -3697 -3023 4441 4804 -3353 -4664 3379 5541 -2687 -5853 2500 6624 -1194 -6412 1560 6828
2836 6828 -757 -6819 537 6839 132 -6592 -484 6973 1102 -6457 -1494 6339 2127 -6010 -2836
2851 -2836 5189 2708 -5182 -3395 4525 3359 -4081 -4076 3069 3832 -3066 -4834 1793 4022 -1574 -5065
2867 -5065 364 4388 -296 -5105 -1317 4364 1247 -4992 -2294 4139 2345 -4436 -3559 3712 3575
2882 3575 -4177 -4490 2656 3920 -3607 -5179 2254 5087 -2212 -5586 1295 4924 -1115 -5998 94
2897 94 4874 -294 -5458 -805 5108 1380 -5064 -2026 4643 2557 -4396 -3025 3770 3549 -3277 -4018
2913 -4018 2973 4494 -2441 -4336 2156 4926 -1569 -5258 1207 5703 73 -5569 -5 6203 841
2928 841 -5383 -995 5839 2155 -5246 -1825 5873 2962 -4693 -2427 5212 3404 -4069 -3048 4589
$$ packed form
2821c697O74P464L63q157j311Q043K162q228l166Q353M124p818n218P972N268
2836F828p585o062P356O302o707o724O108P457n871p559M963P833m212q137L174
2851b836Q025k481p890J787P920j166p440NP145P63o898j768O627K229n596l491
2867e065N429M024m684m809L788N681l117o239K698O433j794o781Q77P271j37
2882C575p752l13P146J264p527j572P433K833p299l374O881L629o039m883O092
2897I4M780n168n164M653N913l728o444L038O669k086o953J371O795k21o826p41
2913d018O991J521o935j895O492K770o495l689O465M496n630n642N564O208n362
2928H41o224M388O834l684p401L421P698k911p655K266P639j808p473J021P637
$$ plain form
2943 4589 3986 -3288 -3134 3395 4368 -2159 -3058 2541 4133 -987 -3449 1023 3729 -54 -3565 21
2959 21 3588 1303 -2907 -1428 3162 2225 -2510 -2624 2422 3301 -1666 -3663 1827 4357 -1439 -4287
2975 -4287 1163 4473 -795 -5395 167 5114 146 -5513 -596 5106 668 -5775 -1382 4929 1198
2990 1198 -5648 -1999 4751 1705 -5037 -2959 4083 2463 -4288 -3369 3255 2773 -3506 -3926 2156 3435
3006 3435 -2404 -4343 1043 3405 -1515 -4299 -100 3776 -175 -4324 -1039 3788 1052 -4187 -2128
3021 -2128 3300 1864 -3967 -3081 3182 3040 -3429 -3489 2434 3492 -2399 -3995 1759 3910 -2080 -4381
3037 -4381 1208 4527 -810 -4251 515 4389 102 -4146 -432 3948 1140 -3523 -1171 3934 1987
3052 1987 -2715 -2005 2703 2675 -2382 -2703 2280 3937 -1128 -3301 1409 4241 -293 -3659 252 4671
$$ packed form
2943D589o03p274J54O529R73o527q99N599J592n120k462M472K706l783l511L586
2959B1L567k285m210J479M590r37m735j14N046Q79m967j997N490K530n796k848
2975d287N450L310n268m600N562M947m968n659M917N702m438o443M393O311l731
2990A198o846L649O750l046o742K078P042j620o751R19O624m82o279m20O082J279
3006C435n839j939N386K362m920k784M199L876l951m149L285M827k736n239K059
3021b128N428j436n831Q86O263j42o469o0N923J058n891j596N754K151n990k301
3037d381N589L319n337l441M766L874m287m248L714M380k808m663K352N105j947
3052A987m702P10M708k8n057l21M983J657n065k173M710K832m534l366L911M419
$$ plain form
3068 4671 916 -3991 -262 4678 1670 -3782 -1452 5102 2443 -4063 -2226 4726 2809 -3785 -2818
3083 -2818 4348 3616 -3029 -3070 3451 3623 -2457 -3335 2820 3714 -1898 -3596 1920 4019 -1118 -3755
3099 -3755 520 3353 -138 -3500 -560 2983 489 -2992 -1332 2612 1402 -2598 -2031 1801 2199
3114 2199 -1939 -3150 1088 3156 -881 -3515 535 3613 -546 -4172 -129 3941 178 -4452 -1125
3129 -1125 4094 773 -4610 -1639 3663 1231 -3989 -2535 3218 1908 -3883 -2819 2840 2362 -2691
3144 -2691 -3205 1745 2825 -2097 -3476 1100 3244 -1470 -3566 435 2952 -215 -3295 -525 2697
3159 2697 556 -3154 -1387 2878 1799 -3140 -2127 2294 2273 -2440 -3169 1932 2953 -2110 -3009 1784
3175 1784 3440 -1210 -3059 1318 3877 -565 -3668 715 3680 -161 -3305 313 3938 703 -3309
$$ packed form
3068D671l755m907L729M940l008n452K330O554k659o506J837O952j917o594R67
3083b818P166p32o645m1O521J72o080q78O155Q94n612j698N516K099n137k637
3099c755M275K833l491l362K940L543k494l481J660L944j210m000N67L832L98
3114B199m138j211M238K068m037k634M050L078m159l626M043M070l763m630L327
3129a125N219l321n383K971N302k432n220J454N753j310n791J064N659m78n053
3144b691n14M950J080m922j379M576K144m714k096M001K517l167l080K770L222
3159B697k141l710J767M265j079m939J013M421k1m713p29N101J021n063q99M793
3175A784J656m650j849M377K559m442l103M383K965l841l144L618L625l235m012
$$ plain form
3190 -3309 -471 3507 1495 -2904 -1276 3113 1917 -1965 -1291 2219 2509 -1253 -1937 1773 2900 -715
3206 -715 -2530 1033 3109 -47 -2566 303 3268 535 -2597 -491 2853 1264 -2811 -1274 3216
3221 3216 1943 -2380 -1963 2803 2276 -2347 -2469 2517 2364 -1687 -3048 1792 2903 -1525 -3004 1266
3237 1266 2896 -1212 -3239 191 2961 -246 -3180 -330 2874 371 -3045 -1289 2693 928 -2653
3252 -2653 -2012 1857 1475 -2252 -2255 1503 2229 -1837 -2846 852 2316 -1388 -3053 119 2819 -473
3268 -473 -3144 -404 2765 183 -3552 -754 2844 773 -3671 -1790 2765 1460 -3117 -2059 2467
3283 2467 1705 -2453 -2450 1911 2063 -1675 -2691 1278 2488 -1224 -2545 596 2313 -677 -2616 10
3299 10 2731 414 -2555 -542 2680 1347 -1960 -1198 2212 1914 -2001 -1535 1849 2234 -1169 -1813 1648
$$ packed form
3190c309K838L978k012m399J628M389j196l882O74L510K90l762o84L710J127l615
3206g15j815L563K076l156k519K869K965k733l132K106L344j589m075J537M490
3221C216j273m323M17M766n27m623j22M986j53m051j361M840J111m428j479M270
3237A266J630m108k027L430K770l207k934K850L204k503l416J756L982j765l581
3252b653O41L869l82l727lL758P26m066j009L698J464l704j665L172K700l292
3268d73k671K740L169k582l735K798L598k071m444J881M555j305m577J058M526
3283B467p62m158LM361J52l738j016L969J210l712j321L141J717k990j939K626
3299A0K721k317k969K013L222j333l307P62L410k98l915M66L384L85l403o44L461
$$ plain form
3316 1648 2294 -669 -2103 882 2858 -199 -2455 244 2982 381 -2299 75 2847 726 -2394
3331 -2394 -635 2845 1637 -2265 -1355 2934 1886 -1859 -1688 2283 2615 -1609 -1842 1790 2619 -916
3347 -916 -2448 1359 2538 -451 -2403 410 2861 108 -2673 -124 2313 395 -2177 -375 2539
3362 2539 920 -2362 -1553 2010 1274 -1996 -1849 1412 1607 -1278 -2084 1078 1915 -993 -2253 317
3378 317 1976 -517 -2541 -32 2183 -60 -2371 -814 1851 513 -2275 -1392 1481 1242 -2263 -1473
3394 -1473 1393 1315 -1584 -2216 1077 1450 -1318 -2171 672 2272 -828 -2326 293 2264 -240 -2941
3410 -2941 -379 2046 118 -2563 -688 2196 719 -2282 -1298 1941 1322 -2271 -1620 1752 1656 -1598
3426 -1598 -1967 1741 2159 -1282 -1849 1362 2148 -856 -2058 586 2335 87 -1908 190 2343 10
$$ packed form
3316A648O46k963j434K985J976l057k256K699K738k601k680K374K772k121l120
3331b394J759L480j208l902R10M289j048l745J71L971L32m224k33L632Q29l535
3347i16j532L807J179k989j952K813K451k753k781K549K437j918k572J802K914
3362B539j619l282Q09L563p36l270J47L261J95k885q06L162Q37k908j260K570
3378C17J659k493k024K509K215k243k311J557K665j338k788Q83K873k39l505P90
3394a473K866p8k899o32L293L73k768q53K843J600l100j498K619J971k504k701
3410b941K562K425j928k681J875K884j477l001R84L239o19l593O51L372r6l254
3426a598l69L708M18l441n67L211P86l004j202K644J749k248j995K098K153k333
$$ plain form
3442 10 -1956 227 2405 891 -2077 -377 1902 1349 -1099 -625 1878 1678 -970 -1082 1319 1543 -644
3459 -644 -1319 1022 1559 -115 -1348 570 2035 324 -1250 85 1871 844 -1624 -465 1905 1356
3475 1356 -1327 -948 1736 1624 -993 -1800 1231 1912 -920 -2085 931 2025 -456 -2176 551 2381
3491 2381 -240 -2732 95 2636 -39 -2177 -248 2585 61 -2626 -882 2250 420 -2517 -1048
3506 -1048 1894 895 -2267 -1406 1702 921 -1880 -1775 1142 1267 -1578 -1786 509 1598 -824 -1687 31
3523 31 1122 -179 -1825 -419 1157 245 -1764 -792 1087 885 -1631 -1362 990 797 -1506 -1996 804
3540 804 1617 -1098 -2059 333 1744 -403 -2014 32 1825 -347 -2038 -181 2034 440 -1613 -489
3556 -489 1923 664 -1522 -917 1508 1056 -1120 -1051 1497 1674 -593 -1549 1164 2123 -567 -1774 565
$$ packed form
3442A0j966K183K178j514k968J700K279n53k448M74K503k00k648j12K401K24k187
3459f44o75K341N37j674j233J918J465j711j574J335J786j027k468J159K370n49
3475A356k683L79K684j12k617q07L031O81k832j165L016J094k481j720K727J830
3491B381k621k492K827K541k675k138J929K833k524k687J744L132j830k937J469
3506a048K942r99l162Q61L108p81k801J05K917J25k845k08K295J089k422q63J718
3523C1J091j301j646J406J576r12k009R72J879k02k516K69K352j93k303m90K800
3540H04Q13k715r61K392J411k147j611K046J793k172j691J857K215j594k053J124
3556d89K412j259k186O05K425m52k176O9K548J77k267r56K713R59k690j207K339
$$ plain form
3573 565 2039 -63 -1397 647 2429 274 -1907 -142 2284 444 -1544 -529 2280 782 -1782
3588 -1782 -762 2222 1274 -1734 -1146 1785 1697 -1087 -1058 1286 1865 -814 -1194 1270 1505 -601 -1434
3605 -1434 865 1213 -209 -1188 253 1552 702 -981 -672 1232 838 -873 -859 895 875 -435 -1519
3622 -1519 614 1532 -455 -1487 63 1468 24 -2102 -463 1878 41 -2120 -889 1760 454
3637 454 -2132 -1368 2040 613 -2375 -1199 1648 681 -1962 -1504 1707 788 -1730 -1571 1217 688 -1829
3654 -1829 -1503 1041 1225 -1290 -1707 538 1389 -693 -1723 0 1089 -203 -1692 -443 1121 174
3670 174 -1192 -707 1101 513 -1069 -718 1218 954 -784 -1315 1092 1479 -746 -1314 630 1418 -706
3687 -706 -1436 322 1664 214 -1297 -145 1678 293 -1330 -388 1765 894 -1470 -413 1374 974
$$ packed form
3573E65J474k102j334K044J782k155k181J765K426j840j988J015K809j498k564
3588a782J020K984r48l008N88K931q8k784K9K344N79k679l80K464K35k106q33
3605a434K299L48j422r79J441J299q50j683L09J904l94j711J4J754k0j310j084
3622a519K133R18j987j032J550J405j444k126J639K341j837k161J231K649j306
3637D54k586P64L408j427k988J176K847r67k643M58L211r19k518J59K788n29k517
3654a829L26K544J84k515m17K245Q51k082j030J723J089j292j489J249J564r47
3670A74j366M85J808n88j582L51J936k64j738n31K407L87k225n68J944P88k124
3687g06p30J758J342j450j511J152J823j385j623R42K153q71k364J057J787m00
$$ plain form
3703 974 -1020 -650 1271 1216 -610 -1023 832 1517 11 -1138 261 1702 293 -1259 124 1760
3719 1760 666 -1509 -547 1962 962 -1580 -867 1950 1598 -1201 -1088 1661 1693 -1336 -1560 1379 1725
3736 1725 -1008 -1636 1415 1774 -870 -1648 690 1451 -878 -1723 211 1892 -544 -1483 235 1494
3752 1494 -82 -1340 -418 1248 393 -1122 -791 823 587 -1126 -822 559 793 -548 -1553 -234
3768 -234 1080 -180 -1526 -382 1108 266 -1729 -850 1222 543 -2120 -1080 1201 761 -1645 -1401
3784 -1401 1448 1422 -1608 -1621 891 1362 -1179 -1759 490 1449 -822 -1621 499 1666 -544 -1703 217
3801 217 1288 -306 -1542 53 1644 21 -1300 -324 1121 512 -1421 -788 1297 623 -969 -711
3817 -711 936 1667 -777 -1489 580 1123 -220 -1411 509 1570 -181 -885 491 1850 166 -1475
$$ packed form
3703I74j994L70J921n5j826m13J855O85j506j149J399J441j409j552J383J636
3719A760j094k175R62K509j000k542P13K817l52k799J13K749L2l029k24K939L46
3736A725k733o28L051L59k644p78K338P61k329q45J934J681k436r39J718J259
3752A494j576j258R22J666q55j515L31J614k36j713L04J381K34j341j005J319
3768b34J314j260j346J144J490q42j995Q79K072o79k663J040K281m40k406K44
3784a401K849k6l030j3K512M71k541n80K249R59k271p99K120J167k210j159J920
3801B17J071j594j236J595J591j623j321R76J445o09j933O33K085o74j592K58
3817g11J647P31k444p12K069N43j343j191J920J061j751p04J376J359j684j641
$$ plain form
3833 -1475 -62 1800 371 -1136 -212 1808 741 -1097 -488 1678 997 -978 -792 1286 1347 -413
3849 -413 -751 769 1166 71 -928 234 1459 167 -1101 53 1211 347 -1017 -498 1139 1109 -894
3866 -894 -705 1443 977 -1227 -1160 1166 1408 -941 -1468 817 1467 -712 -1519 553 1684 -278 -1923
3883 -1923 339 1657 -387 -1565 -93 1545 -151 -1638 -446 1397 228 -1819 -587 1086 528
3898 528 -1169 -1164 1223 605 -1096 -1318 716 676 -729 -1309 83 1038 -567 -1720 -263 841 102 -1631
3916 -1631 -486 1054 268 -1487 -983 1204 503 -1251 -914 1074 681 -1135 -1158 970 1328 -901 -1599
3933 -1599 819 1558 -604 -1661 394 1358 -450 -1303 394 1541 -353 -1421 -133 1376 602 -1320
3949 -1320 -253 1529 698 -1100 -470 979 916 -834 -505 960 1413 -542 -1190 783 1559 -134 -961
$$ packed form
3833a475J413J862j429j507R24K020j067j838O09K166o81j975J86K078O1j760
3849d13l38J520L97j095r99J162J225j292j268J154J158q64j364N19J637l0k003
3866h94J89K148m66k204O7K326K42k349n27K285O50k179q07K072J131j962j645
3883a923K262J318k044j178J472J638j696j487J192J843j169k047J232J673n58
3898E28j697NK387o18j701k22K034m0j405n80J392R55j605j153J457J104p39j733
3916a631J145J540p86j755N04K187p01j754L37J988l93j816k3K128L58k229o98
3933a599K418P39k162j057K055R64j808q53J697J147j894j068J288J509p74j922
3949a320J067J782q31j798O30J449o3j750L29J465M53j955o48J973P76j693q27
$$ plain form
3966 -961 203 1657 605 -1181 86 1482 481 -1454 33 1796 764 -1142 -608 1788 1189 -1241
3982 -1241 -639 1533 946 -939 -916 944 1604 -693 -809 953 1483 -408 -1498 593 1396 -203 -1301
3999 -1301 -71 1229 -46 -1192 -389 1584 493 -1442 -768 1069 807 -1242 -969 761 1038 -961
4015 -961 -1459 486 986 -866 -1290 393 1035 -362 -1619 242 965 -311 -1692 -367 1264 -78
4031 -78 -1494 -589 796 302 -1392 -776 946 697 -1159 -827 828 755 -1222 -1353 239 1171 -558 -1529
4049 -1529 2 1380 -359 -1628 -133 1248 -61 -1518 -194 1307 210 -1588 -399 1480 510
4064 510 -1548 -841 1336 973 -913 -1007 1069 1291 -963 -1227 894 1442 -706 -1262 846 1436 -213
4081 -213 -1648 199 1696 39 -1140 -55 1317 129 -1521 -518 1553 786 -980 -600 1434 883
$$ packed form
3966i61J164J454j052j786J267J396j001j935J487J763j032j906N34K396n99k430
3982a241O02K172n87j885K3J860O60k297j16J762N30j891j090K091Q03j599j098
3999a301J230J300j275j146Q03J973j091j935O74J837k62k049K73J730K77j999
4015i61m98J945N00j852m24J683O42j397j257J861P23j276j381J325J631j342
4031g8j416R05J385m94j694O16J722k49j856L32J655p3j977j31J592R32j729r71
4049a529J531J378j739j269J495J381j309j457J324J501j097j798J189J879r70
4064E10k058P07K177l63j886r4K076K22k254k64K121N48k148n56K108N90j649
4081b13j435J847J497j657j179J085J372j188j650J003K071p67j766L80K034n51
$$ plain form
4097 883 -558 -755 981 909 -446 -882 918 1514 -365 -1054 640 1455 -60 -894 191 1299 459
4114 459 -1415 32 1430 531 -1037 -515 1403 848 -730 -897 1102 877 -1029 -1126 587 1187 -502
4131 -502 -1569 895 1493 -26 -1583 228 1657 30 -1622 86 1367 35 -1622 -373 1299
4146 1299 205 -1519 -727 1261 722 -1487 -1052 874 787 -1399 -1226 1076 1096 -1362 -1057 573 755
4163 755 -986 -1423 691 807 -640 -1248 120 940 -260 -1466 -167 1205 291 -1467 -610 1011 683
4180 683 -1150 -959 745 668 -1075 -1095 841 1159 -604 -873 367 1220 -189 -1309 -168 1449 193
4197 193 -1429 -343 1195 464 -1556 -158 1171 499 -1220 -838 1307 1038 -980 -1043 1317 899 -608
4214 -608 -1049 928 1552 -551 -939 692 1788 168 -1373 -5 1632 43 -1722 94 1815 547
$$ packed form
4097H83j441j97J736p2j355m36J800N96j879o89J694Q15j515q34J085J108q40
4114D59j874J447J398q99j568N22J918n55j578j67J999k25j906r7J713O00j689
4131e02j067K464N98j519j557J811J429j627j652J708J281j332j657J249J672
4146A299j094j724P92J988n39k209M35J926q7k186J73K302K0k458L05J630J82
4163G55j741m37K114J16j447o08J368Q20j200j206J299J372r14j758Q57J621l28
4180F83j833J91J704p7j743k0J936L18j763k69J240Q53j409j120J141J617j256
4197A93j622J086J538p31k020J398J329o72j719L82K145k69k018o3K360m18j507
4214f08m41J977O24k103l88J631J096j620j541J368J637j589j765J816J721j268
$$ plain form
4230 547 -1159 -313 1633 735 -1024 -819 1496 1111 -942 -863 1103 1459 -654 -922 1013 1273 -499
4247 -499 -1023 813 1158 -217 -1386 128 1555 -220 -1148 199 1115 413 -916 -402 1236 513 -1131
4264 -1131 -381 1027 587 -717 -785 895 1059 -788 -1243 201 1142 -325 -1383 -78 1193 -72 -1475
4281 -1475 -381 1382 178 -1617 -880 1294 408 -1228 -1269 1116 660 -1317 -1413 1124 935 -1302 -1022
4298 -1022 623 1202 -1050 -1340 735 1250 -864 -1813 611 1346 -588 -1288 143 1486 -126 -1461
4314 -1461 -198 1179 221 -1078 -531 1399 252 -1053 -527 1040 538 -904 -856 785 1010 -612 -1291
4331 -1291 417 894 -352 -904 403 1534 -257 -1110 -75 1241 270 -999 -302 1271 629 -1046
4347 -1046 -563 1276 828 -1008 -794 883 1097 -691 -910 1186 1442 -406 -1103 689 1250 -222 -1395
$$ packed form
4230E47j706Q46J946q98j759K05K315l85k053P9J966L56k113k68J935K60j772
4247d99n24J836L45j375j169J514J427j775r28J347R16p02j329N14J638p23j644
4264a131P50J408m40j304o8J680J64j847m55J444R41j467j058J305J271j265j403
4281a475J094J763j204j795P37K174q86j636m1K385m56j977r6K537j89k237K80
4298a022J645N79k252k90K075N15k114r49K424P35j934p00J431J343j612j335
4314a461J263J377r58j299N47J930j147j305N26J567n02j442M8J641K25j622o79
4331a291J708M77j246n52J307J131j791q53J035J316r71j269O97J573o42j675
4347a046M83J839m48j836K14J677K14j788k19K096K56j848o97J792N61j472j173
$$ plain form
4364 -1395 292 1283 100 -1062 -130 1335 367 -1134 -410 1469 893 -970 -747 1485 1156 -985 -1101
4381 -1101 921 1623 -835 -1030 750 1306 -784 -1509 665 1828 -508 -1739 527 1369 -302 -1648
4397 -1648 532 1264 -204 -1884 -86 1426 44 -1060 -466 869 389 -1139 -739 832 562 -932
4413 -932 -773 468 860 -725 -1150 164 876 -463 -1160 -237 941 67 -1204 -508 959 272 -1236
4430 -1236 -891 533 526 -1538 -1182 917 1177 -1178 -1286 873 994 -961 -1466 570 1459 -763 -1536 368
4448 368 1355 -454 -1535 249 1232 -216 -1793 26 1262 92 -1287 -539 1367 534 -1548 -582
4464 -582 1130 747 -1010 -762 847 803 -929 -901 955 1501 -398 -1111 453 1230 -274 -934 594 1442
4482 1442 179 -1381 -292 1472 240 -1161 -317 1386 614 -945 -193 1240 854 -524 -441 1055
$$ packed form
4364a395J687R91j183j162R32J465r68j501P24J879n76j863K23K232l29k141j16
4381a101K022P02k458j95J780N56k090p25K174J163k336j231K266Q42j671j346
4397a648K180P32j468j680J798J512j382j104N94J335m80j528M00J571k70j494
4413i32J59J241L92j585m25J314P12j339o97R23J178q74j271O96J467o87j508
4430a236L45J424pk064L56K099K60k355j08K159J21j955n05K036Q89k222p73J904
4448C68R87j809j081J784R83j448j577J819J236j170j379P48J906q33k082R66
4464e82J712l83j757K48J609m4j732K8J856N46j899p13J564P77j504o60J528Q48
4482A442j263j560J089J764j232j401Q44J703p72j559P52J433l86j378Q3J496
$$ plain form
4498 1055 928 -446 -753 736 1123 -277 -969 639 1413 -208 -1167 310 1290 381 -1093 240 1279
4515 1279 429 -1301 -411 946 464 -900 -754 825 873 -836 -1437 696 1043 -740 -1610 496 1435
4532 1435 -674 -1361 180 1190 -581 -1510 -116 1772 -421 -1589 -447 1284 230 -1727 -259
4547 -259 1308 341 -1373 -618 1169 557 -955 -951 694 859 -778 -926 313 1088 -606 -1384 386 925
4565 925 4 -1175 -123 931 -313 -1299 -472 1126 370 -957 -787 1075 711 -1153 -725 1011 962
4582 962 -1035 -765 695 1186 -551 -1075 440 1379 -454 -1256 545 1524 -66 -1394 397 1635 52
4599 52 -1262 40 1315 375 -1123 -162 1578 851 -805 -398 1141 852 -1011 -1019 918 1141 -217 -637
4617 -637 637 1162 23 -1022 247 1530 47 -1341 -54 1421 402 -824 -494 1207 727 -971
$$ packed form
4498A055j27j374l07J489L87j400o92J608P74j621r59J477R80r09j474J333J039
4515A279q50j730Q90J357m82j364J46J579M8j709o01K133L47j783q70K106R39
4532A435k109o87J541J010j771r29J394J888k193j168J142J731j054j957J468
4547b59J567r67j714P55J787o12j512MJ645J65j637j48J239P75j694p78J770N39
4565I25r21j179J052J054j244r86Q27J598p56j327J70J862l64j864M28J736m9
4582I62j997K70J460M91j737n24J515R39j833q02J801R79j590j328J791J238j583
4599E2j314J302J275r40j498R61J740p27j656M07J539k89j863qJ937K23j358m20
4617f37J274N25j139j045J269J283j483j388J287J475j019j226L30J701m80j698
$$ plain form
4633 -971 -368 1303 936 -888 -601 728 928 -553 -949 800 1089 -730 -1258 507 1069 -285 -1100
4650 -1100 209 988 -136 -1100 -127 1309 -54 -988 -226 999 217 -933 -707 902 331 -835 -999
4667 -999 556 708 -564 -1001 179 897 -575 -1243 96 857 -514 -1241 113 1157 -241 -1456 -354
4684 -354 1253 202 -958 -482 1268 507 -964 -516 951 744 -721 -807 541 945 -743 -871 560
4701 560 1148 -742 -1305 590 968 -175 -1294 187 1211 89 -986 27 1506 592 -705 -274
4717 -274 1081 617 -529 -409 1082 636 -771 -642 926 905 -599 -991 319 1296 -463 -729 791
4734 791 1302 -385 -1044 431 1262 130 -1259 136 1154 225 -1080 -632 1432 271 -1183 -311 786
4751 786 694 -655 -273 1018 1010 -268 -832 562 859 -110 -645 415 854 -265 -799 313 1015 287 -758
$$ packed form
4633i71O03J671l67j824K87J329K00j481l96J749K89j819n28J765N62j354q15
4650a100J309P79j124r64R73J436j363r34P62J225p82j150K26J609n71j166j64
4667i99J555J52j272m37J180P18j472o68J339P61j371p27J354J044j398j215J102
4684c54J607j051j160M76J750p61j471M48J467k07j465q6J348M04j688j28J431
4701E60N88j890n63J895L78j143j119J481J024j122j075J013J479r14j297M31
4717b74J355m64j146J20J491m46j407J29J568k1j504l92J310R77j759k66J520
4734G91N11j687o59J475Q31j132j389J395J018r29j305M48K064j161j454Q72J097
4751G86r2j349L82J291qj278n64J394K97r69n35J060M39j119n34J112P02p28j045
$$ plain form
4770 -758 17 808 342 -1066 -452 933 505 -887 -866 734 836 -576 -1093 666 922 -764 -991 515
4788 515 781 -436 -1445 331 1023 -270 -1369 -201 1070 -98 -1514 -460 1212 82 -1109 -503
4804 -503 909 665 -1045 -716 852 258 -995 -962 545 881 -818 -1157 711 822 -520 -853 229
4821 229 726 -393 -1528 64 989 -244 -1096 -132 1054 -20 -1052 -445 645 294 -884 -395 862
4838 862 722 -609 -808 614 758 -496 -685 340 678 -555 -661 251 1103 127 -1063 -36 1414
4855 1414 124 -760 -38 1108 585 -835 -636 1149 953 -1179 -575 585 1185 -613 -669 725 1124
4872 1124 -511 -967 234 1103 17 -802 305 1167 241 -1076 27 978 305 -1150 -164 1421 304
4889 304 -1021 -208 1007 700 -839 -693 965 614 -664 -633 655 923 -586 -1191 291 1126 -444
$$ packed form
4770g58P75P91m66j408O14J385m28j392K1J600J02j412n17J759K56j686k27J506
4788E15K66j217j009J776O92j293j099J168J271j168j416J054J672j130j191O06
4804e03J412k44j710L29J568n94j253L3J507L36j699l39J868J11j342l33J082
4821B29M97j119j135J592R25j233q52R64J186j074j032O07J090l51j178M89J257
4838H62j40j331j99J422J44j254j89J025L38j233j06R12Q52r76j190J027J450
4855A414j290q84P22J146n23j420J99J785j96k132O04J160O00j798n6J394L99
4872A124j635m56J201Q69j086q19J107Q62r26j317J103R51o73j455R86J585j117
4889C04j325Q13J215l07j539J46J658l51j278L1J288K68j509o05J482Q35j570
$$ plain form
4906 -444 -1093 191 1107 -264 -1135 135 817 26 -1002 -157 657 324 -846 -490 491 547 -829 -775 421
4925 421 632 -551 -1038 336 765 -379 -807 -25 826 -200 -830 49 674 163 -1004 -305 1142 370
4943 370 -837 -621 638 331 -903 -797 909 401 -715 -1107 679 1015 -806 -749 362 955 -534
4960 -534 -1142 253 1328 -381 -1246 79 1134 7 -1132 -90 925 208 -1175 -453 1228 582
4976 582 -853 -399 1083 618 -386 -530 638 668 -562 -777 475 920 -279 -697 442 934 -22 -795
4994 -795 325 1095 506 -877 -4 1066 298 -680 -301 877 467 -727 -232 810 503 -365 -646 440
5012 440 1094 -565 -789 537 952 -202 -938 516 1023 21 -982 -243 1234 88 -718 105 814
5029 814 276 -989 -334 874 514 -818 -785 750 831 -577 -930 711 871 -883 -1020 674 828 -519
$$ packed form
4906d44o49J284R16j371q71J270O82p91j028Q45Q14l33j170L56R81N6j376N4J196
4925D21K11j183m87J374M29j144m28P82Q51j026o30Q79O25n11j167O99J447p72
4943C70j207K16J259l07j234J06J706n08j116l92J786L36j821N7J111N93j489
4960e34o08J395J075j709q65J325J055j127j139J042J015p17j383P22J681o46
4976E82j435M54J482m65j004j44J168L0j230k15J252M45j199m18J139M92r56p73
4994g95J120P70n89j383Q73J070p68r78L79J178m10j194M95J042l07q68k81J086
5012D40O54j659k24J326M15j154p36J454N07j002j003P39J477j146q06Q23P09
5029H14n38j265O55J208l60j332L3J535Q1j408l53J641J60j754j37J694J54j347
$$ plain form
5047 -519 -988 -21 985 -432 -1107 -45 647 75 -976 -11 976 51 -829 -390 588 101 -742 -71 634
5066 634 493 -1048 -645 397 475 -608 -848 239 699 -372 -748 -55 760 -65 -958 -19 602 134 -872
5085 -872 -352 878 458 -763 -721 443 636 -729 -765 429 790 -451 -886 478 1095 -282 -860 328
5103 328 914 -381 -1061 76 1009 83 -1030 -66 1195 51 -829 -128 903 756 -595 -220 1001
5120 1001 643 -645 -476 865 826 -346 -646 650 513 -507 -668 420 1020 -207 -732 139 999 -38
5138 -38 -872 -237 855 364 -707 -333 987 436 -603 -259 832 692 -450 -518 641 754 -731 -592
5156 -592 450 629 -101 -658 5 284 -180 -1012 -17 653 47 -743 -459 634 371 -911 -404 722 289
5175 289 -1115 -504 279 692 -710 -935 446 755 -455 -725 150 474 -472 -1109 291 1036 142 -1125
$$ packed form
5047e19m69R67J006j417o75J062O92n72j051R65R87r25q80M39R78m87q43O71P05
5066F34j41j541M03J042P8j083k40J087M60j071l76O93Q15q25q93R39O21m68j006
5085h72N20J230m20j221M2J164J93j365l6J194L61j241m35J364O17j377n78J188
5103C28N86j295o80J137R33r26j113R64J261j144q80P01J031j47j351L75J221
5120A001l58j288J69J341l9j172l00J296j37j020j61J088O00j227n25Q71Q60j037
5138c8q34O35J092m91j071L74J320n51j039L44J091j40j142o8J159J13j485J39
5156e92J042J79p30n57O63K79m64q32R95O70o06p90K84J093k63j282N07J126m33
5175B89j404O11P83M13j402k25J381L09j210k70Q75L24r46o37J400P45q94j267
$$ plain form
5193 -1125 -224 765 -45 -1290 -150 716 233 -813 -420 1071 281 -1046 -770 466 232 -507 -708 571
5211 571 647 -392 -796 219 850 -252 -271 256 761 -271 -582 213 616 247 -904 -200 577 216 -641
5230 -641 -322 507 404 -464 -594 397 677 -604 -500 376 520 -355 -790 595 957 45 -892 159 927
5249 927 85 -770 -140 641 180 -680 -185 785 632 -622 -424 803 617 -675 -469 623 809 -335
5267 -335 -494 538 731 -95 -474 260 798 -171 -670 -25 691 -221 -615 -134 738 154 -692 -199 716 561
5287 561 -584 -641 785 638 -801 -581 806 612 -380 -740 258 483 -377 -870 242 707 -182 -789 140
5306 140 484 -94 -685 -24 574 -98 -904 -330 729 326 -726 -690 117 301 -406 -552 676 740 -295
5325 -295 -703 147 413 -314 -677 193 702 -244 -885 121 608 5 -811 131 760 435 -732 -336 827
$$ packed form
5193a125R01R89q10j245J140Q66m83j046L93J491p90j327K76J236k34p39k01J279
5211E71P6j039m04J015O31j102j9N27N05j032l11P95M03l69j151P04P77l61q57
5230f41L19Q29j03q68j30R91K80j281J04Q76J44q75m35J385L62r12r37J051P68
5249I27q42q55O30P81m61q60M95R70j53j254J98J227j86j292K06J092J86j144
5267c35j59J032J93q26l79P34N38r69m99O45P16r12l94M81Q72n84q46M93R15j55
5287E61j145n7J426j47j439K20J387j94r92l60R98K25q60m93J112M65q89o07R29
5306A40L44n78n91O61N98o72q06N74J059m03j052L6Q07J84p07j46J228O4j035
5325b95m08Q50K66p27l63Q70N09r46o41J006M87o03q16R42O29l25j167L96J163
$$ plain form
5344 827 658 -348 -116 308 227 -446 -709 381 414 -569 -450 317 492 -158 -555 26 540 -229 -808 37
5364 37 778 14 -375 -81 670 688 -556 22 718 365 -318 -160 521 114 -197 -274 429 636 -205 -403 200
5385 200 648 198 -684 115 894 230 -507 138 606 64 -607 42 714 288 -858 -2 731 391 -341 -161
5405 -161 509 398 -519 -177 569 483 -279 -229 206 508 -239 -525 323 716 -134 -849 15 666 65 -566 -353
5426 -353 542 371 -320 -203 466 504 -593 -525 394 418 -624 -539 374 693 -506 -726 -67 601 -356 -963
5446 -963 -222 442 66 -808 -177 653 -90 -731 -310 387 444 -704 -427 359 394 -366 -547 287 334 -332 -673
5467 -673 258 445 -413 -788 -180 462 -133 -706 54 604 -15 -828 -113 513 219 -680 -385 670 393 -295
5487 -295 -124 310 429 -177 -135 375 476 -244 -178 543 511 44 -525 348 471 139 -443 162 720 169 -309
$$ packed form
5344H27j69j006K32M24q1o73k63J090L3r83J19P67J75o50l97N81N14p69n79Q45
5364C7P41p64l89K94P51J8j244N78O96l53o83J58O81m07l11p7P03K07q41j98O03
5385B00M48m50q82P99P79o64p37O45M68n42o71O49O72m26j146Q56P33l40p32J80
5405a61O70j11r17L42P46q6p62N0M35L02p47k86Q48L93q50p15Q64O51o01o31K13
5426c53Q95j71o91J17O69L8j097O8R19K4j042Q5R13L19j199k20O59O68r57o07
5446i63P41O64l76q74O31Q30p43o41M21O97N7j148K77P86L5p60j81Q34M7o66l41
5467f73R31J87q58l75O08O42n95n73P60N50o19q13P15O26k94q99K95J055k77o88
5487b95J71M34J19o06M2N10J01p20O6P21l2m67n69Q73J23l32n82O05N58n51m78
$$ plain form
5508 -309 121 630 254 -331 -49 737 525 -273 -403 442 513 -273 -408 240 355 -66 -451 350 778 -213
5528 -213 -476 299 519 173 -198 -72 704 287 -532 -227 670 210 -740 -260 501 195 -816 -129 302 628
5548 628 -238 -410 160 442 -616 -818 371 399 19 -439 -54 617 -174 -509 -64 576 23 -403 9 554
5568 554 518 -613 -299 515 133 -433 -336 232 318 -404 -373 113 677 -263 -705 209 677 -220 -593 -351 531
5589 531 58 -577 98 413 8 -684 -335 423 549 -686 -465 393 557 -556 -520 139 702 -374 -707
5608 -707 150 365 -314 -534 165 742 -129 -443 -32 685 156 -471 155 477 -118 -550 68 638 495 -452
5628 -452 -321 394 546 -335 -364 518 307 -254 -370 256 451 -384 -227 441 616 269 -543 135 543 430
5648 430 -536 52 362 6 -405 -148 423 316 -280 -169 506 414 -355 -403 139 199 -11 -661 455 540 -257
$$ packed form
5508c09M30N09l76n85K82P86k12p98j30Q45P1p86j35O48J15m21l85Q01M28r91
5528b13k63P75K20l46l71J26P76m17q19L05Q97m60r50M80P61l06j011O87M31L26
5548F28q66j72N70K82j058k02J189K8l80m58L85O71p91l35M45O40n53m26M12N45
5568E54l6j131L14Q14l82n66R7N68Q6p22L1M86N64r40m42R14M68q97l73K42Q82
5589E31m73o35O75L15m05o92L49P58J26j235K21Q58J64j113L6O59N63j076l33
5608g07Q57K15o79k20O99N77q71l14M11P17n29o27O26L22n95m32O18N70j43r47
5628d52J31P15J52q81k9Q82k11n61j16O26J95q35J57O68J75l47q12O78M08j13
5648D30r66N88L10l56m11K57N71j07n96J11O75r2p69m8N42O0k10o50J116Q5p97
$$ plain form
5669 -257 -643 -65 311 344 -283 -32 590 159 -362 -297 452 266 -364 -360 261 379 -494 -596 334 382 -385 -442
5691 -442 225 396 -327 -550 -77 272 -159 -695 -113 315 -231 -390 -239 447 50 -551 -233 398 -21 -697
5711 -697 -253 647 58 -539 -322 448 227 -278 -567 298 160 -383 -279 96 514 -382 -703 22 320 -107
5731 -107 -537 -157 566 21 -263 -256 401 337 -90 -263 312 608 -515 -512 324 373 139 -321 183 542 -286 -451
5753 -451 -39 517 -124 -527 -76 533 137 -537 -164 517 170 -553 -447 517 281 -466 -203 442 326 -302
5773 -302 -417 225 171 111 -530 501 825 -350 -184 183 291 136 -507 -130 519 -28 -388 -271 375 206
5793 206 -566 -94 451 519 -129 -40 325 114 -427 -449 1 228 -152 -438 -12 355 -211 -556 258 596 -180
5814 -180 -292 -15 299 121 -133 -68 342 221 -263 -374 210 38 -255 -610 -422 185 -224 -482 161 404
$$ packed form
5669b57l86N78L76L3o27K51O22m31n21O5P49j86o30MO21J18q73j02R30M8p67n7
5691d42O67J71p23k23M73L49m31n36N82M28n46j59J51O86l97o01L18O31m19o76
5711f97M44R00n89n97K17P70k21n05k89Q65j38n43J04L75M18q96l21P25K98m27
5731a07m30L80P23n45k84PO57o4m27j73N75K96j123LQ36M9k34m60N04L59q28j65
5753d51M12N56o41m03M51O09l96o74L73O81l47p23J06R64k36p47K63O45j16o28
5773c02j15O42n4o0o41J031L24j175J66L67J08j55o43L77O49n47l60J17O46j69
5793B06p72M72N45O8o48Q9L65k11n41k2M50K27l80k86M26L67n66l45Q14L38p76
5814a80j12K77L14j78k54O5M10j21m84j11N84j72k93l55J88O07m09k58O43K43
$$ plain form
5834 404 -393 -415 264 146 -156 -608 35 761 40 -738 -257 435 354 -333 -416 524 62 -422 -788 276 44
5855 44 -424 -462 419 389 -350 -354 388 544 -246 -664 541 242 9 -446 300 435 -11 -200 -188 149 265 -209
5877 -209 -90 437 194 -311 -135 446 395 -558 -340 189 311 36 -304 215 400 2 -51 39 516 314 -315
5898 -315 109 424 237 -255 -249 353 152 -133 -124 575 202 -196 -228 273 317 -224 -207 118 444 -87 -119 62 412
5921 412 -149 -356 -74 684 136 -163 -317 264 135 -344 -262 264 362 -204 -271 456 294 -240 -497 155 394
5942 394 -241 -668 163 452 -116 -534 150 274 -382 -207 59 282 147 -487 -293 304 14 -472 -297 352
5962 352 36 -207 -164 286 144 -249 -281 -32 295 -48 -362 -57 270 -210 -490 -20 84 -61 -800 14 288
5983 288 26 -542 -159 59 37 -289 -185 112 195 -359 -86 279 85 -568 -254 344 478 -93 -604 -44 141
$$ packed form
5834D04p97k2O79j18l02m52O43P26p21p78M81O92q1o87q3R40m62m84l66J064k32
5855D4m68l8Q81l0p39mP42J56p90m18J205k99k33m55P46J35m46j89J2L37J16m74
5877b09J19N27k43n05J76N81n1r53K18N29J22k75l40N19J85l98n3R0M77k02o29
5898c15M24L15j87m92OO02k01k85RO99l73l98l2N01M4n41J7L25L26n31l2J81L50
5921D12n61k07K82P58n48k99j54N81j29m79Q2N26R8n66o7P27j62n34k57O52K39
5942C94o35m27Q31K89n68m18O84J24o56J75K66K23j35o34J94N97k90m86J75O49
5962C52l16k43M3M50j42l93l2K49L27l43l14L05L27m80k80M70J04j45p39Q14K74
5983B88k62n68L83K18k2l26J04K97Q3n54K73L65j94o53L14N98J34n71n11N60J85
$$ plain form
6004 141 -89 -488 441 486 198 -253 -36 411 -19 -391 56 630 11 -548 -200 328 346 -10 21 169 186
6025 186 -195 -136 180 415 -288 -349 -38 514 -137 -389 79 340 39 -552 -48 497 274 -260 -246 444 7
6046 7 -159 -413 382 359 -125 -82 345 296 -117 -193 297 307 -249 -392 289 370 -329 -327 -125 612 203 -275 -155
6069 -155 397 -137 -401 -186 665 35 -405 -179 405 323 -141 -358 202 414 -59 -280 -186 50 -236 -456 14
6090 14 442 27 -329 -8 408 -98 -620 -153 246 294 -258 -549 218 -72 -252 -160 -7 264 -581 -422 91
6111 91 313 -19 -298 231 307 -153 -408 163 330 240 -552 -158 220 -162 -504 -177 453 241 -402 -557 382
6132 382 9 -219 -156 159 297 -489 -301 371 405 -104 -151 154 261 27 -152 366 375 -42 -253 231 299 323
6154 323 -390 -63 510 116 -203 -46 433 437 94 -325 22 133 -327 -451 106 88 -281 -168 130 500 147
$$ packed form
6004A41k30l99R29M5k88m51K17M47m30l72M47N74o19n59L48N28J8l56L1J48J7
6025A86l81N9L16K35p03o1L11N52o51k52M68K61l01n91N04N45k23n34J4O90m37
6046Gj66k54P95k3m84M3M27m9m13p6M90J0n56j43O81Q1o99KK02P37m09m78J20
6069a55N52n34k64K15Q51o30m40K26N84q2m64k17N60K12m73k21R4K36k86k20M70
6090A4M28m15l56L21M16n06n22M67L99M8n52k91P67k90j80R2J53K71q45J59N13
6111I1K22l32k79N29P6m60k55N71J67r0p92L94L78l82l42L27O30k12o43j55R39
6132C82l73k28O3L15J38p86J88O72L4n09m7L05J07k34j79N18Rm17k11M84O8K4
6154C23p13L27N73l94l19J57M79Ml43m19L47J11m60j24N57j8l69J13K98L70l53
$$ plain form
6175 147 -298 -139 276 57 -437 106 454 28 -578 138 446 205 -184 -404 382 285 -217 -465 281 370 -301
6196 -301 -487 264 291 -339 -472 73 264 -239 -396 138 448 -56 -470 -293 236 518 -264 -137 132 103 -279
6217 -279 -266 326 23 -18 -199 218 476 -187 -197 161 426 -49 -462 -189 348 -12 -572 -176 351 10 -626
6238 -626 84 170 30 -239 -385 510 70 -474 -491 118 360 -155 -203 164 434 81 -414 44 417 -143 -428
6259 -428 -243 521 40 -248 -3 176 145 -153 -290 467 398 -255 -223 342 129 -198 -332 178 443 -177 19
6280 19 58 263 -140 -350 364 600 -4 -354 168 635 159 -254 -22 410 56 -90 -47 119 -25 -286 -345
6301 -345 550 122 -120 -206 190 349 148 -298 195 268 -66 -553 -81 313 -296 -370 90 415 206 -325 -324 474
6323 474 497 -215 -373 299 97 -161 -245 19 276 -392 -351 234 544 -291 -256 -28 148 138 -314 61 240 89
$$ packed form
6175A47m45J59M15k19m94N43L48m26o06P16L08k41l89k20P86r7n02k48P46Q9o71
6196c01j86P51K7o30j33N45J91n03j57N34L10n04m14J77N29K82p82J27K69k9l82
6217b79J3N92l03m1j81M17K58o63j0L58K65m75m13K73N37l60n60L96N27l41o36
6238f26P10Q6j40k69j46Q95m40n44j7O09K42n15m8L67K70l53m95M58L73n60k85
6259d28J85P64m81k88K45J79l1k98j37P57o9o53L2N65k13l27j34N10K65o20J96
6280A9L9K05m03k10P14K36o04l50N22M67m76m13K32M32l54j46M3J66j44k61n9
6301c45Q95m28k42q6L96J59k01m46M93P3l34m87M72L94o09p4M60L25k09n31JP98
6323D74K3p12j58O72k02k58q4K64K57o68M1N85L10q35L5K28J76j0m52L75J79j51
$$ plain form
6345 89 -144 -248 246 -209 -327 -358 273 15 -347 -300 91 175 -394 -296 273 29 -346 -287 -38 61 -190 -471
6367 -471 92 145 -174 -663 134 322 67 -209 123 413 -108 -25 7 384 257 -541 -278 182 125 -182 -353
6388 -353 200 456 281 -285 166 408 133 -657 -107 331 248 -622 175 391 -24 -318 -223 395 76 -135 -68
6409 -68 322 448 -192 -437 341 404 -65 -277 198 78 -501 -225 303 658 -30 -575 23 301 -191 -233 -47
6430 -47 493 125 -553 178 605 170 -504 -60 161 285 -298 -454 547 260 -444 4 22 294 -487 -241
6450 -241 -61 214 -3 -444 220 393 -209 -423 168 238 68 -320 61 287 -169 -375 233 241 -6 -281 -99
6471 -99 235 18 -91 -281 -32 61 -79 -371 -112 415 -82 -396 -219 295 -161 -468 -61 147 350 -577 -3
6492 -3 307 266 -377 -187 85 -128 -471 -130 226 340 -481 -261 377 223 12 -135 104 195 27 -538 209
$$ packed form
6345H9k33j04M94m55j18l1O31k58l62M7L91Q4n69R8N69k44l75N9K49R9k51k81
6367d71N63N3l19m89P97J88k55k76L32K90n21Q3L2L77j27p98K63M60n7l07j71
6388c53N53K56j75n66M51K42k75p90N50M38q3q70P97K16m15k94R5O18l19k11O7
6409f8L90J26o40k45P78O3m69k12M75j20n79K76N28L55o88n45N98K78m92m2J86
6430d7N40l68o78P31M27m35o74M44K21J24n83j56J001k87p04M48J8K72p81K46
6450b41J80K75k17m41O64J73o02k14N91P0j70l88L81K26m56k06O08Qk47k75J82
6471i9L34k17j09j90K49R3j40k92K59N27m97l14J77N14m56l07M07K08K03r27N74
6492cL10m1o43J90K72k13l43L41L56J14q21K20O38j54k11j47K39R1j68n65P47
$$ plain form
6513 209 356 149 -303 -178 21 -196 -49 -46 -5 17 -200 -162 391 12 -401 -276 112 339 -175 -415 75 319
6535 319 92 -421 -64 464 -61 -290 279 133 66 -151 -19 405 338 -262 15 -212 144 14 -73 277 54
6556 54 -173 -332 203 285 120 -366 65 372 -295 -397 34 575 -200 -513 207 7 12 -212 114 388 -34
6577 -34 -169 -147 89 164 -433 -234 136 43 11 -289 427 238 2 -391 -36 271 35 -441 209 153 -81 -335
6599 -335 70 187 -122 -594 16 418 -61 6 -163 505 183 -319 -248 335 44 -120 -218 -31 154 -113 44
6620 44 -10 164 -28 -179 131 41 56 -176 -1 147 176 -519 -216 241 19 -347 -349 310 -154 -84 -402 366 273
6643 273 -525 -439 -190 382 -146 -364 90 390 261 -352 28 326 135 -231 -170 331 394 -174 -182 389 304 -357
6665 -357 -6 424 44 -218 -130 596 168 -186 12 351 424 -58 -336 -55 309 -27 -157 315 370 142 -390
$$ packed form
6513B09J47k07m52J25J99k17J47LM1K2k17L8N53l79m13J25L88K27n14k40M90K44
6535C19k27n13L57N28n25k29N69j46o7k17J32M24o7o00K77k27L56j30q7L50k23
6556E4k27j59N35Q2j65m86M31L07o67j02M31N41p75l13P20k00Nk24L26K74m22
6577c4j35K2K36P5n97J99L70r3l2l00P16j89k36l93L55L07k36m76O50n6k34k54
6599c35M05J17l09m72O10M02m79O7j69O68l22n02P1N83k91j64r8J87J85k67J57
6620D4n4J74j92j51L10r0J5k32J75J48K9o95L03M57k22l66kO59m64P0l18P68r3
6643B73p98Q6K49N72n28k18M54L00j29o13L80K98j91l66O1N01O3n68qN71q5o61
6665c57L51M30l80k62Q8P26m28l54J98L39P3m82k78K81L64l36j30M72N5k28n32
$$ plain form
6686 -390 -9 415 298 -334 -12 250 104 -91 -208 210 142 159 -254 414 373 -236 -241 -26 279 93 -191 158
6708 158 93 -28 -633 -64 351 71 -305 15 410 181 -197 -116 355 210 -307 -143 205 391 -442 -442 382
6729 382 256 -347 -559 490 331 -112 -338 -59 432 -55 -595 -50 283 -49 -61 -76 241 280 -448 -199 225
6750 225 -37 -36 -104 434 232 -268 -272 116 360 -210 -410 129 441 -71 -538 215 250 194 -18 -17 303 -9 -518
6773 -518 -119 144 5 -383 71 221 361 -326 -286 24 367 -490 -292 20 242 128 -121 185 399 252
6793 252 -238 262 321 285 -295 -106 345 56 -177 39 188 181 -437 -301 256 80 -239 -229 299 299 -439 -365 95
6816 95 506 -362 -382 19 216 75 -141 -163 242 71 -447 8 403 246 -318 -127 392 238 -207 -7 54
6837 54 -24 -323 -117 254 189 -97 -329 171 309 -345 -61 -294 460 -272 -570 69 60 -193 -401 -86 160 -123
$$ packed form
6686c90L81M24j17o32L22K62j46j95j17M18o8J7m13O68m1o09nK15L05j86k84L49
6708A58o5j21o05N69M15k80l76L20L95k29l78Q1M71j45n17J64L48J86q33%Q24
6729C82j26o03k12J049j59m43k26K79M91m87n40N45L33l32j2j5L17L9p28K49M24
6750B25k62Jo8N38k02n00mL88K44n70k00N39L12n12m67P53L5n6k12JL20l12n09
6773e18L99K63j39l88M54J50J40o87M0L10L43q57J98L12K22j14k49L06K14j47
6793B52m90N00N9l6n80J89M51k89k33K16J49po18J36N57j76l19J0N28%p38P4M60
6816I5M11q68k0M01J97j41k16k2M05j71n18M55L95j57n64J91N19j54m45K00O1
6837E4p8k99K06L71o5k86k32N00J38o54K84k33P54p32k98O39rk53k08L15K46k83
$$ plain form
6859 -123 -523 -17 166 248 -409 -51 446 43 -23 -225 77 45 -426 -188 233 180 195 -200 211 354 -5 -370
6881 -370 47 277 -160 -265 19 217 -38 142 -81 137 131 149 -376 147 310 -353 92 285 565 127 -80
6902 -80 263 285 42 -285 264 -6 -369 -319 22 392 -111 -149 188 441 -150 -202 34 309 264 -245 -92 137
6924 137 169 -169 50 410 580 -257 -307 325 450 -465 -475 116 349 28 -616 119 377 -144 -296 -296 305 -135
6946 -135 -189 -207 404 132 -328 -300 124 170 -239 -279 501 437 -282 -231 140 153 -178 -438 -41 79 125 -275 -247
6969 -247 576 25 -396 -34 302 78 -212 -150 314 115 -374 -513 403 196 -102 -298 162 299 -179 -445
6989 -445 -119 304 -209 -464 304 372 90 -429 -59 345 -115 -347 -73 386 165 -427 -145 183 106 -397 123
7010 123 156 342 -380 -326 304 264 -435 -120 59 127 -169 -394 245 448 -205 -419 143 213 72 -270 188 269
$$ packed form
6859a23m00N06J83Q2o57L58M97m03o6k02L02l2m71K38M21n3J5l95M11J43l59l65
6881c70M17K30m37j05K84J98k55J80k23K18oJ8n25N23J63o63M45J93K80m38k07
6902h0L43K2k43l27N49k70l63N0L41L70n03l8L37K53n91n2K36K75m5n09J53K29
6924A37L2l38K19L60J70q37n0O32J25r15j0N91K33l21o44P35K58n21j52%O01m40
6946a35n4j8O11k72m60K8M24M6m09m0P80o4p19N1L71J3l31k60L97J20M6m00K8
6969b47Q23n51m21L62L36k24k90O2M64j99m89j39R16k07k98j96M60J37m78k66
6989d45L26M23n13k55P68O8k82n19L70M04m60k32K74M59k21n92K82L28p7n03N20
7010A23L3J86p22N4O30m0o99L15J79O8k96k25O39K03o53k14N62P0j41l42M58Q1
$$ plain form
7032 269 462 -244 -290 438 627 -269 -261 181 74 70 -344 374 85 -116 -125 -10 255 61 -260 -230 288 -35 -434
7055 -434 -160 677 235 -332 -226 401 313 -115 18 393 222 -455 -146 172 272 -212 -271 431 400 -77 -245
7076 -245 285 359 -152 -695 41 587 127 -539 -206 503 -180 -352 -378 564 22 -251 -122 368 200 -401 -82
7097 -82 396 4 -265 -349 416 22 -91 -362 89 108 7 -115 103 254 140 -280 -251 312 3 -386 -195
7118 -195 281 93 -370 -338 209 441 -381 -344 144 -44 223 -326 -33 122 -66 -72 350 327 -304 -481 -297 302
7140 302 298 -388 -425 245 342 -53 -346 237 345 -287 -346 434 328 -378 -138 204 269 -216 -255 262 383 -30
7162 -30 -461 73 241 -258 -312 326 662 201 -382 75 192 250 -296 94 433 41 148 130 309 197 -197
7183 -197 232 147 353 -27 -67 584 -47 322 -380 232 486 19 -127 -297 309 260 -334 -182 440 174 -129
$$ packed form
7032B69J93p06m6P28J89q96QM42j07mm14P18k89k01rJ15K65j94l21L0N18l23l99
7055d34K74Q37m42n67J06O27q8m28J33L75j71o77L09L18J00m84n9P02l1m77j68
7076b45N30P4n11n43P36N46m60o66L33P09o83j72k6R42n42k73J29M90j68o01L19
7097h2M78l92k69q4P65l94j13k71M51J9j01j22K18J51j14m20K9N63l09l89J91
7118a95M76j88m63L2N47K32q22L7M88j88K67n49K93J55j88oM22k3o31j77J84N99
7140C02mo86l7O70R7l95k93N83J08o32n9P80j06p06K40L42O5m85l9N17J21m13
7162c0m31N34J68m99n4O38L36m61n83M57J17N8n46L90L39l92J07j8J79j12l94
7183a97M29q5K06l80m0O51o31L69p02O12K54m67j46j70O06m9n94J52O22k66l03
$$ plain form
7204 -129 -393 37 193 -217 -205 225 427 -16 -243 199 283 -305 -469 422 443 -177 -396 45 378 -55 -257
7225 -257 -59 381 -4 -391 -80 584 222 -208 -351 481 -70 -311 -366 259 443 1 -205 54 198 -324
7245 -324 -567 179 527 -241 -470 -163 91 -105 -588 -150 264 -221 -65 -48 402 74 -117 28 88 130 -283
7266 -283 -469 202 150 -399 -366 57 224 80 -39 -87 221 338 -169 18 296 75 -44 -296 357 -4 -378
7287 -378 -169 246 123 -359 110 232 361 -231 -566 77 467 -173 -189 -41 565 22 -354 136 191 99 -420
7308 -420 157 628 -238 -124 -50 555 -48 -154 -152 438 131 -179 115 -65 282 -115 -239 126 177 23 -385
7329 -385 255 264 -91 -444 -10 38 -127 -25 223 362 -305 5 -192 392 306 -199 -105 405 210 -135 -124 181
7351 181 233 -60 -344 -10 87 -243 -109 -89 338 -40 -312 -88 202 116 -234 -257 556 -255 -239 -13 145 -19
$$ packed form
7204a29k64M30J56m10J2M30K02m43k27M42Q4n88j64Q91K1o20k19M41L33m33k02
7225b57J98M40l85l87L11O64l62m30j43Q32n51k41n5O25J84m42k06K59J44n22
7245c24k43P46L48p68k29L07K54j96m83M38M14m85J56J7M50l28j91J45O0M2m13
7266b83j86O71n2n49L3M23J67j44j19m8L08J17n07J87K78k21j19k52O53l61l74
7287c78K09M15j23m82M69J22J29n92l35O43L90o40j6J48O06n43l76M90N5r2n19
7308d20N77M71q66J14P4O05o03j06KN90l07l10K94j80L47l97j24L65N1j54m08
7329c85O40Rl55l53M34M8j65J02K48J39o67L10j97N84q6n05R4N10j95l45J1L05
7351A81N2k93k84L34R7l30J34K0M27l78k72K24K90q6l50k3Q13q11J6K26J58j64
$$ plain form
7373 -19 -208 -148 263 167 -53 -21 -107 408 -32 -252 310 414 -151 -364 254 327 -37 -173 319 326 55 -485 182
7396 182 726 -259 -297 25 311 155 -232 -342 393 -25 -441 -286 487 282 -260 -265 443 201 -205 -443 53
7417 53 121 93 -467 -51 93 -70 -538 -66 336 182 -312 -91 581 257 -417 -57 93 -240 -267 57 188
7438 188 387 -226 -605 283 272 -91 -82 47 300 39 -117 105 453 232 -231 29 340 -218 -227 97 302 244
7460 244 -198 -48 272 187 -529 -235 305 182 -358 -398 398 245 -289 -472 164 216 -272 -286 -108 69 -334
7481 -334 -398 -155 500 293 -329 -113 408 59 -341 -127 392 353 -370 -405 76 35 -246 -50 257 532 -19
7502 -19 -306 115 334 -238 -554 -44 108 23 -248 -173 421 190 -274 -226 281 65 78 164 315 350 -338 -121
7524 -121 349 -117 -92 -109 92 85 -76 -160 389 229 -104 -314 83 176 -97 -331 175 452 -115 -27 -64 -62 326
$$ packed form
7373a9j89O0M11r6k20L2q6N15m40k20N62J04n65k13O18P3l64j36M92Pk71n40O67
7396A82N44r85l8L22K86j56l87j10P35m18m16J55P73k05n42nP08k42m06k38M96
7417E3O8k8n60M16J44j63m68M72M02j54m94K21O72l24o74L60J50l33k7L24J31
7438A88J99o13l79Q88j1l63RJ29K53k61j56K22L48k21m63K60L11n58rL24K05n8
7460B44m42J50L20q5p16K94N40j23n40m0P96j53n34j83O36N2m88j4J78J77m03
7481c34o4K43O55k07o22K16N21l49m00K14N19l9p23l5M81m1k81J96L07K75n51
7502a9k87M21K19n72l16N10J52q5k71P5N94k31m64M8N07k16J3Q6J51L5o88K17
7524a21M70m66K5j7K01pj61q4N49j60l33k10L97R3k73k34N06K77n67Q8l7KL88
$$ plain form
7547 326 -259 -2 -19 214 -242 -167 150 63 209 -63 34 477 -294 -620 -137 424 -41 -73 -315 112 -64 -402
7569 -402 188 239 55 -294 1 87 -39 -219 -79 490 67 -306 -39 209 324 -119 -301 207 248 -15 -282
7590 -282 172 421 -50 -452 -71 238 121 -254 -106 67 200 -432 -48 277 120 201 -116 -15 409 -320
7610 -320 49 126 146 -7 -314 257 534 -121 -337 44 147 35 -154 -67 130 -6 -185 146 203 83 -188
7631 -188 -180 285 67 -316 -385 317 156 -249 -169 218 189 -217 -226 -364 467 -398 -511 -77 203 -126 -353 22
7653 22 207 -68 -391 -295 139 120 -408 -33 81 -161 -272 -148 193 66 8 -131 70 104 -279 -290 117 89
7675 89 -84 -528 27 86 -120 -293 -302 144 122 -212 180 301 266 -292 -191 184 467 -245 -4 186 113 36 -285
7698 -285 64 260 -162 -138 75 230 -38 -278 -87 136 90 -263 -392 315 400 -376 -301 251 -184 -220 -236 303
$$ packed form
7547C26n85K57j7K33m56P5L17q7J46k72R7M43p71l26M83N61m65l2k42M27j76l38
7569d02N90N1j84l49K95Q6j26j80J40N69m23l73K67K48J15m43j82N08M1k63k67
7590b82M54K49m71m02L81L09j17l75J48J73J33o32L84L25j57Q1l17J01M24p29
7610c20L69P7K0j53l07N71K77o55k16L81J03j12j89Q7J97j36j79L31N7j20k71
7631a88QM65k18l83o9P02j61m05Q0L87k9m06rj38Q31q65j13M34K80l29k27L75
7653B2J85k75l23R6M34j9n28L75J14k42j11J24L41j27n8j39K01L4l83j1M07k8
7675H9j73m44N55N9k06j73rM46k2l34L92J21l5n58J01L75K83p12K41J90p3p7l21
7698b85L49J96m22K4K13J55k68k40J91K23m6l53j29P07Q5p76P5N52m35l6j6N39
$$ plain form
7720 303 170 -251 -306 113 16 -114 -294 -140 248 50 -128 80 211 -44 -267 28 671 -95 -215 -74 -43
7741 -43 48 -483 -314 83 36 -232 81 143 -2 -202 -253 136 352 -260 -419 -30 -53 -407 -463 133 -13 -74 -346
7764 -346 -151 -72 307 26 36 166 -9 -294 -265 58 112 -379 -121 344 119 -218 -309 69 317 -126 -227 3
7786 3 265 36 -299 269 69 159 -357 219 463 188 69 -133 396 73 -188 -103 431 366 -78 -31 312 283
7808 283 -108 -78 -90 -81 -35 -315 63 283 -176 -170 211 295 27 -125 80 491 137 -207 63 348 -14 -239 -175
7831 -175 374 89 -265 -201 141 92 -161 -91 195 378 -211 -276 49 132 176 -250 1 193 91 -292 -446 312
7853 312 236 -201 105 223 248 -49 137 331 86 109 -85 83 501 -189 -293 48 167 -9 -287 -172 -53
7874 -53 60 -644 123 349 95 -379 -143 385 99 -267 -470 275 161 -355 -39 273 233 23 -338 75 250
$$ packed form
7720C03j33m21n5M19r7j30j80J54L88j98j78K08J31k55k23K95O43p66j20J41L1
7741d3R1n31J69L97m7k68L13O2j45k00n1L89K16o12j59L89k3l54n6N96j46o1k72
7764c46J95P9L79k81J0J30j75k85K9L23N4m91K58M65k25l37r1L78K48m43j01K30
7786CK62k29l35N68k00R0n16N76K44k75j19k02N29l23k61Q5N34o5m44M7L43k9
7808B83l91L0j2RM6k80L78K20m59OL81Q4k68j52K05M11l54l44K70K85l62k25O4
7831a75N49k85l54O4L42m9k53P0K86J83n89o5L25Q3M4m26K51J92j02l83j54P58
7853C12p6m37L06J18K5k97J86J94k45K3j94J68M18o90j04L41J19j76k78J15J19
7874e3J13p04P67K26k54m74K36N28k86l66k03P45j14n16L16L12m0k10l61M13J75
$$ plain form
7895 250 -114 -214 -79 273 -124 -372 -98 364 -405 33 123 98 160 -250 227 314 58 -243 -202 206 65 -113
7917 -113 -146 400 188 -265 -105 -234 371 -198 -162 130 133 10 -457 119 190 -111 -399 321 191 91 -82 -199
7939 -199 233 218 62 -146 8 165 -199 48 -188 140 -121 -307 -29 85 -349 -220 -190 634 13 -388 -192
7960 -192 284 -187 -269 221 53 -35 -326 -149 246 176 -368 7 163 121 -32 -369 163 188 -9 -429 104 292
7982 292 -75 -322 -65 -84 125 -276 51 242 86 -2 -101 214 -105 -86 -157 -10 57 -302 163 165 368 -333 -296
8005 -296 275 27 -114 -442 -13 -30 -281 -455 163 30 -45 -372 185 216 137 -437 -165 349 -236 31 107 214
8027 214 235 -405 -279 81 284 -139 -164 92 125 -81 -206 7 363 77 -439 146 125 -214 -53 64 366
8048 366 54 -280 239 307 157 -105 255 -94 322 -48 -206 58 -93 57 -291 417 -129 -218 -192 294 501
$$ packed form
7895B50l64j00J35L52l97k48K74M62p69M38R0k5O2m10M77Q7k56l01M1M08j41j78
7917a13l3N46k12m53J60j29O05n69L6K92Lj23m67N76P1l01k88P20j30j00j73j17
7939a99M32j5j56k08J54J57l64K47k36L28k61j86K78J14m34J29L0Q24o21m01J96
7960a92M76m71q2M90j68q8k91J77L95p0n44L75J56m2j53l37N32K5j97m20N33J88
7982B92l67k47K57j9K09m01L27J91j56q8r9L15l19J9p1J47O7l59M65KK03p01L7
8005b96N71k48j41l28M29j7k51j74O18j33p5l27N57L1p9n74K72N14n85K67P6J07
8027B14K1o40J26L60K03m23k5K56L3k06j25K13L56k86n16N85k1l39J61J17L02
8048C66l12l34N19O8j50k62L60l49M16l70j58K64j51J50l48P08n46q9K6M86K07
$$ plain form
8069 501 -75 -187 228 411 -52 -256 255 195 127 -442 -157 231 172 -508 -127 431 54 -98 124 233 227 4
8091 4 -108 286 517 -436 -56 91 324 106 -467 132 309 216 -313 66 373 -10 -320 -61 193 278 -272
8112 -272 45 104 235 -250 -181 336 272 -261 -655 94 210 -82 -17 85 75 -88 -375 -21 195 -215 -482 -62
8134 -62 157 -80 25 -70 139 -112 -339 176 347 65 -272 -275 541 286 26 -223 152 171 -501 -275 -11 553
8156 553 214 -315 -227 156 -189 -168 46 336 82 -312 -192 371 -330 -441 -259 182 95 -138 -200 285 152
8177 152 -186 -131 226 -10 -367 -118 186 75 -26 -355 -42 345 50 -177
$$ packed form
8069E01n76j12M15J83m63k04N11o0o8n69K85L88n9o80L81N58l77j52K22J09ok23
8091Dj12L94K31r53L80J47K33k18n73N99J77r3n29L79L07l83l10K59K54Q5n50
8112b72L17N9J31m85O9N17o4n33l94P49J16k92O5J02j0j63k87L54K16m10k67M20
8134f2K19k37J05r5K09k51k27N15J71k82l37lQ16k55k60k49L75J9o72K26K64N64
8156E53l39n29Q8L83l45K1K14K90k54l94J20N63p01j11J82M41q7k33o2M85j33
8177A52l38N5L57k36l57K49L04j11j01l29L13L87k95k27
8191a77
$$ Imaginary data points
##PAGE= N=2
##DATA TABLE= (X++(I..I)), XYDATA
$$ plain form
0 0 0 0 0 0 8 0 8 -8 16 -16 16 -24 32 -32 40 -50 64 -72 83 -101 116 -136 156 -181 209 -235 270 -308 348
29 348 -391 444 -497 555 -621 695 -773 860 -953 1059 -1173 1297 -1437 1592 -1763 1951
45 1951 -2166 2411 -2687 3002 -3374 3813 -4341 4992 -5821 6914 -8417 10645 -14272 21189
59 21189 -39047 177033 318216 -217638 -219393 195110 242587 -213238 -270143 153709 287378
70 287378 -104839 -247137 88695 249391 -78508 -258510 30245 257754 20695 -209057
80 -209057 -21384 221059 64120 -192012 -83671 189335 126308 -152364 -145808 123630 147638
91 147638 -123193 -183930 98477 213946 -47788 -198180 46199 215415 -27344 -233181
101 -233181 -5349 232639 33562 -218619 -39259 223495 57925 -224146 -86765 201182
$$ packed form
0@%%%%QqQj6K4l2L2m0N6o4P2r0J14j36J55j84K17k52K92l37L90m44N05n78O56
29C48p39Q35r41J052j176J316j468J633j813K012k232K470k734L029l355L714
45A951m117M577n098N689o376P187q154R333j0813J2735j5331J9062k4917L5461
59B1189o0236K16080J41183n35854j755M14503M7477m55825n6905M23852J33669
70B87378l92217j42298L35832J60696l27899j80002K88755K27509k37059k29752
80b09057J87673K42443j56939k56132J08341K73006o3027k78672O556K69438K4008
91A47638k70831o0737K82407J15469k61734j50392K44379J69216k42759k05837
101b33181K27832K37988j99077k52181J79360K62754j65570k82071J37381K87947
$$ plain form
111 201182 90134 -196157 -105366 181911 113151 -173824 -130559 151991 136164 -135801 -145625
122 -145625 112383 144152 -102297 -157594 75193 157009 -56827 -160206 34803 156962
132 156962 -26826 -178942 -17792 159493 25180 -169207 -55328 161655 75966 -157274
142 -157274 -98884 144984 112035 -141492 -132869 127300 141204 -124298 -163117 103344 164048
153 164048 -102188 -185484 76813 182337 -69880 -193775 49774 195857 -28049 -187970
163 -187970 17153 189596 4247 -182119 -24041 167958 34103 -162869 -54733 147481
173 147481 69779 -132900 -83292 119393 101184 -96897 -109528 83341 127397 -55243 -128502
184 -128502 42447 143550 -13930 -142329 -541 149339 22790 -149738 -40342 152388
$$ packed form
111B01182j11048k86291R0791K87277o8760k86975M3265K82550j5827k71965r824
122a45625K58008L1769k46449n5297K32787Q1816k13836j03379J95009J22159
132A56962j83788j52116J61150J77285j34313j94387J13879K16983q5689k33240
142a57274N8390K43868l2949k53527Q623K60169J3904k65502l8819K66461O0704
153A64048k66236q3296K62297J05524k52217j23895K43549J46083k23906j59921
163a87970K05123J72443j85349j86366J58078J91999j33855j96972J08136K02214
173A47481p7702k02679M9608K02685j8209j98081j2631J92869M4056j82640p3259
184a28502J70949J01103j57480j28399J41788J49880j26549j72528J09396J92730
$$ plain form
194 152388 63370 -143417 -71906 149277 97866 -133499 -102204 133674 121473 -117255 -123593
205 -123593 115730 139351 -96367 -137004 93304 148186 -75422 -147210 65378 151023 -49177
216 -49177 -147876 38607 150784 -16939 -138702 10321 140145 10060 -128645 -19994
226 -19994 123982 35364 -114503 -46747 107640 61378 -97695 -75026 85598 84066 -77311
237 -77311 -98571 62201 106026 -50556 -113570 39389 121768 -26352 -128578 11336 128742
248 128742 -4940 -139599 -15793 133416 22052 -139038 -40129 132428 47821 -134039
258 -134039 -66186 121672 71563 -120234 -88226 105160 93857 -97787 -106630 79741 107596
269 107596 -74234 -122938 49443 118792 -41864 -130073 18766 127911 -3226 -130464
$$ packed form
194A52388q9018k06787P1511K21183n1411k31365L1295K35878j2201k38728o338
205a23593K39323K3621k35718m0637K30308N4882k23608p1788K12588Q5645k00200
216d9177r8699J86483J12177j67723j21763J49023J29824j30085j38705J08651
226a9994J43976q8618j49867O7756J54387m6262j59073K2669J60624j532j61377
237g7311k1260J60772M3825j56582o3014J52959Q2379j48120j02226J39914J17406
248A28742j33682j34659J23806J49209j11364j61090R8909J72557q4607j81860
258a34039O7853J87858n0109j91797L2008J93386j1303j91644q843J86371K7855
269A07596j81830m8704J72381O9349j60656q8209J48839J09145j31137j27238
$$ plain form
279 -130464 -18252 124081 31631 -124996 -54548 113545 64865 -110817 -83322 100109 95330
290 95330 -92783 -111147 78110 119123 -68200 -130846 52515 136919 -37016 -138371 25536
301 25536 142381 -9932 -140809 -3634 138388 16399 -134001 -29030 129866 44925
311 44925 -116347 -50095 111826 65211 -96234 -69068 88052 79927 -71257 -80300 63830
322 63830 91325 -43517 -87718 35907 94268 -18804 -90854 10463 94368 6777 -86002
333 -86002 -9948 92912 29684 -81679 -32556 83472 46952 -74522 -51329 72275 61805
344 61805 -61423 -62528 61915 72144 -51490 -73582 48365 79498 -39674 -80091 34857
355 34857 85892 -23306 -81959 19823 84603 -11690 -84224 3601 81257 952 -82492 -9988
$$ packed form
279a30464J12212J42333r2450j56627P0448J68093m8680j75682K7495J83431m779
290I5330j88113j8364J89257M1013j87323o2646J83361Q4404j73935j01355J63907
301B5536J16845j52313j30877J37175J42022j21989j50400J04971J58896q4941
311D4925j61272O6252J61921m6615j61445K7166J57120q125j51184r043J44130
322F3830K7495j34842m4201J23625N8361j13072p2050J01317Q3905q7591r2779
333h6002P6054J02860o3228j11363M9123J16028l6520j21474K3193J23604j0470
344F1805j23228j105J24443J0229j23634k2092J21947L1133j19172m0417J14948
355C4857N1035j09198n8653J01782O4780r6293p2534Q7825P7656q0305q3444P2504
$$ plain form
367 -9988 79813 17699 -77163 -25976 72577 31638 -71241 -41947 62291 45220 -60366 -54552
379 -54552 52335 58439 -48724 -68345 36287 66892 -35246 -78828 19414 74619 -16677
390 -16677 -81710 4671 79614 924 -83764 -14409 77919 17374 -81688 -32108 72184 34626
402 34626 -72898 -46501 63269 47710 -63604 -60261 50336 58986 -48889 -68573 37962
413 37962 70491 -29835 -73245 21395 73682 -14428 -77288 2465 73038 2150 -75410 -12483
425 -12483 72042 20045 -69424 -27606 65763 34666 -61058 -40495 57128 48318 -48294 -48333 47226
438 47226 57188 -36567 -57386 32345 60690 -24997 -61957 19171 65008 -8862 -60560 8284
450 8284 67190 4677 -60209 -5642 64073 17155 -57418 -17918 60882 30459 -52070 -30146
$$ packed form
367i988Q9801o2114r4862N1187R8553m0939j02879K9294J04238j7071j05586N814
379e4552J06887O104j07163j9621J04632L0605j02138m3582R8242N5205r1296
390a6677o5033Q6381P4943p8690q4688O9355R2328o0545r9062M9580J04292l7558
402C4626j07524K6397J09770j5559j11314L343J10597Q650j07875j9684J06535
413C7962L2529j00326m3410R4640N2287q8110o2860P9753P0573p0888p7560O2927
425a2483Q4525n1997q9469M1818R3369l1097r5724K0563R7623q810r6612l9R5559
438D7226R962r3755k0819Q9731K8345q5687l6960Q1128M5837p3870n1698O8844
450H284N8906o2513o4886N4567O9715m6918p4573L9500P8800l0423q2529K1924
$$ plain form
462 -30146 54557 40129 -47781 -43293 46045 50302 -38559 -50578 39131 61140 -26994 -57754
474 -57754 27961 66274 -17542 -65414 13925 69332 -4966 -67444 786 70115 7809 -67827
486 -67827 -13677 65932 19979 -64203 -27055 60823 34249 -54995 -38237 52144 45894 -45242
498 -45242 -51531 36729 52846 -33639 -61066 21900 60258 -17279 -65922 5505 63985 -739
510 -739 -68490 -12871 63439 17077 -65208 -28339 59492 33099 -58565 -43652 49688 43784 -50999
523 -50999 -56659 37298 53802 -36792 -61937 25322 60106 -21228 -63502 10524 59504 -7427
535 -7427 -62517 -4028 56279 7512 -55967 -17101 48959 20203 -47994 -29562 37418 29383
547 29383 -36549 -36645 29175 39424 -22900 -41576 18568 45296 -12636 -46925 6262 47510 -1736
$$ packed form
462c0146Q4703j4428q7910M488Q9338M257q8861j2019Q9709K2009q8134l0760
474e7754Q5715L8313q3816m7872P9339N5407p4298o2478O8230O9329o2306p5636
486f7827N4150P9609m5953q4182L7148Q7878k6574q9244J6758R0381o250r1136
498d5242o289Q8260J6117q6485k7427Q2966L8358p7537m8643P1427N8480o4724
510g39o7751N5619P6310m6362q2285L6869Q7831k6393r1664J4913R3340n904r4783
523e0999n660R3957J6504r0594k5145Q7259L4784q1334m2274P4026M8980o6931
535g427n5090N8489O0307m8767o3479L8866O6060k8756o8197J8432O6980q035
547B9383o5932r6O5820J0249o2324j8676O0144K6728n7932l4289N3187M1248m9246
$$ plain form
560 -1736 -47739 -2254 48685 7699 -46333 -9769 47607 13850 -45764 -15764 46012 21072
572 21072 -40492 -18336 43781 24953 -36078 -20791 38620 24744 -33735 -23043 34266 26707
584 26707 -28059 -22933 29890 28309 -21209 -23789 21996 27606 -15219 -23777 16129 28772 -6854
597 -6854 -23451 7927 28759 1133 -25072 -3548 25751 9444 -24122 -12262 25636 19975
609 19975 -21608 -21190 23588 28857 -19934 -32236 18851 36907 -15280 -38750 13847 42064 -10030
622 -10030 -43826 6815 44230 -5998 -47852 213 45255 1611 -46420 -5973 44168 8533
634 8533 -43562 -13894 38257 13294 -39376 -20679 31858 19441 -31122 -25983 23123 24913 -22214
647 -22214 -31472 11439 27405 -11995 -33317 3223 30659 -1457 -33913 -5732 31495 6278
$$ packed form
560a736m6003M5485N0939m0986n4032L6564N7376l3757n9614L0000O1776k4940
572B1072o1564K2156O2117j8828o1031J5287N9411j3876n8479J0692N7309p559
584B6707n4766N126N2823j581m9518k580M5785N610m2825q558L9906J2643l5626
597f854j6597L1378K0832k7626k6205K1524K9299j6307l3566J1860L7898n661
609A9975m1583M18M4778N269m8791j2302N1087J8056n2187k3470N2597K8217n2094
622a0030l3796N0641L7415n0228m1854M8065M5042m3644m8031M0447N0141l5635
634H533n2095K9668N2151k4963n2670J8697N2537j2417n0563N139M9106J790m7127
647b2214r258M2911J5966l9400k1322L6540K7436l2116l2456K8181L7227k5217
$$ plain form
659 6278 -36100 -15827 30342 14943 -34632 -22288 29832 22454 -31204 -27452 26592 26026 -28411
672 -28411 -30773 23372 28867 -23498 -30973 20919 30175 -19314 -30887 15806 28751 -15080 -30090
685 -30090 10783 28641 -7407 -26524 4753 26567 773 -22651 -2828 21315 7679 -17788
697 -17788 -9379 17123 15913 -11739 -16383 12566 23154 -7202 -24640 6054 30733 -814 -30376
710 -30376 1445 37856 6841 -35123 -4693 41672 11820 -39653 -11736 43869 18346 -39778
722 -39778 -16478 44056 23624 -38458 -21327 40565 25976 -35603 -24578 35742 29110 -29245
734 -29245 -26185 29312 30579 -22105 -28493 18792 29175 -12631 -27699 7733 27403 -624 -23255
747 -23255 -2229 22105 8127 -19188 -12695 15399 14949 -14321 -19711 11063 22539 -8419 -25941
$$ packed form
659F278m2378K0273M6169j5399m9575J2344N2120p378n3658L752N4044n66n4437
672b8411k362N4145N495n2365p475N1892R256m9489j1573M6693J2945m3831j5010
685c0090M0873J7858l6048j9117L1277K1814k5794k3424J9823K4143j3636k5467
697a7788Q409K6502j210k7652m644K8949J0588l0356j7438L0694K4679l1547k9562
710c0376L1821L6411l1015m1964L0430M6365k9852n1473K7917N5605k5523n8124
722c9778K3300O0534k0432o2082J7131O1892j4589o1579J1025O0320o632n8355
734b9245L060N5497J267n2684o388M7285J0383m1806j5068L5432J9670k8027k2631
747b3255K1026K4334j3978k7315O493K8094m50k9270n390L0774J1476l0958j7522
$$ plain form
760 -25941 4749 27022 -4308 -31756 -2113 29390 1579 -32661 -6482 30045 6761 -31520
772 -31520 -11085 26189 8036 -29007 -13287 22488 9797 -23927 -13230 18942 10381 -19596
784 -19596 -14691 12667 10680 -14436 -15234 7138 11218 -7077 -13848 1530 10123 -2242 -13430
797 -13430 -3588 9573 1731 -13047 -6498 11354 7181 -12763 -9542 11995 9357 -14242 -12534
810 -12534 13534 11833 -15895 -13183 17263 15223 -17133 -15659 18229 17011 -18222 -17090 18772
823 18772 18330 -17073 -16052 19926 19365 -16348 -16590 18118 18779 -15038 -16722 15470 19002 -10447
837 -10447 -14471 12094 18032 -5495 -12957 5457 14616 554 -9806 -387 10769 7771 -4276
850 -4276 -5833 6655 12228 -1328 -12060 2169 17446 2469 -17581 -1649 23558 8011 -22111
$$ packed form
760b5941L0690K2273l1330k7448K9643L1503k7811l4240K6179L6527k3284l8281
772c1520K0435L7274j8153l7043J5720L5775j2691l3724J0697L2172q561k9977
784a9596M905K7358j987k5116p98K2372M080j8295o771J5378Q593j2365j1188
797a3430R842J3161p842j4778O549J7852m173j9944L221K1537k638k3599J708
810a2534K6068j701k7728K712L0446k040l2356J474L3888j218l5233J132L5862
823A8772m42l5403J021L5978n61l5713k42L4708O61l3817j684L2192L532k9449
837a0447m024K6565N938k3527p462J8414R159j4062j0360R419J1156k998j2047
850d276j557J2488N573j3556j0732J4229J5277j4977k0050J5932K5207j5547l0122
$$ plain form
863 -22111 -7487 26009 12364 -24686 -12409 26150 15178 -24181 -14256 26018 17184 -24222
875 -24222 -17625 23311 17634 -22316 -19063 19303 18695 -17351 -18559 15217 18000 -13231 -18276 9601
889 9601 15359 -8886 -17244 3824 13796 -3104 -14709 -1535 11232 1737 -13461 -7616 8549
902 8549 6655 -10843 -11732 6759 11020 -8146 -15595 4105 13433 -7068 -18884 1944 15959
915 15959 -5506 -21005 1528 19053 -2754 -22234 -1516 18931 -540 -21804 -3357 18158
927 18158 1793 -19727 -4079 17247 3592 -17973 -6878 14775 6119 -14865 -9552 11032
939 11032 9838 -8402 -10744 5980 11863 -3481 -12569 518 12787 2364 -13370 -4164 15149
952 15149 8613 -13411 -9129 15456 13283 -13866 -14266 15268 18101 -12001 -17080 14157 21927 -9540
$$ packed form
863b2111J4624L3496j3645l7050J2277L8559j0972l9359R925M0274q834m1406
875b4222O597M0936n677l9950L253L8366o08l6046j208L3776K783l1231n045K7877
889I601N758k4245q358K1068R972j6900j1605J3174J2767r495j5198N845J6165
902H549j894j7498q89J8491M261j9166p449J9700R328k0501j1816K0828J4015
915A5959k1465j5499K2533J7525k1807j9480K0718K0447j9471k1264J8447K1515
927A8158j6365k1520J5648K1326j3655k1565J1095K1653q656k0984N313K0584
939A1032j194j8240k342J6724N883j5344r088J3087J2269j0423j5734R206J9313
952A5149o536k2024M282K4585k173k7149m00K9534K833l0102n079L1237P770l1467
$$ plain form
966 -9540 -19439 11464 22753 -7867 -20653 9352 23487 -4687 -19477 6903 22514 -1614
978 -1614 -18208 2934 19442 1387 -15031 -218 15519 5157 -10075 -2413 11232 6539 -6326
991 -6326 -5239 5887 7826 -2201 -6749 1744 9447 2798 -7587 -2712 9266 5545 -8844 -6373
1005 -6373 8617 7632 -8108 -7716 8436 9256 -8235 -9563 7638 8696 -9470 -11250 7204 9186
1019 9186 -8039 -10230 6469 8756 -7282 -10302 4667 6896 -7317 -9357 4038 6507 -5847
1032 -5847 -8593 3153 6030 -4840 -8639 475 4874 -3333 -7674 -776 4789 -952 -7000 -1920
1046 -1920 4427 348 -7625 -4985 3953 2816 -6937 -6864 4561 6555 -6036 -9552 3576 8442 -5470
1061 -5470 -12260 2487 10957 -3315 -12612 1773 12731 -948 -13349 -51 13225 534 -13650
$$ packed form
966i540r899L0903J1289l0620j2786L0005J4135k8174j4790K6380J5611k4128
978a614j6594K1142J6508j8055j6418J4813J5737j0362j5232P662J3645m693j2865
991f326J087J1126J939j0027m548Q493P703o649j0385M875J1978l721j4389K471
1005f373J4990r85j5740L92J6152Q20j7491j328J7201J058j8166j780J8454J982
1019I186j7225k191J6699K287j6038l020J4969K229j4213k040J3395K469j2354
1032e847k746J1746K877j0870l799R114M399q207m341O898N565n741o048N080
1046a920O347m079p973K640Q938j137r753P3J1425J994j2591l516J3128M866j3912
1061e470o790J4747Q470j4272r297J4385J0958j3679j2401J3298J3276j2691j4184
$$ plain form
1074 -13650 -2075 13381 3745 -12136 -4103 12011 6483 -9444 -6280 9261 7937 -6811 -6929
1087 -6929 7148 9710 -3101 -7756 4298 10997 -251 -9188 172 10995 3872 -8227 -3063
1100 -3063 11219 7559 -7002 -5433 9329 9852 -6367 -8613 7997 11840 -4030 -9950 6109
1113 6109 13627 -1667 -10572 3193 12700 -277 -10987 731 12538 2725 -9780 -1256 11501
1126 11501 4230 -8600 -4026 8604 4990 -7385 -5146 7211 6712 -5568 -6555 5078 7538 -3925
1140 -3925 -8807 2008 7393 -2072 -8385 540 7780 -559 -8952 -1577 7699 819 -10006 -4522
1154 -4522 7460 3348 -9126 -5827 6381 4587 -7432 -7822 4353 4715 -7112 -8896 3070 6081
1168 6081 -4837 -9285 1643 7256 -3144 -9879 -1037 6607 -863 -9483 -2664 7101 1197 -8564
$$ packed form
1074a3650J1575J5456r636j5881Q033J6114n528j5927L164J5541j324j4748j18
1087f929J4077K562j2811m655J2054O699j1248q937R360J0823p123j2099N164
1100c063J4282l660j4561J569J4762N23j6219k246J6610L843j5870n920J6059
1113F109P518j5294q905J3765R507j2977j0710J1718J1807r813j2505Q524J2757
1126A1501p271j2830M574J2630l614j2375K239J2357m99j2280r87J1633K460j1463
1140c925m882J0815N385r465o313Q925P240q339q393P375R276o880j0825N484
1154d522J1982m112j2474L299J2208j794j2019l90J2175L62j1827j784J1966L011
1168F081j0918m448J0928N613j0400o735Q842P644p470q620O819R765n904r761
$$ plain form
1182 -8564 -4071 6431 3230 -7892 -6438 4830 5012 -6057 -7352 4183 6390 -3587 -7966 2059
1196 2059 7515 -1676 -8512 -378 7665 1474 -7158 -2303 7107 4251 -6111 -4100 5958 5486 -4838
1211 -4838 -6121 4768 8324 -1882 -7639 2749 9721 101 -8041 327 9520 2329 -7998 -1128
1225 -1128 9967 4392 -7413 -2249 9629 5249 -6898 -3777 8555 6296 -5576 -3962 7278
1238 7278 6874 -3696 -3740 5664 5986 -3045 -3702 3698 5099 -1249 -2706 2597 3972 217 -1534 669
1254 669 2316 1066 -440 -926 880 1944 980 -1609 -350 2717 1432 -2687 -1747 2826 1357 -3596
1270 -3596 -2042 3874 1952 -4369 -2705 3747 1661 -5491 -3116 3968 1493 -5791 -2851 4250 1541
1285 1541 -6103 -3095 4032 770 -6169 -3427 3718 775 -6025 -3078 3243 1219 -5401 -3584 2685
$$ packed form
1182h564M493J0502l201j1122J454J1268J82j1069j295J1535K207r977m379J0025
1196B059N456r191o836Q134Q043o191q632M855R410k856j0362K011J0058m72j0324
1211d838j283J0889L556j0206n757J0388O972r620q142Q368R193p191j0327O870
1225a128J1095n575j1805N164J1878m380j2147L121J2332k259j1872J614J1240
1238G278m04j0570m4R404L22r031o57P400J401o348j457N303J375l755j751K203
1254F69J647j250j506m86J806J064r64k589J259L067j285m119R40M573j469m953
1270c596J554N916j922o321J664O452k086p152K375P084k475p284K940P101k709
1285A541p644L008P127l262o939K742P145k943o800K947O321k024o620J817O269
$$ plain form
1300 2685 1082 -4549 -4183 1186 1791 -3123 -4053 53 2842 -1822 -4979 -1436 3283 290 -5514 -3149
1316 -3149 3718 2693 -4977 -4340 3867 4271 -4950 -6114 3848 5420 -4510 -6529 3534 6664 -3140
1331 -3140 -6804 2936 6740 -2298 -6480 1923 6362 -817 -5242 1149 5900 1048 -4003 -424 4146
1346 4146 2474 -1609 -1305 2254 3841 638 -2113 313 5109 3168 -3942 -2150 6005 5634 -4703
1361 -4703 -4627 6684 8073 -4274 -6073 7254 9408 -4933 -8123 6902 10391 -4923 -8926 6971
1375 6971 11526 -4294 -9360 6228 10631 -4086 -9206 5154 9611 -3773 -7934 4467 8912
1388 8912 -2563 -6926 2702 7002 -1691 -5702 1033 4864 -514 -3696 -385 2614 1236 -2099 -2326
1403 -2326 -16 2494 -119 -4318 -2347 3362 2421 -5096 -4654 4105 3690 -6691 -6235 4424 5183 -7139
$$ packed form
1300B685j603n631L66N369O05m914r30M106K789m664l157L543M719k993n804K365
1316c149O867j025p670O37Q207M04r221j164R962J572r930k019J0063L130r804
1331c140l664R740L804r038m182Q403M439p179m425O391M751m852n051L579M570
1346D146j672m083L04L559J587l203k751K426M796j941p110J792Q155l71j0337
1361d703P6J1311J389j2347j799J3327K154j4341l190J5025L489j5314m003J5897
1375F971M555j5820n066J5588M403j4717n120J4360M457j3384m161J2401M445
1388H912j1475m363R628M300q693m011O735L831n378l182L311K999j378l335k27
1403b326K310K510k613m199J971N709r41p517M42Q759m15j0381M56J0659P59j2322
$$ plain form
1419 -7139 -7806 5362 6682 -7025 -9116 4902 7002 -6826 -9679 3929 7774 -5713 -9844 3182
1433 3182 7771 -3972 -9433 818 7255 -2019 -8827 -1137 6630 510 -7698 -2710 5837 2800
1447 2800 -6467 -5854 4497 5668 -4618 -7696 2883 8305 -2420 -9350 1391 9914 -675 -10572
1461 -10572 -357 11034 983 -10906 -1722 11693 2887 -10699 -2253 11134 3807 -10184 -3157
1474 -3157 10752 4477 -8462 -3443 9111 5065 -6192 -3332 6770 5191 -3531 -3321 3857 4814
1488 4814 -519 -2575 1413 4785 2662 -2198 -1996 3762 5284 -1537 -4665 2925 8100 -638 -7107
1503 -7107 2014 10169 -196 -9829 1151 12031 643 -11242 551 13066 1107 -12160 -157
1516 -157 13202 1312 -12784 -754 12759 1103 -12612 -1086 12228 1115 -11970 -1548
$$ packed form
1419g139o67J3168J320j3707k091J4018K100j3828k853J3608L845j3487m131J3026
1433C182M589j1743n461J0251O437r274o808P690P767o120q208M988Q547l037
1447B800r267O13J0351J171j0286l078J0579N422j0725o930J0741Q523j0589r897
1461a0572J0215J1391j0051j1889R184J3415q806j3586Q446J3387p327j3991P027
1474c157J3909o275j2939N019J2554m046j1257K860J0102j579q722K10P178R57
1488D814n333k056L988L372k123m860K02N758J522o821l128P590N175q738o469
1503g107R121Q155j0365r633J0980J0880j1388j1885J1793J2515j1959j3267J2003
1516a57J3359j1890j4096J2030J3513j1656j3715J1526J3314j1113j3085J0422
$$ plain form
1528 -1548 11293 1705 -11028 -2553 9187 2230 -9079 -3375 6706 2586 -6726 -4399 3994 2953
1542 2953 -4505 -4672 1149 3547 -1413 -5474 -1184 4431 1298 -6379 -4585 4497 3270 -6862 -6793
1557 -6793 4577 5974 -6413 -8584 4387 7540 -6291 -10048 3804 8803 -5550 -11222 3482
1570 3482 9752 -4340 -11446 2143 10073 -2995 -11358 91 10030 -346 -10176 -1769 8793
1583 8793 2148 -8517 -3555 6964 4698 -6555 -6034 5544 7185 -3880 -7811 3268 9348 -1422
1597 -1422 -9459 1125 11040 1124 -10249 -1133 12505 3404 -11880 -3336 13334 5387 -11941
1610 -11941 -4997 13330 7249 -11495 -6112 13080 8813 -10200 -7139 11819 9061 -8888 -7708
1623 -7708 9929 9666 -6763 -7927 7184 9658 -4035 -7571 4310 9122 -1202 -7142 985 8081
$$ packed form
1528a548J2841r588j2733Q475J1740o957j1309N704J0081m120r312K327Q393j041
1542B953p458j67N821K398m960m061M290N615l133p677J794R082j227j0132O9
1557f793J1370J397j2387k171J2971L153j3831l757J3852M999j4353n672J4704
1570C482O270j4092p106J3589P930j3068q363J1449R939j0376r830Q407J0562
1583H793o645j0665M962J0519k266j1253N21J1578J641j1065l931J1079O080j0770
1597a422q037J0584R915r916j1373R116J3638r101j5284Q544J6670p947j7328
1610a1941O944J8327o081j8744N383J9192m267j9013L061J8958k758j7949J180
1623g708J7637k63j6429j164J5111K474j3693l536J1881M812j0324n940Q127P096
$$ plain form
1637 8081 1845 -5912 -2176 6874 4887 -4477 -5393 4517 7472 -3603 -8376 3395 10064 -1832
1651 -1832 -10923 1055 12250 -200 -13076 -1135 13335 1466 -13927 -3032 13537 3081
1663 3081 -14561 -4728 13521 4756 -14644 -6721 12535 6228 -12932 -8365 10524 7632 -11019
1676 -11019 -9663 8156 7975 -8693 -10531 5463 8881 -5569 -10903 2427 9364 -2267 -11147
1689 -11147 -1472 9063 858 -10776 -4309 8695 4288 -9763 -7170 7833 7036 -8639 -10131
1702 -10131 6619 9681 -6858 -11627 5083 11442 -5174 -12845 3677 12984 -2875 -13972 1221
1715 1221 13358 -688 -13140 -455 13026 1863 -11625 -2648 11682 3820 -10903 -4910 10459
1728 10459 6675 -8106 -6770 8030 8929 -5323 -8307 4902 10024 -2422 -9114 2577 11001
$$ packed form
1637H081o236p757L736R050j987r364r16R910K955j1075m773J1771O669j1896
1651a832r091J1978J1195j2450j2876J1941J4470j1869j5393J0895J6569j0456
1663C081j7642R833J8249q765j9400P923J9256o307j9160M567J8889k892j8651
1676a1019J356J7819j81j6668j838J5994L418j4450n334J3330O937j1631q880
1689a1147R675J0535q205j1634O467J3004m407j4051K593J5003p97j5675j492
1702a0131J6750L062j6539m769J6710O359j6616p671J6522R307j5859j1097J5193
1715A221J2137j4046j2452J2685J3481j1163j3488Q977J4330p862j4723N993J5369
1728A0459l784j4781J336J4800Q99j4252k984J3209N122j2446o692J1691Q424
$$ plain form
1741 11001 454 -10123 -78 12104 3676 -10596 -3325 12179 6082 -10495 -5536 12109 8601
1754 8601 -9784 -7769 11184 10378 -8867 -9424 9734 11757 -7331 -10877 7952 12563 -5679 -11657
1768 -11657 5623 12986 -3554 -12392 2943 12944 -719 -11603 133 11593 1467 -10893
1780 -10893 -2808 10456 4046 -9795 -5564 8610 6603 -8198 -8139 6878 8739 -5973 -10714 4189
1794 4189 10472 -3669 -12113 1605 11813 -1485 -13190 -1166 12565 1399 -13939 -3949 12414
1807 12414 3527 -13513 -6377 11670 6335 -12372 -8640 10009 7711 -10799 -10385 8042 9639
1820 9639 -8736 -11457 5763 11023 -5894 -12693 2958 11505 -2630 -13015 -59 11703 780
1833 780 -12401 -3236 11256 3538 -11656 -5955 9995 6383 -10360 -8171 9275 9524 -8068 -10493
$$ packed form
1741A1001j0547j0577J0045J2182q428j4272P271J5504o097j6577M959J7645l508
1754H601j8385K015J8953q06j9245n57J9158K023j9088l546J8829M611j8242n978
1768a1657J7280P363j6540q838J5335J0001j3663j0884J1736J1460j0126j2360
1780a0893Q085J3264o410j3841M231J4174k007j4801N9J5017J861j4712m741J4903
1794D189O283j4141q444J3718J0208j3298j1705J2024J3731j1166j5338R990J6363
1807A2414q887j7040P136J8047n335j8707L732J8649k298j8510M14J8427J597
1820I639j8375k721J7220N260j6917o799J5651Q547j4135j0385J2956J1762j0923
1833G80j3181R165J4492p718j5194N701J5950l612j6743K189J7446K49j7592k425
$$ plain form
1847 -10493 7437 11418 -6341 -12312 4947 13040 -3642 -12929 2337 13900 -622 -13337 330
1860 330 14233 2217 -13259 -2575 13694 5037 -12273 -5218 12733 7879 -10594 -7539 10837
1873 10837 10037 -8462 -9212 8595 11729 -6008 -10499 6220 12840 -3690 -11589 3416 13577
1886 13577 -477 -11980 239 13677 2406 -11868 -2537 12756 4859 -10991 -5039 11764
1898 11764 7569 -10069 -7277 10090 9649 -7764 -9877 6848 11127 -5180 -11297 4475 12217
1911 12217 -3078 -12731 1623 12604 -160 -12784 -1623 12465 2793 -12799 -4575 11771
1923 11771 5642 -12001 -7717 10293 7471 -10865 -9903 8568 9843 -8966 -11862 6156 11848
1936 11848 -6709 -13408 4005 12538 -3994 -14427 1351 12889 -1404 -14721 -1583 13213
$$ packed form
1847a0493J7930L981j7759n971J7259Q093j6682r287J5266J1563j4522j2715J3667
1860C30J3903j2016j5476J0684J6269q657j7310P055J7951m854j8473L055J8376
1873A0837q00j8499p50J7807L134j7737m491J6719O620j6530p899J5005J0161
1886A3577j4054j1503J2219J3438j1271j4274R331J5293p897j5850N952J6803
1898A1764m195j7638K792J7367m41j7413k113J6725M279j6307o117J5772P742
1911A2217j5295r653J4354J0981j2764j2624J1161J4088r672j5592Q224J6346
1923A1771o129j7643M284J8010k822j8336R62J8471J275j8809k896J8018N692
1936A1848j8557o699J7413Q533j6532j0433J5778J1538j4293j3317J3138J4796
$$ plain form
1948 13213 1567 -13892 -4440 12116 4155 -12858 -6883 10617 6676 -10887 -9410 8734 9225
1961 9225 -8927 -11061 6547 11057 -5688 -12441 3962 12212 -3251 -12890 1653 12630 -205
1974 -205 -13256 -1387 12845 2870 -12669 -4027 12272 5417 -11263 -6339 10952 7976 -9253
1987 -9253 -8464 9069 10102 -7261 -9584 6931 11273 -4207 -10731 3958 12273 -1330 -11131 1293
2001 1293 12589 1831 -11139 -1875 12805 4888 -10896 -4920 11464 7542 -9720 -7424 10238
2014 10238 10194 -8328 -9659 8844 12365 -6679 -11875 6786 13816 -4453 -13425 4466 14742
2027 14742 -2058 -14096 1990 14783 -272 -14101 -306 14434 2175 -13503 -2648 13284
2039 13284 4199 -12403 -5173 11383 6111 -10708 -7262 9097 7789 -8070 -9077 6241 8725
$$ packed form
1948A3213j1646j5459R452J6556p961j7013N975J7500l941j7563J477J8144M91
1961I225j8152k134J7608M510j6745o753J6403Q250j5463r639J4543J0977j2835
1974b05j3051J1869J4232r975j5539Q642J6299o855j6680M924J7291k976j7229
1987i253P89J7533J033j7363k323J6515M342j5480o524J4689Q315j3603r801J2424
2001A293J1296j0758j2970R264J4680p917j5784N976J6384l922j7262K296J7662
2014A0238m4j8522j331J8503L521j9044n196J8661P030j8269q972J7891J0276
2027A4742j6800j2038J6086J2793j5055j3829J3795J4740j2259j5678J0855J5932
2039A3284r085j6602P230J6556n272j6819L446J6359j308j5859j007J5318K484
$$ plain form
2052 8725 -5160 -9956 3218 9658 -2473 -10716 -41 9899 469 -11512 -3244 9664 3754
2065 3754 -10875 -6309 9440 6463 -10166 -8811 8393 9009 -9086 -11131 6890 10451 -7444
2078 -7444 -12937 4869 12064 -5298 -13967 2748 12792 -2929 -14266 406 12656 -347 -13687
2091 -13687 -1994 12510 2614 -12589 -4477 11122 5334 -11131 -6968 9761 7538 -8976 -9068
2104 -9068 7932 9800 -6349 -10881 5319 11354 -3606 -11734 3005 12778 -1035 -12337 519
2117 519 13848 1636 -12570 -2068 13767 3956 -12212 -3961 13020 6315 -10992 -5954 11627
2130 11627 7700 -9410 -7623 9615 9353 -7444 -8520 7581 10084 -5027 -9204 4466 10394
2143 10394 -1911 -9464 1481 10448 1139 -8864 -1518 9791 4093 -8118 -4812 8446 7145
$$ packed form
2052H725j3885m796J3174O440j2131q243J0675R940r430j1981Q268J2908n910
2065C754j4629M566J5749k977j6629J355J7204O16j8095k045J8021L561j7895
2078g444n493J7806P195j7362q669J6715J0044j5721j1337J4672J2250j3003j3340
2091a3687J1693J4504r896j5203Q112J5599n788j6465M163J6729k223j6514r2
2104i068J7000J868j6149m532J6200O035j4960q128J4739R773j3813j1302J2856
2117E19J3329j2212j4206J0502J5835r811j6168Q251J6981o705j7307N038J7581
2130A1627l927j7110J787J7238k62j6797j076J6101K503j5111m177J3670N928
2143A0394j2305p553J0945Q967r309j0003P346J1309n698j2211L306J3258j301
$$ plain form
2156 7145 -7354 -7479 7246 9315 -5536 -9909 5469 11626 -4293 -12060 3475 13035 -2429
2169 -2429 -13854 1583 14035 -572 -14375 -342 14317 1167 -14732 -2709 13824 3132
2181 3132 -14251 -4585 12850 4631 -13014 -6123 11211 6397 -10951 -7926 9049 7291 -8653
2194 -8653 -9357 6403 8566 -5926 -9849 3244 8926 -2988 -10503 282 9208 401 -10258 -3048
2208 -3048 8850 3261 -9776 -5654 8137 5886 -8689 -7869 7061 8309 -7405 -9936 5816
2221 5816 10128 -5785 -11612 3858 11440 -3704 -11982 2027 11899 -1464 -12286 9 11926
2234 11926 1072 -11660 -1998 11449 3522 -10471 -4554 9881 5887 -8472 -6111 8441 7758
2247 7758 -6178 -7947 6478 9719 -4510 -9557 3856 10968 -1482 -10443 1452 12038 923
$$ packed form
2156G145j4499j25J4725K069j4851m373J5378O157j5919p767J5535R560j5464
2169b429j1425J5437J2452j4607j3803J4033J4659j3150j5899J2023J6533j0692
2181C132j7383R666J7435q219j7645O891J7334m814j7348L025J6975j758j5944
2194h653p04J5760K163j4492l923J3093N682j1914p515J0785Q926q807j0659P210
2208c048J1898n589j3037M122J3791k251j4575Q20J4930J248j5714k531J5752
2221E816M312j5913n827J5470P582j5144q278J4009R872j3363j0822J2295J1917
2234A1926j0854j2732R662J3447p927j3993N917J4435l994j4359K361J4552o83
2247G758j3936j769J4425L241j4229n047J3413P112j2450q961J1895J0586j1115
$$ plain form
2260 923 -11116 -916 12245 3177 -11215 -3144 12465 5049 -10682 -5093 11440 6996 -9897
2273 -9897 -6460 10666 8398 -8643 -7771 8819 9124 -7117 -8730 6834 9884 -4830 -9197 4619
2287 4619 9373 -2649 -9099 2125 8959 -555 -8650 -823 8380 1935 -7717 -3375 7006 4498
2301 4498 -6467 -6120 5433 6947 -4822 -8405 3598 8982 -3280 -10065 1857 10435 -1755
2314 -1755 -11794 -364 10930 315 -12343 -2156 11435 2018 -12576 -3866 11250 3614 -12022
2327 -12022 -5799 10319 5328 -11001 -7081 8751 6779 -9390 -8381 6925 7397 -7333 -9118
2340 -9118 4940 8360 -4561 -9390 2678 8757 -2411 -9433 259 8743 535 -9231 -2449 8356
2354 8356 3280 -8402 -4742 7653 5635 -7620 -6687 6880 7621 -6158 -8468 5908 8981 -4675
$$ packed form
2260I23j2039J0200J3161r068j4392Q071J5609p416j5731N589J6533m444j6893
2273i897L437J7126k268j7041Q72J6590L05j6241j613J5564L050j4714m367J3816
2287D619M754j2022o450J1224O834r514q095P827R203o445r652M342J0381k508
2301D498j0965L47J1553J514j1769l583J2003N384j2262o785J1922Q578j2190
2314a755j0039J1430J1294j0615j2658J0187J3591r417j4594Q710J5116p636j5636
2327a2022O223J6118m991j6329L920J5832j972j6169J009J5306M72j4730j785
2340i118J4058L420j2921m829J2068O079j1168p022R692Q484q208r766O782J0805
2354H356n076j1682L660J2395k018j3255R33J3567P41j3779k310J4376L073j3656
$$ plain form
2368 -4675 -9343 4080 9901 -2651 -9811 2821 10854 -1175 -10064 885 11008 981 -9454
2381 -9454 -995 10076 2727 -8530 -2719 8727 4767 -7179 -4745 7189 6283 -5315 -6055 5482
2395 5482 7942 -3514 -7472 3228 9050 -1160 -8556 1440 9600 460 -9173 -1079 9861 2960
2409 2960 -9086 -2976 10052 4979 -9276 -5433 9342 6770 -8567 -6938 8537 7824 -7433
2422 -7433 -7776 7039 8577 -6148 -8908 5067 9440 -4517 -9571 3025 9068 -2138 -9032 1168
2436 1168 9187 -458 -9279 -1001 7846 1732 -8136 -3552 6869 3770 -7016 -5197 5341 5462
2450 5462 -5836 -7331 3786 6699 -4058 -8572 1812 8302 -2072 -9500 -281 8967 102 -9821
2464 -9821 -1850 8960 1712 -9766 -3830 8633 3447 -9369 -5199 8191 4773 -8237 -6463
$$ packed form
2368d675m668J3423N821j2552p160J2632Q033j2029q889J0949J0123j0027j0435
2381i454Q459J1071p349j1257N811J1446l960j1946K434J1934r06j1598p40J1537
2395E482K460j1456l958J0700N822j0210p396R996Q160r140r633Q094J0940o901
2409B960j2046O110J3028n073j4255L843J4775k572j5337J629J5475p13j5257
2422g433l43J4815J538j4725k760J3975M373j3957n054J2596O043j1206o894J0200
2436A168Q019r645q821Q278Q847o114r868M584J0421l099j0786J819J0538J21
2450E462j1298j495J1117K913j0757m514J0384O490j0374p428R219R248q865r923
2464i821P971J0810p248j1478N936J2463n186j2816M170J3390l418j3010J774
$$ plain form
2477 -6463 6751 6343 -6783 -7258 5364 7484 -4945 -7839 3599 7917 -3181 -8321 1577 8154
2491 8154 -836 -8200 -195 8042 1294 -7853 -2048 7504 3412 -6784 -3712 7156 5158 -5784
2505 -5784 -5215 5952 6724 -4802 -6728 4809 7845 -3441 -7697 3442 9285 -1677 -8100 2053
2519 2053 9146 -93 -8435 328 9398 1584 -8222 -853 9152 3074 -7701 -2833 8139 4454
2533 4454 -6454 -4122 6251 5800 -5240 -5452 5078 6553 -3860 -6434 3339 7398 -2140 -6966
2547 -6966 1801 7999 -226 -7739 -415 7698 1329 -7897 -2441 7469 2943 -7598 -3802 6625
2561 6625 4593 -6457 -5314 5699 5780 -5418 -6474 4238 6462 -4356 -7678 3370 7309 -2570
2575 -2570 -8213 1215 7542 -1230 -8315 -643 6966 326 -8080 -2096 7013 2095 -7336 -3766 5945
$$ packed form
2477f463J3214m08j3126m75J2622K120j2429k894J1438M318j1098n140R898O577
2491H154q990p364Q005Q237o748r147N805R552m092j0196L072J0868j998j0942
2505e784N69J1167P72j1526j926J1537L036j1286m256J1139N843j0962o423J0153
2519B053P093r239q342Q763R070p814r806P369J0005o078j0775M868J0972l685
2533D454j0908K332J0373m51j1040k12J0530J475j0413k574R773M059r538m826
2547f966Q767O198q225p513P324Q113o369r226N456R910m526j0541L796J0427
2561F625k032j1050J143J1013Q1j1198j056J0712K224j0818l322J1048L939r879
2575b570n643R428O327q772p085P672P609o640q406N984R109m918r431L570R711
$$ plain form
2590 5945 3681 -6603 -5558 5065 5017 -5425 -6422 3744 6262 -3880 -7664 2541 6780 -2460
2604 -2460 -8225 1131 7781 -714 -8084 -732 7824 1077 -7862 -2521 7248 2586 -7375 -3328 7090
2619 7090 3741 -6187 -4529 5962 5084 -5319 -5331 4833 6290 -3688 -6292 3586 6959 -1944 -7095
2634 -7095 2065 7245 -495 -6993 241 7487 1133 -6583 -1083 7437 2547 -5919 -2690 6645 4147
2649 4147 -5239 -4086 5625 5872 -3974 -5024 4330 6676 -2822 -6285 3034 7056 -1487 -6449 1371
2664 1371 8061 609 -6736 -291 7266 1864 -6787 -1903 7003 3511 -6497 -3449 6755 4710
2678 4710 -5498 -5390 5526 5560 -4837 -5953 4088 6856 -3434 -7174 2592 7310 -2146 -7515
2692 -7515 1184 7200 -903 -7281 -343 7131 560 -7282 -1837 6218 1595 -7088 -3171 5549 2669
$$ packed form
2590E945k264j0284J045J0623m8j0442r97J0166K518j0142l784J0205M239r240
2604b460n765R356O650q495p370P352Q556o747q939N341R769m662r961M047J0418
2619G090l349r928J658J0491q78j0403j2J0164J457r978k604R878L373q903n151
2634g095R160N180p740o498P234P246o354p716N500Q520m890q466L229R335k498
2649D147r386J153R711K47r846j050R354K346r498l463R319M022q543m962P820
2664A371O690p452p345O445P557n402q651M884Q906l492j0008L048J0204k045
2678D710j0208J08J0916L4j0397j116J0041K768j0290l740R766M718r456n369
2692g515Q699O016q103o378O938P474o571p842N445Q055m623q683L917Q720k880
$$ plain form
2707 2669 -5800 -4239 4667 3910 -4649 -5019 3184 4564 -3716 -5747 2097 4963 -2025 -6098 522
2722 522 5199 -466 -6132 -1445 5059 968 -6141 -2528 5207 2420 -5546 -4065 4638 3765 -5064
2737 -5064 -5096 3811 4766 -3806 -5851 3178 5913 -2653 -6196 1982 6335 -1718 -6671 1166 6416 -421
2753 -421 -6624 -273 6326 998 -6092 -1437 6294 2456 -5533 -2998 5656 3716 -4730 -3424 4784
2768 4784 4937 -3674 -4737 3984 5585 -2933 -5505 3046 6542 -1596 -5996 1500 6951 -280 -6107
2783 -6107 250 6990 1039 -6100 -778 6880 2361 -5620 -1912 5902 3302 -4999 -2995 5340 3880
2798 3880 -4101 -3790 4189 4632 -2814 -4355 2623 4916 -1658 -4876 926 4863 -60 -4700 -318
2813 -318 4815 1337 -5024 -1805 4372 2566 -4646 -3647 4028 3995 -3858 -4661 3463 5079 -3122 -6096
$$ packed form
2707B669q469J561Q906p57q559l70Q203J380q280k031P844K866o988m073O620
2722E22M677n665n666M687O504m091p109L613P735k787p966J481Q703q73q829
2737e064l2Q907R55q572k045R029K735q566l543Q178M353q053m953P837N250o837
2753d21o203O351O599n328p090M655P731l838p989K535Q654j940q446J306Q208
2768D784J53q611j063Q721J601q518k572Q551L496q138m400P496N451p231n827
2783f107O357O740n951p139N322P658m519p981L708P814k600q301K004Q335j460
2798C880p981L11P979M43p446j541O978K293o574l218N802L937m923m640M382
2813c18N133l478o361L219O177j806p212R99P675l3p853q03Q124J616q201k974
$$ plain form
2829 -6096 2408 5886 -2702 -6776 1217 6370 -1477 -7271 324 6434 -626 -7480 -567 6256 399
2844 399 -6936 -1739 6096 1369 -6707 -2392 5588 2086 -6004 -3262 4603 2974 -4673 -4463 3562
2859 3562 3456 -3412 -4423 1928 4066 -2168 -4936 1206 4267 -568 -4916 -447 4560 1100 -4775
2874 -4775 -1604 4569 2411 -4500 -3002 4319 3645 -4104 -3958 4041 4356 -2667 -4502 2771 5160 -1983
2890 -1983 -4923 1826 5629 -1008 -5003 1058 5681 38 -4993 -217 5465 1328 -4935 -1348 5215
2905 5215 2671 -4257 -2273 4497 3731 -3424 -3408 3485 4505 -2306 -4336 2472 5413 -1578 -4995 1232
2921 1232 5732 -264 -5339 166 6045 875 -5157 -518 6134 1414 -5474 -1645 5686 2443 -4897
2936 -4897 -2446 4895 3136 -4513 -2972 4514 3234 -3692 -3251 3444 3518 -2888 -3892 2274 3802 -2255
$$ packed form
2829f096Q504L478q588m074P993N153p847n794P595O110p060o854O913O823n857
2844C99p335N197P835m727q076M315P980l502q090K742P865j629p647K10Q025
2859C562j06o868j011O351K138o234k768O142L061m835m348M469N007l460n875
2874d775L171O173k158o911J498P321o74p749J46P999L15p023j835P273K389p143
2890a983k940O749L803o637l995O061M623n643n031M776N682m137o263L587O563
2905E215k544o928J984O770p66p155J6O893J020o811k030O808K941o991l417O227
2921A232M500n996n075N505N879n170o032M639O652m720o888L829P331l243p340
2936d897K451P341j759p649J541P486j280o926M41O695P4o406j004O166J528o057
$$ plain form
2952 -2255 -3933 1099 3611 -765 -3685 -489 3507 436 -3461 -1464 2823 1381 -3110 -2954 2194
2967 2194 2579 -2588 -3830 1287 3679 -1975 -4662 1222 4502 -1415 -5445 18 4724 -706 -5755
2982 -5755 -415 4991 429 -5670 -1489 5205 1068 -5685 -2287 4656 1531 -5083 -2561 4314 2303
2997 2303 -4699 -3159 3414 2935 -3887 -3481 2711 3635 -2182 -3994 1798 4233 -981 -3917 597 4150
3013 4150 46 -3967 -435 3940 1021 -3694 -1190 3885 2179 -3510 -2299 3588 3073 -3037 -3022 3290
3029 3290 4152 -2005 -3469 2305 4534 -1624 -4098 1940 4609 -757 -4071 955 4638 311 -4129
3044 -4129 175 4695 1071 -3146 -862 3806 1610 -3035 -1551 3638 2867 -2415 -2343 2355 3212 -1677
3060 -1677 -3179 1322 3926 -565 -3777 350 4239 -38 -3975 -688 4347 1148 -4642 -1582 4319
$$ packed form
2952b255j678N032K512m376k920L196L996l071l897J997M287j442m491J56N148
2967B194L85n167j242N117K392n654k687N884L280n917m030N463M706n430n049
2982e755N340N406m562o099M181O694m137o753L398O943l125o614K522O875k011
2997B303p002J540O573m79o822M06O192R24n817j812N792K435n214k936M514L553
3013D150m104m013L532M375k919m715K504N075j706n689J211N887n15o110J5O312
3029C290Q62o157j464N774K229o158k474O038K669n366l314N026L683m327m440
3044d129M304M520l624m217K284M668k196m645J484N189p71n282P2M698Q57m889
3060a677j502M501K604m491l212M127L889m277l937L287N035l199n790L060N901
$$ plain form
3075 4319 1815 -4586 -2082 4249 2541 -4294 -3078 3778 2396 -3981 -3541 3291 3370 -3149 -3768 2401
3091 2401 3621 -2423 -4129 1077 3336 -1851 -4010 419 3114 -413 -3829 -333 2858 231 -3562
3106 -3562 -1360 2531 990 -2580 -1875 2020 2407 -2380 -3227 1022 2741 -1575 -3788 511 3563 -758
3122 -758 -4089 163 3779 -58 -4242 -761 3867 482 -4462 -1528 3928 1810 -3650 -2055 3616
3137 3616 1852 -3510 -2595 2990 2758 -2773 -2525 2555 3483 -1623 -2933 1918 3445 -1187 -2930 1214
3153 1214 3416 -137 -3203 74 3474 900 -2763 -884 3165 1763 -2530 -1583 3119 2678 -2222
3168 -2222 -2148 2881 3221 -1663 -2814 2134 3512 -1429 -3098 1557 3942 -651 -3384 1085 3604 5
3184 5 -3479 158 3808 405 -3225 -297 3275 909 -2823 -1145 2688 1637 -2659 -2030 2425 1891
$$ packed form
3075D319k504o401K504O331j708o835J216O856j382o377M40O832P9o519o19O169
3091B401J220o044j706N206K259n187k159M429K695l527l416L496L191k627l793
3106c562K202L891j541l570P05L895L87m787q47M249J719m316k213M299L052m321
3122g58l331M252L616l837m184L481M628l385m944K934N456k118n460J595N671
3137C616j764n362R15N585k32n531K48N080R28n106j310M851J527m632j743M144
3153A214K202l553l066L277L400k574l663J879M049j402m293R47M702m41m900
3168b222P4N029L40m884j151M948J378m941j669M655K385m593k733M469K519l599
3184El484L637L650l403l630K928L572k366l732J678L833j051m296O29M455n34
$$ plain form
3200 1891 -1979 -2116 1598 2200 -1290 -2898 646 2509 -709 -3333 24 2850 111 -2937 -691
3215 -691 2694 653 -2951 -1633 2734 809 -3188 -2108 2425 1995 -2737 -2618 1728 2300 -2469 -3105
3231 -3105 1578 2348 -2055 -3453 1004 2666 -1003 -3262 544 2849 -557 -3434 -547 2736 32
3246 32 -2934 -1092 2361 973 -2726 -1563 2238 1275 -2026 -2272 1463 2156 -1586 -2547 1290 2617
3262 2617 -821 -2997 209 2768 -406 -2957 136 3563 405 -2902 -578 3155 1172 -3065 -1238
3277 -1238 2982 1719 -2631 -1362 2623 1975 -2121 -1651 2545 2434 -1352 -2076 1865 2701 -733 -2316
3293 -2316 1047 2868 -109 -2295 499 2774 255 -2304 -82 2723 1156 -1800 -911 2421 1726
3308 1726 -1625 -1364 1907 1773 -1255 -2018 1670 2389 -621 -2076 1344 2777 -571 -2556 -2 3073
$$ packed form
3200A891l870j37L714O02l490j608L544J863l218k624L357K826k739l048K246
3215f91L385k041l604J318M367j925l997J080M533m30m732J19M346N72m769o36
3231c105M683P70m403j398M457J662l669k259L806K305l406k877K887L283k704
3246C2k966J842L453j388l699J163L801r63l301k46L735O93l742r61L837J327
3262B617l438k176L206K559l174k551L093L427l158l307K324L733j983m237J827
3277a238M220j263m350J269L985o48m096M70M196j11l786p24L941Q36l434j583
3293b316L363J821k977k186K794K275k519k559K222K805j567k956Q89L332o95
3308A726l351K61L271j34l028p63L688P19l010j455L420J433l348j985K554L075
$$ plain form
3324 3073 -18 -2921 -218 2632 634 -2811 -1075 2622 1032 -2691 -1723 2308 1685 -2481 -1889 1955
3340 1955 1898 -1895 -2463 1616 2104 -1593 -2768 976 2394 -884 -2754 25 2443 -441 -2645 -538
3356 -538 2385 -89 -2962 -845 2000 733 -2635 -1188 1704 1110 -2263 -1701 1562 1351 -1949 -2120
3372 -2120 1068 2012 -1205 -2241 525 2018 -835 -2823 20 2200 97 -2486 -232 1793 647
3387 647 -1986 -1076 2066 1037 -2133 -1339 1774 1602 -1513 -1322 1602 1997 -1084 -2167 1242 2331
3403 2331 -699 -2302 694 2770 -215 -2137 207 2678 422 -2148 -268 2554 1000 -2118 -968
3418 -968 2681 1599 -1815 -843 2222 1805 -1510 -1339 1924 2328 -1267 -1512 1508 2457 -509 -1862 1128
3435 1128 2516 -419 -1839 336 2206 165 -2065 -207 2306 600 -1845 -610 2190 827 -2111
$$ packed form
3324C073l091k903K703K850j998l445J736L697j590l723R68M031o23m166N92L844
3340A955n7l793n68M079M88l697j175L744J418l278j870K779K418k884k204K107
3356e38K923k474k873K117K845j267l368J447K892n94l373N62L263k11l300j71
3372b120L188R44l217j036K766J493k853j988K843K180k103k583K254K025j146
3387F47k633R10L142j029l170P94L113j72l115J91K924L95l081j083L409J089
3403B331l030j603K996K076k985j922K344K471k256k570J880K822j554l118J150
3418i68L649j082l414R72L065m17l315J71L263M04l595k45L020R49k966j353K990
3435A128J388k935j420K175J870k041k230J858K513j706k445J235K800j363k938
$$ plain form
3450 -2111 -722 1603 1336 -1295 -1057 1478 1446 -895 -1580 676 1567 -1117 -1732 442 1558 -83 -1895
3467 -1895 -438 1237 220 -1914 -955 1274 759 -1632 -1165 1321 1206 -1437 -1766 867 1512 -1456
3483 -1456 -2244 620 2187 -934 -2613 262 2359 -786 -2836 183 2110 -287 -2800 -201 2275
3498 2275 248 -2849 -819 2068 203 -2398 -1164 1731 750 -2448 -1194 1651 1069 -1808 -1449 1211
3514 1211 1261 -1168 -1646 773 1545 -828 -1712 433 1710 169 -1654 -90 1665 248 -1557 -364
3530 -364 1452 933 -1424 -605 1382 1514 -1000 -1344 1183 1606 -702 -1564 834 1807 -124 -1460 578
3547 578 2225 173 -1734 261 2269 641 -1634 -419 2139 893 -1543 -424 1946 1194 -1493
3562 -1493 -1412 1777 1624 -974 -1428 1119 2063 -671 -1583 555 1683 -284 -1867 574 1966 114
$$ packed form
3450b111J389K325k67k631K38K535l2k341o85K256Q91k684o15K174J116j641j812
3467a895J457J675j017k134R59K229n15k391M67K486j15k643l29K633O45k968
3483a456p88K864J567l121j679K875K097l145k050L019J927k397k513K599K476
3498B275k027l097K030K887j865k601J234K895r81l198J254K845n82k877L59K660
3514A211N0k429m78K419P72k373q84K145J277j541j823J564J755j417j805J193
3530c64J816n19k357Q19J987J32k514l44K527M23k308q62K398R73j931j336K038
3547E78J647k052j907J995K008j628k275J215K558j246k436J119K370p52k687
3562a493Q1L189j53k598m54K547R44k734r12K138J128j967j583K441J392j852
$$ plain form
3578 114 -1895 -343 2182 272 -1935 -501 1985 526 -2358 -700 2011 1177 -1800 -1125 1630 1294
3594 1294 -1457 -1519 1314 1485 -1629 -1681 1020 1310 -1031 -1369 479 963 -687 -1459 83 1044 -251
3611 -251 -1463 -352 983 221 -912 -746 565 848 -1166 -1320 340 1011 -599 -1812 71 1387
3627 1387 -125 -2179 -262 1575 -215 -2071 -700 1761 268 -2335 -888 1960 703 -2152 -1344
3642 -1344 2038 1073 -2011 -1240 1705 1573 -1727 -1578 1437 1485 -1221 -1225 1215 1604 -807 -1353 1189 1520
3660 1520 -514 -1403 460 1486 20 -1126 -82 1533 541 -1278 -165 1515 781 -847 -809 1388
3676 1388 1036 -710 -804 936 1696 -443 -1179 765 1584 -477 -1375 564 1833 -46 -1519 224 1834
3693 1834 598 -1270 -30 1755 709 -1365 -432 1776 713 -1051 -685 1342 1139 -571 -1041 857
$$ packed form
3578A14k009J552K525j910k207J434K486j459k884J658K711q34k977O75K755l36
3594A294k751o2K833J71l114n2K701K90k341l38J848M84j650p72J542R61j295
3611b51j212J111J335p62j133J66J311K83k014j54J660O71j610j213J883J316
3627A387j512k054J917J837j790j856J371K461j493k603J447K848j257k855Q08
3642a344L382r65l084P71K945j32l300J49L015M8k706mK440L89k411n46K542L31
3660A520k034q89J863J026j466j146J044J615r92j819J113J680p34j628L8K197
3676A388l52j746r4J740P60k139p36J944Q19k061q98J939J269j879j473J743J610
3693A834j236j868J240J785j046k074R33K208j063j764L66K027k03j710m70J898
$$ plain form
3709 857 1129 -361 -1436 370 1576 -254 -1517 -84 1475 255 -1559 -267 1535 676 -1811 -1115
3725 -1115 1684 890 -1879 -1400 1161 1277 -1732 -1533 1202 1499 -1834 -1978 1066 1483 -1063 -1978 807
3742 807 1667 -1083 -1962 361 1410 -932 -1791 -29 1230 -241 -1634 -181 1028 5 -1401 -526
3758 -526 749 583 -1142 -844 452 774 -783 -1018 -36 1199 -568 -1391 -131 1189 286 -1597 -322
3775 -322 1459 755 -1688 -944 1409 694 -1568 -1231 1540 1061 -1329 -975 1257 1610 -910 -1471 1235
3792 1235 1586 -883 -1496 1076 1587 -397 -1434 713 1558 -136 -1131 203 1715 306 -1372 -273
3808 -273 1553 590 -980 -483 1143 1097 -862 -836 1132 1134 -693 -830 1205 1682 -179 -1259 343 1792
3826 1792 -135 -1527 354 1830 39 -1559 -75 2249 251 -1496 -462 1628 600 -1384 -714
$$ packed form
3709H57K72j490j075J806J206j830j263J433J559j220j814J292J802q59k487O96
3725a115K799p94k769M79K561J16l009J99K735K97l333j44L044M17k546r15K785
3742H07Q60k750q79K323J049k342q59J762J259j471j393J453J209j023j406Q75
3758e26J275j66j725K98J296L22j557k35R82J235j767q23J260J320r03j883J275
3775c22J781p04k443P44K353p15k262L37K771m79k390L54K232L53k520n61K706
3792A235L51k469o13K572N11j984j037K147Q45j694r95J334J512j409j678J099
3808b73J826r63j570M97J626m6j959K6J968Kj827j37K035M77j861j080J602J449
3826A792j927j392J881J476j791j598J484K324j998j747J034K090j028j984O70
$$ plain form
3841 -714 1259 708 -979 -835 1102 1045 -706 -1459 543 1085 -658 -1389 255 1267 -335 -1349 -223
3858 -223 1269 118 -1337 -718 919 540 -1110 -1070 983 1016 -1172 -1303 824 999 -1336 -1793 740
3875 740 1363 -730 -1728 310 1689 -759 -1761 212 1529 -540 -1900 -191 1529 -206 -1661 -604
3891 -604 1551 411 -1897 -402 1131 352 -1316 -773 848 717 -931 -728 576 1002 -926 -1126 307
3908 307 1137 -433 -1473 406 1652 -23 -1039 -149 1292 710 -1246 -556 1526 923 -1176 -729 1460
3925 1460 1305 -895 -514 1266 1461 -814 -1305 996 1565 -496 -1182 847 1641 -377 -1528 336 1738
3942 1738 -84 -1153 153 1510 386 -1294 82 1430 530 -1004 -340 1255 603 -806 -588 1117
3958 1117 1097 -718 -941 659 1398 -347 -1386 343 1551 -96 -1221 -103 1702 231 -1241 -429
$$ packed form
3841g14J973n51j687J44J937n7j751p53K002N42j743p31J644J012j602j014J126
3858b23J492j151j455O19J637l79j650M0K053L3k188j31K127J75k335m57K533
3875G40O23k093r98K038J379k448j002J973J317k069j360J709J720j735j455J057
3891f04K155j140k308J495J533p79j668N43J621j31j648K03J304M26j928k00J433
3908C07Q30j570j040J879J246j675j016Q90J441n82j956O90K082o03k099M47K189
3925A460j55k200L81J780J95k275m91K301N69k061o86K029P94k018j151J864J402
3942A738j822j069J306J357j124j680J376J348r00j534O64J595o52j409K18J705
3958A117k0j815k23J600P39j745j039J729J208j647j125J118J805j471j472Q12
$$ plain form
3974 -429 1461 569 -1686 -599 1340 765 -1491 -965 1193 975 -1310 -1448 1115 1189 -1065 -1428 973
3991 973 1161 -1197 -1682 56 1267 -508 -1786 -326 1038 -309 -1680 -314 1162 263 -1807 -626
4007 -626 1045 453 -1152 -1006 700 808 -1100 -1160 851 1016 -1106 -1444 288 1357 -440 -1422 343
4024 343 913 -139 -1584 -115 1619 193 -1172 -300 1132 299 -1576 -572 1134 1027 -964 -759
4040 -759 1166 889 -1060 -930 602 1287 -611 -1153 471 1443 -42 -1220 197 1685 251 -1525
4056 -1525 40 1605 550 -962 34 1411 1123 -1368 -689 1542 1198 -718 -811 1332 1640 -880 -923
4073 -923 1125 1753 -461 -1238 599 1688 -429 -1154 560 1716 231 -1420 -44 1679 153 -1129
4089 -1129 -192 1448 398 -1152 -327 1388 1070 -1126 -1237 1194 1026 -677 -951 368 1286 -421 -1059
$$ packed form
3974d29J890q92k255J087J939n75k256N26K158k18k285j38K563P4k254l63K401
3991I73J88k358m85J738J211j775j278J460J364j347j371J366J476q99k070J181
4007f26J671n92j605J46J706J08j908o0K011J65k122l38J732J069j797r82J765
4024C43N70j052j445J469J734j426j365Q72J432q33j875J004J706j07j991K05
4040g59J925k77j949J30J532O85j898n42J624R72j485j178J417J488j434j776
4056a525J565J565j055j512R96J377k88k491O79K231l44j916r3K143L08k520m3
4073i23K048O28k214p77J837J089k117p25J714J156j485j651J376J723j526j282
4089a129R37J640j050j550Q25J715l18k196j11K431j68j703k74J319R18j707o38
$$ plain form
4106 -1059 80 1391 -212 -1318 140 1328 -205 -1243 -345 1194 96 -1196 -439 1023 522 -1080
4122 -1080 -1076 810 804 -1339 -1201 330 1036 -558 -1654 361 1133 -599 -1609 47 1452 -320 -1515
4139 -1515 123 1038 203 -1599 -370 1318 433 -1661 -452 1235 802 -1462 -1071 1334 731 -1154
4155 -1154 -980 1297 954 -883 -1469 512 1284 -876 -1757 527 1175 -373 -1342 111 1452 -79 -1049
$$ packed form
4106a059J139J311j603j106J458J188j533j038Q98J539j098j292P57J462n01j602
4122a080MJ886ok143J38J531P06j594j096K015P72j732j010J656J405j772j195
4139a515J638R15q35j802J229J688q85k094J209J687m33k264L91K405o03j885
4155a154J74K277l43j837n86J981P72k160q81K284O48j548r69J453J341j531r70
$$ [...]
8191F2
##END NTUPLES=NMR FID
##END=
