##TITLE=1H_IBA1508-1
 CDCl3
 8 sc, 
 16.8.2024
##JCAMPDX= 6.0         $$ Bruker NMR JCAMP-DX V2.0
##DATA TYPE= NMR FID
##DATA CLASS= NTUPLES
##ORIGIN= UXNMR, Bruker Analytische Messtechnik GmbH
##OWNER= root
$$ XWIN-NMR		Version 3.5
$$ Fri Aug 16 13:55:54 2024 Russian Standard Time (UT+4h)  she@DPX200
##.OBSERVE FREQUENCY= 200.1318
##.OBSERVE NUCLEUS= ^1H
##.DELAY= (6, 6)
##.ACQUISITION MODE= SIMULTANEOUS
##.ACQUISITION SCHEME= undefined
##.AVERAGES= 8
##.DIGITISER RES= 18
##SPECTROMETER/DATA SYSTEM= spect
##.PULSE SEQUENCE= zg30
##.SOLVENT NAME= Acetone
##.SHIFT REFERENCE= (INTERNAL, Acetone, 0, 15.7039)
##AUDIT TRAIL= $$ (NUMBER, WHEN, WHO, WHERE, WHAT)
$$ ##TITLE= Audit trail, XWIN-NMR		Version 3.5
$$ ##JCAMPDX= 5.01
$$ ##ORIGIN= Bruker BioSpin GmbH
$$ ##OWNER= she
$$ F:/spectra/data/she/nmr/H-F/1/audita.txt
$$ ##AUDIT TRAIL=  $$ (NUMBER, WHEN, WHO, WHERE, WHAT)
(   1,<2024-08-16 13:54:50.73 +0400>,<she>,<DPX200>,
      <created by zg, POWCHK disabled, PULCHK disabled
       configuration hash MD5:
       00 E9 B6 7A A2 85 ED C7 34 08 36 98 17 FE 4E 26
       data hash MD5: 16K
       F0 07 5B C9 F6 E7 70 7A F2 89 C8 A2 D0 20 CD 01>)
$$ ##END=
$$ 
$$ hash MD5
$$ 10 E9 F3 D9 90 40 FA CD 4A 7A 06 88 D6 A5 8A D3
##$RELAX= 
##$RELAX= 
##$RELAX= 
##$RELAX= 
##$RELAX= 
##$RELAX= 
$$ Bruker specific parameters
$$ --------------------------
##$DU= <F:/spectra>
##$EXPNO= 1
##$NAME= <H-F>
##$PROCNO= 1
##$TYPE= <nmr>
##$USER= <she>
##$AMP= (0..31)
100 100 100 100 100 100 100 100 100 100 100 100 100 100 100 100 100 100 
100 100 100 100 100 100 100 100 100 100 100 100 100 100 
##$AQSEQ= 0
##$AQ_mod= 1
##$AUNM= <au_zg>
##$AUTOPOS= <>
##$BF1= 200.13
##$BF2= 200.13
##$BF3= 200.13
##$BF4= 200.13
##$BF5= 200.13
##$BF6= 200.13
##$BF7= 200.13
##$BF8= 200.13
##$BYTORDA= 1
##$CFDGTYP= 0
##$CFRGTYP= 5
##$CHEMSTR= <none>
##$CNST= (0..31)
1 1 145 1 1 1 1 1 1 1 1 1 1 1 1 1 1 1 1 1 1 1 1 1 1 1 1 1 1 1 1 1 
##$CPDPRG= <>
##$CPDPRG1= <>
##$CPDPRG2= <>
##$CPDPRG3= <>
##$CPDPRG4= <mlev>
##$CPDPRG5= <mlev>
##$CPDPRG6= <mlev>
##$CPDPRG7= <mlev>
##$CPDPRG8= <mlev>
##$CPDPRGB= <>
##$CPDPRGT= <>
##$D= (0..31)
0 1.2 0 0 0 0 0 0 0 0.06 0 0.03 0 0 0 0 0.0002 0 0 0 0 0 0 0 0 0 0 0 0 
0 0 0 
##$DATE= 1723802090
##$DBL= (0..7)
120 120 120 120 120 120 120 120 
##$DBP= (0..7)
150 150 150 150 150 150 150 150 
##$DBP07= 0
##$DBPNAM0= <>
##$DBPNAM1= <>
##$DBPNAM2= <>
##$DBPNAM3= <>
##$DBPNAM4= <>
##$DBPNAM5= <>
##$DBPNAM6= <>
##$DBPNAM7= <>
##$DBPOAL= (0..7)
0.5 0.5 0.5 0.5 0.5 0.5 0.5 0.5 
##$DBPOFFS= (0..7)
0 0 0 0 0 0 0 0 
##$DE= 6
##$DECBNUC= <off>
##$DECIM= 24
##$DECNUC= <off>
##$DECSTAT= 4
##$DIGMOD= 1
##$DIGTYP= 9
##$DL= (0..7)
0 120 120 120 120 120 120 120 
##$DP= (0..7)
150 150 150 150 150 150 150 150 
##$DP07= 0
##$DPNAME0= <>
##$DPNAME1= <>
##$DPNAME2= <>
##$DPNAME3= <>
##$DPNAME4= <>
##$DPNAME5= <>
##$DPNAME6= <>
##$DPNAME7= <>
##$DPOAL= (0..7)
0.5 0.5 0.5 0.5 0.5 0.5 0.5 0.5 
##$DPOFFS= (0..7)
0 0 0 0 0 0 0 0 
##$DQDMODE= 0
##$DR= 18
##$DS= 0
##$DSLIST= <SSSSSSSSSSSSSSS>
$$ [...]
##$SUBNAM2= <"">
##$SUBNAM3= <"">
##$SUBNAM4= <"">
##$SUBNAM5= <"">
##$SUBNAM6= <"">
##$SUBNAM7= <"">
##$SUBNAM8= <"">
##$SUBNAM9= <"">
##$SW= 24.0689170037331
##$SWIBOX= (0..15)
0 0 2 0 0 0 0 0 0 0 0 0 0 0 0 0 
##$SW_h= 4816.95568400771
##$TD= 16384
##$TD0= 1
##$TE= 0
##$TE2= 300
##$TE3= 300
##$TEG= 300
##$TL= (0..7)
0 120 120 120 120 120 120 120 
##$TP= (0..7)
150 150 150 150 150 150 150 150 
##$TP07= 0
##$TPNAME0= <>
##$TPNAME1= <>
##$TPNAME2= <>
##$TPNAME3= <>
##$TPNAME4= <>
##$TPNAME5= <>
##$TPNAME6= <>
##$TPNAME7= <>
##$TPOAL= (0..7)
0.5 0.5 0.5 0.5 0.5 0.5 0.5 0.5 
##$TPOFFS= (0..7)
0 0 0 0 0 0 0 0 
##$TUNHIN= 0
##$TUNHOUT= 0
##$TUNXOUT= 0
##$USERA1= <user>
##$USERA2= <user>
##$USERA3= <user>
##$USERA4= <user>
##$USERA5= <user>
##$V9= 5
##$VALIST= <valist>
##$VCLIST= <CCCCCCCCCCCCCCC>
##$VD= 0
##$VDLIST= <DDDDDDDDDDDDDDD>
##$VPLIST= <PPPPPPPPPPPPPPP>
##$VTLIST= <TTTTTTTTTTTTTTT>
##$WBST= 1024
##$WBSW= 4
##$XGAIN= (0..3)
0 0 0 0 
##$XL= 0
##$YL= 0
##$YMAX_a= 774475
##$YMIN_a= -743220
##$ZGOPTNS= <>
##$ZL1= 120
##$ZL2= 120
##$ZL3= 120
##$ZL4= 120
##$ABSF1= 10
##$ABSF2= 0
##$ABSG= 5
##$ABSL= 3
##$ALPHA= 0
##$AQORDER= 0
##$ASSFAC= 0
##$ASSFACI= 0
##$ASSFACX= 0
##$ASSWID= 0
##$AUNMP= <proc_1d>
##$AZFE= 0.1
##$AZFW= 0.1
##$BCFW= 1
##$BC_mod= 2
##$BYTORDP= 1
##$COROFFS= 0
##$CY= 11.3945322036743
##$DATMOD= 1
##$DC= 2
##$DFILT= <>
##$DTYPP= 0
##$F1P= 15.6554695791079
##$F2P= 12.8336369535428
##$FCOR= 0.5
##$FTSIZE= 0
##$FT_mod= 4
##$GAMMA= 1
##$GB= 0.15
##$INTBC= 1
##$INTSCL= 1
##$ISEN= 128
##$LB= 0.24
##$LEV0= 0
##$LPBIN= 0
##$MAXI= 10000
##$MC2= 0
##$MEAN= 0
##$ME_mod= 0
##$MI= 1.114404
##$NCOEF= 0
##$NC_proc= 0
##$NLEV= 6
##$NOISF1= 3.799351
##$NOISF2= 2.8
##$NSP= 1
##$NTH_PI= 0
##$NZP= 0
##$OFFSET= 15.70392
##$PC= 1
##$PHC0= -26153.13
##$PHC1= 12.18748
##$PH_mod= 1
##$PKNL= yes
##$PPARMOD= 0
##$PSCAL= 0
##$PSIGN= 0
##$REVERSE= no
##$SF= 200.130013532006
##$SI= 16384
##$SIGF1= 3
##$SIGF2= 2
##$SINO= 400
##$SIOLD= 16384
##$SREGLST= <1H.CDCl3>
##$SSB= 0
##$STSI= 0
##$STSR= 0
##$SW_p= 3612.71676300578
##$SYMM= 0
##$S_DEV= 0
##$TDeff= 0
##$TDoff= 0
##$TI= <>
##$TILT= no
##$TM1= 0
##$TM2= 0
##$TOPLEV= 0
##$USERP1= <user>
##$USERP2= <user>
##$USERP3= <user>
##$USERP4= <user>
##$USERP5= <user>
##$WDW= 1
##$XDIM= 8192
##$YMAX_p= 0
##$YMIN_p= 0
$$ End of Bruker specific parameters
$$ ---------------------------------
##NTUPLES= NMR FID
##VAR_NAME=  TIME,          FID/REAL,        FID/IMAG
##SYMBOL=    X,             R,               I
##VAR_TYPE=  INDEPENDENT,   DEPENDENT,       DEPENDENT
##VAR_FORM=  AFFN,          ASDF,            ASDF
##VAR_DIM=   8192,          8192,            8192
##UNITS=     SECONDS,       ARBITRARY UNITS, ARBITRARY UNITS
##FACTOR=    0.0002076,     1,               1
##FIRST=     0,             0,               0
##LAST=      1.7004516,     0,               0
##MIN=       0,             -743220,         0
##MAX=       1.7004516,     774475,          0
$$ Real data points
##PAGE= N=1
##DATA TABLE= (X++(R..R)), XYDATA
0@%%%%Qk3L2l5M1n1P0r8J27j55J85k20K65l26L98m71N47o36P42q68J009j157J318
27G02j501J708j943K200k477K780l113L482l892M345m834N364n946O588p302Q091
43D252q955R907j0969J2161j3510J5045j6797J8820k1196K4038k7510L1851l7454
56b0317M5002n5794P2681j03894K43360p36650O40917O89170j367358P68639M38315
67F14071j081900O85177K97537j020392Q72789L8789r85040J015379k4833j109381
77f97804J140722j8833j152851J082845N8936j107332R78731J9490r21188Q92007
87B74723j21113p47451R42899l26599o58822J068301m52196o92628J180520m63545
97D089p47309J177709l96066p30276J075150l64126n98328R55214m32789m15532
$$ y = [0, 0, 0, 0, 0, 8, -15, 17, -18, 23, -28, 42, -56, 71, -84, 101, -119, 146, -180, 218, -253, 294, -342, 400, -468, 541, -616, 702, -799, 909, -1034, 1166, -1311, 1469, -1644, 1838, -2054, 2291, -2543, 2821, -3125, 3463, -3839, 4252, -4703, 5204, -5765, 6396, -7114, 7931, -8866, 9954, -11242, 12796, -14714, 17137, -20317, 24685, -31109, 41572, -62322, 181038, -555612, 85305, 774475, -592883, 175756, 614071, -467829, 217348, 514885, -505507, 367282, 406071, -578969, 436410, 411577, -697804, 442918, 424085, -728766, 354079, 413015, -694317, 284414, 303904, -617284, 274723, 153610, -593841, 349058, 22459, -636363, 431938, -20258, -712886, 467634, 4089, -743220, 434489, 38423, -691853, 383297, 19171, -579157, 376057, -56732, -472264]
107d72264R16166n84962k81487R74665p25334k53318J062244p74233k94583J083224
117F50118p28657l11546J001185o67281k38781Q66347o70696r1815P65309p59454
127a85271N2231P48997q76437J21497P91111r41022J09960Q16018r16722P9747
137a99891P64314q41094J03099O45284p88328K00640N22970q03438L26143M59068
147C88767q64882M12888M58047r11398M31866M73897q96685M08339M49935q24709
157d73935L99208L66972p44221M42144K57137p04861N24779J72728p14248N99627
167A25330J39060p37949O27482J37707p31039O09378J24732o79396N81103P3055
177B69463o04790N78712j1037n45017O11364r3669n21613O55722j45207n23191
$$ y = [-472264, 443902, -141060, -422547, 552118, -173216, -426534, 635710, -138523, -433106, 650118, -78539, -390085, 611100, -56181, -294962, 571385, -99311, -191126, 574183, -185271, -133040, 615957, -260480, -138983, 652128, -288894, -178934, 637084, -279638, -199891, 564423, -276671, -173572, 471712, -316616, -115976, 406994, -396444, -70301, 388767, -476115, -63227, 394820, -516578, -84712, 389185, -507500, -99161, 350774, -473935, -74727, 292245, -451976, -9832, 247305, -457556, 67223, 239951, -474297, 125330, 264390, -473559, 153923, 291630, -439409, 169969, 294701, -384695, 196408, 269463, -335327, 243385, 232348, -312669, 298695, 205026, -316587, 339135, 193928, -329263]
187c29263O78094j62236n17377O63674j70069m80428O28880j96232m16906O02061
197C00198k47722l51066N99671l07283l05402O13456l50904k81251O22872l68742
207g6173k63163O10480l68568k30761N76843l71434j78368N38670l89407j17767
217b69648N12443m18008o6860N00159m41781l3571M90891m50089j1475M71173
227B83234m44430J1652M37171m35105M3246L95526m31799Q1420L56560m37005
237a39530J17370L26714m44268J42336L03542m44854J57165K78437m36174J68806
247B9544K47206m22026J83367K11727m08709K02709J76877l98666K22497J46733
257A91259l90182K38973J22361l80159K49713J01046l64584K56599P8631l44345
$$ y = [-329263, 348831, 186595, -330782, 332892, 162823, -317605, 311275, 115043, -301863, 300198, 52476, -298590, 301081, -6202, -311604, 301852, -49052, -330303, 292569, -76173, -339336, 271144, -97424, -328185, 248658, -122776, -301144, 237526, -151881, -269648, 242795, -175213, -242073, 258086, -183695, -217266, 273625, -176464, -187939, 283234, -161196, -149544, 287627, -147478, -104232, 291294, -140505, -59085, 297475, -139530, -22160, 304554, -139714, 2622, 306164, -138690, 18475, 296912, -139262, 29544, 276750, -145276, 38091, 249818, -158891, 43818, 220695, -177971, 44526, 191259, -198923, 40050, 162411, -217748, 31965, 133011, -231573, 25026, 103657, -240688]
267b40688K63582N4301l23008K72191K9811l02733K80803P825k83804K87090j0993
278C4377k64427K89814k7494k44188K89016m3232k22492K85473n9166k00669K80553
289A17565p5136j79934K75017r0272j61168K67900j03127j43591K58134j14267
299E1121j26279K46235j24199j09327K32877j32597r3073K19532j39735p7524
309e2969K06239j45201o2754J92949j49110m8999J80174j51014l5920J67014j50967
320e0558k2899J54227j49250j0237J42120j46514J460J30713j42227J1949J19853
331C8637j37039K1683J09397j31249L0590R9468j24872L8068Q9770j17850M4158
342c9239P9849j10435M8665P0167j03328N1566O0902r5969N2654N1623q8570N2464
$$ y = [-240688, 22894, 77195, -245813, 26378, 56189, -246544, 34259, 42084, -241720, 45370, 34377, -230050, 59764, 32270, -211918, 77098, 33866, -188626, 96847, 37681, -162988, 117565, 42429, -137505, 137512, 47240, -113928, 153972, 50845, -92746, 165388, 51121, -75158, 171077, 46878, -62449, 170428, 37831, -55242, 164290, 24555, -52969, 153270, 8069, -54685, 138264, -10846, -59845, 120329, -30685, -66605, 100409, -50558, -73457, 80770, -68480, -78717, 63403, -83111, -81651, 49062, -93165, -81216, 38637, -98402, -76719, 32678, -98571, -67981, 31487, -93385, -55317, 34453, -83397, -39239, 40610, -69825, -21160, 49007, -54321, -2755, 58147, -37822, 14832, 66455, -22115, 30349]
354C0349M2596q1847N1103L4087p5626M8571K6225o9317M4979J9097o2480M0617
366D8354J2810n5674L5698P971m9076L0041M359m2267K4369J792l5602J9211O61
379B647k9570J4397J041k3453R147K724j7311L802N226j1502j125Q782o595n870
393d7660J3381k414j0568J8331R90j4888K3325K838j9153K8714L805k4035L4495
406G161L849k8994L9936K862l3810M5321ol8427N0900m040m2941N6307q813m7038
420B267O1467j4388n0077O6824k0734n2750P2510k7442n4651P7956l4509n5193
432b8720Q3309m2003n4152Q9180n0127n1990R4999n7839m8934J00568o5284m4625
444g5618J05419p2721l9141J10366q0093l2874J14663q7221k5479J17813r4746
$$ y = [30349, 72945, -8902, 42201, 76288, 662, 49233, 75458, 6141, 51120, 70217, 7737, 48354, 61164, 5490, 41188, 49159, 83, 30124, 34483, -7784, 16585, 18377, -17225, 1986, 2647, -26923, -12526, -11485, -34938, -25791, -23067, -40378, -36576, -31350, -42852, -43977, -35195, -41790, -47660, -34279, -36693, -47261, -28930, -27940, -42828, -19503, -16665, -35818, -7104, -3299, -27334, 7161, 11010, -17984, 21952, 24814, -8996, 36325, 36319, -2108, 48792, 44752, 1811, 58118, 49305, 2267, 63734, 49346, -731, 66093, 45359, -7391, 65119, 37677, -16974, 60982, 26473, -28720, 54589, 12586, -41566, 47614, -2513, -54503, 40496, -17343, -66277, 34291, -30993, -75618, 29801, -42920, -82061, 28305, -51788, -84662, 30001, -57220, -82699, 35114, -59632]
455e9632j6883J20263j02814q108J21997j10530O24J22495j17849R656J21600
466H0819j25436J8982J19596j33209K8195J16427j40829L7462J11719j48486M7553
477A2793J06173j56213N7854J00021j63377O8045R2913j69378P8372Q4715j74571
488f2653Q9219P6068j79093J00375O7217j82343J11783N7475j84255J23946M7013
499F4752j85475J36495L6385j85426J48467K5919j83684J60097J4491j80228J71391
510B3184K568j75754J82113r931j70121J91907k3392j63282K01519l7586j56350
521a35125K10379n1397j49100K17144o4791j40707K21335p8722j30531K23885
531A22370r3782j19472K26016j09578j07946K27967j25585r6731K29526j40978
$$ y = [-59632, -76515, 43748, -59066, -67174, 54823, -55707, -55083, 67412, -50437, -40781, 80819, -44617, -25635, 93961, -39248, -11053, 105374, -35455, 2007, 113726, -34760, 12793, 118966, -37247, 20607, 120628, -42749, 25296, 118209, -51169, 27203, 111918, -62653, 26566, 102634, -76459, 23916, 91133, -91210, 20573, 78048, -106207, 17739, 64752, -120723, 15772, 52157, -133269, 15198, 41117, -142567, 17530, 32021, -148207, 23184, 25752, -150002, 32111, 22180, -147941, 43966, 20574, -142708, 58811, 21225, -135125, 75254, 23857, -125243, 91901, 27110, -113597, 107738, 29016, -101515, 122370, 28588, -90884, 135132, 25554, -82392, 145575, 19990, -76741, 152785, 11807]
541A1807q5966K29904j54252p5182K27726j65631o2267K22782j77037m6000K17081
552A42965j90422k8325K13160k04642j1694K10732k17184K963K08117k26272J6741
563h3861K02892k31579L1888J93232k35153N0962J80185k40940P3635J68061k50138
574a40816R5946J59810k59917J13328J53946k65205J25277J45263k64060J36107
584c21J29625k58854J50437J07864k54903J70028Q5003k56413J91608O7270k62409
595a31065K08164N6553k65969K14975M7342k60112K15602L1499k44945K18808
605I0852O176k28336K30926k3116k18531K49520m6892k17406K65905n9505k18214
616a68621K71465o4125k10354K65477p1477j88885K57298r1149j59861K58790
$$ y = [11807, -74159, 155745, 1493, -73689, 154037, -11594, -73861, 148921, -28116, -74116, 142965, -47457, -75782, 137378, -67264, -78958, 131774, -85410, -82447, 125670, -100602, -83861, 119031, -112548, -80660, 112572, -122581, -71619, 108566, -132374, -58739, 109322, -140816, -44870, 114940, -144977, -31649, 122297, -142908, -17631, 127632, -136428, -321, 129304, -129550, 20887, 128751, -126152, 43876, 128879, -127534, 64074, 131344, -131065, 77099, 133652, -132317, 82658, 130000, -130112, 85490, 116989, -127956, 90852, 97028, -131308, 99618, 76502, -142029, 107491, 60599, -156807, 109098, 49593, -168621, 102844, 38719, -171635, 93842, 22365, -166520, 90778, -371, -160232, 98558]
626I8558j21326j36589K73013j49823j27053K90513j64890j26599K97636j65666
636c2226j21773K87613j63817j01522K67655j73731o6990K52801k00374l2422
646h4786K54374k33659j2947K67873k55671j1334K75873k56895j3726K63889k45723
657e2732j814K33067k40642L0733K00497k55143P2587J84420k84622J03111J88587
668A78049l09593J10220J98353l12075J02364J92147k91412J01036J61005k66761
678a36667J23400J17735k59957J64278Q6145k75878K02073P9825k98481K16757
688A9230R0151l04086K07038R3894k82245J92409P2138k45476J96417K8133k18974
699a51371K25558j5342k18967K63794l5719k37574K85074l0875k49897K77526
$$ y = [98558, -22768, -159357, 113656, -36167, -163220, 127293, -37597, -164196, 133440, -32226, -153999, 133614, -30203, -131725, 135930, -37801, -104791, 148010, -52364, -84786, 169588, -64071, -77018, 190855, -64816, -76150, 199723, -57172, -70898, 192991, -52732, -54546, 178521, -62121, -31388, 169109, -86034, -13447, 170973, -113649, -10538, 178049, -131544, -21324, 177029, -135046, -32682, 159465, -131947, -30911, 130094, -136667, -13267, 104468, -155489, 8789, 94934, -180944, 21129, 100954, -197527, 19230, 109381, -194705, 12333, 106227, -176018, 16391, 88529, -156947, 39470, 67603, -151371, 74187, 58845, -160122, 103672, 67953, -169621, 115453, 84578, -165319, 112207]
709A12207k0513k36249K53081k9900j98139K37489o6603j58296K48017j15077
719B6017j40293K78630j48471j48645L04413j52550j64195L03471j37770j60446
729a39839K76002j30774j26992K44815j50108p9164K34546j90931m3748K50804
739A44611k28518l6395K75311k39981m8132K81740k24318n3139K58685k02570
749g2706l1748K19549k00355J2453J90496k24599N5804J88002k58219P5457K03682
760A57816k75546O9339K13549k65251N6786J98487k38780O1469J60240k20556
770h2447R0702J20621k26369J30323J00822k50210J56794J04230k70024J58303
780C2745J14040k67380J44080J08235k42891J36451P9237k15232J50039L9551
$$ y = [112207, 91694, -144555, 108526, 78626, -119513, 117976, 51373, -106923, 141094, 26017, -114276, 164354, 15883, -132762, 171651, 19101, -145094, 158377, 20607, -139839, 136163, 5389, -121603, 123212, -26896, -106060, 128486, -62445, -106193, 144611, -83907, -120302, 155009, -84972, -133104, 148636, -75682, -128821, 129864, -72706, -104454, 115095, -85260, -72807, 117689, -106910, -51106, 136896, -121323, -45866, 157816, -117730, -48391, 165158, -100093, -43307, 155180, -83600, -22131, 138109, -82447, 8255, 128876, -97493, 32830, 133652, -116558, 40236, 144466, -125558, 32745, 146785, -120595, 23485, 131720, -111171, 25280, 104517, -110715, 39324, 78875]
790G8875k03521J80831R703k12130K09535J767k26813K19267Q044k28186K09271
801D6643J0184k07769J94561o257j75630J93228l8480j50442K09463p0121j43552
812a38172K31861q5981j49246K42952q4647j51752K35272p8565j38376K16195
822I9541q3353j10564K01168j03597q1880K00323j30075o5575K09881j48189o3440
833g5760K16823j50901o5648K10649j44192n8978J92038j40846l9651J71820j48258
844c2904j4692J60318j63995M794J59760j77860J3223J62192j81727J4532J58312
855A01953j75225J7891J44540j66933L0196J25918j64460M9443J10669j69433
865i5441O7774J03370j76416P8881J00626j78463Q2867R6333j72994Q4566Q5835
$$ y = [78875, -124646, 56185, 65888, -146242, 63293, 65060, -161753, 57514, 65558, -162628, 46643, 56827, -150942, 43619, 37362, -138268, 54960, 16480, -133962, 75501, 5380, -138172, 93689, 7708, -141538, 101414, 16767, -134985, 100287, 21722, -116654, 99541, 16188, -94376, 106792, 3195, -78685, 121638, -8437, -74012, 135869, -12320, -75760, 141063, -9838, -75486, 135163, -9029, -68007, 124031, -16815, -56466, 115354, -32904, -47596, 112722, -51273, -46479, 113281, -64579, -51356, 110836, -70891, -56359, 101953, -73272, -55381, 89159, -77774, -47578, 78340, -86120, -36677, 73992, -95441, -27667, 75703, -100713, -21832, 78794, -99669, -16802, 79531, -93463, -8897, 76938]
876G6938j63324R0143O9632j55214J00722N3030j52439J12717M0988j53114J20966
887D1045L3599j52186J23388K7452j46479J22270J8521j36646J21580O184j26278
898f7550J23643p486j18072J28017j9105j12760J31411k6727j08114J31617l1805
909B3069j01167J28452l7011r1354J24870m3915q0271J22587n1798p0067J21915
920D5310n8691o1765J21274o3723n4654J19680o6916m7661J15944o9115l9309
931e9626J10952p2120l0079J05947p5929k1194J01679p9670j3779R7674q2646
942a8791p503R2998q4388j609Q7482q5475M207Q1322q6305J0185P4558q6875J6164
955d030O7907q7477K1540O1761q7265K5892N6127q6279K9756N0051q4223L3474
$$ y = [76938, -86386, 3757, 73389, -81825, 18897, 71927, -80512, 32205, 73193, -79921, 41045, 74644, -77542, 45846, 73298, -73181, 49089, 67610, -69036, 52544, 58728, -67550, 56093, 48607, -69465, 58552, 39447, -73313, 58098, 31371, -76743, 54874, 23069, -78098, 50354, 13343, -78011, 46859, 2944, -77327, 45260, -6538, -76605, 45310, -13381, -75146, 46128, -17595, -72249, 47431, -19485, -67146, 48798, -20317, -59626, 51326, -20794, -50873, 55074, -20855, -42049, 59630, -20040, -33819, 63855, -18791, -26294, 66704, -17684, -19293, 68189, -17286, -13079, 68243, -18062, -7877, 66681, -20194, -4030, 63877, -23600, -2060, 59701, -27564, -1672, 54455, -31824, -2068, 47983, -36240, -2766]
967b766M3805q1898L7116L7786p9137M0443L2241p5961M3397K7028p2316M5786
979d476K2277o8503M7500J7863o4127M8804J3347n9569M9793R117n5298N0555
991G283N180n1117N0646J612m6869N0145j986m2815M9252n206l8902M7989q136
1004A7076l5236M6293j0824l1698M4432j3538k8354M2529j5808k5410M0358j7750
1016A2070k2222L7820j9247j9052L5341k0404j6280L2867k1015j3645L0330k1296
1028d733j0911K7900k1184q394K5640k0628o038K3391j9626l938K1123j8540j672
1041a7610J8810j7132n2J6832j5397J126J4846j3478K166J2716j1641K748J0784
1054D718r894K924R001q071K783P089o212K437N314m664J711L950l031M23K685
$$ y = [-2766, 41039, -40859, -3743, 34043, -45094, -4651, 27590, -48371, -4974, 22054, -50262, -4476, 17801, -50702, -3202, 14661, -49466, -662, 12685, -46884, 2909, 12026, -43272, 7283, 12463, -38654, 11992, 13604, -33265, 16880, 14894, -27921, 21331, 16125, -22777, 25212, 17076, -18160, 28133, 17309, -14389, 30043, 16505, -11849, 30680, 14872, -10538, 29820, 12070, -10152, 27668, 8421, -10631, 24710, 4306, -11974, 20893, -122, -13767, 16563, -4733, -15644, 12256, -8928, -17322, 8318, -12310, -18348, 5043, -14583, -18521, 2602, -15938, -17610, 1200, -15932, -15984, 848, -14549, -13423, 1423, -12055, -9889, 2827, -8814, -6066, 4718, -5176, -2252, 6749, -1322, 1461, 8550, 2338, 4775, 10089, 5425, 7136, 11086, 8055, 8478, 11163]
1069A1163j332j053J416K33k414M74J653m069J10L001n727j82M370p392l75N781
1085E657r176J28O946j0988J039Q297j2738K040R499j4358L407J0212j5919N188
1099a0766J1016j7613P124J1669j9233R129J2006k0710J1283J2063k2383J3572
1111b843J1572k3879J5929J1005k5323J8131R832k6507K0518Q366k7833K2869
1123A1837O902k9236K5015N068l0284K7153K963l0996K9312N13l1487L1542j979
1136A6323l1721L3598m760l1462L5601p609l1170L7858j0301l0612L9970j3138
1148B577k9500M1794j5890k8012M3728j9005k6250M5553k2044k4106M7223k5135
1160i067k1690M8676k8191j9167N0060l1462j6485N0921l4647j3507N1461l7917
$$ y = [11163, 9831, 8778, 10194, 10427, 8013, 8487, 10140, 6071, 6181, 9182, 3455, 3273, 7643, 251, -124, 5657, -3519, -3391, 3555, -7433, -6394, 1903, -10835, -8795, 704, -13654, -10247, -35, -15954, -10766, 250, -17363, -10239, 1430, -17803, -8674, 3332, -17378, -6095, 5968, -16415, -2843, 8729, -15150, 779, 11784, -13539, 4592, 14424, -12083, 8435, 16801, -11032, 11837, 18739, -10497, 14518, 19586, -10698, 16455, 19418, -11578, 17734, 18247, -13240, 18302, 16323, -15398, 18200, 13440, -18022, 17579, 9970, -21200, 16658, 6357, -24255, 15715, 2577, -26923, 14871, -1019, -29031, 14697, -4308, -30558, 14995, -7049, -31155, 16068, -9067, -30757, 17919, -10272, -29439, 20621, -10841, -27326, 23595, -11052, -24559, 26902, -11015]
1172a1015j0296N1728m1350o915N1747m4760l483N1214m8044L01N0095n1289L877
1185h190M9081n4334P505M7531n7065J1324M5603n9570J5189M3338o1912J9324
1197b176M0773o3895K3502L7975o5503K7659L5030o6565L1790L2017o7455L5713
1209a135K8916o7799L9595K5473o7540M3547K1632o7213M7795J7803o6687N1887
1221F274J3824o5978N5516J0107o5083N8779N942o3422O1551J571o1286O4232
1233B2027l432n8889O7144q831n6722P0235j4254n4812P2910j9089n2678P4636
1245C8245k3693m9706P5557k8547m5776P5962l4031m1238P6662m0066l6792P7942
1257D4519m5925l2904P9160n0719k9304P9392n4130k5421P8108n7187k0032P5726
$$ y = [-11015, -21311, 30417, -10933, -17848, 33899, -10861, -14344, 36870, -11174, -10873, 39222, -12067, -8190, 40891, -13443, -5938, 41593, -15472, -4148, 41455, -18115, -2926, 40412, -21500, -2176, 38597, -25298, -1796, 36179, -29324, -1665, 33365, -33200, -1410, 30607, -36848, -1135, 27781, -40018, -423, 25050, -42490, 1057, 22689, -44524, 3271, 21074, -45613, 6274, 20098, -45880, 9636, 19743, -45340, 13439, 19381, -44041, 17510, 19081, -42205, 22027, 18595, -40294, 26850, 18019, -38703, 31532, 17278, -37534, 35376, 16287, -36391, 38245, 14552, -35154, 40403, 11856, -33920, 42042, 8011, -33227, 43435, 3369, -33423, 44519, -1406, -34310, 44850, -5869, -35173, 44219, -9911, -35332, 42776, -14411, -34443, 41283]
1269D1283o0705j3512P3670o5065o935P2591o9713j362P2225p3253K739P1139
1281D3102p4809O403O8279p5091J1178O3504p5558J7805N8149p7623K5145N4258
1293D4742q1021L1194N1960q3820L4818N0150q4375L7072M6426q2599L9968M0094
1305D4609q0243M5019L2287p9535N1887K5504q0997N8382K1307q3049O2402J9033
1317C6606q3025O3492J6040p9539O3905R853p4073O6456J190o9513P2143p613
1329A5922o7633P8614j3418o7992Q2933j5926o7404Q3305j7374o3228Q0958k1241
1341G516n5605P9538k8880m7278Q1405l8214m1834Q5933m5415m0344Q9380m8120
1353a918l9980Q8775m7899l6897Q3937m8478k9412P8048n3142j9427P5050o1116
$$ y = [41283, -19422, -32934, 40736, -24329, -31264, 41327, -28386, -29748, 42477, -30776, -28037, 43102, -31707, -25304, 42975, -32116, -20938, 42566, -32992, -15187, 42962, -34661, -9516, 44742, -36279, -5085, 46875, -36945, -2127, 48023, -36352, 720, 47146, -35453, 4515, 44609, -35634, 9385, 41672, -37863, 14024, 39528, -41469, 16913, 38220, -44829, 17573, 36606, -46419, 17073, 33113, -46426, 17479, 27332, -46741, 19715, 20905, -48608, 23535, 15922, -51711, 26903, 13485, -54507, 28426, 12500, -54904, 28401, 11027, -52201, 28757, 7516, -48089, 31449, 2569, -44709, 36696, -1518, -43352, 42581, -2834, -43178, 46202, -1918, -41898, 46877, -1022, -37919, 46018, -2460, -31872, 46176, -6966, -26393, 48657, -12459]
1365a2459j1454P6281o8821q067P9006p2224p895P8523p0705o600P3034o8161
1377a9542r14O4664o8756Q916N8004p3956J8842N5908q0630K4644N7368q4506
1389c9958K5785N7677q2818K5642N3213p7781K8737M4131p4157L6834L4518p5128
1401d3305M7021K8837p9630N4459K7799q3226N6449K8135q2056N4886K5156p5998
1413d1473N4400J6875o8722N8231N957o4967O5834k637o6139P2935o127o8767
1425d4600P5118n963o8029P2246o765o2028O8340j2175n3121O7478k1327m5966
1437c6792P0999l0234m3437P6369l5017m3959P8578l4926m3718P5903l3764l8980
1449c8978P0480l5631l0489O6383m1588k1789O6457m9180j6474O9165n4396j4977
$$ y = [-12459, -23913, 52368, -16453, -24520, 54486, -17738, -25633, 52890, -17815, -24415, 48619, -19542, -20456, 44208, -24548, -15632, 42372, -31584, -12742, 43166, -37464, -12820, 44548, -39958, -14173, 43504, -39314, -13672, 39541, -38240, -9503, 34628, -39529, -2695, 31823, -43305, 3716, 32553, -47077, 7382, 35181, -48045, 8404, 36539, -45517, 9369, 34525, -41473, 12927, 29802, -38920, 19311, 25268, -39699, 26135, 23498, -42641, 30294, 24167, -44600, 30518, 24555, -43474, 28772, 22007, -40021, 28319, 16144, -36977, 30501, 9174, -36792, 34207, 3973, -39464, 36905, 1888, -42071, 36507, 1581, -42137, 33766, 2, -38978, 31502, -4129, -34618, 31765, -9823, -31612, 34845, -14335, -30809, 38356, -16040, -31017]
1461c1017P1066n5291j4517O9083n3641j1564O3435n2854m804N7238n5675L604
1473a4937N3885o1126J0248N3576o5772J3284N3819o7181J4148N1914o5427J5646
1485g923M6667o2810J9998L9592o2182K6621L3773o4111L2819L0690o6700L6522
1497B956K9489o7319L7363K7767o4902L7669K3572o0849L9367J7417n7496M3078
1509H112J1370n5903M7367P096n5884N0524M875n5310N1248L303n2801N0462O20
1522A5079m8622M9949l902m4069N0944r118m0821N2953j3348l8956N4503j6063
1534H529l7562N4724j7875l5176N3436j9672l1631N1769k2626k7207N0662k6339
1546A032k3149N0564k9915k0246N0630l2389j8117N0137l3945j5464M8306l4862
$$ y = [-31017, 40049, -15242, -29759, 39324, -14317, -25881, 37554, -15300, -20104, 37134, -18541, -14937, 38948, -22178, -11930, 41646, -24126, -10842, 42977, -24204, -10056, 41858, -23569, -7923, 38744, -24066, -4068, 35524, -26658, -37, 33736, -30375, 2444, 33134, -33566, 2956, 32445, -34874, 2489, 30256, -34646, 3023, 26595, -34254, 5113, 22530, -34966, 8112, 19482, -36421, 10946, 18042, -37842, 12682, 17557, -37753, 13495, 16798, -36003, 14459, 15079, -33543, 16406, 12504, -31565, 19379, 10261, -30560, 22393, 9045, -29911, 24592, 8529, -29033, 25691, 7816, -27360, 26076, 6404, -25227, 26542, 3916, -23291, 27371, 1032, -22117, 28447, -1468, -21714, 28916, -3473, -21590, 28547, -5398, -20862, 27444, -7418]
1558g418j2199M5945l6080q316M3681l7933m415M1967l9734j089M0573m0991J362
1571a4647L9238m1370L739L6941m1089O150L4181m0836Q969L1285m0704J1804
1583f339K8624m0830J4345K6422m0806J6333K4221m0196J7652K1954l9197J8961
1595A144J9337l8007K0362J6528l6974K2042J3809l6041K3365J1489l5084K4411
1607F381R312l3916K5154P017l2301K5653M824l0688K6326K543k8948K6818M09
1620H584k7414K7406j606k5857K7775l387k4116K7826n141k2145K7817o794k0190
1633a7242K7524q269j8306K7194r729j6279K6685j1038j4593K6210j2144j2704
1645a2691K5379j3042j1039K4467j3810r273K3412j4619p635K2281j5118o044
$$ y = [-7418, -19617, 26328, -9752, -18068, 25613, -12320, -16735, 25232, -14502, -15591, 24982, -16009, -14647, 24591, -16779, -13040, 23901, -17188, -11038, 23143, -17693, -8724, 22561, -18143, -6339, 22285, -18545, -4200, 22222, -18584, -2251, 21970, -18226, -574, 21380, -17817, 1144, 20481, -17526, 2836, 19364, -17610, 4432, 18241, -17800, 5565, 17054, -18030, 6381, 15693, -18223, 6931, 13948, -18353, 7300, 12124, -18564, 7762, 10305, -18643, 8175, 8584, -18830, 8576, 6970, -18887, 8888, 5501, -18615, 9211, 4070, -18075, 9742, 2948, -17242, 10282, 2013, -16293, 10901, 1172, -15107, 11578, 540, -14053, 12157, 13, -12691, 12688, -354, -11393, 13074, -736, -10009, 13403, -1216, -8851, 13430, -1688, -7732]
1657g732K1124j5601m626J9944j5825l334J8708j5938k157J7403j5962q80J6018
1670A1142j5944L65J4751j5757J278J3591j5454K226J2324j5005K965J1150j4469
1683f837L682R950j3920M441Q880j3323N035P750j2739N583O738j2102N997N807
1697D942j1402O212M895j0648O476L995r894O589L088r078O499K549q582O484
1711B125J691p690O399J010o884O044N82o298N890k8n475N313k88m866M862o58
1727A729m124M630r39l609M029r12k932L388r01k443K925r56j876K318p35j418
1743a826J775n51r42J208k32p22P76Rn29L53L49l26k78Q40j61p30J283r7j211
1762a012J664j30j626K158k40k000K626m79k282L180p47k540L585j000k711M041
$$ y = [-7732, 13392, -2209, -6835, 13109, -2716, -6050, 12658, -3280, -5437, 11966, -3996, -4876, 11142, -4802, -4437, 10314, -5443, -4165, 9426, -6028, -3802, 8522, -6483, -3518, 7632, -6837, -3155, 6795, -7125, -2684, 6196, -7127, -2092, 5658, -7081, -1498, 5240, -6862, -865, 4942, -6460, -248, 4647, -6001, 475, 4470, -5424, 1165, 4253, -4825, 1674, 4223, -4359, 2125, 3816, -3874, 2525, 3535, -3349, 2695, 3277, -3021, 2869, 2841, -2634, 2679, 2391, -2475, 2387, 1729, -2395, 2235, 1296, -2313, 1716, 804, -2128, 1260, 359, -2084, 841, -115, -1991, 327, -408, -1826, -51, -602, -1544, -336, -568, -1290, -514, -505, -1034, -681, -332, -658, -936, -96, -257, -987, 296, 199, -1012, 652, 522, -1104, 1054, 814, -1186, 1440, 961, -1321, 1859, 1112, -1428, 2157, 1157, -1554, 2487]
1778B487j355k991M530j746l038N036k378l000N517k799l038O099l475k802O317
1793C364l966k633O709m490k363P026n120k034P375n653j676P580o258j261P840
1808D440o986p85Q002p502k51Q092q116M54P921q538Q64Q002r109J470P873r688
1824c857K207P717j0183K786P495j0545L610P047j0951M253O776j1353M922O332
1838F256j1710N806N766j1988O510N342j2146P239M668j2393Q102L965j2445Q833
1852A805L328j2614R718K505j2469J0427J716j2442J1252P94j2213J1913o6j1951
1866h297J2500q90j1698J3126j832j1327J3667k768j0778J4172l797j0261J4539
1879F356m745r711J4896n682r015J5148o648q240J5296p450p567J5340q294o881
$$ y = [2487, 1132, -1859, 2671, 925, -2113, 2923, 545, -2455, 3062, 263, -2775, 3324, -151, -2953, 3364, -602, -3235, 3474, -1016, -3379, 3647, -1473, -3507, 3868, -1785, -3461, 4119, -2139, -3400, 4440, -2546, -3331, 4671, -2831, -3082, 5010, -3106, -2652, 5269, -3269, -2405, 5597, -3512, -2042, 5831, -3857, -1650, 6067, -4116, -1330, 6165, -4380, -770, 6277, -4674, -421, 6355, -4998, -76, 6256, -5454, 352, 6118, -5870, 640, 5982, -6164, 1075, 5743, -6650, 1452, 5417, -7028, 1805, 5133, -7481, 2237, 4742, -7727, 2700, 4416, -8026, 3226, 4020, -8193, 3720, 3654, -8297, 4203, 3313, -8385, 4741, 2909, -8418, 5249, 2481, -8297, 5875, 2078, -8183, 6356, 1611, -8100, 6796, 1114, -7901, 7247, 599, -7641, 7655, 205, -7362, 7978, -316, -7197]
1893g197J5560r321n981J5453j0035n133J5367j0837m111J5198j1633l237J5015
1906I108j2322k342J4609j2930j275J4250j3469l30J3830j4076P59J3372j4603
1919e419J686J2969j5245K910J2202j5616L969J1546j6041N003J0891j6169O055
1932a259R917j6377P089R022j6599Q175Q145j6626R151P156j6585J0096O178j6480
1946h997J0914N149j6225J1617M197j6012J2359L143j5639J3090K047j5179J3692
1959D156J043j4709J4158k3j4182J4668j021j3499J4975j984j2862J5244k881
1972C083j2159J5506l880j1456J5803m870j0706J5841n696r926J5907o618r021
1985h192J5947p529q083J5866q234p228J5725r183o194J5530r966n163J5197j0682
$$ y = [-7197, 8363, -958, -6939, 8514, -1521, -6654, 8713, -2124, -6235, 8963, -2670, -5907, 9108, -3214, -5556, 9053, -3877, -5152, 9098, -4371, -4701, 9129, -4947, -4188, 9184, -5419, -3733, 9236, -6009, -3099, 9103, -6513, -2544, 9002, -7039, -2036, 8855, -7314, -1259, 8658, -7719, -630, 8392, -8207, -32, 8113, -8513, 638, 7794, -8791, 1305, 7483, -8997, 1917, 7066, -9159, 2458, 6655, -9357, 3002, 6145, -9494, 3596, 5643, -9536, 4156, 5199, -9510, 4648, 4625, -9557, 5111, 4090, -9409, 5566, 3582, -9280, 5964, 3083, -9076, 6430, 2550, -8906, 6897, 2027, -8679, 7162, 1466, -8460, 7447, 829, -8192, 7755, 226, -7857, 8009, -225, -7453, 8272, -911, -7105, 8425, -1541, -6704, 8493, -2189]
1999b189m250J5113j1407l177J4733j2108k162J4188j2598j122J3654j3099J4
2012d410J3080j3625J146J2399j3943K094J1695j4224L097J1030j4462M008J0253
2025H138j4635M928R465j4530N701Q556j4523O615P689j4469P362O830j4376Q043
2039G94N933j4101Q710N098j3930R302M313j3624R651L468j3177J0095K579j2648
2053g537J0470J636j2135J0945P23j1698J1332j46j1226J1689q85j0788J1836
2066D216j564j0073J1853k331r314J2039l303q467J2199m252p749J2299m984p140
2080f571J2356n572o618J2369o076n845J2032o581m885J1694p343l842J1349q063
2094a596k897J1225q749k225J1061q991j776J0679r129j058R996r276k36R299
$$ y = [-2189, -6439, 8674, -2733, -5910, 8823, -3285, -5447, 8741, -3857, -4979, 8675, -4424, -4410, 8670, -4955, -3809, 8590, -5353, -3259, 8436, -5788, -2691, 8339, -6123, -2115, 8138, -6497, -1569, 7896, -6634, -933, 7623, -6900, -285, 7404, -7065, 297, 7127, -7249, 794, 6727, -7374, 1336, 6434, -7496, 1806, 6119, -7505, 2146, 5614, -7563, 2532, 5111, -7537, 2933, 4569, -7566, 3379, 4102, -7596, 3736, 3590, -7636, 4053, 3168, -7620, 4216, 2652, -7421, 4432, 2101, -7213, 4826, 1523, -6944, 5255, 1003, -6746, 5553, 569, -6571, 5785, 213, -6405, 5964, -112, -5957, 6075, -506, -5391, 6303, -1040, -4882, 6467, -1596, -4493, 6732, -2017, -4242, 6819, -2172, -3948, 6731, -2398, -3456, 6540, -2736, -2972, 6327]
2108F327r485N95Q783r907J567Q194j0129K061Q069j0252K341P598j0022K720
2122a540O879r819L367O062r703M165N247r673M849M673r701N323M374r782N517
2137B38M095r465N645L385q865O003K474q341O445J688q240O996J063q147P518
2152B492M73p922P586J98p626P537l24o862P496j023o294P541j789n720P811k461
2168A113n428Q055k831n221P980l071m778P764l221m267P396l632l589P314m193
2183f09k975P286m638k483P178m905k226P100m910j991O800m958j490O387n046
2198a480r64O019n214m48N794n479p6N651n690K98N434n700M41N100n594P50M769
2215C611n533J123M293n558J604L772n537J951L594n734K161L365n669K443L080
$$ y = [6327, -3158, -2563, 6220, -3687, -2120, 6074, -4055, -1994, 6075, -4177, -1836, 5762, -4260, -1540, 5339, -4480, -1113, 4949, -4754, -589, 4658, -5015, -166, 4507, -5194, 129, 4503, -5279, 238, 4333, -5132, 513, 3898, -4967, 1036, 3510, -4831, 1614, 3302, -4938, 2058, 3121, -5026, 2492, 2965, -4957, 2629, 2827, -4799, 2738, 2414, -4448, 3048, 2025, -4269, 3272, 1483, -4237, 3574, 1113, -4315, 3740, 909, -4312, 3668, 597, -4181, 3583, 362, -3905, 3491, -141, -3730, 3584, -609, -3584, 3702, -936, -3419, 3759, -1146, -3372, 3728, -1182, -3173, 3627, -1331, -2821, 3566, -1480, -2444, 3575, -1639, -2087, 3707, -1772, -1848, 3803, -1887, -1589, 3845, -1855, -1414, 3686, -1908, -1158, 3611, -1922, -799, 3494, -2064, -460, 3312, -2225, -274, 3320, -2414, -253, 3112, -2557, -114, 2966]
2230B966n540K506K683n301K821K237n212L078J840n077L372J523m995L628J271
2245A800m840L653J076m706L748O57m295L716M60m083L843P3l748L945k57l569
2261b527L994m09l536M000n67l167L850p08l033L881q66k815L760j133k467L592
2277A849j189k378L552j339k167L551j533j907L373j529j843L219j593j566L114
2292A614j703j474L068j868j170K907j795j054K825j928q79K753j936o77K498
2307A181j931n31K511j969m22K394j961k31K266k011p4K109k040M8K039k031J46
2324e07J887k003K26J811j915K42J690j888K75J549j868M02J369j729M57J213
2340A211j769N08J200j743M99J163j729M99J014j593M97R79j516N59Q09j409N51
$$ y = [2966, -2574, -68, 2615, -2686, 135, 2372, -2840, 238, 2078, -2999, 373, 1896, -3099, 529, 1800, -3040, 613, 1689, -3017, 731, 1388, -2907, 809, 1269, -2814, 1029, 1102, -2646, 1299, 1042, -2527, 1467, 1058, -2478, 1522, 955, -2212, 1638, 930, -2103, 1778, 912, -1903, 1857, 724, -1743, 1849, 660, -1718, 1834, 495, -1672, 1879, 346, -1561, 1812, 283, -1560, 1659, 66, -1500, 1614, -89, -1563, 1505, -363, -1533, 1374, -421, -1475, 1350, -578, -1457, 1296, -640, -1317, 1181, -750, -1281, 1230, -739, -1161, 1233, -728, -959, 1307, -704, -778, 1331, -709, -661, 1378, -653, -507, 1380, -623, -397, 1414, -501, -259, 1431, -457, -182, 1367, -501, -99, 1270, -459, -2, 1211, -558, -50, 1150, -593, -94, 1069, -660, -161, 853, -740, -243, 736, -780, -221, 588, -821, -270]
2357b70Q03j457O99O77j342N89P48j284N06P46j241O57N64j087O32M88j104O67
2375iM65j000N52M95r59O56L51q74N46M16q84N56L41q07M34K87p39N15J44o28
2395a42M40J86o82M54J18o05M41J01n76L96J01n66L24R3m70K82Q3l04J87J32l65
2416c72J79Q6k31J61P7k17J19J37k53J35J55k05R7J67j59L3K19j42j23K85j01
2437D7n4K04K9k19K89k6k61K80Pk74K66M8l53K85M5l96L37L9m05M37j26m88M81
2460A92%o17N61o6n70N96Lp03O29N9p92Q08o4p82Q18L0r00R39p6q36R89n7r74
2483h13J152j78r15J188j96r93J370k54j092J418l44j065J464m25j026J661n29
2500D23j176J732o36j128J887q37j139J908q20j099K003r59j219K224j163j079
$$ y = [-270, 533, -924, -225, 452, -890, -301, 447, -837, -331, 415, -826, -169, 395, -692, -60, 428, -676, -9, 456, -544, 8, 503, -456, 200, 551, -323, 223, 639, -245, 311, 652, -155, 279, 566, -173, 342, 486, -142, 298, 484, -198, 256, 374, -231, 210, 311, -265, 131, 232, -334, -10, 83, -387, -105, -22, -326, -139, -7, -372, -193, -107, -338, -177, -100, -317, -198, -61, -314, -179, -24, -229, -132, 35, -124, -91, 128, -14, -137, 148, 47, -7, 197, 226, 7, 296, 270, 9, 289, 296, 22, 288, 336, -17, 268, 313, -83, 254, 293, -112, 325, 199, -289, 192, 192, -425, 136, 70, -500, 96, 99, -604, 25, 84, -708, 100, 36, -746, 72, 102, -798, 141, 65, -771, 218, 161, -813, 339, 161, -754, 434, 238, -755, 615, 361, -731, 687, 343, -722, 742, 317, -709, 952, 423, -753, 979, 343, -785, 1102, 265, -874, 1034, 214, -885, 1118, 159, -1060, 1164, 1, -1078]
2516a078K161j143j093K320j444r41K343j530r16K531j673q40K582j894p11K765
2532A439k144n78K821k326m19K794k373l24K899k636j75K948k846O3K874k946
2548i29K59K833l200L96K848l278N45K891l506P65K684l589R33K766l973J290
2564b65K565m065J439K664m198J581K527m358J990K244m460K120K257m569K465
2579f3K079m699K752J865m808L058J762m830L265J501m955L688J232m967L972
2594H52J048n016M287P46n024M542M39n045M864K24n034N112j18n019N341m57
2610A742m867N514q52m743N814j248m627N997j616m434O245k055m362O425k350
2625E83m059O533k801l836O697l192l521O876l637l241O941l965k974P131m436
$$ y = [-1078, 1083, -60, -1153, 1167, -277, -1218, 1125, -405, -1321, 1210, -463, -1303, 1279, -615, -1326, 1439, -705, -1283, 1538, -788, -1207, 1587, -786, -1110, 1789, -847, -1022, 1926, -920, -857, 2017, -929, -670, 2163, -1037, -641, 2207, -1071, -526, 2365, -1141, -376, 2308, -1281, -348, 2418, -1555, -265, 2300, -1765, -326, 2338, -1860, -279, 2248, -2110, -120, 2124, -2336, -216, 2041, -2528, -63, 2016, -2683, 69, 1934, -2874, 184, 1946, -2884, 381, 1882, -3073, 615, 1847, -3120, 852, 1900, -3116, 1171, 1917, -3107, 1435, 1874, -3171, 1693, 1917, -3117, 1995, 1877, -3142, 2199, 1742, -3125, 2389, 1537, -3206, 2608, 1360, -3267, 2730, 1114, -3320, 2925, 870, -3492, 2933, 583, -3476, 3057, 256, -3580, 3117, -75, -3596, 3280, -357, -3598, 3343, -622, -3596, 3535, -901]
2640i01k636P096m649k308P194n025j978P150n461j464P114n802j068P157o230
2655a811p14P120o502l44P025o773M5O831p068N53O557p364J030O486p802J598
2671a133O219q165K043N983q318K420N883q504K823N406q546L407M901q725M060
2686b46M488q896M683M093r165N134L804r145N525L453q968N836K881q873O515
2701A119K152q723O966J640q744P534J169q769Q050P61q666Q186L77q431Q443
2716C064k64p972Q673j081p589R111j745p337R474k370p186R776k756o986R884
2731D696l212o599R855l820n932R821m518n207R941n235m792J0284n988m406J0442
2746E330o422m086J0397o568l609J0082o922k754R732p483j875R570q184j130
$$ y = [-901, -3537, 3559, -1090, -3398, 3796, -1229, -3207, 3943, -1518, -2982, 4132, -1670, -2738, 4419, -1811, -2525, 4595, -1907, -2251, 4774, -1999, -1954, 4877, -2191, -1638, 4919, -2445, -1415, 5071, -2731, -1133, 5086, -3079, -1036, 4947, -3371, -951, 4932, -3572, -749, 4657, -3889, -482, 4419, -4306, -246, 4242, -4654, 29, 4122, -5043, 91, 3895, -5250, 275, 3728, -5240, 596, 3477, -5396, 1119, 3271, -5452, 1514, 3154, -5590, 1944, 3113, -5656, 2394, 3155, -5511, 2675, 3052, -5379, 3064, 2800, -5172, 3501, 2420, -5169, 3942, 2197, -5140, 4334, 1964, -5222, 4554, 1798, -5188, 4696, 1484, -5115, 4740, 920, -5012, 4809, 291, -4916, 5025, -210, -5002, 5282, -706, -5112, 5330, -1092, -5178, 5219, -1349, -4958, 5124, -1798, -4552, 5180, -2303, -4178, 5392, -2792, -3922]
2760c922R644q810n45R578r116j85R435r218K30Q962r308J090Q132r556K033P673
2776F117j0034K883P356j0575L512P260j0848L818O850j0705M125O212j0551M763
2790A83N260j0327N492M487j0540O384L923j0730O946L549j0776P245L260j0608
2804f252P362K694j0075P715J765r580Q360P41r247Q988J05r326R590l44r257
2819f761R799o39q875R761j100q214R756j925p384R991k958o870J0368l779o467
2834e297J0676m371o221J0881m773n809J0517m933n162J0187n606m255J0005o384
2848e45l461J0036p207k845J0189p763k430J0024p965j948R640q062j477R195
2862E381q248n43Q526q632L88Q281r079J021Q126r377J464P856r509J956P500
$$ y = [-3922, 5722, -3088, -3633, 5945, -3171, -3356, 6079, -3139, -2909, 6053, -3255, -2165, 5967, -3589, -1556, 6117, -3917, -1034, 6322, -4253, -741, 6519, -4329, -511, 6339, -4366, -241, 5971, -4580, 183, 5443, -4884, 608, 5095, -5445, 939, 4862, -5868, 1078, 4627, -6149, 1096, 4356, -6252, 1110, 3804, -6271, 1444, 3209, -6371, 1989, 2730, -6517, 2471, 2576, -6750, 2840, 2496, -6761, 3038, 2399, -6476, 3285, 2185, -6029, 3727, 1802, -5582, 4409, 1451, -5419, 4949, 1170, -5297, 5379, 1008, -5213, 5668, 895, -4914, 5603, 670, -4492, 5695, 89, -4166, 5839, -545, -4006, 6030, -1177, -4022, 6167, -1596, -4026, 5998, -1967, -3915, 5725, -2337, -3814, 5381, -2867, -3410, 5116, -3516, -3128, 5153, -3926, -2905, 5221, -4156, -2692, 5164, -4345, -2389, 5111]
2877E111r415K405O853r305L105O228r455L860N654r613M514N203r760M951M895
2892E231r671N222M305r411N485L710r171N933K943r024O511K105q772O953J466
2907C815q694P345J021q514P516N34q097P612o7p692P779p35p098Q020j452o759
2923e466Q387k089o359Q477k500n914Q599k913n537Q510l328m850Q449l775m303
2938d612Q362m262l738Q315m638l202Q188n112k668Q004n313k291P795n541j840
2953b553P550n830j359P289o122q13O955o389l16O593o611R0O369o732M77N921
2969D519o787R87N502o819J404N096o901J829M633o905K356M241o826K675L834
2984B838o694K982L574o709L262L151o486L673K668o301M090K140o117M318J764
$$ y = [5111, -4304, -1899, 4954, -4351, -1246, 4982, -4473, -613, 5041, -4572, -58, 5145, -4615, 336, 5231, -4440, 782, 5087, -4324, 1161, 4871, -4300, 1633, 4576, -4448, 2063, 4168, -4604, 2349, 3815, -4879, 2466, 3487, -5027, 2489, 3023, -5074, 2538, 2471, -5221, 2558, 1823, -5275, 2745, 1293, -5466, 2921, 832, -5527, 2950, 450, -5464, 3135, 222, -5315, 3195, -133, -4983, 3466, -309, -4612, 3750, -512, -4250, 4065, -573, -3775, 4413, -699, -3367, 4637, -676, -2967, 4828, -713, -2553, 4997, -833, -2192, 5097, -1025, -1838, 5117, -1272, -1588, 5005, -1606, -1516, 4853, -1879, -1402, 4519, -2268, -1281, 4221, -2598, -1194, 3902, -2999, -1170, 3463, -3442, -1086, 3155, -3671, -996, 2838, -3856, -874, 2700, -4009, -747, 2404, -4082, -409, 2259, -4042, 48, 2188, -3929, 389, 2153]
2999B153n777M464J373n620M616J028n383M802N85n143M944J68m811M947k42m516
3015b412M989n87m294M917q24l922M899j327l575M854j599l319M735j751l126
3030b342M746k031k755M483k165k440M429k437k064M244k486j763M091k667j405
3045b562L923k683j161L842k762q97L598k686n97L414k787l34L222k747k6K963
3061A720k713J37K777k714M03K464k663N01K247k503O55J943k476O87J694k364
3077b05Q70J409k295R75J151k155Q05J161k143Q85Q45j902Q14O95j741Q12O14
3094E95j614P13M56j330P07L08j175O23K15q45M55K97p96N15K68o32L57L20l68
3113i31K50K32k27J16L52j81M8M37k0j64N36o7k92N95R4n21O83O7o42P61N3q34
$$ y = [2153, -3624, 840, 2213, -3407, 1209, 2237, -3146, 1656, 2241, -2902, 2042, 2210, -2601, 2346, 2104, -2412, 2577, 1990, -2304, 2613, 1789, -2133, 2766, 1439, -2136, 2718, 1119, -2200, 2535, 784, -2342, 2404, 373, -2382, 2101, -64, -2504, 1925, -512, -2576, 1668, -818, -2581, 1510, -1157, -2562, 1361, -1322, -2483, 1359, -1403, -2300, 1298, -1388, -1985, 1429, -1358, -1692, 1530, -1217, -1243, 1720, -993, -856, 1921, -793, -390, 2074, -589, -88, 2159, -344, 311, 2254, -222, 465, 2159, -205, 665, 2074, -221, 754, 1905, -250, 555, 1716, -427, 458, 1303, -599, 215, 910, -831, -19, 595, -1019, -306, 150, -1180, -473, -165, -1340, -717, -502, -1347, -892, -595, -1391, -876, -608, -1240, -883, -563, -931, -681, -449, -676, -560, -208, -389, -341, 96, 76, -88, 448, 381, 89, 684, 778, 257, 940, 1007, 365, 1126, 1179, 345]
3135C45Q74K4r76R75M0j160J116n6j404J297j60j459J422j95j665J633l11j705
3153a365J893m61j859K065n58j828K356q07j801K538r76j762K845j139j677L046
3169E10j357j676L355j601j556L555j881j435L708k092j347L997k494j076L970
3184B580k736r69M111k958q89M281l488n15M233l691m04M243m019j54M219m401
3200e57J69M195m832N55M038n055P98M090n432J210L867n664J530L777n901K095
3216a117L543o132K531L355o320L014L174o517L526L000o669M001K689o759M514
3231a67K320o798N029J989o822N506J469o763N887J186o903O341O66o832O826
3246B934J77o830P123k84o739P525r64o532P831j518o341Q021k059o184Q431k764
$$ y = [345, 1219, 1243, 267, 1242, 1282, 122, 1238, 1182, -222, 1075, 915, -544, 878, 683, -982, 651, 340, -1365, 528, 67, -1792, 273, -285, -2113, 243, -564, -2365, 173, -803, -2565, 280, -859, -2536, 510, -847, -2523, 832, -769, -2325, 1230, -651, -2086, 1622, -470, -1817, 2180, -314, -1390, 2580, -156, -1125, 2986, 28, -861, 3420, -68, -583, 3650, -41, -445, 3798, -221, -375, 3844, -557, -388, 3807, -1025, -470, 3568, -1487, -689, 3401, -2031, -821, 3046, -2618, -1088, 2689, -3212, -1117, 2426, -3706, -1175, 2180, -4140, -1126, 2048, -4469, -943, 2057, -4612, -611, 2078, -4681, -167, 2153, -4645, 384, 2373, -4449, 1057, 2526, -4237, 1650, 2836, -4067, 2274, 2940, -3892, 2934, 3111, -3719, 3404, 3120, -3619, 3906, 2942, -3590, 4241, 2723, -3618, 4403, 2344, -3840, 4591, 1827]
3262A827n883Q687l338n607Q827l966n196R035m460m916R240n118m353R419n786
3277a588l798R642o410l272R712o930k697R779p468k067R769p950j327R572q422
3292c455n82R506r032K24R369r640J013R084j0101J666Q900j0496K304Q417j0663
3307c486K934P892j0975L770P210j1396M743O648j1828N474O192j2145O139N733
3321F905j2316O533N151j2135P033M462j2205P968L422j2188Q951K632j2260R691
3335A644K085j2293J0328J585j2219J0644J091j1713J1074Q1j1004J1577r74j0536
3349h630J2455k147j0222J3291k902j0204J3796l356r857J3815l904r141J3642
3362F636m891p948J3638o147o958J4076p619o292J4708q729o046J4980r152n792
$$ y = [1827, -4056, 4631, 1293, -4314, 4513, 547, -4649, 4386, -74, -4990, 4250, -868, -5221, 4198, -1588, -5386, 4256, -2154, -5426, 4286, -2644, -5341, 4438, -3030, -5097, 4672, -3278, -4605, 4967, -3455, -4037, 5469, -3563, -3339, 6030, -3610, -2597, 6487, -3614, -1948, 6952, -3544, -1240, 7177, -3486, -552, 7340, -3635, 135, 7345, -4051, 692, 7340, -4488, 986, 7178, -4967, 1172, 6905, -5411, 1122, 6273, -5862, 1171, 5633, -6572, 1396, 4818, -7370, 1581, 4213, -8047, 1644, 3729, -8564, 1764, 3349, -8870, 1774, 2865, -8848, 2226, 2307, -8697, 2880, 1906, -8630, 3825, 1678, -8544, 4747, 1845, -8359, 5437, 2081, -7776, 6039, 2135, -7006, 6636, 1745, -6203, 7435, 1288, -5670, 8406, 787, -5505, 9203, 474, -5572, 9408, 256, -5536]
3376e536J4761r437n000J3987r910l589J3326j1127k019J3097j2444r40J3491
3389H660j3468n56J3852j3768l63J3554j3618L18J2488j3375J770J1208j3933
3402g231L616J0502j4945N108J0483j6076N945J0704j6304N960J0493j5787O023
3415a509R423j4983P079P688j4808Q788O089j5438J0579N448j6424J1525N421
3428H878j6926J1470N350j6320J1131M219j5030J1465K189j3877J2672Lj3737
3441h513J4437j302j4380J5678j554j4845J5719j382j4284J5034j987j2462J4397
3454D556l632j0478J4975n937r413J6457p598r464J7654q038r702J7826p689r387
3468i870J7020p643p886J5675q557n677J5230j0478l800J5764j2353l215J6872
$$ y = [-5536, 9225, -212, -5212, 8775, -1135, -4724, 8602, -2525, -4544, 8553, -3891, -4831, 8660, -4808, -5364, 8488, -5280, -5643, 7911, -5707, -5389, 7099, -6276, -4506, 6702, -7231, -3615, 6887, -8058, -2950, 7533, -8543, -2598, 8106, -8198, -2238, 8255, -7532, -1509, 7914, -7069, 10, 7698, -7110, 1678, 7767, -7671, 2908, 8356, -8068, 3457, 8878, -8048, 3422, 8772, -7548, 3583, 7802, -7228, 4237, 6426, -7451, 5221, 5224, -8513, 5924, 4622, -9758, 5920, 4366, -10479, 5240, 3858, -10426, 4608, 2621, -9841, 4556, 924, -9554, 5421, -516, -9929, 6528, -1070, -10534, 7120, -918, -10620, 7206, -483, -9870, 7150, -493, -8379, 7296, -1261, -6938, 8292, -2186, -5986, 9778, -2575, -5790, 11082]
3481A1082j3370l455J7100j3049l527J6156j2522k459J4338j2616n08J2966j3880
3494c744J627J2664j5707K857J3115j6738K947J3490j6728K802J2680j5643L324
3507c054J0882j5032N053Q985j5317P017P955j6257Q722P761j7218R388P928j7172
3521a0359R330P423j6049R273O053j4727J0063L990j4002J1700K305j4259J3285
3534D026J485j4801J4005J360j4714J3783J027j3907J3304J3j2467J3270j766
3547D618j1252J3893l425j0659J4874m662j0728J5398n087j0639J5340n227j0024
3560g580J4635n748q681J3977o728p258J3999q091o154J4354r220n518J4679r634
3574b968n195J4605r717m537J4020r892l336J3205j0304j915J2535j1046n30J2236
$$ y = [11082, -2288, -5743, 11357, -1692, -5219, 10937, -1585, -4044, 10294, -2322, -2830, 10136, -3744, -2117, 10547, -5160, -2303, 10812, -5926, -2979, 10511, -6217, -3415, 9265, -6378, -3054, 7828, -7204, -2151, 6834, -8483, -1466, 6489, -9768, -1046, 6715, -10503, -1115, 6813, -10359, -1029, 6394, -9655, -382, 5671, -9056, 1007, 4997, -9005, 2695, 5000, -9259, 4026, 5511, -9290, 4715, 6075, -8639, 5144, 6171, -7736, 5568, 5581, -6886, 6384, 4618, -6634, 7259, 3834, -6825, 8049, 3387, -7341, 8057, 2970, -7669, 7671, 2444, -7580, 7055, 1307, -7374, 6603, -125, -7383, 6616, -1475, -7629, 6725, -2495, -8013, 6666, -2968, -8163, 6442, -3275, -7812, 6208, -3684, -7020, 6185, -4119, -6034, 6501, -4545, -5075, 7161]
3588G161j1812K89J2213j2360R23J1826j2356J494J0996j2205K227J0032j2249
3601c821L258Q971j2415M368Q095j2720N116P504j2954N668O991j2896N995O182
3615G342j2589O455N219j2110O958M202j1806P599L349j1671Q320K551j1440Q673
3629A052K169j1300R081J476j0609R234Q43r972R393J77r347R661n74q820J0022
3644B486j189q343J0254j785p804J0219k276p205J0236k870o544J0083l553n935
3658d226J0034m118n361R896m654m754R684n140m189R362n661l499Q950n897k999
3673b572Q674o405k393Q298o663j758P854o939j112P480p136n28P069p260P4O625
3689C308p222O07O228p288J165N808p179J653N383p049K067N014o900K471M583
$$ y = [7161, -4651, -4362, 7851, -4509, -3586, 8240, -4116, -2622, 8374, -3831, -1604, 8428, -3821, -563, 8408, -4007, 361, 8456, -4264, 852, 8356, -4598, 1070, 8061, -4835, 1160, 7342, -5247, 1208, 6427, -5683, 1275, 5477, -6329, 1270, 4619, -7052, 1268, 3819, -7621, 1052, 3221, -8079, 1002, 2478, -8131, 1103, 1946, -8026, 1367, 1544, -7803, 1858, 1284, -7536, 2486, 1297, -7046, 3208, 1423, -6381, 3838, 1562, -5643, 4593, 1723, -4821, 5262, 1709, -4226, 5808, 1690, -3671, 6225, 1571, -3183, 6501, 1361, -2828, 6534, 873, -2626, 6324, 427, -2572, 6102, -303, -2696, 5602, -1061, -2819, 5035, -1904, -3016, 4464, -2672, -3200, 3869, -3391, -3317, 3308, -3914, -3307, 2921, -4367, -3202, 2606, -4573, -2920, 2463, -4586, -2519, 2495, -4405, -1934, 2649]
3704B649o768K917M129o564L144L757o423L461L246o251L693K769n960L884K282
3719C965n758L966J816n535M059J375n280M141Q34m983M102M63m775M136P6m472
3735a870M025k57m168L980n47l785L865q52l396L800j081l072L833j320k650L495
3751@j280k283L442j386j956L301j349j687L152j369j274K905j317r85K778j343
3767f51q47K663j326o66K380j250m77K118j219l19J869j165k59J600j100k01J267
3784B417q73k97J034q50k17P57p03k76M92n64m20M47n17m25K63k47n93J67L6o46
3804a015K3K55p56oN08q93P4N97p80K0Q82j018J93J098j197L09J280j334L90J497
3824A27j640O24J579j711O86J718j999Q38J758k262J109J704k578J271J730k806
$$ y = [2649, -4119, -1202, 2927, -3637, -493, 3264, -3159, 302, 3548, -2703, 990, 3759, -2201, 1683, 3965, -1793, 2173, 3989, -1546, 2513, 3888, -1392, 2749, 3583, -1400, 2702, 3165, -1610, 2526, 2602, -1870, 2155, 1898, -2270, 1710, 1163, -2622, 1243, 391, -3005, 795, -286, -3358, 475, -845, -3495, 0, -1280, -3563, -121, -1507, -3463, -162, -1511, -3198, -46, -1415, -2689, 216, -1101, -2086, 692, -651, -1498, 1165, -161, -827, 1553, 303, -174, 1944, 725, 406, 2275, 1110, 851, 2451, 1351, 1150, 2417, 1544, 1247, 2281, 1431, 1214, 1971, 1268, 992, 1484, 920, 500, 947, 430, 5, 268, 21, -572, -405, -369, -1015, -992, -737, -1493, -1499, -991, -1884, -1810, -1213, -1993, -1973, -1091, -2109, -1916, -818, -2015, -1706, -426, -1760, -1370, 127, -1513, -889, 690, -1021, -335, 1383, -616, 222, 1980, -282, 827, 2531, -47, 1224, 2954, 148]
3840A48J412J730l102J583J534l355J854J485l654K063J266l863K336J101m031
3855a493K703Q23m271K991P31m485L420M87m488L645L06m494L984J58m630M532
3871h1k62m425M821n52m360N297r08m214N651j233m172O051j597m042O369k068
3887B75l772O646k524l562O823k998l335P009l525l011P190m162k699P249m640
3902I64k504P396n160k056P290n774j673P297o271j136P142o774p68P154p277
3917b150k04P003p695L94O883q097Q74O812q360J492O588q828K241O367q954K876
3933b758O084r256L565N884r478M210N488r640M958N037r861N648M656j0026O273
3948G84M114j0092O968L478j0143P441L008j0230Q139K190j0168Q616J395j0147
$$ y = [148, 1560, 3290, 188, 1771, 3305, -50, 1804, 3289, -365, 1698, 2964, -899, 1437, 2538, -1493, 1210, 2033, -2238, 753, 1484, -3001, 419, 906, -3582, 63, 369, -4125, -141, 17, -4613, -81, -343, -4768, 53, -499, -4859, 438, -470, -4684, 967, -266, -4438, 1613, 16, -4026, 2343, 275, -3497, 3149, 625, -2937, 3886, 888, -2447, 4562, 1037, -1974, 5216, 1054, -1645, 5604, 964, -1540, 5856, 696, -1360, 5930, 156, -1517, 5780, -491, -1627, 5515, -1259, -2027, 5127, -2150, -2354, 4649, -3046, -2652, 4231, -3866, -2992, 3820, -4540, -3048, 3540, -5288, -3047, 3320, -5634, -2758, 3326, -5930, -2365, 3519, -5959, -1749, 3739, -5901, -943, 4094, -5767, -119, 4537, -5489, 784, 4898, -5194, 1774, 5252, -4891, 2550, 5558, -4672, 3467, 5657, -4511, 4105, 5500, -4647]
3962d647R269O10j0086R796j52r928J0172r35r637J0492j756r112J0781k641q769
3977f543J1386l658q254J1753m486p812J2214n271p233J2351n733o608J2342o437
3991a989n751J2461p322m739J2568q158m004J2864q988l371J3015r537k805J3008
4005G252r965k101J2605j0364j139J2090j1158K5J1701j1856J024J1508j2843
4018c221J744J1477j3330K133J1153j3555K735J0377j3598L624R265j3830M955
4031g1Q291j4438O292P745j5240P215P558j5621P679P226j5307P998O257j4683
4045i099Q750M802j4049J0144L283j4135J1674K425j4572J2807J968j4730J3042
4058B310J974j4265J2898J114j3042J3021n00j1740J3825k458j1154J5210l891
$$ y = [-4647, 4622, 5232, -4854, 4942, 4790, -5138, 5034, 4099, -5538, 4954, 3198, -5914, 4867, 2226, -6543, 4843, 1185, -7069, 4684, 198, -7614, 4600, -671, -7904, 4447, -1286, -7894, 4448, -1989, -7740, 4721, -2601, -7340, 5228, -2930, -6934, 5930, -3058, -6429, 6586, -2951, -5756, 7252, -2713, -4814, 7791, -2573, -3712, 8378, -2780, -2755, 8946, -2910, -1886, 9622, -3221, -1477, 10000, -3330, -1197, 9956, -3599, -864, 9513, -4085, -461, 8804, -5026, -71, 8220, -6218, 74, 7819, -7421, -206, 7352, -8269, -590, 6636, -8671, -673, 5584, -9099, -349, 4453, -9596, 548, 3831, -10304, 1370, 3795, -10777, 2030, 3998, -10732, 2310, 4284, -9981, 2917, 4031, -9011, 4010, 3510, -8230, 5595, 3137, -8017, 7193, 3302]
4071C302j1301J6280m464j1681J6403m510j1183J5675m895r856J4897o260q091
4084e684J4982q456o713J5899j0272o474J6929j0968o795J7188j0817o659J6313
4097H473j0555n303J4881j1225k900J3979j2859q19J4223j4782K35J5285j5953
4110g320K95J5700j5480P3J4816j4421R79J2875j4114L250J0961j5058N890J0248
4124H694j6768P491J0527j8047P763J1023j7840P215J0361j6571P284Q277j5279
4137e870Q677N750j5236J1084L912j6293J2849L734j7573J3409M139j7739J2764
4150C607L982j6436J2053K484j4540J2477O7j3209J4112k217j3337J6155l145
4163B053j4116J7081k811j4460J6653k378j3414J5547l170j1107J4924n046r170
$$ y = [3302, -7999, 8281, 3817, -7864, 8539, 4029, -7154, 8521, 3626, -6230, 8667, 2407, -5684, 9298, 842, -5871, 10028, -244, -6718, 10211, -757, -7552, 9636, -1181, -7840, 8473, -2082, -7385, 7496, -3729, -6629, 7350, -5509, -6328, 7895, -6887, -6652, 8633, -7320, -7025, 8675, -6805, -6732, 8084, -6337, -5358, 7517, -6597, -3347, 7614, -7444, -1554, 8694, -8074, -583, 9944, -8103, -340, 10683, -7157, 58, 10419, -6152, 1132, 9409, -5870, 2807, 8557, -6679, 4405, 8317, -7976, 4873, 8607, -8966, 4443, 8582, -9157, 3607, 7589, -8847, 3206, 5690, -8850, 3627, 3694, -9515, 4597, 2380, -10957, 5198, 2053, -12063, 5018, 2207, -12253, 4400, 2022, -11392, 4155, 985, -10122, 4802, -244, -9414]
4176i414J5844p463q152J7231q927q406J8399r157q820J8151q678q114J6719q685
4190E28o237J5215r846l997J4733j1882k342J5307j3739j770J5952j4236k073
4203d387J5822j3848j853J4523j3245n89J2628j3446J495J1390j4684L486J1062
4216H354j5979M583J1256j6502M602J1394j6123M666J0505j5169N278Q954j4516
4229h697O780P313j4629Q510O325j5185R658O156j5673J0044O155j5475R925N532
4243F739j4484J0040M181j3507J0691K502j2943J1845J058j2996J2794K60j3090
4256f910J3121j61j2851J2975o98j2027J2682j680j0897J2564k968r884J2971
4269F237m308r194J3490n257q859J3753n701q335J3495o032p450J3094o492o386
$$ y = [-9414, 6430, -1033, -9185, 8046, -881, -9287, 9112, -45, -8865, 9286, 608, -7506, 9213, 528, -5709, 9506, -340, -4337, 10396, -1486, -3828, 11479, -2260, -4030, 11922, -2314, -4387, 11435, -2413, -4266, 10257, -2988, -3577, 9051, -4395, -2900, 8490, -6194, -2708, 8354, -7625, -3042, 8214, -8288, -3686, 7708, -8415, -3749, 6756, -8413, -3135, 5819, -8697, -1917, 5396, -9233, -723, 5602, -9583, 75, 6231, -9442, 602, 6757, -8718, 1207, 6739, -7745, 2295, 6476, -7031, 3660, 6162, -6781, 5064, 6122, -6874, 5920, 6180, -6910, 6211, 6050, -6801, 6174, 5476, -6551, 6131, 4451, -6446, 6118, 3150, -6734, 6237, 1929, -7265, 6225, 968, -7891, 5862, 161, -8174, 5321, -711, -8161, 4933, -1559, -7945]
4283g945J2693p143n174J2531q058m082J2451q573l417J2432q988k778J2116r154
4297c089k123J1641r262j239J0848r513k78J0317r928N36R903j0327J184R418
4311H088j0443J648Q877j0648K219Q219j0612K676P550j0655L374O812j0746L841
4325B00O220j0726M389N574j0621M896M846j0428N413M229j0155N828L554r781
4339f562O170K907r380O591K341r034O899J876q624P261J163q166P492O06p628
4354f088P625J39p180P841m49o717P862r42o166P771j449n641P685j950n162P482
4370D661k383m667P448l001m125P177l267l854P025l629l405O735l896k987O417
4385D249m094k596O152m339k135N928m468j689N647m680j222N433m721q54N159
$$ y = [-7945, 4748, -2395, -7569, 4962, -3096, -7178, 5273, -3300, -6717, 5715, -3273, -6051, 6065, -3089, -5212, 6429, -2833, -4072, 6776, -2737, -3015, 7302, -2626, -2090, 7813, -2514, -1330, 8088, -2355, -707, 8170, -2478, -259, 7960, -2652, 24, 7574, -3081, 293, 7105, -3641, 200, 6420, -4306, 83, 5657, -4964, -68, 4778, -5650, -237, 3992, -6163, -335, 3219, -6562, -392, 2515, -6865, -274, 2067, -6967, -68, 1808, -6816, 445, 1608, -6558, 934, 1540, -6088, 1537, 1676, -5504, 2337, 1888, -4829, 3033, 2091, -4075, 3696, 2247, -3394, 4291, 2341, -2821, 4661, 2278, -2389, 5059, 2058, -2067, 5110, 1843, -2011, 5014, 1385, -2020, 4715, 819, -2168, 4249, 155, -2441, 3711, -628, -2763, 3165, -1303, -2992, 2655, -2025, -3247, 2186, -2535, -3389, 1770]
4400A770m651m10M761m520l8M470m518L85M191m500P38L915m345R60L660m235
4416b367J285L313m130J538K861l814J589K627l803J774K223l622J930J771l451
4431b76J981J498l274J960J141l158J862R21k954J873O27k737J707M30k544J712
4447G69K16k249J594K0k066J494k9j831J513j35j565J344l9j435J340j64j133
4464b356J190nr42R24J27p42R04P4m68P75J48l91O43K91l24L65N04l63K75N14
4484A143k42o3P53l14j45O34k19m09P68l44m50Q30m97o64J067o67q08J203q51
4503G25q52J390r31j037J624j059j143J728j137j004J864j353q72K024j612p27
4519b372K253j742o66K488j900n80K738k143m35K845k286k12K946k501K3K998
$$ y = [1770, -2881, -3291, 1470, -3050, -3088, 1382, -3136, -2751, 1440, -3060, -2322, 1593, -2752, -1792, 1868, -2367, -1082, 2231, -1899, -361, 2500, -1314, 275, 2902, -901, 873, 3096, -526, 1404, 3175, -276, 1705, 3203, -71, 1889, 3030, -128, 1734, 2655, -299, 1574, 2201, -536, 1171, 1601, -943, 769, 985, -1264, 330, 350, -1716, -222, -251, -2082, -569, -704, -2269, -925, -964, -2399, -1059, -1223, -2356, -1166, -1171, -2113, -1189, -1062, -1804, -900, -826, -1294, -519, -371, -762, -119, 172, -152, 213, 717, 354, 629, 1143, 901, 838, 1591, 1277, 1132, 1766, 1547, 1138, 1906, 1562, 1112, 1942, 1445, 781, 1848, 1181, 373, 1576, 725, -127, 1263, 332, -705, 919, -140, -1283, 445, -692, -1696, 168, -1185, -2057, -33, -1645, -2372, -119, -1861, -2527, -39, -1939, -2519, 219, -1924, -2359, 486, -1800, -2012, 934, -1567, -1544, 1454]
4535A454k768K02L244l192M65L309l395O33L236l628Q27L154l910J142L013m129
4551c43J322K928m483J670K704m708J899K601m961K261K437n278K619K212n426
4566b546K954J957n463L265J683n557L671J324n572M208R82n518M594O61n534
4581d891N047L22n455N352J20n432N771k85n295O137o56n096O399j091m999O808
4597B756j634m680P131k259m464P286k618m338P442l124l950P457l605l643P549
4612E306m265l380P791m887k866P774n388k634P802n837k257P850o306j730P747
4627D720o856j141P655p162n99P544p607p0P505q062N59P355q379J259P165q736
4643d850J897O847q946K643O498r238L362O174r406L948N782r530M535N244r602
$$ y = [1454, -1314, -1112, 2132, -1060, -595, 2714, -681, -48, 3188, -440, 387, 3541, -369, 773, 3786, -343, 979, 3907, -576, 1094, 3798, -910, 989, 3590, -1371, 890, 3327, -1951, 668, 2880, -2546, 408, 2365, -3098, 167, 1850, -3707, -36, 1288, -4284, -76, 906, -4612, -18, 643, -4891, 156, 478, -4977, 375, 495, -4937, 834, 549, -4746, 1391, 735, -4361, 2038, 947, -4052, 2756, 1122, -3558, 3573, 1314, -3150, 4136, 1518, -2820, 4622, 1498, -2452, 5005, 1400, -2243, 5306, 1041, -2339, 5452, 565, -2301, 5473, 85, -2549, 5253, -584, -2841, 5009, -1297, -3027, 4720, -2136, -3277, 4378, -2784, -3383, 4161, -3446, -3516, 3989, -4073, -3514, 3841, -4538, -3279, 3886, -4850, -2953, 3894, -5052, -2409, 4089, -5149, -1787, 4387, -5019, -1071, 4711, -4819, -284, 4960, -4642]
4658d642N237M631r631N759M083r781O395L559r977P056K886r969P410K305r789
4673d468P792J589r655Q276Q17r463Q802m6r245R264o66r206R839j265q949R985
4689C401j840q438J0235k543p912J0593l474p338J1099m279o860J1526m949o513
4703g292J1668n317o073J1737n766n340J1545o453m362J1404p281l424J1494q148
4717a608k761J1693q917k307J1651r225j895J1334r467j211J0685r830o3R866
4731G945j0579J189R511j1509K093R455j2133K484R341j2311K872Q763j1977L299
4745a557P774j1730M367O652j1964N765N770j2543O955N567j3113P553N461j3042
4759h085P515N195j2483P763M096j1575Q528K620j1185R667J526j1495J1011Q72
$$ y = [-4642, 595, 5226, -4405, 1354, 5437, -4344, 2051, 5610, -4367, 2689, 5575, -4394, 3016, 5321, -4468, 3324, 4913, -4742, 3534, 4351, -5112, 3690, 3644, -5601, 3663, 2997, -6209, 3630, 2365, -6584, 3401, 1561, -6877, 3358, 815, -7097, 3496, 22, -7316, 3783, -496, -7356, 4170, -779, -7292, 4376, -941, -7014, 4723, -1043, -6383, 5162, -1291, -5653, 5751, -1530, -4954, 6540, -1608, -4369, 7324, -1593, -3900, 7751, -1474, -3369, 7965, -1502, -2713, 7972, -1858, -1921, 7945, -2634, -1445, 8066, -3443, -1350, 8105, -4028, -1544, 7797, -4514, -1642, 7121, -4856, -1557, 6217, -5513, -1146, 5506, -6458, -693, 5077, -7466, -511, 5056, -8057, -504, 4957, -8085, -570, 4625, -7858, -95, 4001, -7574, 954, 3574, -7611, 2056, 3582, -7913, 3098, 3970]
4773C970j1861J1557P04j1851J1486N24j1198J1131l78r991J1204j961r021J2026
4787F341l598q660J3085m646q850J3623m904q880J3380m878q185J2608n466o683
4801e713J1932o663n075J2004q255m132J2761r424l891J3371r723l931J3232r459
4815b966l487J2167r109k100J1030r828k95J0498j1098J318J0583j2219J749J1128
4829G371j2529J661J1141j2238J764J0113j1537K704Q642j1520M195P378j2197
4842e052N826O833j3227O747O972j3782O787O844j3452O580O202j2604O759M702
4856F135j1852P911L020j1832R422J922j2260J0426J681j2695J0599J675j2368
4869h216J0347J229j1272J0191n3r943J0575j602r156J1555k826r015J2533l552
$$ y = [3970, -7891, 3666, 4370, -7481, 4005, 4529, -6669, 4462, 4084, -5907, 5297, 3336, -5685, 6341, 2743, -5917, 7168, 2522, -6328, 7295, 2391, -6489, 6891, 2013, -6172, 6436, 970, -5713, 6219, -444, -5519, 6485, -1770, -5902, 6859, -2565, -6456, 6915, -2808, -6739, 6493, -2966, -6453, 5714, -3395, -5495, 5535, -4293, -4588, 5910, -5188, -3870, 6713, -5506, -3757, 7371, -5158, -3497, 7644, -4594, -2830, 7283, -4254, -1550, 7092, -4428, -233, 7145, -5052, 774, 7607, -5620, 1127, 8099, -5683, 1104, 7948, -5504, 1076, 7278, -5326, 1433, 6135, -5717, 2194, 5214, -6618, 2804, 4726, -7534, 2892, 4573, -8122, 2477, 4152, -8216, 2131, 3360, -7912, 2279, 2226, -7717, 2858, 1256, -7900, 3655, 829, -8186, 4347, 795]
4883G95q999J2808l564q804J2513l752p810J1820m379o409J1499n593n272J1742
4897F595o836m620J2269p657m349J2375p958m096J1958p959l576J1291q192k476
4911c231J0466q799j312J0109r595n23J0114j0418J60J0047j0637L79R824j0588
4925d004Q35R114j0536J727Q190j0479K736P427j0834L716P046j1182M397O777
4939D930j1267M857O271j0993N223N640j0615N718M774j0254O286L967j0134O974
4953A377L186j0052P576K607r993P920J999r574Q006J359r105Q170O22q708Q383
4968C773j59q208Q634r68p808Q832j569p366Q880k080p002R005k596o432Q831
4983C767l102n952Q861l540n324Q852m100m751Q775m523m157Q742m938l615Q583
$$ y = [795, -8204, 4604, 1040, -7764, 4749, 997, -6813, 5007, 628, -5781, 5718, 125, -5147, 6595, -241, -4861, 7408, -249, -4598, 7777, -181, -4277, 7681, -278, -3854, 7437, -755, -3231, 7235, -1564, -2876, 7233, -2362, -2885, 7229, -3189, -3029, 7018, -3619, -3240, 6584, -4004, -3169, 5945, -4591, -2864, 5326, -5153, -2417, 5010, -5824, -2108, 4938, -6244, -1847, 4930, -6337, -1480, 4791, -6202, -979, 4661, -5954, -236, 4538, -5716, 570, 4537, -5597, 1377, 4563, -5489, 2087, 4694, -5299, 2621, 4620, -4954, 3052, 4411, -4694, 3476, 4098, -4610, 3773, 3614, -4594, 4040, 3072, -4736, 4096, 2527, -4839, 4041, 1961, -5041, 3964, 1368, -5064, 3767, 665, -5287, 3574, 34, -5290, 3562, -538, -5289, 3486, -1037, -5194, 3548, -1390, -5005, 3578]
4998C578n229l112Q546n515k542Q231n717j986P975o058j391P710o199q74P276
5013D693o404l57P034o631K03O592o688N07O213o747R02N800o903J427N208o872
5029b023J862M781o859K194M314o847K554L831o745K973L330o698L220K981o462
5044c594L389K567o178L635K149n970L892J649n693M101J434n489M263J106n322
5059d061M488P72m959M478M73m604M461J40m258M525k18l924M576n20l712M548
5075B205p61l470M488j028l156M379j306k822M144j451k542M096j771k301L912
5090B616j883j995L683k013j800L619k270j441L351k244j187L160k300j060L049
5105A285k278p45K754k200n63K501k137l42K379k122l9K203k147M6K058j956J85
$$ y = [3578, -1651, -4763, 3783, -1732, -4274, 3957, -1760, -3746, 4229, -1829, -3220, 4490, -1709, -2583, 4693, -1711, -2068, 4966, -1665, -1462, 5130, -1558, -1051, 5162, -1585, -683, 5117, -1786, -359, 4849, -2023, -161, 4620, -2239, -45, 4269, -2578, -24, 3807, -2938, 35, 3365, -3333, -113, 2868, -3594, -205, 2362, -3816, -181, 1968, -4002, -110, 1539, -4154, -53, 1381, -4108, 155, 1261, -4061, 427, 1199, -3760, 718, 1191, -3413, 1048, 1188, -3070, 1455, 1237, -2687, 1889, 1369, -2343, 2205, 1444, -2026, 2462, 1434, -1722, 2657, 1351, -1471, 2673, 1222, -1320, 2776, 1005, -1296, 2616, 733, -1262, 2421, 408, -1392, 2227, -43, -1484, 1867, -377, -1564, 1596, -704, -1764, 1285, -993, -1738, 1016, -1184, -1747, 754, -1383, -1725, 654, -1468, -1507, 696, -1451, -1405, 653, -1303, -1118]
5122a118J906j816J59J726j693K90J569j524L64J281j441M43J088j345N50R75
5138A414j294M85R14j314M23P03j037L32N88r37K73N06q28J38M00o46P4L33o83
5157a56J52L34o33o5M39n85n5L47k98k15K66j17m19M53K4n01M83M0m93N25o9m59
5179a002P20K5o94R35Q4r30J035J61j046J113J86j142J167J18j086J239o5j121
5197c03J400j21j314J654k61j469J823l84j611J983n24j516K024o63j502K050
5213A266q53j489K346j114j442K477j359j298K497j436j371K815j678j236K881
5228A006j817j070K915k019r67L019k181p94L209k498n47L305k727l38L264k886
5244a126j56L295l128Q6L371l389L96L208l471M97L171l799Q43L076m017J187
$$ y = [-1118, 788, -1028, -869, 857, -836, -546, 1023, -501, -137, 1144, -297, 146, 1234, -111, 439, 1414, 120, 605, 1519, 205, 628, 1331, 294, 626, 1214, 277, 550, 1056, 228, 366, 766, 120, 194, 527, -156, -4, 330, -303, -368, 71, -514, -569, -222, -520, -735, -469, -586, -1005, -552, -528, -1029, -546, -506, -999, -474, -543, -1002, -282, -257, -951, -16, 68, -862, 173, 334, -712, 401, 587, -555, 612, 730, -356, 883, 818, -303, 1097, 976, -338, 1316, 1055, -414, 1409, 1025, -586, 1397, 873, -643, 1381, 718, -784, 1266, 413, -1076, 1270, 156, -1286, 1191, -168, -1466, 1031, -405, -1776, 1039, -639, -1875, 1006, -811, -1881, 1034, -985, -1952, 1067, -1114, -1908, 1301, -1197, -1744, 1561, -1166, -1504, 1760, -1126, -1282, 2013, -1115, -1029, 2342, -1047, -651, 2557, -914, -417, 2754, -1045, -202, 2874, -1143, 44]
5260D4K871m200J423K713m313J691K563m512J939K480m587K261K102m739K625
5275C61J871m798K935J626m892L303J407m857L484J120m859L781R07m846M125
5290F68N37m824M487J91m728M809j13m711N227n88m522N352q33m358N563j220
5306I37m224N760j530m011N890j998l726O079k475l460O240k931l192O339l422
5321B76k790O371l833k493O366m181k093O318m601j722O308m965j338O228n303
5336a452q96O214n688n33O127n994j7N948o285M28N672o430J028N358o652J521
5352a651N182o920J965N024p114K408M655p144K909M246p251L435L958p442L902
5367A62L552p453M344L178p517M678K737p472N132K191p370N570J699p387O019
$$ y = [44, 2915, -1285, 138, 2851, -1462, 229, 2792, -1720, 219, 2699, -1888, 373, 2475, -2264, 361, 2232, -2566, 369, 1995, -2897, 406, 1813, -3044, 440, 1560, -3299, 482, 1389, -3457, 668, 1205, -3619, 868, 1059, -3669, 1140, 1027, -3684, 1543, 955, -3567, 1785, 952, -3406, 2157, 937, -3287, 2473, 943, -3068, 2822, 824, -2902, 3177, 702, -2758, 3482, 551, -2641, 3698, 276, -2514, 3857, 24, -2469, 3897, -284, -2377, 3941, -660, -2382, 3926, -1039, -2377, 3851, -1452, -2348, 3866, -1822, -2355, 3772, -2222, -2239, 3709, -2576, -2148, 3524, -2906, -1878, 3480, -3172, -1651, 3531, -3389, -1424, 3600, -3514, -1106, 3549, -3595, -686, 3560, -3691, -256, 3702, -3740, 162, 3714, -3739, 605, 3783, -3734, 944, 3681, -3791, 1341, 3532, -3838, 1732, 3431, -3956, 2063]
5382B063J141p315O440O28p166O666K67p111O909k65o676P108q30o371P428j477
5398A439o170P812k071n763Q009k610n496Q160l010n155Q306l484m530Q144m032
5413d51l939Q253m655l340Q273n166k954Q402n534k614Q334n874k104Q066o085
5428a388j492P749o488q17P495p033j52P347p485L17P344p886P44P109q020J176
5444a480O699q094J706O142q198K355N667q550L179N296q857L707N013q997M002
5459d10M773q956M403M230q775M878L497q537N401K757q390O070K262q536O647
5474A314J881q599O935J511q384P150R95p838P203L46p344P563n99o914P983j363
5490A840o643Q435j856o558Q646k183o188Q423k468n707Q308l154m934Q347l914
$$ y = [2063, 3204, -4111, 2329, 2957, -4209, 2457, 2724, -4387, 2522, 2257, -4419, 2689, 1859, -4512, 2916, 1439, -4731, 3081, 1010, -4753, 3256, 646, -4850, 3310, 300, -4855, 3451, -33, -4563, 3581, -451, -4390, 3863, -792, -4132, 4141, -1025, -3979, 4423, -1111, -3725, 4609, -1265, -3369, 4697, -1388, -2880, 4869, -1619, -2436, 5059, -1974, -2126, 5221, -2264, -1947, 5397, -2489, -1745, 5364, -2656, -1480, 5219, -2875, -1169, 4973, -3225, -870, 4797, -3753, -574, 4722, -4135, -428, 4585, -4412, -410, 4363, -4593, -190, 4040, -4735, 143, 3640, -4897, 504, 3261, -5129, 941, 3203, -5333, 1314, 3195, -5404, 1531, 3042, -5342, 1808, 2803, -5035, 2168, 2514, -4830, 2733, 2134, -4780, 3203, 1840, -4803, 3632, 1776, -4782, 3864, 1681, -4507, 3916, 1448, -4259, 4049, 895, -4039, 4308, 394]
5505C94m327Q496m606l976Q732n082l677Q723n289l351Q533n519k771Q300o001
5520a421k026P957o457j177P761p028o37P770p495q7P590p605J93P401p687P15
5536b233O859p755J337O297p897K100N880q286K856N512q444L194N257q419L522
5551b20M811q493L989M261q169M283L629q060M817K905p856N280K452q026N870
5566A473J961p918O063J522p577O184J053p266O442M51o941O695k30o531P038
5581B419p83o287P277j287n981P383j559n725P414k017n308P480k466m755P423
5596C228k952m285P537l521l851P610l805l608P519m171l110P374m420k767P255
5611D033m716k148P025n215j616O969n579j201O789n847p23O499n986l83O314
$$ y = [394, -3933, 4563, -43, -4019, 4713, -369, -4046, 4677, -612, -3963, 4570, -949, -3720, 4580, -1421, -3447, 4510, -1947, -3124, 4637, -2391, -3028, 4742, -2753, -2840, 4750, -2855, -2662, 4739, -2948, -2233, 4626, -3129, -1792, 4505, -3392, -1292, 4588, -3698, -842, 4670, -3774, -580, 4677, -3742, -220, 4591, -3902, 87, 4348, -3821, 462, 4091, -3969, 848, 3753, -4103, 1177, 3629, -4397, 1473, 3434, -4484, 1579, 3101, -4476, 1708, 2761, -4505, 1937, 2388, -4553, 2142, 1912, -4619, 2419, 1636, -4651, 2626, 1339, -4642, 2741, 1182, -4543, 2871, 854, -4454, 3026, 560, -4195, 3228, 276, -4009, 3528, 7, -3844, 3766, -39, -3647, 3872, -299, -3409, 3965, -455, -3222, 4033, -683, -2831, 4194, -1021, -2637, 4332, -1247, -2448, 4341, -1506, -2229, 4270, -1716, -2099, 4215]
5626D215o188J63N808o216P03N402o305J087N130o541J556M802o517J931M452
5641C482o552K380M000o473K682L631o458L038L272o332L371K805o285L729K462
5656B752o197L998J997n952M230J582n821M495J227n589M586Q90n405M754L86
5671A933n101M829J59m965N027k11m772N129o82m362N169r87m199N313j353l865
5687b938N175j528l545N154j838l284N176k090k998N084k364k567M988k595k300
5702b470M991k907k041M874k991j639M651l114j302M398l288r41M270l514n94
5717a617M040l467m06L878l627k6L648l635K25L324l617M07L190l665P40K818
5733B210l587R01K625l612J093K492l660J347K174l588J501J962l489J634J744
$$ y = [4215, -1973, -1810, 3998, -2218, -1515, 3887, -2418, -1331, 3799, -2742, -1186, 3616, -2901, -970, 3482, -3070, -690, 3310, -3163, -481, 3150, -3308, -270, 3002, -3330, 41, 2846, -3439, 290, 2752, -3445, 553, 2550, -3402, 828, 2410, -3411, 1084, 2311, -3278, 1308, 2198, -3207, 1547, 1933, -3168, 1661, 1820, -3145, 1882, 1671, -3101, 2028, 1346, -3016, 2153, 1166, -3033, 2280, 927, -2938, 2237, 709, -2836, 2318, 480, -2804, 2372, 282, -2716, 2368, 4, -2563, 2425, -170, -2470, 2521, -386, -2427, 2447, -544, -2183, 2468, -646, -1948, 2450, -838, -1779, 2491, -1023, -1617, 2423, -1044, -1450, 2428, -1199, -1225, 2423, -1212, -987, 2337, -1280, -873, 2317, -1348, -608, 2210, -1377, -476, 2149, -1463, -370, 2122, -1538, -191, 1983, -1605, -104, 1858, -1631, 3, 1747]
5748A747l380J694J561l297J801J331l131J903J112k989J998Q63k847K017O74
5763A057k792K178N26k565K104L58k407K199J35k352K241o0k083K185j14k005
5779a395K134k88j708K093m21j603J964m32j465K004o03j251J780o62j047J790
5795H90p79q74J577p29q60J554o52q65J551q11n69J305p92n57J271o98m46J092
5813F08p30l15R80o88k92J023p28k50Q84o40j94Q04o22j43O21l77k34O10l89j78
5833b50N23l61j07L84k53j81M74k85j59L76j82j67L20j40k42L44l2k87K61J01
5853A37l07K65P3m22K48K11m49L51J47n18L23L01o63L04L81p02L52L89p87M36
5873G0L11q31N20L92r24N78L00r67P31L38j096P82K92j126P59L80j196R19L07
$$ y = [1747, -1633, 61, 1622, -1675, 126, 1457, -1674, 229, 1341, -1648, 350, 1213, -1634, 383, 1057, -1735, 443, 969, -1596, 508, 866, -1541, 658, 793, -1559, 682, 622, -1461, 724, 610, -1395, 739, 451, -1257, 836, 415, -1188, 776, 344, -1121, 883, 280, -971, 809, 147, -900, 890, 111, -763, 814, 85, -775, 779, 127, -738, 813, 2, -567, 738, -54, -611, 660, -38, -484, 608, -122, -437, 543, -145, -437, 586, -142, -392, 492, -148, -342, 462, -160, -303, 318, -59, -293, 317, -72, -250, 273, -88, -195, 189, -64, -245, 229, -56, -215, 161, -21, -188, 132, -8, -250, 94, 62, -225, 36, 137, -170, 95, 168, -254, -6, 205, -244, 107, 254, -264, 59, 360, -303, 1, 382, -320, 32, 421, -366, 70, 381, -450, 70, 462, -462, 116, 416, -551, 180, 518, -578, 204, 496, -630, 129, 509, -687, 232, 539]
5892E39j355J070K64j334J173J35j330J178R0j380J333J18j503J444q4j410J602
5909E50k46j351J663l17j383J789m87j264J863o81j254J989p81j167K070q70j202
5926a079K130j010j152K226j198r63K328j431q10K331j554q56K442j692p60K494
5942A446j841m74K405k018l50K360k153k06K401k301k4K341k487J89K364k591
5958i39L14K263k717N24K186k886P99K053k949Q93K069l015J118J855l138J391
5974a79J691l156J517J684l296J720J469l180J914J322l255K059J139l289K307
5989D67R46l242K486P60l394K752N60l278K898K80l249L126Ml110L230k43l019
6006b026L385m86k910L525p41k859L650r87k622L730j295k465L866j594k248L861
$$ y = [539, -816, 254, 518, -816, 357, 492, -838, 340, 430, -950, 383, 501, -1002, 442, 358, -1052, 550, 304, -1047, 616, 299, -1084, 705, 218, -1046, 817, 136, -1118, 871, 90, -1077, 993, 123, -1079, 1051, 41, -1111, 1115, -83, -1046, 1282, -149, -959, 1372, -182, -1038, 1404, -288, -1048, 1446, -395, -869, 1536, -482, -832, 1528, -625, -831, 1570, -731, -755, 1586, -901, -712, 1652, -939, -625, 1638, -1079, -555, 1631, -1255, -456, 1597, -1352, -459, 1610, -1405, -287, 1568, -1570, -179, 1512, -1644, -127, 1557, -1739, -19, 1450, -1730, 184, 1506, -1749, 310, 1449, -1840, 467, 1413, -1829, 657, 1417, -1977, 775, 1335, -1943, 955, 1235, -2014, 1112, 1116, -1994, 1236, 993, -2026, 1359, 873, -2037, 1488, 747, -2112, 1538, 551, -2071, 1659, 364, -2101, 1765, 171, -2077, 1784]
6022A784j757k090L981k075j797L889k256j670M007k489j419M002k747j129L925
6037B159k901r20L933l200o50L912l301m39L859l581q0L629l650J78L617l931
6053a366M72L417m045P70L349m210J043L203m348J316K949m358J565K721m439
6068a961J841K573m643K174K369m677K393K122m572K585J975m708K795J681m645
6083b698L211J224m497L440R29m402L619O38m269L848L54m270M085J15m276M361
6099A412k36l914M339o40l633M432q91l476M631j318l255M734j567l067M777j813
6115E15k899M774j986k702M800k335k338M843k721k078M811l019j732M895l420
6130e92j508M892l477j316M777l662j057M693l868o16M426m058k70M335m339J41
$$ y = [1784, 27, -2063, 1918, -157, -1954, 1935, -321, -1991, 2016, -473, -1892, 2110, -637, -1766, 2159, -742, -1662, 2271, -929, -1579, 2333, -968, -1407, 2452, -1129, -1209, 2420, -1230, -1052, 2565, -1366, -894, 2523, -1522, -752, 2597, -1613, -570, 2633, -1715, -399, 2550, -1808, -243, 2478, -1961, -120, 2453, -2190, -16, 2353, -2324, 69, 2191, -2381, 204, 2179, -2529, 266, 1947, -2698, 513, 1737, -2760, 680, 1609, -2793, 826, 1464, -2805, 1043, 1397, -2873, 1212, 1327, -2949, 1412, 1176, -2738, 1601, 961, -2672, 1760, 869, -2607, 2024, 706, -2549, 2185, 618, -2449, 2328, 515, -2384, 2390, 404, -2298, 2502, 167, -2171, 2672, -49, -2127, 2684, -335, -2067, 2828, -592, -2100, 2792, -685, -2001, 2776, -886, -1943, 2750, -1118, -1734, 2692, -1366, -1636, 2699, -1640, -1499]
6146a499M225m544L12M279m650O22L912m686R35L696m701J310L311m806J843K963
6162B522m802K016K808m980K409K711n070K535K412m943K701K091m756K905J763
6177B322m782L228J394m670L585J017m767L755R27m742L927N85m484L989K76m298
6193b738M106j44l923M211n47l711M393q30l748M680j088l585M717j268l357M689
6209A857j535l076M749j948k572M642k250k330M765k545k159M875k846j897M839
6224B569k890j770M746l098j457M519l233r98M355l510o70M293l874k86M257m077
6240a124q3M110m128K06L870m149L22L656m160P23L244m233J167L045m362J370
6256e26K887m523J660K753m524J862K569m502K000K247m216K153J893m129K509
$$ y = [-1499, 2726, -1818, -1506, 2773, -1877, -1255, 2657, -2029, -1094, 2602, -2099, -789, 2522, -2284, -441, 2522, -2280, -264, 2544, -2436, -27, 2684, -2386, 149, 2561, -2382, 319, 2410, -2346, 559, 2322, -2460, 768, 2162, -2508, 1077, 2094, -2673, 1082, 2009, -2733, 1194, 1779, -2705, 1284, 1560, -2738, 1368, 1224, -2699, 1512, 965, -2746, 1647, 817, -2931, 1749, 661, -2924, 1793, 525, -2832, 1857, 322, -2754, 1995, 47, -2525, 2117, -133, -2463, 2302, -243, -2402, 2473, -373, -2270, 2569, -321, -2091, 2655, -443, -1900, 2619, -614, -1612, 2743, -767, -1437, 2856, -1018, -1304, 2953, -1124, -1207, 2903, -1225, -1019, 2851, -1298, -976, 2680, -1480, -757, 2487, -1746, -579, 2466, -1896, -526, 2361, -2162, -502, 2251, -2273, -411, 2158, -2344, -344, 1903, -2313, -160, 1733, -2396, 113]
6271A13J594m149K739J331m148K966J124m103L169Q87l925L211P16l807L294L13
6287A325l538L539K2l508L716l63l299L778n36l252L894q08l006L883j006k767
6303a926L755j172k568L697j371k310L788j829j915L752j959j834L782k217j550
6318a877L697k237j417L628k403j167L546k570q23L378k735m68L157k774k81L161
6334A815k969m6L087l002J21K850k944K88K708l040N57K513l022O92K333l079
6350a138J016K105l151J127K000l185J293J813l116J355J683l058J512J389l024
6365a379J733J104k898J796R20k796J917Q02k854K038N90k740K174M83k704K190
6381C76K81k424K157J05k242K281j36k151K407l31k038K417l97j850K356m80j795
$$ y = [113, 1707, -2442, 297, 1628, -2520, 446, 1570, -2533, 636, 1523, -2402, 809, 1525, -2282, 1012, 1325, -2213, 1326, 1348, -2160, 1556, 1193, -2106, 1672, 1136, -2116, 1778, 970, -2036, 1847, 841, -1926, 1829, 657, -1911, 1786, 415, -1895, 1893, 64, -1851, 1901, -58, -1892, 1890, -327, -1877, 1820, -417, -1834, 1794, -609, -1776, 1770, -800, -1623, 1755, -980, -1448, 1709, -1065, -1346, 1815, -1154, -1200, 1887, -1115, -994, 1856, -1088, -800, 1908, -1132, -575, 1938, -1084, -392, 1941, -1138, -122, 1983, -1168, -41, 1959, -1226, 67, 1880, -1236, 119, 1802, -1256, 256, 1645, -1379, 354, 1458, -1440, 356, 1276, -1520, 397, 1199, -1655, 383, 973, -1767, 407, 890, -1814, 376, 657, -1767, 390, 495, -1747, 534, 398, -1753, 654, 323, -1715, 702, 305, -1545, 811, 331, -1464]
6398a464K345n21j676K385p76j416K273q85j221K206j046j092K265j189r90K159
6414A357j131r35K101j252p79J946j293o13J818j321m72J842j507l69J742j531
6430c97k26J646j591j65J661j508q8J446j517O5J357j580K22J277j473L50J092
6447E71j394L51J046j409M92R26j393N07R68j404O05P31j208N66P48j293O88O40
6465G38j176O81N27j146P75M06j198P99K67r30O56K78r94P61J92r78O72K30q64
6484c04N79J00p15O31k1p55O29n4n91N62m4n50N56n9n38N06o6m76M20J1l42M39
6506h2j25k71M03r6k59M49j34k72M66r4k35K93J6k13K59O5j21J19R0j73K21q6
6528B20j6R0k0j27J66L7k10O5K26k92O5J94k57j45L23k20p4K27k59q0K61k61r4
$$ y = [-1464, 881, 360, -1316, 1069, 293, -1123, 1150, 265, -956, 1250, 204, -888, 1377, 188, -802, 1357, 226, -709, 1392, 140, -639, 1307, 14, -599, 1219, -102, -574, 1268, -239, -608, 1134, -397, -623, 1023, -568, -733, 928, -580, -668, 778, -739, -674, 683, -897, -675, 602, -871, -521, 571, -823, -472, 574, -835, -343, 583, -810, -303, 665, -739, -134, 597, -611, -45, 703, -590, 98, 738, -438, 243, 770, -376, 399, 805, -393, 406, 673, -257, 399, 677, -317, 444, 636, -342, 330, 560, -304, 275, 375, -340, 291, 270, -485, 144, 90, -501, 61, 17, -533, 23, -36, -574, -68, -134, -610, -190, -179, -521, -82, -207, -478, -75, -171, -430, 19, -115, -387, 79, -15, -250, 43, 59, -154, 105, 170, 49, 168, 258, 85, 306, 220, 204, 294, 274, 147, 313, 350, 140, 205, 431, 139, 204, 398, 141, -4, 319, 99, 25, 252, -7, -87, 174, -87, -181]
6551a81K72l32J9K66l61r2M57m47n3M55l77j34N20m26K5M25m42M6M45m78J28M11
6573A46m87J33N73p07J21P39p69K18O37q22K42O26q12K52O58r38M55N02r71M44
6593B40N23r85N29N19j103M81M79j069O43L80j138O54L60j190Q75K30j165Q73
6611A36J51j107Q31K27j147R99J06j227J075J39j236J148jj187J259r5j095J269
6629B45j29j110J404k85r57J384m16r39J525m95r56J540n50r23J572o80p66J569
6647A033q07o67J487q18p37J652j015n73J654j174n94J713j214m71J705j449k54
6664e29J515j401j80J525j457q0J465j592J22J503j739K00J422j704K02J481j745
6681i92M02J306j785N61J225j773O59J278j962Q90J144k009R39J113k006R83J092
$$ y = [-181, 91, -241, -222, 44, -317, -409, 48, -399, -452, 3, -374, -508, 12, -414, -389, 36, -406, -360, 85, -393, -265, 146, -341, -208, 365, -342, -221, 518, -251, -33, 604, -218, 24, 650, -162, 90, 748, -190, 265, 767, -204, 240, 763, -222, 307, 826, -277, 204, 683, -386, 257, 637, -501, 153, 513, -677, 198, 428, -737, 136, 287, -820, 11, 238, -909, 90, 196, -1031, 44, 183, -1053, 95, 94, -1093, 166, 71, -1024, 245, 116, -994, 410, 125, -832, 552, 136, -803, 722, 227, -729, 811, 261, -662, 910, 230, -536, 1033, 226, -441, 1046, 228, -509, 1143, 128, -445, 1209, 35, -559, 1154, -60, -531, 1174, -275, -529, 986, -415, -595, 930, -527, -607, 858, -734, -612, 891, -848, -648, 774, -930, -728, 753, -992, -590, 716, -1069, -508, 717, -1056, -397, 881, -1081, -191, 953, -1056, -117, 996, -1010, -27, 1065]
6698A065k037J129Q33j852J287O37j941J465M34j912J563M24k012J620K78j907
6714i26J590K86j907J690N8j803J815j89j730J897l27j706K050m64j723K129n12
6731B28j603K138p02j495K150q51j316K196r57j197K235j128j068K266j232r54
6747a290K299j371q15K245j385o90K164j546m68K185j704l24K197j952j95K238
6763A588k032oK040k100J31J941k096L59J709k145M37J721k241N75J647k343O72
6780a43J532k395Q12J520k384R47J239k355J122J087k346J281R70k329J461Q18
6796H37k428J592P98k435J629P61k349J722M86k154J905K04k066K124p4k087K279
6813G44r4k197K428k10k068K376k17j911K138m29j684K306p05j469K383r52j507
$$ y = [1065, -972, 157, 990, -862, 425, 1062, -879, 586, 1020, -892, 671, 1095, -917, 703, 981, -926, 664, 950, -957, 733, 791, -1012, 803, 614, -1116, 781, 454, -1252, 798, 334, -1389, 740, 228, -1375, 763, 61, -1434, 716, -135, -1451, 745, -212, -1409, 826, -302, -1370, 896, -336, -1290, 1009, -362, -1177, 1068, -317, -1007, 1157, -389, -857, 1328, -376, -700, 1497, -455, -650, 1588, -444, -450, 1590, -510, -379, 1562, -534, -175, 1534, -611, -174, 1547, -694, -119, 1528, -815, -143, 1389, -1006, -194, 1326, -1058, -111, 1128, -1227, -105, 982, -1364, -83, 887, -1442, 19, 837, -1591, 1, 799, -1636, -7, 754, -1595, 127, 613, -1541, 364, 568, -1498, 626, 552, -1535, 744, 650, -1547, 881, 671, -1397, 979, 762, -1149, 989, 560, -1124, 1182, 477, -992, 1391, 439, -1068]
6830a068K589j184j489K698j213j464K577j277j243K404j373r57K319j587p60
6845a028K397j945n45K490k005n18K465j978o10K463j903l77K149j895q7J933
6861A006k068L20J902k295M52K030k451M55K083k541N80J861k292N69J688k211
6877i12Q59J306k207J103J270k483J422J125k642J525J174k577J360J141k456
6892i92J373Q75k294J554N19k239J813K61k176K006J35k351K156Q2k331K143J39
6909F73k165J991q8j946K024k90j699K078n47j446K172p87j603K560q95j582K455
6926I05p92j509K327q00j325K216r78j031K100j206q20K217j460o63K332j551
6942c8p60K280j503p50K280j531n43J948j519l80J880j690j17J827j863R2J746
$$ y = [-1068, 1521, 337, -1152, 1546, 333, -1131, 1446, 169, -1074, 1330, -43, -1000, 1319, -268, -1028, 1369, -576, -1121, 1369, -636, -1154, 1311, -667, -1277, 1186, -717, -1094, 1055, -840, -927, 1006, -1062, -742, 1160, -1135, -683, 1347, -1104, -649, 1434, -1107, -527, 1334, -958, -389, 1299, -912, -53, 1253, -954, 149, 1419, -1064, 358, 1483, -1159, 366, 1540, -1037, 323, 1464, -992, 381, 1256, -1038, 516, 1035, -1204, 609, 870, -1306, 700, 835, -1516, 640, 722, -1609, 534, 673, -1492, 499, 411, -1535, 489, 199, -1500, 578, 31, -1415, 757, -30, -1633, 927, 32, -1550, 905, 113, -1396, 931, 131, -1194, 1022, 44, -987, 1113, -93, -913, 1304, -156, -819, 1513, -38, -798, 1482, -21, -771, 1509, -22, -565, 1383, -136, -516, 1364, -326, -443, 1384, -479, -387, 1359]
6959A359k015J57J793j990J16J835k116K02J720k051M42J415j914O27J228k019
6975a211Q44J183k134J060J061k093J030J064k023J053R93j942J067Q61j922J306
6991A97N74j762J358L89j717J548K82j808J562L11j747J498L13j784J531J07j571
7008g19J496o7j378J424k34j324J626l17j370J698m84j250J667n13j273J644n19
7025A07j129J559n83r24J470o60q80J595q36p38J565q93o52J640r85n96J608r96
7043c28n42J484r26l65J369r62j83J250j122r1J374j313L0J313j185p2J360j247
7061a56K7J157j191J62R66j118K69Q67j322M09Q08j312N15P86j384N03P40j267
7079e41M36O85j176M76N66j165N42M91j053O11M11j152P77K73j064P86K46j009
$$ y = [1359, -656, -499, 1294, -696, -580, 1255, -861, -659, 1061, -990, -548, 867, -1047, -420, 808, -1211, -367, 816, -1318, -258, 803, -1290, -260, 804, -1219, -166, 827, -1115, -48, 813, -1109, 197, 771, -991, 367, 756, -961, 587, 869, -939, 623, 934, -813, 685, 998, -786, 745, 852, -719, 777, 710, -668, 756, 522, -802, 824, 507, -863, 835, 351, -899, 768, 255, -1018, 626, 107, -1022, 537, -46, -970, 500, -160, -1040, 555, -281, -1019, 546, -347, -999, 641, -344, -940, 668, -328, -870, 614, -312, -677, 692, -270, -453, 797, -325, -416, 958, -355, -325, 988, -197, -269, 1091, -156, -129, 1028, -163, -1, 965, -153, 116, 983, -339, 70, 878, -434, 81, 867, -517, -14, 726, -541, -105, 580, -596, -120, 446, -719, -177, 314, -739, -128, 283, -869, -92, 181, -883, -97, 149, -860]
7097h60Q34J90r88P99K25r28Q01J61q61Q29K3p49Q48j8p34R04k20o72R46j32p15
7118c17Q99k00n74P78k09n63Q22l59m28P66l74m43P33l04m83O97l72l81O93l96
7138a5k91O63n01k43N76m01j87N21l76j02M31m15q5M83m71j1M84m25J3L86l92
7159c58M5L89l81QM72m07L3M70m24R6L10l14J59K65l57J12L10m11J64K40l27N1
7181A45K25k38P1J37k34J18Q4j82J23j1k42J65L5l12J31J05k11O4P2j46r8J14
7203h5m1m8j6r1P4o3Mj0M8o0P2R7j04O3O2q9k0Q5R8j26J20N6n9l0J64ll0J75r1
7232A52O3j8j08J30K8j84K25R6k93J75J24l43J76N6k23K06rk39J42m5k06J49m
7255E0k51L34j22l74L78n6l16K94J8l74L11l1k36K81j23j73L60j28k33M47j70
$$ y = [-860, -26, 164, -824, -25, 200, -728, 73, 234, -627, 202, 225, -524, 324, 306, -428, 476, 256, -416, 530, 398, -317, 582, 382, -192, 586, 377, -186, 636, 277, -151, 615, 241, -202, 531, 227, -256, 441, 69, -312, 381, -15, -306, 357, -144, -387, 189, -212, -399, 122, -254, -356, 75, -340, -425, 58, -413, -424, 60, -365, -352, 34, -358, -313, 76, -305, -297, 175, -232, -199, 271, -153, -57, 253, -61, 98, 363, 6, 118, 428, 17, 181, 421, 94, 145, 370, 132, 203, 340, 106, 224, 308, 126, 249, 238, -4, 161, 196, -116, 15, 120, -91, -27, 45, -101, -199, -85, -126, -174, -190, -281, -207, -270, -266, -276, -228, -288, -216, -119, -223, -160, -98, -187, -207, -122, -24, -150, -30, 26, -33, -63, 101, 98, 68, 243, 152, 215, 197, 89, 219, 247, 63, 288, 384, 91, 266, 390, 47, 223, 279, 56, 262, 253, 14, 156, 111, -95, 54, 50, -201, 133, 11, -363, 15, -41, -357, -63, -45, -419, -108, -139, -375, -94, -217, -390, -30, -158, -391, 56, -114]
7276a14k69N05j66l27N52j92j94L87k05j66M81k12j93N04k87j84N75l89k08N50
7296D48l67j90N91l79j47N23l54j37N21n21m0M94n56k4N92o20L1M52n95J24M59
7317C05o28M8N53o30J19M22p29K80M34o28K54M01o76K77L98o64L74L41p55M06
7337i8L15o53L69L85p33N20L16p48L97L09o74M78K52p28N93J24o81N92N7o53O08
7358C47O6p16O34M9p41O97k4o95O64k3o31O40j09o16P92k84o09Q21k99m85P79
7379B57l13n41P44k54m71P67l69k79O88m57k34P81m35m22R36n96k88Q24m26k97
7399c85P50l65l23P78m96r0O46o28p5Q73p73m3P76o87q8Q08p29nN99o43K8O33
7421E61p57J37N12p58K62M96q20L04M92p72K06N51q45L34L84p62L46L95p52M22
$$ y = [-114, -383, 122, -44, -371, 181, -11, -205, 182, -23, -189, 292, 80, -113, 391, 104, -80, 495, 106, -102, 448, 81, -109, 482, 103, -44, 479, 125, -12, 509, -12, -52, 442, -114, -138, 454, -166, -135, 317, -278, -154, 305, -323, -275, 278, -352, -233, 189, -540, -260, 174, -454, -200, 201, -475, -198, 200, -464, -90, 251, -504, -98, 217, -436, -67, 318, -415, 105, 421, -327, 70, 379, -295, 183, 435, -293, 300, 424, -257, 335, 392, -261, 347, 413, -303, 331, 380, -361, 336, 312, -383, 281, 258, -373, 267, 158, -458, 334, 50, -559, 262, -37, -522, 257, -56, -597, 147, -107, -578, 189, -180, -459, 229, -228, -462, 319, -116, -538, 398, -198, -486, 338, -88, -385, 365, 0, -323, 455, -41, -131, 515, -113, -188, 685, -88, -131, 645, -42, -130, 678, -51, -56, 543, -100, -72, 561, -196, -59, 453, -305, -43, 453, -367, -63, 429, -343, -137, 414, -431, -97, 287, -475, -129, 266, -486, -64]
7441f4K78q04O11K62q27M96K77p87N09L86q56M99K84p12N78Q6o60O70M4o89O91
7462B72K2p02O88Q4p50O69L4n78O02p7n51O33j37m84O94k41n20P63l14m80Q07
7483D34l27m72O96j94n31O35l18k67O60m95j12O10m98j60O86n83k08Q07n33k21
7503c91O53l94k17O04l71j58M85m95J15M96o05J10O29o94K7O50n84K7N33o00L8
7524a42M67m21J61K89n42K38L69o03K70L59o73K30M36o72K07M10n94J97K67m39
7544a86K30J22m09L77K4n15M66O3o58N01J90o08M33J65n28K59J92l56L15o4l30
7565c17M32j40l27O29j88m48N87j89l20M59on18M58J5l23M16j59j79M92m32j29
7586a87N63l84j59N46l95k20N49k62j98L46j69j17K64k17J7K63m14J54K83m73
$$ y = [-64, 214, -590, 21, 283, -544, -48, 229, -558, -49, 337, -519, -20, 264, -448, 130, 216, -444, 226, 270, -419, 272, 294, -408, 280, 364, -386, 283, 317, -261, 341, 264, -287, 346, 209, -275, 419, 178, -342, 421, 107, -373, 434, 107, -365, 331, 137, -394, 241, -77, -344, 316, -179, -291, 319, -179, -339, 347, -236, -444, 363, -170, -391, 262, -132, -349, 255, -116, -274, 211, -284, -169, 327, -278, -168, 461, -233, -206, 444, -140, -113, 420, -180, -142, 325, -96, 65, 354, -188, 50, 419, -184, 86, 445, -228, 2, 438, -234, -27, 383, -211, -14, 253, -186, 44, 166, -243, 134, 158, -357, 109, 172, -486, 15, 205, -403, 30, 195, -333, -74, 118, -238, 77, 13, -317, 115, -25, -352, 277, 89, -359, 228, 39, -281, 178, 172, -346, 112, 127, -196, 220, 61, -118, 374, -58, -187, 376, -8, -167, 379, -16, -236, 313, 51, -147, 199, 30, -87, 177, -40, -23, 240, -174, -20, 263, -210]
7606b10J28M04m54n7L83l91n0L79k78k7K60k04L8K03l23J08K38m68L21K33n15
7627b82K50K80l87N5K61l81J82K01l20K27O4k46J89O4l19L24Pl34L12P9m38K83
7649G1P4l06K15Q0k45J67M7j92J61j4k26L20j18j55L58k31k40L53m9k59K75j03
7671a7j32K14k3j85K63j05j51K55j36j78L38k22n9K91j91j14K72q2j08J28k1o4
7693b7J15j09K0J33j65m7K76k19m1K81k96l6K91j38n7J24k03O2J76j62J4Q8j53
7716g3M6J00j12K4Q8j85O2J28k00M6J42j52P9N1j02O7m1q3R9J3j05R4O7j62J12
7741CJ34j85R7O7j58N4M2j07Q1L3n7J1O7q8J76j90m8J81m8p3M2j1q0J36p9JJ6
7768A7j2o7N0m1J05q1Oo0J33j50L5L8kk8J00r8k2P8n9M0J3qJ6k4M9m4K2j0L2k3
$$ y = [-210, -82, 322, -132, -189, 194, -197, -247, 132, -146, -173, 87, -117, -79, 124, -199, -91, 147, -321, 0, 233, -282, -32, 248, -139, -84, 177, -204, -22, 179, -141, 86, 150, -96, 93, 157, -162, 162, 169, -165, 147, 226, -212, 71, 145, -161, 54, 134, -111, 56, 103, -89, 72, 58, -168, 152, 34, -121, 237, 6, -234, 119, 70, -189, 86, -17, -149, 65, 42, -143, 120, 15, -136, 119, -17, -195, 143, -79, -138, 153, -38, -152, 120, 38, -70, 58, 37, -27, 88, -21, -1, 132, -33, -80, 196, -23, -64, 217, -79, -115, 176, 38, -19, 105, -98, -36, 140, -22, -8, 80, -73, -27, 73, -39, -15, 73, -112, -50, 78, -122, -76, 66, -86, -7, 44, -58, 9, -32, -115, -16, -3, -108, -14, 53, -109, 3, 137, -48, 49, 116, -42, 12, 54, -53, 28, 61, 4, 15, 82, -6, 170, -20, -68, 113, 65, -8, 34, 23, -57, 79, 0, 1, 17, 5, -62, -12, -53, 52, -29, -23, -83, 50, -100, -65, -27, -29, -57, 43, -55, -77, 1, -58, -18, -5, -13, 3, -21, 28, -16, 6, -4, 28, 5]
7798El5R7m3l9M6J2l8K5k6Ol5J12o6M7Mo9L6Ll5M8o7K9O0l0n6J7L3p4P4j10R2
7829B3p5ON9Nj18J06m6j05M8J03j17N5N7r2L7%l6J26n2p2J73m3q2P9K9r8%O5n8
7858b3J6L3j19J74o0lkMmK0l7q6J78j1j64J72l8r0P6k9j5K8Lo3R2r1p0J73j20
7887e6OQ8l7r9J52j51p7J92o7l3Q7j16MJ69j25JQ5j23N6J31p8n9J43j56o4L05
7913A78j83j9J93j52m6J44q9K1J63k07O3J76k61L7J93k26M3J93k60M4J41j46L
7936CR9j63N4O3j78R7J01k42J16J26k80R6J95k62R5J36k73J50O4k24J87J17k62
7959a85J62M4k51J47J58l60K47J49k50J50J66l67L24L1l23K64P4k50K46l0k26
7980h0K58J6k76K28L7k65K99k3k86K53l2l02L74j18k47L57j07k64L21r8k62L54
$$ y = [5, -30, 67, 24, -15, 31, 43, 5, 30, 4, 10, -25, 87, 21, 68, 72, 3, 39, 42, 7, 55, -12, 17, 77, 47, -9, 8, 41, -33, 41, -69, 23, -52, -46, 13, 18, -100, 6, -40, -145, -97, 6, -111, -56, 1, -91, -54, -54, -90, 36, -16, -88, 85, 42, -40, 39, 68, -30, -30, 35, -23, -7, 26, -93, 81, 21, 18, 16, 20, 16, 36, -1, -87, 91, 80, -84, 88, 50, -40, 36, 7, -8, 20, 23, -40, 52, -39, -109, 64, -56, -50, 38, 1, -98, 54, -97, -174, 18, -49, -82, 5, -111, -107, 62, -63, -62, 23, -100, -44, 87, 9, -50, 93, -63, -127, 178, -5, -24, 169, 17, -29, 115, 26, 47, 210, 3, 66, 242, -19, 18, 211, -15, 28, 221, -39, 5, 146, 0, 3, 102, -61, -7, 56, -122, -25, 76, -166, -50, 76, -204, -108, 87, -175, -80, 56, -217, -67, -3, -227, -40, 77, -185, -23, 21, -230, -83, 75, -285, -38, 111, -139, 11, 177, -190, 134, 165, -158, 106, 180, -70, 176, 146, -80, 178, 194, -82, 146, 183, -82, 217, 194, -92, 161, 129, -173, 201, 83, -164, 193, 86, -178, 143, 45, -217, 137]
8002A37j09l03L96j29l05M04j29k73L81j85j82M46k99j87M62k27k06M46j73k86
8022c21N64k82k32N36l12j46M68l32m8M62l59j14M67l65o4M87m20j1M65m51o7
8043g5M71m01j1N04o16P6M20m73J3L99m58O6M33o21J72M11o50J91L72n70J76L40
8065A69n72J94L49n89K78L41n55K61K78o49M36K88o64M63K18o46L93K48n55L71
8085E7K35o35N10J79o71N75J37p54O51J33o92O34Q9p43O06J00p53P39r0o15O59
8106C51r4o42P99k22n99P52j72o66Q01k43o21Q33k88n64Q64l69n09Q11l90m14
8126e82Q18m42m16R36m59n31R96m84l99Q97m81l44R16n60k85R35o93j14Q76p58
8146a74j02R46p61j52R34p63j01R73q57m4Q45q81N8Q05r62J77P88r68J07Q25r24
$$ y = [137, 28, -275, 121, -8, -313, 91, -38, -311, 70, -115, -297, 149, -150, -337, 125, -102, -308, 138, -35, -321, 243, -39, -271, 265, -47, -193, 275, -57, -105, 357, -2, -116, 351, -14, -78, 409, -11, -22, 443, -8, -75, 396, -5, -16, 488, -128, -52, 368, -105, -92, 307, -151, -85, 348, -273, -101, 310, -340, -149, 223, -347, -171, 169, -403, -209, 140, -449, -171, 170, -385, -124, 154, -495, -59, 229, -435, 28, 246, -400, -7, 241, -314, 57, 292, -343, 167, 346, -325, 250, 387, -367, 284, 417, -275, 359, 448, -295, 311, 411, -342, 397, 307, -308, 351, 257, -385, 414, 192, -407, 345, 173, -493, 308, 65, -556, 277, -11, -575, 289, -80, -589, 222, -168, -582, 236, -206, -622, 314, -145, -676, 320, -164, -563, 334, -147, -491, 425, -135, -420, 515, -178, -292, 584, -174, -276, 670, -91, -243, 691, -72, -173, 800, -57, -101, 744, -137, -79, 726, -236, -59, 729, -239, -132, 693, -231]
8167b31J31Q19j128K15Q35j047K50O25j033L55O48j072M14O32j084M57O49j183
8185g48N32N93j174O40M97j032
$$ y = [-231, -100, 719, -409, -194, 641, -406, -156, 469, -564, -209, 439, -633, -219, 413, -671, -214, 435, -748, -216, 377, -797, -157, 340, -692]
8191f92
$$ Imaginary data points
##PAGE= N=2
##DATA TABLE= (X++(I..I)), XYDATA
0@%%%Qk4L2l2L3m3O3q7J10j30J53j84K26k78L35l92M54n28O19p24Q37r56J087
26E79j237J407j598J807k033K277k546K848l183L549l946M374m844N371n955O594
42C464p295Q069q936R915j1022J2283j3729J5407j7391J9776k2707K6404l1218
55a6980L7768m7229O2096q8720J49661m95187l8865J205321j258099J46193J001926
66F57885j046433J49762Q47787j031550L74579O32454j074432N54312N98946j237570
76e74260O79044O32812j307086O34492O96850j269275N57124O29708j111996N26835
86I4248M58185r85927O33419K46746r60070Q00576J30066j042181R28644J28290
96D31996j121167R34625J83619j107678Q53679J82321r80411P79979P4347q18502
$$ y = [0, 0, 0, 0, 8, -16, 16, -16, 17, -26, 37, -50, 60, -70, 83, -101, 125, -153, 182, -210, 244, -284, 335, -389, 448, -508, 579, -658, 749, -849, 958, -1075, 1202, -1344, 1504, -1679, 1870, -2076, 2298, -2546, 2825, -3130, 3464, -3831, 4238, -4698, 5217, -5805, 6478, -7251, 8156, -9235, 10541, -12166, 14238, -16980, 20788, -26441, 35655, -53065, 96596, -398591, -437456, 767865, -490234, -344041, 657885, -388548, -238786, 609001, -422549, -47970, 584484, -489948, 64364, 663310, -574260, 104784, 737596, -569490, 65002, 761852, -507423, 49701, 679409, -432587, 94248, 552433, -433494, 199925, 446671, -513399, 287177, 417243, -624938, 303706, 431996, -689171, 245454, 429073, -678605, 175074, 357395, -623016, 156963, 231310, -587192]
106e87192Q00583j02594p20575R12759k47243p26529J034131k91369p82361J074234
116C63844k51570p92155J012636k15955p03880R14550k59572n51307Q65381l85771
126c799m18083R00888n25355l67322R79366o00783l88526J021064n89950m11299
136d03799R77085n43069l68573Q71758n35050k53813P75538n98970j22800P43492
146E41799p00069m0810P67124p72990k5116P92573p78755l9671P66745p32081
156b21251k5958O82345o87048M4848N80618o87751J50364N13316p32735K39719
166a43533M97576p80451K79343N05752p87810K78740M92631p48530K78407M36761
176C08886o91992L10067L52328o56500L75405K75328o57847M44813K31727o78763
$$ y = [-587192, 213391, 110797, -609778, 302981, 55738, -670791, 363340, 71971, -710390, 363844, 112274, -679881, 332755, 116800, -587080, 327470, 67898, -483409, 381972, -3799, -421882, 479006, -46349, -413671, 565695, -35088, -423614, 597450, 7500, -403799, 573286, 30217, -338356, 533402, -1648, -255461, 520077, -78893, -201693, 541799, -158270, -199080, 568044, -204946, -230062, 562511, -216244, -255915, 510830, -221251, -247209, 435136, -251912, -207064, 373554, -314197, -163833, 349483, -383252, -143533, 354043, -426408, -147065, 358687, -429123, -150383, 342248, -406282, -127875, 308886, -383106, -73039, 279289, -377211, -1806, 273522, -384325, 60488, 292215, -386548]
186c86548M86123K17749o85231M89676K04266o57711M77139J64759o06350M76882
196A80754R8187n57914N01135K6351n32142N37440k6994n25466N63613n5886n19023
207c09945N65304p1645m93560N46836r5318m46248N27972j36233l91383N22968
217B18748j85360l46516N30988k25990l17209N38582k48834k94651N33175k58042
227e5109k66113N13603k65256k25912M87753k79486j78186M66053l01383j33726
237b37762M52634l23361j00026M42891l36780p5969M28067l40603n3667M04744
247B60168l40536k7456L75487l42698K459L46490l49359L1634L20978l57346N6377
258b3802K98922l62448P4887K77841l61685R0140K53532l56130J05886K26202
$$ y = [-386548, 99575, 317324, -367907, 121769, 326035, -331676, 145463, 310222, -296128, 180754, 278941, -278973, 222162, 248513, -283629, 253811, 226817, -298649, 264964, 209078, -309945, 255359, 183714, -309846, 236990, 141672, -304576, 223396, 87163, -304220, 218748, 33388, -313128, 217860, -8130, -325339, 213243, -35591, -330242, 202933, -55109, -321222, 192381, -72875, -298787, 188966, -90520, -268706, 197347, -104036, -237762, 214872, -108489, -208515, 234376, -102404, -178373, 249694, -90909, -144576, 260168, -80368, -107824, 267663, -75035, -72576, 273914, -75445, -43811, 277167, -80179, -23802, 275120, -87328, -12441, 265400, -96285, -6145, 247387, -108743, -2857, 223345]
268B23345l49363J23602J98715l43269J41898J73736l37015J58291J51683l28603
278a86980J71572J31389l16736J82147J11401l01950J91107R1338k85303J99585
288a2430P1398k68142K07530N2670k51814K13923L5824k35295K17083K0107k18097
299a67243K17536N023k00635K15926r701j83318K12663k3690j66969K07992l6756
310G0828j51696K01840m9076j37538J94907n9918j23994J86355o9310j10431J77060
321A29027p7715r7164J67335q4864q4706J57512r0240p2964J47753r4092o1340
332f1458J38176r6277n0122J29191r7163l9314J20464r6530k8886J11602r4198
343f4515j8984J03059r0859r924R5244q6372k060Q7211q0934M778P9136p5387
$$ y = [223345, -126018, -2416, 196299, -146970, -5072, 168664, -168351, -10060, 141623, -186980, -15408, 115981, -200755, -18608, 92793, -209157, -18050, 73288, -212015, -12430, 58968, -209174, -1644, 51026, -200788, 13135, 48959, -186336, 30747, 50854, -167243, 50293, 55316, -145319, 70607, 60906, -122412, 90251, 66561, -100408, 107584, 70828, -80868, 120972, 71896, -65642, 129265, 69347, -54647, 131708, 62398, -48033, 129027, 51312, -45852, 121483, 36619, -48087, 109425, 19185, -53779, 93974, -118, -61458, 76718, -19559, -69681, 59510, -37653, -76967, 43497, -53033, -81919, 29683, -64515, -83499, 19560, -71299, -81223, 14021, -72351, -74411, 12800, -68134, -63356, 15780, -59607]
355e9607J0518P1200o9852J4926O3497o4061J7772N5721n7897J9236M7600n1699
367b646J9112L9789m5870J7412L2636l9903J4740K5733l4202J1619J9686k8974
379B9132P755J4793k3982L033J0715j8546k174P575j2893p511N749p433j2702
392f489N489k229j8065O313L048k2965Q051P816k7477J1358J2282l2101J5623
405c9346J6668l6832K0427K0594m1486K5705K3231m6110L1832K4651n1060L8307
417a3419K5326n5935M4679K4770o0714N1155K2667o5677N7676J9727p1089O4085
429D3251J5797p5671P0252J0435p9539P6828L864q3177Q3672l231q6265R0132
441F6348j0786q8135R6432j8892q8690J02866k6970q8600J09319l5238q6856J15338
$$ y = [-59607, -49089, 22111, -47741, -32815, 30682, -33379, -15607, 40114, -17783, 1453, 49053, -2646, 16466, 56255, 10385, 27797, 60433, 20530, 35270, 61003, 26801, 38420, 58106, 29132, 36887, 51680, 27698, 30731, 41446, 22900, 20726, 28301, 15408, 7897, 13646, 6213, -6489, -1000, -3229, -21294, -14981, -11933, -34898, -26847, -19031, -46508, -35150, -22868, -54969, -39346, -22678, -59510, -39083, -18489, -59975, -34270, -11039, -57149, -25317, -666, -51726, -13419, 11907, -44028, 651, 25421, -35293, 15862, 38529, -27148, 30528, 50255, -20834, 43251, 59048, -16623, 53629, 64064, -15475, 61353, 65217, -17960, 65712, 62481, -23784, 66348, 55562, -32573, 63859, 44967, -43723, 59143, 32173, -56427, 52892, 17654, -69202, 46136]
453D6136m3791q3606J21613n2940p9280J28256o1739p4113J34277o9971o7829
464a02987J39478p8464o0433J44152q7166n2646J48058r5722m4285J50997j04891
475d3909l4890J53089j14692k4979J54215j24752j5452J54251j34536n655J52521
486A15211j44308M801J49770j54209J5469J46170j63768K6062J41355j72974L7615
497A194J35094j81903M9767J28443j90371O2124J21273j97342P4505J12948k02737
508h7005Q7331J03616k06901J00520R3684k09714J14001Q3088k11005J28161P1835
519F7611k11596J42611O0584k11308J55924M9490k09073J67611L7497k04622J78600
530B3329K3906j98771J89706R127j92655K00670o310j86757K11137k1631j81173
$$ y = [46136, 2345, -81261, 40352, -12588, -91868, 36388, -25351, -99464, 34813, -35158, -102987, 36491, -41973, -102406, 41746, -45420, -98066, 49992, -45730, -90015, 60982, -43909, -78799, 74290, -40402, -65381, 88834, -35918, -51370, 102881, -31655, -37310, 115211, -29097, -24296, 125474, -28735, -13266, 132904, -30864, -4802, 136553, -36421, 1194, 136288, -45615, 4152, 132595, -57776, 4348, 125621, -71721, 2784, 115732, -87005, 326, 103942, -102959, -2439, 91245, -118469, -4468, 78620, -132385, -4224, 67611, -143985, -1374, 59210, -152098, 3826, 53316, -155757, 11854, 49351, -155271, 23329, 47235, -151536, 38170, 47297, -145358, 55312, 49002, -137755, 73382, 51751, -129422]
541a29422K20125l5933j75210K26365m9709j66772K29623o4956j55491K32433
551A31053q3043j43264K36667j02285j32575K42200j20263j23392K46748j35299
$$ y = [-129422, 90703, 54770, -120440, 105925, 56216, -110556, 119067, 54111, -101380, 131053, 48010, -95254, 141413, 39128, -93447, 148753, 28490, -94902, 151846, 16547]
$$ [...]
8191c39
##END NTUPLES=NMR FID
##END=
