##TITLE=1H_IBA1502
 CDCl3
 8sc, 
 16.2.2024
##JCAMPDX= 6.0         $$ Bruker NMR JCAMP-DX V2.0
##DATA TYPE= NMR FID
##DATA CLASS= NTUPLES
##ORIGIN= UXNMR, Bruker Analytische Messtechnik GmbH
##OWNER= root
$$ XWIN-NMR		Version 3.5
$$ Fri Feb 16 14:12:34 2024 Russian Standard Time (UT+4h)  she@DPX200
##.OBSERVE FREQUENCY= 200.1313
##.OBSERVE NUCLEUS= ^1H
##.DELAY= (6, 6)
##.ACQUISITION MODE= SIMULTANEOUS
##.ACQUISITION SCHEME= undefined
##.AVERAGES= 8
##.DIGITISER RES= 18
##SPECTROMETER/DATA SYSTEM= spect
##.PULSE SEQUENCE= zg30
##.SOLVENT NAME= DMSO
##.SHIFT REFERENCE= (INTERNAL, DMSO, 0, 15.7039)
##AUDIT TRAIL= $$ (NUMBER, WHEN, WHO, WHERE, WHAT)
$$ ##TITLE= Audit trail, XWIN-NMR		Version 3.5
$$ ##JCAMPDX= 5.01
$$ ##ORIGIN= Bruker BioSpin GmbH
$$ ##OWNER= she
$$ F:/spectra/data/she/nmr/H-F/1/audita.txt
$$ ##AUDIT TRAIL=  $$ (NUMBER, WHEN, WHO, WHERE, WHAT)
(   1,<2024-02-16 14:11:00.48 +0400>,<she>,<DPX200>,
      <created by zg, POWCHK disabled, PULCHK disabled
       configuration hash MD5:
       00 E9 B6 7A A2 85 ED C7 34 08 36 98 17 FE 4E 26
       data hash MD5: 16K
       3F A1 ED A6 DE 23 99 A7 E6 DB 3A 2A C0 01 41 F6>)
$$ ##END=
$$ 
$$ hash MD5
$$ D4 65 2F 27 7C E8 75 30 78 5F C7 C2 04 4C 05 D4
##$RELAX= 
##$RELAX= 
##$RELAX= 
##$RELAX= 
##$RELAX= 
##$RELAX= 
$$ Bruker specific parameters
$$ --------------------------
##$DU= <F:/spectra>
##$EXPNO= 1
##$NAME= <H-F>
##$PROCNO= 1
##$TYPE= <nmr>
##$USER= <she>
##$AMP= (0..31)
100 100 100 100 100 100 100 100 100 100 100 100 100 100 100 100 100 100 
100 100 100 100 100 100 100 100 100 100 100 100 100 100 
##$AQSEQ= 0
##$AQ_mod= 1
##$AUNM= <au_zg>
##$AUTOPOS= <>
##$BF1= 200.13
##$BF2= 200.13
##$BF3= 200.13
##$BF4= 200.13
##$BF5= 200.13
##$BF6= 200.13
##$BF7= 200.13
##$BF8= 200.13
##$BYTORDA= 1
##$CFDGTYP= 0
##$CFRGTYP= 5
##$CHEMSTR= <none>
##$CNST= (0..31)
1 1 145 1 1 1 1 1 1 1 1 1 1 1 1 1 1 1 1 1 1 1 1 1 1 1 1 1 1 1 1 1 
##$CPDPRG= <>
##$CPDPRG1= <>
##$CPDPRG2= <>
##$CPDPRG3= <>
##$CPDPRG4= <mlev>
##$CPDPRG5= <mlev>
##$CPDPRG6= <mlev>
##$CPDPRG7= <mlev>
##$CPDPRG8= <mlev>
##$CPDPRGB= <>
##$CPDPRGT= <>
##$D= (0..31)
0 1.2 0 0 0 0 0 0 0 0.06 0 0.03 0 0 0 0 0.0002 0 0 0 0 0 0 0 0 0 0 0 0 
0 0 0 
##$DATE= 1708078259
##$DBL= (0..7)
120 120 120 120 120 120 120 120 
##$DBP= (0..7)
150 150 150 150 150 150 150 150 
##$DBP07= 0
##$DBPNAM0= <>
##$DBPNAM1= <>
##$DBPNAM2= <>
##$DBPNAM3= <>
##$DBPNAM4= <>
##$DBPNAM5= <>
##$DBPNAM6= <>
##$DBPNAM7= <>
##$DBPOAL= (0..7)
0.5 0.5 0.5 0.5 0.5 0.5 0.5 0.5 
##$DBPOFFS= (0..7)
0 0 0 0 0 0 0 0 
##$DE= 6
##$DECBNUC= <off>
##$DECIM= 32
##$DECNUC= <off>
##$DECSTAT= 4
##$DIGMOD= 1
##$DIGTYP= 9
##$DL= (0..7)
0 120 120 120 120 120 120 120 
##$DP= (0..7)
150 150 150 150 150 150 150 150 
##$DP07= 0
##$DPNAME0= <>
##$DPNAME1= <>
##$DPNAME2= <>
##$DPNAME3= <>
##$DPNAME4= <>
##$DPNAME5= <>
##$DPNAME6= <>
##$DPNAME7= <>
##$DPOAL= (0..7)
0.5 0.5 0.5 0.5 0.5 0.5 0.5 0.5 
##$DPOFFS= (0..7)
0 0 0 0 0 0 0 0 
##$DQDMODE= 0
##$DR= 18
##$DS= 0
##$DSLIST= <SSSSSSSSSSSSSSS>
##$DSPFIRM= 0
$$ [...]
##$SUBNAM2= <"">
##$SUBNAM3= <"">
##$SUBNAM4= <"">
##$SUBNAM5= <"">
##$SUBNAM6= <"">
##$SUBNAM7= <"">
##$SUBNAM8= <"">
##$SUBNAM9= <"">
##$SW= 18.0517328524113
##$SWIBOX= (0..15)
0 0 2 0 0 0 0 0 0 0 0 0 0 0 0 0 
##$SW_h= 3612.71676300578
##$TD= 16384
##$TD0= 1
##$TE= 0
##$TE2= 300
##$TE3= 300
##$TEG= 300
##$TL= (0..7)
0 120 120 120 120 120 120 120 
##$TP= (0..7)
150 150 150 150 150 150 150 150 
##$TP07= 0
##$TPNAME0= <>
##$TPNAME1= <>
##$TPNAME2= <>
##$TPNAME3= <>
##$TPNAME4= <>
##$TPNAME5= <>
##$TPNAME6= <>
##$TPNAME7= <>
##$TPOAL= (0..7)
0.5 0.5 0.5 0.5 0.5 0.5 0.5 0.5 
##$TPOFFS= (0..7)
0 0 0 0 0 0 0 0 
##$TUNHIN= 0
##$TUNHOUT= 0
##$TUNXOUT= 0
##$USERA1= <user>
##$USERA2= <user>
##$USERA3= <user>
##$USERA4= <user>
##$USERA5= <user>
##$V9= 5
##$VALIST= <valist>
##$VCLIST= <CCCCCCCCCCCCCCC>
##$VD= 0
##$VDLIST= <DDDDDDDDDDDDDDD>
##$VPLIST= <PPPPPPPPPPPPPPP>
##$VTLIST= <TTTTTTTTTTTTTTT>
##$WBST= 1024
##$WBSW= 4
##$XGAIN= (0..3)
0 0 0 0 
##$XL= 0
##$YL= 0
##$YMAX_a= 51558
##$YMIN_a= -53007
##$ZGOPTNS= <>
##$ZL1= 120
##$ZL2= 120
##$ZL3= 120
##$ZL4= 120
##$ABSF1= 10
##$ABSF2= 0
##$ABSG= 5
##$ABSL= 3
##$ALPHA= 0
##$AQORDER= 0
##$ASSFAC= 0
##$ASSFACI= 0
##$ASSFACX= 0
##$ASSWID= 0
##$AUNMP= <proc_1d>
##$AZFE= 0.1
##$AZFW= 0.1
##$BCFW= 1
##$BC_mod= 2
##$BYTORDP= 1
##$COROFFS= 0
##$CY= 11.3945322036743
##$DATMOD= 1
##$DC= 2
##$DFILT= <>
##$DTYPP= 0
##$F1P= 15.7292609196834
##$F2P= 12.9074282941183
##$FCOR= 0.5
##$FTSIZE= 0
##$FT_mod= 4
##$GAMMA= 1
##$GB= 0.15
##$INTBC= 1
##$INTSCL= 1
##$ISEN= 128
##$LB= 0.24
##$LEV0= 0
##$LPBIN= 0
##$MAXI= 10000
##$MC2= 0
##$MEAN= 0
##$ME_mod= 0
##$MI= 1.114404
##$NCOEF= 0
##$NC_proc= 0
##$NLEV= 6
##$NOISF1= 3.799351
##$NOISF2= 2.8
##$NSP= 1
##$NTH_PI= 0
##$NZP= 0
##$OFFSET= 15.70392
##$PC= 1
##$PHC0= -25036.72
##$PHC1= 9.45264
##$PH_mod= 1
##$PKNL= yes
##$PPARMOD= 0
##$PSCAL= 0
##$PSIGN= 0
##$REVERSE= no
##$SF= 200.130013532006
##$SI= 16384
##$SIGF1= 3
##$SIGF2= 2
##$SINO= 400
##$SIOLD= 16384
##$SREGLST= <1H.CDCl3>
##$SSB= 0
##$STSI= 0
##$STSR= 0
##$SW_p= 3612.71676300578
##$SYMM= 0
##$S_DEV= 0
##$TDeff= 0
##$TDoff= 0
##$TI= <>
##$TILT= no
##$TM1= 0
##$TM2= 0
##$TOPLEV= 0
##$USERP1= <user>
##$USERP2= <user>
##$USERP3= <user>
##$USERP4= <user>
##$USERP5= <user>
##$WDW= 1
##$XDIM= 8192
##$YMAX_p= 0
##$YMIN_p= 0
$$ End of Bruker specific parameters
$$ ---------------------------------
##NTUPLES= NMR FID
##VAR_NAME=  TIME,          FID/REAL,        FID/IMAG
##SYMBOL=    X,             R,               I
##VAR_TYPE=  INDEPENDENT,   DEPENDENT,       DEPENDENT
##VAR_FORM=  AFFN,          ASDF,            ASDF
##VAR_DIM=   8192,          8192,            8192
##UNITS=     SECONDS,       ARBITRARY UNITS, ARBITRARY UNITS
##FACTOR=    0.0002768,     1,               1
##FIRST=     0,             0,               0
##LAST=      2.2672688,     0,               0
##MIN=       0,             -53007,          0
##MAX=       2.2672688,     51558,           0
$$ Real data points
##PAGE= N=1
##DATA TABLE= (X++(R..R)), XYDATA
0@%%%%%%%%%%%%%%%%JrJ6j6J6j6J7k4L1l3L7m4N1o0O8p7R0j01J13j28J44j60J79
39I5k00K22k48K76l06L39l74M15m57N01n53O10o73P42q18R03r97J104j227J370
59G24j538J735j974K273k654L160l872M947o783J0723l3099L3328M0529q4145
73c6646K9778M6214o1188q556P2180m0909l7524O6281j0460p2177N8855M5710
85E1558p5472m614O2222m0425k2552O2632k0018n4929N3310J7011o3824K9202
97e899N2605o2951k1771O6224j5590m0723M6065o36n4584L7471L6633n6700J155
110a8701N3270m0140l1816O1056O15n2896K8965K0640m6039J9045M2615m7372
122a0758j8596N3759j6259l8883M5578J1764n4214J6347L6988l5703k459L9747
$$ y = [0, 0, 0, 0, 0, 0, 0, 0, 0, 0, 0, 0, 0, 0, 0, 0, 0, 1, -8, 8, -8, 8, -8, 9, -15, 16, -17, 20, -24, 27, -33, 35, -42, 48, -53, 60, -68, 76, -84, 95, -105, 117, -131, 145, -161, 178, -196, 219, -238, 263, -290, 320, -353, 389, -429, 474, -523, 581, -646, 724, -814, 921, -1053, 1220, -1434, 1726, -2146, 2801, -3982, 6741, -26358, 6970, 47499, -36646, -6868, 39346, -21842, -30398, 41782, 873, -36651, 29630, 19170, -53007, 5848, 51558, -23914, -28528, 33694, -6731, -29283, 33349, 13331, -41598, 11712, 28723, -35101, -5899, 46706, -16245, -38016, 28208, 12618, -28105, 17960, 17324, -37260, 211, 36844, -19856, -18701, 34569, -5571, -37387, 23669, 24284, -28612, 353, 20993, -25046, -6001, 36614, -10758, -29354, 24405, 8146, -30737, 14841, 26605, -27609, -11262, 25726, -9977, -12436, 27311]
134B7311l1897k6844M9553J232m4095K6866K1314m4528O443M2191k7439j9547
146a9440L5070j2815k8217L8609J0218m5041J2436L0389l1259m112L7717k0121
158C434k7422L2131L431k9084K3368J4618l9384M656L6124k1593j5741L0358j0169
171D727k7247K8215J2190l0889R550J9388k8387j022L4555j5760k3994K4825J945
184H096k4069J9765J4470k9852R12K4251j6813p778K6781j0087k5184K1150J1386
197A3028k2118Q223J4596k3381k692K5952r461j5136J8287k285k0708J6738J4619
210A5662k1611j223J6359j3706n269K2373o079j9535J3773O526j6272R330J3337
223A3665j9483n370J9076n705r685J5532k681j8734J1818J2516j4631N85J1903
$$ y = [27311, -4586, -31430, 18123, 19355, -24740, 2126, 23440, -21088, -14645, 27546, 107, -19440, 15630, 2815, -25402, 13207, 23425, -21616, -9180, 21209, -10050, -14162, 23555, 3434, -23988, 8143, 11574, -17510, 5858, 20476, -18908, -14252, 21872, 279, -15462, 14896, 4727, -22520, 5695, 17885, -13004, -3454, 15934, -12453, -13475, 21080, 5320, -18674, 6151, 8096, -15973, 3792, 18262, -11590, -10678, 13573, -3240, -11018, 15763, 5676, -19508, 1642, 13028, -9090, -867, 13729, -9652, -12344, 13608, 4147, -10989, 7298, 5013, -15695, 1043, 15662, -5949, -7172, 9187, -4519, -9788, 12585, 6506, -13029, 744, 7270, -9002, 328, 13665, -5818, -11188, 7888, 2183, -7502, 8030, 5349, -13385, -1567, 10949, -3682, -3097, 8806]
236H806j3519n828J9051j758j4411R139K951j3873Q505J3050j4174n673J2455
249D721n310o240J4164o66j5648O022Q776r158K303R798j1195o962J3206O38q476
264d027P023R63j2073M912J1108p270m063O904n200n174J1181K324j0537J795
278b134M449o269K741Q744o668p006O322J174l785N712J281r287L30P373j953
293A024j401L857m277n010O120L930m028k99P03m063J117O191q73m424K28J1p26
310a920L652K092l937k798J304J474J373J291j579l338m79K978K373n89j874j488
326a465q80J331L621M89l976j572J612J32J626K843l369m546K879K872j501J630
342A726P10n877n20O740k80l519K642j752n155N559N386o070j907L967m023j075
$$ y = [8806, -4713, -10541, 8510, 6752, -7659, 1480, 4431, -9442, -937, 12113, -2061, -7734, 4721, -589, -6829, 7335, 6669, -8979, -2957, 5819, -3339, -1036, 8762, -2433, -9395, 3811, 4449, -4027, 2996, 3959, -8114, -3202, 7906, 636, -3427, 3477, -1723, -6897, 4284, 6608, -3929, -2134, 2315, -3954, -1213, 7531, 863, -6143, 179, 1353, -2432, 3280, 4561, -4726, -4396, 2977, 1024, -377, 3480, -797, -5807, 313, 4243, 215, -84, 619, -3444, -2327, 3864, 2991, -1433, -1205, -1194, -1920, 1732, 3824, -113, -2911, -1607, -133, 1240, 2531, 952, -2386, -2865, 113, 2486, 1897, 23, -1465, -2345, -1014, 2607, 3096, -880, -2452, -840, -708, 918, 3761, 392, -4154, -1275, 1597, 96, 1726, 2436, -3441, -3961, 2779, 2499, -1020, 1622, -130, -5285, 274, 5660, -410, -2317, 1650, -2373, -3448]
358c448Q614j312q600L398L486n379L770O215q695m369Q794o78m793O936m44j0578
374g083M479Q743o691j678P073o776n510J1648J604j0315M193L977r502L403J1174
389H739q379p047R563j593p461J0326L114j3976K502J0248q034j350J1314p676
403B90j0128J2334L622j1195N887N859j3570J075J4724p294p991J1060k999j1132
417i458J2214O739j4934J297J0549j0012k075J4995o332j2809J1513L562j2119
430f870Q021Q456j5679j537J5279o535p443J2839l257j4121J1589Q548j4227K174
444b763J0903j2851l750J7546m467j3316J1039K392j3714R333J0860j6010k519
457g317J4899q300p432J6436k387j7021J0414Q914j3865L959J1906j4927n140
$$ y = [-3448, 5166, 3854, -4746, -1348, 2138, -3241, 529, 6744, -1951, -6320, 2474, 1796, -2997, 3939, 3495, -7083, -2604, 6139, -552, -2230, 4843, -1933, -7443, 4205, 5809, -4506, -313, 3664, -5838, -2435, 8739, 360, -6687, 2876, 1283, -6178, 4148, 7262, -6714, -4212, 6036, -1998, -3348, 7966, 290, -9838, 2496, 6118, -5077, 810, 6669, -6901, -5826, 8898, 1604, -6387, 4673, 1674, -9458, 2756, 9495, -5439, -4142, 6407, -3605, -5680, 9315, 2983, -9826, 1687, 5249, -6870, 1151, 9607, -6072, -7609, 7670, 1135, -6308, 6531, 3274, -10847, 742, 9290, -4937, -2763, 8140, -4711, -8461, 9085, 4618, -8698, 2341, 4733, -8981, 352, 11212, -4798, -7317, 7582, -718, -8150, 8286, 5899, -11122, -708, 8206, -5659, -1700, 10206, -4721, -9861]
470i861J8331m475j2906J3384J997j7309Q796J3376j4657k454J3731j0368p288
483i703J8571j946j7673J0743Q262j5967M546J5090j4269p357J6416m708j0897
496h892J5727R07j9903R109J4604j5449k202J6073j0946j0477J8146Nj5985J1619
510B336O120j9278O259J8733j5513r398J8081m598j3581J6319L838j9661P792
523b551J2842j7052M56K0038j3360j4696J9858K589j7581J0998Q303j9393L808
536e741J8050j4364p265J9656p516j7626J8790Q584k1188M282J4127j5510j459
549g180J9598j1158j3853J9009N67j9653J3878J3002k2139j486J9945j0579q612
562h661J8162o169j7474J7807P942k1785O538J7340j9048o771K3025n707j6012
$$ y = [-9861, 8470, 3995, -8911, 4473, 6470, -10839, -2043, 11333, -3324, -5778, 7953, -2415, -9703, 8868, 6922, -10751, -8, 8254, -7713, -3167, 11923, -2346, -9703, 6713, 2005, -8892, 6835, 7742, -12161, -3052, 11552, -3897, -6099, 9974, -972, -11449, 6697, 6702, -9283, 2336, 8456, -10822, -4563, 14170, -1343, -10741, 7340, 2742, -10839, 5480, 9318, -10343, -2551, 10291, -6761, -6305, 13733, 373, -14323, 5535, 8124, -9457, 1541, 9844, -9549, -5741, 12309, -2055, -9320, 10336, 2820, -14806, 3984, 12568, -8620, -4338, 9789, -5721, -7180, 12418, 1260, -12593, 6416, 6983, -12670, 1208, 14210, -7929, -9415, 10530, -49, -8661, 9501, 3332, -14142, 3665, 11607, -10178, -3640, 13700, -5348, -12119, 10906, 5199, -10813]
575a0813J5341J411j8330J3688J3005k2406j032K1462j2588j2346K1384m83k0468
588a2175J1798R614j7449O120J5590j9165o903K3565n348j7934J6123N708k0361
601a0817P292J5290j5792k486J6945j2267j1009K1867N51k1733J0412J2314j7464
614f897J418J7296j2996r107J7755m199j4508J6687N370k2135N534J7691j3995
627b086n631J6844q017j2697J6839K613j7322R628J0172j8557P00J9664j0446
640A704j1966J5358r00j3982J2638P001j7737L134J4297j2707m724J7517o014
653C619j4975J3167N722j4204O081R526j4724j333J6054p398r686J3546p85j4585
667i975J0049R509j3938m6J1428r617m452J4764l803j2706J0193M541j2657N503
$$ y = [-10813, 4528, 5939, -12391, 1297, 14302, -8104, -9136, 12326, -262, -12608, 8776, 8293, -12175, -377, 9237, -8212, -2092, 13498, -5667, -12570, 10995, 5647, -12287, 3836, 9544, -10817, -3525, 11765, -4027, -6513, 10432, -1835, -12844, 9023, 9574, -12159, -1747, 10567, -6897, -5479, 11817, -1179, -10286, 7469, 3270, -11238, 5449, 10819, -11316, -5782, 11909, -2086, -7717, 9127, 1110, -11587, 5252, 7865, -9457, 171, 10343, -8214, -7514, 12150, 1704, -10262, 5096, 4196, -9786, 2852, 9853, -7884, -4750, 9547, -3160, -7884, 9633, 3619, -11356, 1811, 7533, -6671, -590, 8936, -5788, -7121, 8933, 1535, -8151, 5395, 4610, -9975, 74, 9583, -4355, -4401, 7027, -2590, -7042, 7722, 3919, -8787, 1406, 5947, -6710, -1207]
681a207J0370j2327l858J2822m520p415J1133o72j2742P655Q232j0965L23R941
695F770q588n418J2341j025r867P108K879j0361M728R175r365l612R496l814o007
710e560R489P84j0426M287O066p625J086Q036p153n166R256j53o964N758K098
725C813q844K824P654o057k491O800l941n064Q154J440q040K933M054o421J299
740a887P197n236m558O410n59m962N654J885p784J517N885m352j069N634l774
755Am695O096J660n344K524K441n803Q54O185l226l341M229j196l808M807K119
771C503n533M05L533l124j89M730k548m144L611J288l133K390J763m666j83M292
787A995j389j706K705j341l212L130K302l021j5J661k519j12L708q75k799J338
$$ y = [-1207, 9163, -3164, -7022, 5800, 1280, -6135, 4998, 4326, -8416, -761, 7471, -3494, -3171, 6770, -1818, -7236, 5105, 4080, -5787, 1321, 4200, -6161, -1433, 7742, -1623, -5235, 4261, 447, -5560, 3929, 4713, -5713, -1426, 4640, -2985, -1899, 6137, -1016, -6182, 3074, 2921, -4043, 1715, 3813, -5031, -2207, 5447, -610, -3101, 3699, -242, -5306, 2848, 4288, -3752, -819, 3235, -3186, -1887, 5310, 74, -4484, 1926, 1367, -3595, 2059, 3944, -3840, -2323, 3562, -790, -1859, 3775, 1, -4694, 1402, 3062, -2282, 242, 2683, -3120, -2266, 3919, 693, -2648, 1581, 385, -3423, 1384, 3503, -2030, -1625, 1908, -1216, -1405, 3325, 777, -3367, 244, 1532, -1601, 789, 2552, -2114, -2297, 1995, 606, -1100, 1605, 264, -2948, 182, 2484, -537, -552, 1109, -1410, -1522, 2186, 1311, -1488, -150]
803a50L87j607J912J640k744j079J918k32l63J724p72k329R31J572n29Q9L11j483
821h04n13J690P21p79l78l51m87P38J166j92j059n99K95O59M47K03n39j233J11
840i04J460K54o61N3n74q87J356J463j376r01Q37p29k56K312k18k622P27J294
858F28j357Q45J904k496j664K813K18j842J969K51l572J223L330k248j059K615
874A558j946k279L975J020l985J141K104l425N95M429k771l193L756J1l360L485
890A115J830n336M33M491k883j496M640k158m532M628K165n001J752L317n201
905b236m60O204k497m142M716n0n304M232L719o309k25N458l930k247O607j688
921A848o207M702K720n916K315M869o248j872P179k170m772N771K38p002M062
$$ y = [-150, 237, -1370, 542, 2182, -562, -1641, 277, 45, -318, 1406, 634, -1695, -764, 808, 279, 368, 679, -804, -1317, 373, 1094, 315, -63, -414, -901, -163, 1003, 811, -248, -847, -552, 107, 554, 757, 218, -1015, -904, 556, 810, 149, 202, -372, -1259, 97, 1560, 184, -717, 120, -609, -865, 1447, 1229, -1393, -666, 628, -729, 116, 2020, -476, -2140, 673, 891, -951, 1018, 1269, -2303, -1080, 2250, 2, -1057, 1558, -388, -2667, 1308, 2328, -1657, -516, 1588, -1837, -1242, 3187, 416, -2777, 979, 990, -2370, 1115, 2945, -2391, -1958, 2533, -350, -1846, 2794, 636, -3896, 732, 2897, -2104, -352, 2965, -2236, -2696, 3508, 1011, -3131, 1585, 1535, -3769, 463, 4182, -2127, -2352, 3106, -824, -3071, 3536, 1848, -4359, 343, 3063, -2853, -538, 4331, -1917, -3789, 3390, 1220, -3552, 2219, 2457, -4545, -483]
936d83N029o386m95O047m575l336P567o08o990M505L028o789K240O312o233k877
952d044P228k207n043O573R03q030L464N645o453m57O917m960m492P843l3o960
968d106M911K948p876K133P337o056l272P384k502n676P121J642q256L195N353
983D280o915l5P838n053n353P676K97o874N072L281q147J591P270n824k787P766
999D083l012o594P282K577q030K696N182o998j65Q108m789n285P735l00p530N876
1015H36M311q629P37P219n577k426Q079l398o939P654K355q604L655N980q137
1030b884j010Q747m264n080P686j077p787O708M484r312J083P849o465l164R022
1045D536k558p317O954J955q289M484O093q950j254R373m289n717Q193k23q520
$$ y = [-483, 4546, -1840, -2335, 3712, -863, -4199, 3368, 2760, -4230, 275, 3303, -3486, -1246, 5066, -1167, -4044, 3184, 977, -4066, 2507, 3410, -4620, -1156, 4489, -1964, -2421, 4496, -464, -4956, 2887, 2854, -4106, 805, 3753, -4123, -1990, 5347, -709, -3981, 3403, 901, -4775, 2346, 3988, -4268, -1073, 4280, -2635, -2670, 5168, 115, -5238, 2438, 2735, -4139, 933, 4214, -3933, -2342, 4928, -896, -3683, 4083, 1071, -5523, 1759, 4336, -3694, -998, 4184, -2814, -2979, 5129, 340, -4945, 2790, 2490, -5040, 836, 5147, -3482, -2745, 4474, -1103, -3529, 4550, 1152, -5787, 1867, 4222, -4382, -727, 5253, -2884, -3894, 4853, 589, -4491, 3195, 2118, -5669, 1039, 5523, -3789, -2706, 5143, -1322, -4486, 4536, 1978, -5339, 1615, 3570, -4719, -235, 5858, -3092, -4346, 5027, 738, -4979, 3214, 2991, -5529]
1060e529N768M782q530J479P553p366l350J0030k287q181P043K723q914L756O849
1075E826q300j476Q951m981n596R517j14r893N691N838q831P94Q256o890m042
1090e250R637k200p896P848K661j0338L570Q359q078k706R046m055o209Q843O87
1105C919r455N333N744r385M73R617o265n761R085n93p888O636L323r607K652
1120b172Q162p691k980R703l472p764Q173K527q991L818N784q477r4R330n604
1135B52n957R020j25q792O050M971r038Q75P791o342l040R062k912p803P506L093
1151D611q894K960O648p585j766Q619l724n669P599K16q242N132N373q074k19
1166c015P556n010l958P917j098p172N544L143p607K261O449o448k607P665k342
$$ y = [-5529, 239, 5021, -3509, -2030, 5523, -1843, -5193, 4837, 2550, -5631, 1412, 4135, -4779, -1023, 5826, -2474, -3950, 5001, 20, -5576, 3941, 3827, -6066, -375, 5463, -3368, -2574, 5682, -1208, -5250, 4387, 2187, -5709, 2139, 4800, -5538, -1968, 6391, -1687, -4393, 4653, 598, -5611, 3232, 3919, -5536, -203, 5541, -3844, -3371, 6246, -19, -5780, 3305, 2712, -5176, 1460, 4783, -4824, -2172, 5990, -1701, -4681, 5022, 1550, -6214, 1959, 4486, -4505, -687, 5097, -3380, -3474, 5856, 252, -5705, 3315, 3190, -5602, 448, 5419, -3619, -2744, 5047, -1295, -4335, 4727, 1815, -5988, 1518, 4611, -4283, -1323, 5325, -2260, -4026, 4593, 869, -4800, 2799, 3015, -5227, -95, 5278, -2796, -3015, 4541, -469, -4427, 3490, 2392, -4780, 764, 3907, -3700, -1439, 5010, -1438, -4045, 3620, 1278]
1181A278n522O239J150p352L484N101o497m77O681m301m056O976j71o448M277
1196C62L096o503J411N865n025k617O338j836m925N417J499o409K329M538n114
1211a574p12N664l178l803N419L42n205L283K806n412O05N049l522k440M852j154
1227A020m127L992J753m909J325L625l853q44M652k083l340L911N38l966K408
1242A02K409m139N9L894k426j916L748p90l443K942J608l636R39K711l002p53
1258a693L615j354k534K787L65l033J843J998l033j29K752j756j316K832n37k580
1274a773J939J171k438P14J940k167o99K520p86j661J884J65k147J242J437j925
1290e84r3J716j233q69J940k40j700J169O55j558N89J299j427m75J477n11q83
$$ y = [1278, -4244, 1995, 3145, -4207, -723, 4378, -2119, -2596, 4085, -216, -4272, 2704, 2533, -3915, 362, 3458, -3045, -1634, 4231, -794, -3411, 2927, 1091, -3834, 1583, 3082, -3327, -998, 3540, -1574, -2286, 3378, 200, -3603, 1816, 2158, -3047, 236, 3042, -2370, -1765, 3284, -238, -2678, 2174, 1020, -3107, 885, 2638, -2271, -946, 2679, -1174, -2018, 2634, 551, -2789, 1122, 1660, -2306, 102, 2511, -1628, -1569, 2325, -101, -2017, 1731, 941, -2502, 440, 2048, -1588, -649, 2062, -940, -1693, 1922, 568, -1966, 821, 1186, -1847, -4, 1994, -1039, -1168, 1584, -172, -1488, 1344, 807, -1773, 166, 1337, -1101, -387, 1553, -614, -1313, 1207, 421, -1240, 644, 809, -1338, -96, 1341, -584, -677, 1039, -194, -1063, 877, 637, -1063, 106, 761, -797, -208, 1091, -336, -811, 666, 155, -728]
1307g28J232M1j384O85Q80j029MR54q11n14J102o0q48N78K29q11L20P06n86l08
1327c48N53j93l47N50J01n71J00L13k12K3K48j96k26J32J65k3o9j0j7q6N1K27
1349A65n7l01J25K09k74P9M08m12l31N94j5n27M90K08q14K28P86o61l50R24l79
1370I5q11J028K86j240M99Q72j184p1J419q32r95J439L3j488J075Q94j786J60
1388f07J706j279q12J921m95j754J658P57k131O67J727j926n19K394r89j785K184
1405G17K90k478J414J661k533o8K590j696j496K801l37k685K093J338k999O95
1421f93K632k522j041L256j072k549K792P09l362J501K451l129m23L447j913k220
1437b136L451j8l473K296J962l618M26L399k667j684L807q05l310L036J314l970
$$ y = [-728, 504, 545, -839, -154, 726, -303, -299, 655, -156, -670, 432, 372, -476, 102, 331, -480, -160, 546, -40, -348, 205, 12, -335, 215, 316, -255, -155, 158, -54, -31, 217, 21, -205, -73, 92, 69, 0, -10, -27, -113, -62, 165, 108, -193, -68, 141, -133, -54, 354, -58, -389, 205, 190, -337, 153, 361, -453, -225, 561, -100, -450, 474, 95, -716, 312, 598, -642, -143, 729, -455, -526, 893, 61, -934, 505, 538, -950, 125, 1019, -767, -607, 1099, -180, -992, 929, 434, -1320, 338, 1095, -1036, -369, 1358, -568, -1087, 1307, 318, -1467, 717, 1007, -1471, -57, 1604, -929, -997, 1593, -103, -1599, 1202, 865, -1820, 273, 1611, -1388, -693, 1939, -583, -1624, 1632, 560, -1989, 803, 1512, -1850, -349, 2102, -1027, -1450, 1997, 84, -2136, 1315, 1297, -2176, 120, 2082, -1536, -1110, 2289, -378, -2062, 1745, 940, -2370, 666, 1980, -1990]
1453a990J294L138l367r14L995j767k858L680M47m001K210K582l955M2L978k706
1469a92k199M192n86l819L134J720m296J135L583l527j268M387j658l279L870
1484A197P09m380K202K929m134j54M238k676k502M333l45m068L043K010m434R44
1500a088L843l474j540M464j456l488L792R96m431J916L118l992m18M341k489
1515I4k734M269j14m154K936K171m431P54L936l328j680M452j367l603L813J129
1531B143m531J911L168m090l89M436k547k760M323j80m182L059K170m558P99M004
1547B776l467j602M587j498l649L882J085m499K001L100m195l54M513k557k804
1562b681M380j83m280L057K283m522P49L908l477j543M692j520l800L928J183
$$ y = [-1990, -696, 2442, -925, -1839, 2156, 389, -2469, 1211, 1658, -2343, -133, 2449, -1506, -1464, 2514, -192, -2391, 1801, 1215, -2604, 530, 2250, -2046, -911, 2672, -855, -2123, 2264, 606, -2673, 1197, 1906, -2474, -272, 2657, -1477, -1631, 2607, -69, -2571, 1762, 1417, -2651, 392, 2402, -2032, -1088, 2755, -719, -2259, 2205, 749, -2739, 1053, 2049, -2382, -466, 2652, -1340, -1758, 2583, 94, -2640, 1629, 1515, -2639, 297, 2468, -1963, -1209, 2727, -601, -2281, 2171, 804, -2799, 1014, 2143, -2388, -477, 2691, -1399, -1788, 2648, 101, -2659, 1664, 1484, -2698, 361, 2531, -2027, -1228, 2776, -691, -2293, 2294, 796, -2853, 1029, 2114, -2385, -384, 2716, -1479, -1833, 2680, 123, -2681, 1699, 1516, -2764, 293, 2576, -1946, -1197, 2711, -766, -2309, 2383, 863, -2937, 991, 2174]
1577B174m610J980L269m240m39M500k612k664M533l88m491L280K425m697P27M055
1593B802l578j608M782j564l774M095J008m866K222L539m419p05M649k444k823
1608b684M523k35m570L213K503m806O83M397l578k126M836j014l914L698J282
1623B208m802J936L758m303j002M826k239l305M467M06m649K629K711m521M32
1638a448M477l409k428M866p27m203L608J749m862J408L895l907j146M710k121
1653D62l484M410P44m732K342K983m415j4M555k889k637M478m77m120L354K063
1669B623m703Q18L998l401j541M494j485l641L749J173m336J838L053m020n38
1684a919M394k127k839L895P0m010K645K382m072L08L654k866j692M154r01l582
$$ y = [2174, -2436, -456, 2813, -1427, -1866, 2634, 22, -2642, 1891, 1503, -2988, 292, 2717, -1980, -1253, 2802, -776, -2384, 2398, 834, -2940, 1155, 2163, -2703, -481, 3058, -1361, -2066, 2583, 139, -2684, 1839, 1604, -2966, 247, 2750, -2056, -1373, 3024, -554, -2680, 2156, 1142, -2772, 926, 2208, -2594, -658, 3100, -1203, -2205, 2621, 382, -2923, 1544, 1950, -2699, -70, 2641, -1880, -1448, 3029, -380, -2808, 2058, 1331, -2872, 736, 2485, -2377, -969, 2926, -981, -2127, 2583, 462, -3022, 1388, 2132, -2600, -258, 2725, -1690, -1704, 2851, -38, -2675, 1803, 1326, -2794, 560, 2623, -2080, -1262, 2736, -665, -2206, 2288, 803, -2838, 911, 2084, -2252, -414, 2639, -1381, -1919, 2475, 348, -2491, 1404, 1474, -2536, 109, 2491, -1581, -1273, 2381, -485, -2177, 1977, 1076, -2506]
1700b506L010J434l830J308L002l357r16L829j557k585L378K81l706K001K419
1715B205l316r5L192k199j803L471l19l121K257J405l230Q04K838k516j231L034
1731A376q84k269K580O35l071J170K181k440l32K689j574j801K602J90k452J520
1747A20J242k539L71K399j707j163K292n84j898J961P64k351O51J649j781k71
1763h45K147j092j546J826K58j782J142J032j970Q3J806j080q26J628m53j485
1779a157J373P22j573L59J116j298k49J602n97j126J118J21j177Q44Q08j317j20
1796e51J123o37m49J122k89j097P86N35q95K82O70r34k22J040k36o23O05l8p66
1815e74N54O06p19j27N32m27j91P45j06o65K98K33l70K57L75n19k64M63rj72K81
$$ y = [-2506, 504, 1938, -1892, -584, 2418, -939, -1855, 1974, 417, -2168, 1210, 1491, -2215, -214, 2205, -1111, -1206, 1986, -213, -2016, 1455, 1136, -1985, 272, 1677, -1553, -749, 2089, -427, -1658, 1376, 492, -1777, 803, 1438, -1633, -463, 1718, -722, -1054, 1635, 61, -1740, 862, 1052, -1400, 120, 1362, -1177, -806, 1593, -114, -1277, 1015, 431, -1467, 494, 1258, -1093, -442, 1207, -574, -845, 1302, 210, -1336, 490, 748, -1034, 108, 1140, -830, -747, 1059, -21, -847, 781, 328, -1157, 216, 938, -635, -276, 840, -458, -707, 895, 298, -828, 290, 411, -766, 78, 886, -431, -551, 572, -65, -514, 608, 319, -778, 8, 543, -352, -70, 600, -334, -556, 484, 248, -375, 230, 192, -574, -20, 586, -133, -260, 272, -155, -346, 399, 293, -372, -74, 159, -211, 46, 421, -98, -362, 101, 92, -80, 201]
1836B01p4m53J70L54j16o5N6k20p9L15J53j91j27j2j8J16J62l6k04j23J14J76
1858I9%j3n5k33ML79K3k57M5k4k16K73L48l51k61K91j02j30M98k8o52J81M07l59
1882a33J03M73n46m27P04J14n33M12J38q35K77Q38n59l55O72l70n98R53K81j053
1902d44K55O18q18P4J109p10q38R99Q4r15Q39M88j364J18J221p69m57J206n31
1921A65j197J272N73j393M37R21j365j10J698p35j157J299J6j429J168R85j785
1938f37l4J558j081o34J814n10j737J385P92j703O01J389j763n26K106o14j449
1955a043J622J26k004J179J508j923k34J856j285j045K242j38k158J301J038k023
1971i81N79J930j890r57K282n37j678J925M17k495R66J881j943l28K152j402j487
$$ y = [201, 127, -326, -156, 198, 82, 17, 73, -147, -226, 89, 242, 51, -76, -88, -106, 10, 172, 136, -68, -191, -77, 99, 99, 86, 31, -202, -198, 181, 204, -53, -8, -32, -248, 25, 373, 22, -239, 52, -50, -180, 318, 290, -362, -181, 226, -133, -30, 443, -103, -530, 174, 288, -245, 167, 305, -530, -253, 585, 26, -329, 343, -27, -625, 328, 609, -444, -189, 429, -389, -315, 794, 84, -754, 245, 329, -586, 253, 741, -623, -505, 716, -53, -510, 696, 165, -1032, 240, 813, -580, -143, 778, -587, -697, 1001, 266, -891, 408, 424, -1005, 163, 1148, -637, -671, 887, -194, -828, 986, 476, -1261, 124, 916, -787, -186, 1203, -560, -1086, 1020, 406, -1043, 579, 705, -1299, -120, 1388, -535, -769, 1087, -198, -1243, 999, 861, -1297, 4, 1042, -981, -402, 1528, -362, -1319, 963, 426, -1252, 673, 1090, -1405, -439, 1442, -501, -829, 1323, -79, -1566]
1988a566K460J47k338J349J188k377M01K391j740j262K281n18j905K124P66k724
2004a323P12K036j949m53K459j250j908K277M42k288J328J356k577R5K636j481
2020A12j464K298l88k177J949J152k523M78J942k016n56K739j000k200K079O05
2036A030k296J269J553k473j58K462j416j249K469m56k496J857J399k383L92J868
2052A372k015o00K643r09j947K071L28k465J383J875k376m50K226j235j113K377
2068A165m10k385J752J182k373O11K100k068j033K506m94j739J859J79k394J398
2084a44J771k314k43K288j474j402K489%k236J351Q91k153R07J997k249q96K578
2101A161p45j824K117M26k481J011J585j954J55K059j866j298K731q5k370J540
$$ y = [-1566, 894, 1041, -1297, 52, 1240, -1137, -736, 1655, -85, -1347, 934, 416, -1489, 635, 1401, -1323, -611, 1425, -524, -977, 1482, 232, -1676, 601, 1043, -1245, 83, 1439, -1138, -1043, 1593, 112, -1352, 946, 558, -1619, 330, 1482, -1041, -563, 1379, -637, -1193, 1546, 546, -1654, 425, 1030, -1266, 3, 1556, -917, -1075, 1387, -29, -1278, 1191, 735, -1761, 96, 1495, -888, -496, 1372, -643, -1243, 1400, 491, -1456, 615, 943, -1522, -139, 1736, -640, -1090, 1136, -99, -1212, 1165, 755, -1630, 122, 1304, -1069, -458, 1642, -426, -1459, 1047, 553, -1186, 673, 852, -1542, -144, 1627, -687, -930, 1358, -116, -1518, 971, 971, -1265, 86, 977, -1176, -269, 1728, -521, -1417, 1161, 416, -1408, 709, 1135, -1346, -335, 1250, -704, -549, 1510, -356, -1654, 1077, 992, -1378, 162]
2117A62J039k359N99K053j800o95K151j125j624K518M44k787R38J816j986j05
2133g61K203j491j378K296k42k025J904R50k815M48K457j636r77K142q89j732
2149a546K236M73k442J151J534k414n6K699j337j758K101k2j958J780R84k621
2165a196M50K208j842p88K555q63k217J983Q83k187R21J468k323j61K594j208
2181B77j637K161m0k321J601J522k307l8J958j546q20K483o02k244J727R31k186
2198a081Q12J815k096p03K289p26j445J935K9k318J294J628k021j01J908j457
2214b38j110K301j25j985J298P62j986P28J858j763q85J980n78j391J811L31k145
2231a137P43J459j526r8J736j228j270J897K20j674J003P77j803K83J791j135
$$ y = [162, 1201, -1158, -559, 1494, -306, -1001, 1150, 25, -1599, 919, 1363, -1424, -486, 1330, -656, -761, 1442, -49, -1427, 869, 627, -1398, 506, 1456, -1359, -911, 1546, -90, -1067, 1075, 186, -1546, 690, 1163, -1279, -128, 1406, -1008, -1064, 1635, 298, -1460, 641, 619, -1339, 441, 1425, -1196, -746, 1462, -380, -1168, 1387, 524, -1693, 290, 1173, -1014, -93, 1375, -948, -1109, 1485, 277, -1360, 801, 761, -1560, 41, 1563, -744, -782, 1176, -370, -1190, 1293, 691, -1553, 174, 1105, -1081, -269, 1546, -550, -1253, 1036, 310, -1135, 800, 829, -1489, -195, 1433, -588, -689, 1219, -238, -1348, 953, 828, -1157, 141, 903, -1083, -355, 1503, -260, -1145, 835, 257, -1134, 677, 1008, -1137, -394, 1065, -461, -559, 1177, -51, -1321, 576, 796, -878, 125, 902, -901, -618, 1173, 38]
2247C8q75J488m51j299J508O47j783L04J203j197j65J612p98j287J302K85j219
2264f87Q40P56j547p0J462o54o57J168l68j223J081P37j218J46Q33j013k21J372
2282G37l66j025P58K04r21O69P73j108k87R63l86m14R37j78j044N42O38o76J26
2301e8N82p74l64R77oo50M33M4p21M22P06n76l18M59k76k36P22N0p46J40L42l25
2323a73J85M53n23l83M68J02k02K84l9n44J42M86j41j21J36k83j69M36J93k88
2343A9p4jj59J89L29j52k98NN5N8K17Rl00j35J50J57R1k3j81j78P3K41J37j23
2367A06j82r1K4J68K00p0k99o0J56Q0J03O8k95k12K74J76p1O2j03l38J26M31r2
2390A61j99Q3j93j40M71J82m60m1J47k24J62M70l14m62L07J08k27L86J34o68j9
$$ y = [38, -837, 651, 200, -1099, 409, 1056, -727, -423, 780, -417, -582, 1030, 232, -1055, 247, 532, -687, 153, 909, -638, -708, 754, 100, -557, 611, 243, -980, 101, 838, -380, -234, 599, -414, -635, 737, 371, -654, 104, 308, -613, 56, 829, -279, -566, 397, 11, -403, 534, 356, -688, -146, 492, -184, -58, 524, -250, -614, 363, 357, -293, 140, 184, -537, -115, 591, 15, -303, 156, -120, -356, 366, 416, -330, -190, 152, -173, 12, 465, -58, -441, 27, 129, -73, 211, 172, -372, -230, 256, 115, -6, 130, -153, -322, 114, 307, 19, -55, -56, -215, -26, 303, 151, -147, -142, -87, -29, 188, 197, -103, -238, -88, 69, 160, 137, -44, -222, -149, 92, 229, 106, -76, -167, -143, 25, 225, 155, -144, -204, -48, 32, 135, 203, -92, -304, -30, 146, 75, 137, 34, -304, -178, 253, 161, -38, 45, -148, -288, 183, 365, -95, -136, 11, -213, -51, 419, 105, -357, -50, 58, -169, 217, 351, -317, -336]
2411c36N70j79j43M26l39n44N77L76n30J03K78o12JQ35k54n79M58l1n59O14M90
2432F22q60j35O55m02j69Q46l09r02O06M24o73L27N63r68k28J070k41o21P32j07
2452B30r76O90P86r18j39P76o86l83J221j15j120O19M15r46M47R67j058n36J144
2471D18k52p27J026Q7j378N47J021r68j11J055q55p84J391J31j209O82N02j314
2489g38L67J374j015p26J216l53r45J263L67j553L76J076j080p2J406q97j133
2506a067J402K58j257Q17O50j559J58J530q99p13J309m16j306J327P62j576K13
2523c67J087j170k08J648o95j304J271K86j389Q95J039j643k42J535o85p36J418
2540G40l54j538J218Q79j508K52J238j316n59J727l10j274J098J72j454R72J190
$$ y = [-336, 234, 55, -88, 338, -1, -545, 32, 408, -122, -19, 259, -353, -352, 483, 229, -350, 108, 77, -482, 132, 622, -238, -373, 282, -120, -289, 557, 248, -654, -48, 376, -297, 30, 593, -375, -603, 467, 226, -395, 337, 230, -746, -56, 730, -188, -327, 449, -237, -620, 601, 486, -634, -15, 400, -546, -99, 868, -190, -726, 418, 166, -561, 465, 552, -826, -279, 742, -226, -337, 718, -137, -921, 470, 601, -608, 74, 576, -738, -371, 1003, -12, -738, 478, 125, -820, 443, 810, -743, -367, 709, -371, -443, 963, 66, -1067, 335, 593, -664, 153, 803, -756, -598, 932, 33, -680, 629, 213, -1093, 234, 996, -580, -367, 720, -450, -658, 990, 295, -1009, 262, 548, -841, 54, 1093, -550, -792, 743, 58, -678, 740, 386, -1152, 66, 945, -563, -311, 927, -389, -948, 779, 469, -805, 293, 465, -989, -17, 1173]
2557A173j616l24J520p63q48J540l9j572Q44P67j279M36J233j447o90J765k19
2574D81j277J107L27j528O03J219j183k41J290r66q79J729J45j675O86Q47j266
2591e81K57J298j086p02J369l70j036J364L56j778M18J331r97k81J189q16q56
2608i21J423N5j291R10N89j581K47J587r08q17J124l28q75J248K77j511N52R75
2626G55j256m8J532p88j169J180K41j019Q38M23j470L25J362j010n64J390m77
2643B45j269J168O37j235L24P07j188J14J516q70j059J294M2j243R24Q08j391
2660d76k4J079q22k36J364o90j294J290N68j342M73Q98j247k13J383n69p29J127
2678E40k74j288J151Q79j469j1J129q97m10J395l81j187R85L20j208P31R97j419
$$ y = [1173, -443, -767, 753, -10, -858, 682, 643, -929, -85, 682, -597, -161, 1072, -375, -1065, 700, 481, -796, 311, 638, -890, -287, 932, -251, -492, 798, -168, -1047, 682, 827, -848, -162, 685, -581, -324, 974, -112, -814, 555, 185, -851, 513, 869, -909, -491, 840, -157, -438, 751, -65, -921, 502, 557, -734, 176, 765, -816, -569, 1018, 110, -707, 417, 89, -786, 462, 739, -772, -220, 755, -501, -549, 983, 195, -974, 206, 447, -572, 266, 689, -781, -456, 906, -104, -668, 722, 245, -1024, 144, 781, -454, -130, 577, -611, -497, 1019, 149, -910, 384, 426, -817, 107, 915, -476, -500, 579, -243, -479, 885, 195, -1099, 191, 759, -583, -110, 788, -459, -672, 711, 142, -587, 540, 266, -1022, 129, 1008, -461, -472, 657, -240, -650, 745, 364, -823, 162, 482, -726, 5, 1002, -417]
2696d17l90J424m37q09J156j04j339Q45Q60j184J07J067j077n83J523j14j221
2713f93Q19L49j211N89J088j160m23J196n36p53J293P9j435N66Q65r92J02J082
2731H25r71p14J304k5j008Q25L30j296L56J190q48m62R96m76q07J138L25j241
2749e59L54P34r44L8J184o93q54R50J17q59P16M67j184N2J050n76l85R13l90q82
2769g51Q52N02r07J92N79q43r8J066l31p61O55M2p41O26N67r04j70P44l98k65
2789c44Q12k00q51N07M44n94K07M90p18k58Q24p3n17M50no64L92N95n31k14M52
2810B04l14k51O73L4o51J83K83l79J98M63m68l75M65N2k54L39K4n69J14M84j93
2831F2j11K34k72k58M48J89l33J2P2k68J25M03j74k97J22Lq0K85Q2l53r5K00J7
$$ y = [-417, -807, 617, 180, -629, 527, 423, -916, -71, 789, -395, -288, 779, -298, -881, 642, 528, -693, 126, 475, -736, -147, 941, -219, -642, 554, 18, -735, 558, 637, -798, -232, 633, -359, -257, 825, -146, -860, 444, 419, -589, 236, 566, -730, -374, 816, -32, -494, 502, 26, -781, 357, 682, -559, -205, 529, -415, -377, 807, 114, -740, 210, 327, -532, 184, 651, -533, -481, 569, -7, -392, 521, 131, -751, 101, 603, -304, -112, 467, -376, -474, 592, 261, -500, 155, 197, -544, 82, 649, -255, -425, 319, -79, -344, 468, 268, -583, -76, 368, -226, -19, 471, -247, -505, 319, 246, -271, 179, 174, -490, -98, 497, -34, -248, 204, -110, -361, 312, 346, -305, -122, 161, -218, -20, 443, -25, -400, 65, 117, -137, 202, 226, -343, -229, 255, 62, -49, 185, -87, -345, 103, 292, -41, -29, 43, -225, -100, 303, 129, -168, -46, -43, -123, 162, 244, -109, -204, -4, 13]
2854A3L7J45j82k54J47J95k0Rm9k02JK39R2j17q8p4k8J52J73q2j90m7M9J08J04
2879A31lj63j53R6J84L2n6o4j52MK44Q6j64q1j9o3J52K30j43k59P5N9j0J98J7
2904A78l44l1K49j2J2J36k29k54K72K22j94K7N2l06L6M28o4k81J26m5k27L34K62
2927C47m20j23K58j52k3M28j68m72K53K19k53J74K38n03j43N25m7k64L10q9m93
2948c98L62M09m14q1L26l79j38O39n4n61K60J71m42L10M69n83k64N51j40k90N61
2969C14l8p19K91N01m67J6N09n41l63P50O0n92L73J68p09K85P12n59l38O13k72
2990fm59P68J59q70K35N28o04O7P49n69n77P71P0o31N36K79r20J53Q42n18l23
3011c20P25l62o80Q45L38r13K46N49p73k2R83m56p13P39M4p51O68M95j049k9R19
$$ y = [13, 50, 195, 13, -241, -94, 101, 81, 90, 41, -161, -160, 79, 171, 54, -34, -108, -136, 16, 189, 107, -83, -130, -81, 27, 131, 128, -35, -188, -92, 92, 124, 68, 4, -148, -144, 100, 186, 22, -59, -78, -141, 11, 241, 98, -161, -86, -27, -37, 161, 178, -166, -197, 52, 40, 52, 188, -41, -295, -23, 199, 5, 32, 84, -222, -186, 242, 178, -103, 23, -22, -249, 85, 347, -73, -196, 62, -90, -113, 315, 147, -325, -72, 147, -106, 68, 306, -197, -340, 185, 138, -126, 184, 95, -398, -36, 373, -41, -122, 204, -175, -313, 326, 272, -289, -29, 142, -300, 10, 479, -104, -368, 183, 43, -247, 314, 276, -443, -152, 349, -118, -102, 407, -134, -497, 253, 313, -279, 94, 262, -447, -162, 550, -9, -347, 266, -6, -465, 303, 462, -408, -173, 355, -249, -182, 567, -2, -579, 192, 262, -369, 167, 446, -474, -321, 521, 3, -320, 405, 43, -637, 208, 546, -367, -121, 428, -345, -367, 616, 160, -553, 186, 230, -521, 147, 642, -407, -436, 483]
3032D83n13l70Q92k60r28P38M76q74K82O44r20k28J139k93q06P54Q3r12N84P19
3052F90r49j27Q60n96m31J101j21j090O12N32q48K49P63q57l72J032k62p06Q64
3071C44J14j134M61Q90q07k06P88n61m86J051k0r99N87M67r81K20J009p28n90
3090e81Q69j33o36Q19J58j095L75Q22p74j92R67n13p76Q82K50q17M55L54r54K10
3110c10J012o72n58Q80j60p91P48M28r33J57N92o84pR61n66p83Q55K30q12M48
3130C5M91q76k2Q17m55l18P88l44q14Q23M72r11J08O31o52j47Q66l30o12O62m
3151B08p48O41N61r65j45Q27l58l70P42k03p27N96L17p25L33N69q37k33R29j71
3171B41o06N58%o90N32M67p54K5O44n91l00R16j06q15M58K91n98L34N07p48j88
$$ y = [483, -30, -400, 492, 232, -696, 42, 518, -356, -74, 570, -350, -578, 561, 268, -538, 216, 299, -613, -29, 690, -259, -386, 474, -122, -553, 548, 427, -663, -51, 481, -367, -118, 645, -212, -584, 448, 186, -520, 344, 458, -676, -215, 675, -132, -338, 450, -111, -597, 454, 434, -565, 22, 489, -492, -272, 737, 9, -581, 288, 155, -481, 338, 496, -599, -224, 598, -176, -368, 599, 86, -690, 192, 442, -375, 80, 434, -520, -310, 702, 30, -528, 352, 192, -599, 149, 577, -356, -199, 393, -291, -298, 663, 97, -686, 169, 399, -413, 35, 526, -350, -372, 445, -10, -328, 460, 116, -698, 125, 597, -314, -206, 425, -227, -374, 492, 162, -450, 212, 208, -540, 101, 662, -303, -448, 379, 21, -349, 393, 190, -537, 59, 376, -349, -16, 553, -284, -517, 412, 241, -365, 193, 193, -497, 35, 502, -252, -227, 417, -174, -474, 442, 336, -479, -21, 270, -328, 6, 513, -235, -423]
3192d23Q05l16m58P02Jq43M04N72o05K5N37n87k78Q46r7p11N05K35p43K93O89
3213E53o17k93O37k93l97P58J1q44L56N16o16N7O65n55m41P32J3n69M93J61p80
3234d53K52P18n52k59O19l08m97P16J66p40K60L88n98Q5P14m68m94O13J3n23M91
3255A43K78p65R1O14m04j86N93k95n62N90K69o07J79L97o07l1P14k73m63M65%
3276A40n25M53L78o41m9N16l44j76O04j79n79L91K62m43J84L57n21j75N92j11
3296A34l50L84k1n09L17M13m32r1L63k82k16N44j8m91K16J96l50J45L87l77k52
3317b90M01k3k53L12M6m59J32L59k22q8K86k35k29L73J20l32Q6J18k69O0L55j67
3339H1k47J89rj64K58J05l23l5K10p6k1K05j32k42J72J46j22M4N7k05l4K55Jj37
$$ y = [-423, 382, 66, -392, 310, 311, -532, -128, 444, -161, -136, 401, -186, -464, 382, 285, -426, 79, 314, -429, -136, 553, -64, -357, 280, -13, -410, 348, 359, -485, -129, 387, -229, -172, 493, -62, -503, 229, 242, -327, 166, 327, -453, -201, 517, -35, -294, 325, 17, -480, 236, 402, -338, -78, 310, -288, -203, 511, 43, -451, 162, 175, -348, 143, 421, -344, -253, 361, -43, -229, 364, 69, -493, 97, 366, -241, -62, 335, -272, -303, 411, 138, -325, 140, 140, -385, 68, 446, -195, -244, 272, -72, -248, 356, 177, -402, -11, 251, -192, -8, 349, -172, -347, 245, 134, -216, 168, 147, -362, -45, 368, -64, -155, 208, -74, -290, 254, 236, -255, -39, 157, -193, -48, 339, -38, -290, 111, 88, -165, 147, 193, -266, -134, 225, 3, -85, 201, -34, -263, 110, 230, -102, -16, 102, -167, -107, 248, 81, -166, 23, 14, -150, 108, 213, -110, -145, 65, -11, -32, 173, 41, -201, -29, 117, -5, 39, 96, -109, -143, 112, 113, -24]
3363b4M5m1j19J53J52j20j23M7k4J6J49j8j61j5P8K6L3L8j08j05O9J02K2l3m9
3388a0p4QJ11O7p8q0KrO5R3l2j42k2R6K7K5M4j36r5J34R3n2%j7j26J6J95Lj42
3417c6M2m1p9J52J31j91p0R4m3oJ91o4k38R6J28q5M8J14k25r4K38J2j24J28l7
3442D1k36J46K28j64p6J42j47r5L16lk85J11R8k07J16K45k44j82K68l4j50K48
3464A36Pl55J12K74k22j5K49k37j93L45O8k91J41J02l36J12L67k46k05L01r8k51
3486b35L62J19m33Q2K77k76JL86k68l25L84P7l38K51J81m67L0M62k52j88L73j57
3508D6l72M02K10m53Q1L11l90m3N31k26l98L83O1m23L39K80n44l0M93k80k00M92
3530B70j44n17M09K80m93J25L82m81j41O22j75m39M37O2n66L39M54n62j03N12
$$ y = [-24, 21, -20, -139, 14, 166, 46, -77, -30, -54, -38, 111, 93, -68, -83, -5, 21, 54, 92, -16, -121, -52, 50, 72, 39, -10, -84, -76, 35, 102, 24, -56, -54, -63, 2, 95, 63, -79, -101, -5, 22, 47, 91, -45, -140, -6, 87, 35, 35, 18, -108, -92, 103, 106, -36, 6, -35, -114, 38, 169, -22, -92, 2, -41, -47, 144, 80, -158, -62, 66, -19, 29, 143, -82, -176, 62, 74, -50, 78, 41, -195, -49, 179, 15, -61, 81, -66, -161, 155, 152, -133, -22, 76, -131, -15, 230, -14, -196, 72, 38, -112, 136, 143, -212, -100, 174, -48, -63, 186, -51, -244, 101, 169, -122, 19, 121, -215, -103, 264, 18, -187, 114, 16, -235, 127, 246, -187, -105, 172, -104, -103, 283, 15, -310, 74, 151, -187, 64, 245, -222, -192, 270, 18, -170, 203, 46, -326, 76, 286, -167, -86, 225, -165, -208, 323, 97, -301, 82, 143, -280, 59, 339, -205, -235, 258, -22, -222, 270, 126, -391, 18, 298, -195, -70, 312, -169, -310, 312, 137, -302, 135, 197, -369, -30, 424, -138, -241, 271]
3550B71l09k73O01n9o17L60L25n47J26N38n14k88O28r4m53M68R5o46K76N35n29
3571a06j43N80l37m01O16Q6o20L14L12n93J20O28m89l72O29o5n18M91K22o83J56
3592a73N28m62j20O14l46n03O17J95o61K67L85n91qO49l47l93N89r0n78N24L45
3613D41p18M0N77m19k00O17k27n30N28J71o12L24M26o40j19O70k36l92N06n4n40
3634c87M36L35o09M9N20m49k50O60r7n52L84J76m96K53M20n71j32N99k50l70N49
3655B18K2o01K91L90m81K3M65m25k50O19p0n08L76J93n53J79M85m36j85M70k20
3676Bl12N47J4n74K59L60m54LM92l58k94M75l8l80L86J10n50J89M50l84j61M50
3698B32k17l40M69Q5m67K31K35m56Q5M92l39l09M62n3l72L69J59n00J07L82l61
$$ y = [271, -38, -311, 290, 231, -386, -26, 299, -248, -122, 416, -98, -386, 242, 148, -305, 163, 258, -388, -112, 423, -106, -249, 331, -6, -407, 209, 295, -325, -11, 301, -292, -172, 456, -33, -405, 224, 159, -359, 132, 354, -329, -173, 355, -107, -227, 387, 41, -462, 155, 350, -311, -44, 341, -250, -258, 391, 44, -349, 240, 150, -428, 96, 441, -277, -237, 340, -79, -279, 338, 111, -419, 109, 280, -332, -8, 418, -222, -341, 329, 93, -299, 207, 153, -387, 49, 384, -225, -176, 344, -105, -355, 305, 208, -344, 40, 216, -280, -27, 393, -178, -310, 289, 39, -331, 218, 240, -361, -70, 320, -161, -138, 327, -98, -348, 271, 201, -307, 69, 262, -291, -112, 373, -63, -248, 222, 2, -310, 237, 251, -323, -64, 296, -158, -155, 337, -21, -315, 160, 122, -258, 128, 238, -312, -123, 327, -57, -218, 232, 15, -325, 144, 229, -238, -7, 228, -228, -143, 349, 10, -299, 163, 110, -262, 107, 266, -234, -127, 255, -106]
3719a06n8M48k53l64M48J04m34K16K40m54M1M55k82k28M01j01l79L91J88m69Q1
3740a15L37l39o0M59k33l29L75M9l70K68K34m61JM09k17j96L81j03l79L31J99
3761B41m05R8L00l54r2M54j47l26L22L5l62K43K80m11n5L74k11j82L96o6l92K58
3783bK10l56Q9L09l35j38M07q0k91K86M4l76J92K84l12p1L07j83j95L67Ql59J89
3806fJ68l06P9K96k58j61L07l7k41K43P0l37J00K67k13p4K61j55k08K87O8k71
3828a21J11J32k41J9K85j51j85K18j0k03K05J02k60K0J88j39o3K22q6j94J58J01
3850A08j76O5J21k01j8K14n8j30J10kj36J08J18j47m1J23o9n8J49k0j37M6P5q7
3874d3M0Q4j01n6R0L2n9M2jr0L8R2l2n3L0j5m5N8N4o6l8L8j5KN6qp1nM8lkK7l2
$$ y = [-106, -164, 284, 31, -333, 115, 219, -215, 1, 241, -213, -172, 283, 1, -227, 174, 73, -306, 85, 273, -196, -115, 222, -117, -177, 282, 49, -280, 95, 144, -226, 42, 276, -185, -184, 225, 8, -188, 193, 90, -289, 42, 241, -164, -66, 234, -120, -212, 242, 95, -231, 91, 126, -236, 7, 287, -124, -179, 195, -16, -198, 198, 132, -260, -2, 208, -148, -59, 250, -85, -223, 184, 104, -187, 99, 143, -233, -41, 243, -69, -140, 167, -16, -211, 156, 164, -195, -6, 162, -144, -65, 231, -27, -188, 119, 82, -159, 84, 154, -183, -83, 184, -29, -103, 158, 3, -205, 82, 150, -121, -10, 122, -119, -100, 185, 34, -151, 67, 57, -146, 59, 161, -99, -79, 109, -30, -93, 129, 43, -151, 7, 108, -68, -3, 118, -83, -101, 113, 55, -75, 35, 33, -103, 5, 123, -24, -65, 58, -11, -69, 80, 60, -77, -31, 44, -43, -3, 81, -20, -76, 14, 46, -13, 29, 28, -62, -24, 68, 36, -17, 13, -2, -47, 11, 65, -1, -39, -1, -16, -14, 42, 34, -37, -42, 6, 3, 1, 28, -4]
3907dm9L9O3l5l2L1l0k9O2L3o7j8N2k7j6Q8l0r9N9M3n9L6M1q3m3J23pq2P3Nj20
3938h2O4J11r6m3Q5m3q5J33K9j51M5R5j22K7J45j12j07J57j3j12J14N4j96L7J64
3963I8j04o3J52p0j46J65O6j78O1J11j70JJ97j04j33J84rj71J44J00k22J2J89
3986A10j32q4K24q2j95J76R4k13Q8J61k37j9K51j09j71K16jk46J68J66k57LK35
4009A46j88j03K90o4k55K01J08k82J12K27k69o6K96j29j81K72Nl21J81K09k87
4030i8JK83k27j43L39o5k80K32J10l28J22K76k90j15L43j20k52L27M8l75J77K58
4052B23l48JL59k50k20L88k6l57K73J70m05R5L48k96j58M00j49l18L81R5m18J49
4074f3L00l48n0M03k25k73L97Rm02K86K24m41L4M12k92j85M14j00l70L45J49m35
$$ y = [-4, -53, -14, 49, 14, -18, 13, -17, -46, 16, 49, -18, -36, 16, -11, -27, 61, 31, -68, -9, 34, -25, 11, 52, -31, -74, 49, 42, -40, 33, 38, -82, -18, 93, -3, -46, 39, -4, -89, 44, 73, -78, -33, 62, -60, -33, 112, 0, -107, 50, 37, -75, 39, 93, -103, -66, 98, -6, -69, 83, 13, -133, 32, 98, -80, -19, 92, -78, -77, 120, 16, -117, 67, 58, -113, 31, 131, -91, -79, 110, -22, -106, 118, 36, -159, 17, 111, -102, -14, 147, -90, -109, 142, 33, -138, 78, 77, -169, -1, 165, -92, -89, 146, -42, -145, 145, 81, -174, 27, 135, -147, -35, 192, -77, -143, 153, 24, -157, 115, 120, -201, -20, 189, -98, -97, 186, -41, -184, 155, 90, -190, 42, 152, -176, -54, 222, -68, -183, 160, 40, -212, 115, 163, -212, -35, 223, -125, -124, 235, -15, -235, 153, 127, -230, 43, 213, -192, -97, 251, -45, -203, 197, 48, -270, 111, 206, -212, -63, 237, -111, -161, 242, 17, -256, 141, 150, -252, 34, 258, -183, -149, 263, -29, -214, 200, 100, -270, 75, 224, -211]
4096b11J38L48l92j01M76j90l38L86N1m24K52K86m51j2M56k85k52M68o1m39L21
4117B6K29m59J07L87l80j57M97j52l81L95R9m80K17L52m32n8M46k40k95M61%m71
4139b89K96K65m57N6M22l46j92M50j02l77L71J33m68J54L72l85j12M43j98l12
4159b76M19N7m59K49K69m25J0M29k88k35M22l9l91L17J85m58J16L66l40j27M28
4180B29j62l28L64R0m07J92K64l85j3M05k42k45L84k9l61K66J95l85O5L42k96
4201e7j28L73j19l02L09Q9l65J71K59l50m3L75j92k27L48k7l26K30J85l46N3L11
4223B21k70j24L38r2k84K79R6l36J39K36l10l1L33j79k17L19nl10K17J68l29O6
4245g5K69k41j15L12p9k64K56P8l01J32K10k67m1L05j76j83K94Jk90J95J52k88
$$ y = [-211, -73, 275, -117, -218, 258, 68, -270, 116, 167, -257, -5, 281, -170, -182, 274, -11, -263, 205, 144, -295, 26, 255, -204, -97, 290, -90, -247, 250, 98, -283, 112, 211, -269, -52, 300, -132, -190, 256, 16, -279, 182, 182, -289, 7, 272, -185, -129, 293, -53, -245, 205, 103, -274, 97, 230, -238, -84, 288, -97, -209, 234, 36, -276, 143, 200, -259, -10, 259, -166, -156, 273, -15, -250, 172, 133, -258, 59, 244, -214, -98, 268, -72, -199, 229, 67, -261, 103, 193, -214, -22, 242, -143, -156, 249, 7, -238, 146, 117, -244, 22, 217, -168, -103, 239, -57, -185, 188, 69, -233, 76, 165, -200, -29, 230, -120, -163, 212, 20, -207, 141, 114, -212, 18, 203, -143, -90, 221, -49, -173, 165, 73, -211, 68, 164, -172, -33, 203, -107, -138, 195, 16, -201, 118, 113, -197, 20, 188, -141, -75, 194, -47, -162, 150, 71, -193, 63, 141, -160, -28, 182, -85, -126, 179, 3, -180, 114, 115, -175, 20, 172, -116]
4267a16M0K61k10j22K83o7k44K33Q0k92J18K06k45l9K81j49j85K67Nk72J68J57
4289A58k79L6K49j96j07K68o7k17J98P9k66J04K07k30n2K48j18j75K45J7k46J52
4311HJ44k40J2K32j70j13K29l8k02J64Q9k35O7J99j90o0K28j11j50K05L0k21J01
4334b2J40j88lJ90j24j14J98kj83J21R4j97L6J70j34o9J71n1j48J50N4j75O1J15
4358I0j38j3J57p2j12J22K4j37Q0Q6j41mJ36q7o2J26k0j11O7O7j05K8Q6q5m5J10
4384D7k3q4P2K9r1N0O6p0l7P6j9m7M0K9o6J6M1l9%M5l0m8M9J9l9kL1j2j8L6kl8
4416a9mL0oqK2om0J1L8k6j4M5l5l1N4K1m5J7K5m0k1O6j1o4M8J4o1L8O5p6l7Q6
4448C6l1o5R6Mj04M7Q2r5oJ00p2p6J28oj08P5N5j21J9J36r9p7J41l6j13J19N8
$$ y = [-116, -76, 185, -25, -147, 136, 69, -175, 58, 138, -154, -36, 170, -75, -114, 167, 18, -167, 100, 105, -167, 1, 158, -121, -85, 164, -32, -139, 129, 62, -155, 43, 122, -144, -40, 167, -63, -115, 133, 15, -160, 85, 102, -144, 8, 152, -88, -76, 156, -14, -127, 102, 64, -138, 26, 115, -120, -53, 146, -44, -104, 124, 13, -137, 68, 98, -123, -22, 118, -70, -73, 117, -7, -121, 77, 75, -108, 13, 107, -90, -54, 116, -18, -87, 84, 33, -115, 35, 89, -86, -25, 90, -48, -61, 96, 24, -88, 34, 58, -79, 1, 87, -54, -58, 78, -9, -71, 55, 35, -76, -9, 58, -47, -19, 67, -18, -63, 47, 24, -60, 12, 41, -50, 0, 66, -4, -41, 35, 16, -31, 9, 38, -28, -12, 29, -10, -10, 35, 5, -43, 6, 25, -14, -16, 15, 3, -15, 21, 19, -19, -23, 7, 1, -7, 15, 9, -31, -20, 18, -8, -22, 23, -12, -43, 11, 32, -13, 4, 29, -11, -32, 34, 23, -41, 7, 21, -40, -2, 63, -13, -50, 36, 5, -60, 36, 40, -64, -17, 65, -30, -36, 64, -8, -84, 44, 38, -70, 5, 60, -61, -42, 94, -5, -82, 59, 23, -90, 29, 87]
4475H7j61L5J12j11k6J54q2j21J52L1j51Q2J01j79mJ85r5r5J61m0j47J40Q1j96
4499h7L3J60j45o0K21p7j68J53M6j97J24J37k25k0K07r6j16K06l2k24J68J21k30
4522a01M4J94j84q1K57p5j93J94M6k40J30J82k42m5K44j29j47K65k5k63J58J49
4544A38k48M7K31k20j03K81o6k22K32N5k95J22K37k45m9K66j62j81L01Jk80J58
4566bJ65l00N8K91k48j50L15o9k55K76Q4l50J17K61k67n6L19j74k38L25L5l30
4588a93K00J69l47M3L63k56j84L40p1k87K95J18l79R8K94k84p7L76j75k87L31
4609H7P4l53J95K20l80LL93k38k14L78o0l62L01J90l93N2L22l12j03M22j30l49
4631b57L38J01m07J97K97l96o1L99j96k47L91j4m18K56K68l92K9L59k83j92M22
$$ y = [87, -74, -39, 73, -38, -64, 90, 8, -113, 39, 70, -81, 1, 102, -77, -81, 104, 9, -86, 75, 35, -112, 28, 109, -87, -54, 106, -39, -99, 122, 45, -123, 30, 76, -121, 3, 140, -85, -105, 102, 6, -110, 96, 64, -160, 8, 129, -101, -57, 137, -47, -128, 129, 54, -139, 55, 101, -139, -9, 173, -69, -114, 130, 1, -146, 119, 94, -169, -11, 138, -110, -63, 168, -52, -155, 126, 60, -162, 70, 125, -170, -48, 189, -56, -105, 161, -1, -182, 119, 120, -160, -2, 163, -137, -79, 212, -36, -186, 129, 60, -195, 81, 165, -185, -68, 193, -74, -130, 189, 15, -223, 102, 137, -193, 7, 176, -171, -128, 235, -21, -205, 135, 64, -223, 72, 190, -189, -91, 203, -81, -158, 218, 43, -244, 87, 161, -192, 3, 223, -157, -154, 239, 1, -213, 165, 105, -257, 44, 234, -159, -107, 215, -97, -200, 222, 92, -257, 81, 182, -225, -28, 269, -127, -188, 211, 15, -232, 159, 145, -273, -17, 251, -141, -112, 247, -36, -228, 194]
4652A94p7l52L08J16m18J63L50l55j29L96j60k77L82L1m18K02K70l80K0L98k84
4673b0k53M24Kl79K77J61m12Q2L95l32j39L99j59l23L75J28m23J29K78l36k0L93
4695B47k22k71L71J2l66K66K04m11K6L68k51j44L54j18l18L09J49l80J30K73l42
4716a14p4L99j48k63K86K0l17K28K12l66LL20k10j62L60m9l47K30J62l02R6K57
4738B21l22r5L68j07k39K66L1l36J92K26k91k3K70k01j41L35l8l11J92J35k68
4759a36Q4K52k57j16K92q1j93K57J8l10J44K07k44RK32j79j66L09kk55J71Q0k64
4782a48R7K38k16j06K40r6j65K47M0k81J02J72k08L4K26j93j58K49%j91J62O8
4804A13k57P2K17j58q1J96j04j67K38N3k25P4J28k07K7K42j43j53J84j0j66J85
$$ y = [194, 117, -235, 73, 189, -229, -66, 284, -71, -200, 196, 36, -241, 141, 172, -246, -44, 226, -154, -134, 264, -20, -273, 151, 153, -226, 51, 212, -200, -118, 277, -55, -194, 205, 46, -277, 98, 226, -197, -68, 210, -126, -146, 247, 25, -246, 125, 137, -229, 37, 241, -170, -144, 224, -27, -171, 183, 65, -253, 56, 205, -175, -45, 228, -114, -188, 211, 63, -200, 86, 106, -211, 17, 229, -137, -134, 186, -24, -186, 174, 125, -222, 8, 170, -132, -36, 221, -101, -196, 172, 65, -174, 92, 123, -213, -21, 205, -86, -109, 161, -40, -181, 154, 116, -195, -3, 132, -136, -52, 200, -57, -173, 119, 38, -155, 102, 120, -190, -46, 161, -83, -74, 158, -21, -187, 122, 120, -135, 36, 116, -148, -51, 187, -29, -135, 105, 9, -156, 91, 131, -150, -48, 124, -84, -50, 176, -17, -175, 74, 74, -117, 45, 113, -144, -72, 145, -13, -94, 102, -2, -169, 69, 122, -103, -29, 99, -108, -81, 161, 18, -135, 49, 39, -127, 58]
4826E8P7k47M1J62j22k7J76r3j75J72P3j70P6R9k02pK32j01j20J56l5j43J47R8
4850A25j92qJ42j18k1J91p2j65J13O0j24P0J07j77k9J70l5q0J11m6j39J00J21
4873A04j13k6Q4r5m0J51J1j37L7M3j04P1J11j13p6J10j3m0Q0lj18L0Q1k4j2N8
4899E7q6o3J28K0o1J1J1p6K9R6k4p2J1Kj1N8L0p1m2N5mJ0L6l0o7NN9K5j3j2l8
4930b7j6M5N2l0m8NjMN4L2q2n1N3K0NL6l6q8M5P3k9j5L9p6l9J10L6r1J3K3o5K0
4962b9J23p5q5P2kn0R0L8j48%J08n0k1J09o7j41J30O1j00M8O5j58j4J84m0j21
4988g3J04j2j33J30J20j60n0J33q7m2J86m4k02J06Q9j29O1J37j88q2K22m1j23
5011g8J53j7k13J10J94j68m0J55j42r3K51J1k32J07Q8k18Q9K17j93j24K11n2j24
$$ y = [58, 135, -112, -71, 91, -31, -58, 118, 25, -150, 22, 95, -75, 1, 100, -102, -109, 123, 22, -98, 58, 23, -120, 27, 125, -67, -75, 67, -51, -72, 119, 47, -118, -5, 55, -69, 1, 108, -69, -98, 72, 37, -43, 68, 22, -117, -17, 104, -9, -35, 49, -46, -86, 65, 76, -61, -24, 19, -85, -14, 97, -16, -92, 18, 5, -35, 45, 42, -76, -46, 35, 11, -1, 57, -29, -92, 36, 56, -5, 6, 17, -59, -30, 66, 42, -30, -19, -17, -28, 30, 60, -11, -53, 2, -2, 8, 44, 14, -53, -48, 11, 36, 23, 11, -27, -43, 2, 54, 24, -24, -19, -20, -16, 38, 70, -12, -63, -10, 10, 15, 51, 15, -73, -28, 45, 16, 1, 40, -36, -75, 35, 71, -20, -7, 16, -49, -29, 94, 19, -66, 6, 4, -46, 44, 82, -66, -66, 42, -8, -29, 80, 13, -128, 2, 63, -37, 11, 76, -82, -96, 88, 48, -73, 31, 19, -114, 16, 136, -24, -74, 59, -28, -70, 116, 72, -130, -24, 65, -64, -3, 134, -54, -136, 86, 45, -78, 75, 58, -155, -45, 149, -19, -59, 96, -46, -139, 112, 123, -109, -2, 86, -132, -43, 174, -19, -143, 68, 16, -108]
5034a08K05K5k73Q6K00j77j0K08j72j71K66L5k20J31Q9k70P9K73j91j30K33r8
5056A0j89K64Q8l07O2J87k01J0K85j83k38K59N3k35J79J26l17J6L02j64j21K70
5078A56j32k58K96J35l20P5K02k79oL59j69k55K64K9k88K34J82l44k4K97j81j11
5100a38L22j06l39K86J55l30J26K35l42p3L91j13k47K83j5l46K58K61l64m2L12
5121A74k26j44L93o2l71K45J50l45J61L11l89j43M18r5k66L25J2m23K26K98l56
5142a07j4L44k80k31M53K1l97K13J52l72J48L67l65j50L98j32k91L85R6m73J34
5163a01L28l18j3L70k94k74M48M3m05K43J95m31L7M35k49k08L59j36l21M12J48
5184B68m84J04L43l55m6M42k04l55L60O9l59K71K17m81oM65k25k27M03j08l86
$$ y = [-108, 97, 122, -151, -65, 135, -42, -52, 156, -16, -187, 79, 114, -106, 25, 114, -156, -77, 196, 5, -125, 108, 10, -179, 85, 173, -134, -72, 115, -86, -76, 209, 26, -212, 47, 100, -135, 44, 170, -147, -131, 171, 7, -114, 156, 24, -234, 62, 197, -123, -48, 154, -125, -131, 228, 59, -196, 68, 97, -191, 43, 225, -119, -143, 154, -27, -138, 184, 78, -261, 25, 180, -150, -24, 211, -131, -204, 187, 74, -173, 110, 95, -251, 7, 268, -96, -138, 174, -52, -196, 197, 135, -236, 9, 159, -186, -25, 286, -103, -246, 172, 77, -189, 136, 148, -275, -49, 249, -107, -121, 223, -57, -288, 165, 186, -211, 2, 154, -218, -70, 297, -68, -218, 180, 48, -243, 142, 238, -235, -101, 227, -91, -104, 266, -28, -302, 146, 189, -216, 27, 222, -209, -172, 263, 14, -194, 165, 29, -292, 120, 268, -216, -112, 231, -124, -170, 272, 68, -287, 73, 142, -217, 54, 271, -210, -216, 249, 24, -203, 200, 92, -294]
5205b94L16K32l92Q2K80l64q3M94j45l83L12R9l83K06L02m00p2L75k01j77M13
5226B17o8m37K45K71l50M6L15l20j51M11o9k95K85M2l89J86L64l57j33L39j61
5247ik08L76K5l96J72K03l04O9L47l00k28L56Jk65K45P9l61R3L15k48p0K79j89
5270a8k28L45Q9l11R0J68k79M5L20j86k06K66m8k24K67J09l46K2K71j79m2K56
5292A81j39k52K55R3k43J31J34k94LL10j15j76J89n1j95K21J33k62RJ87k00j7
5314i8K86j16k37J59P0j64J31J27k49m7K39q4p8J76o1k37J73J55j72RJ07j74l5
5337a20K55l9j91J19J5j66J36J54k01o9J47o0m7J84l8k23R8J20j22N4J18j84p8
5360a38J94Kj10J02k5j65J08J55j24l3Q1j01n5J95J9j89M9O2q9O7J34j50r5J19
$$ y = [-294, 22, 254, -138, -56, 224, -140, -223, 271, 126, -257, 55, 154, -229, -23, 279, -121, -193, 182, -19, -196, 217, 149, -288, -43, 228, -122, -76, 239, -81, -232, 179, 110, -185, 100, 142, -247, -61, 303, -54, -187, 152, -9, -217, 159, 184, -212, -40, 163, -141, -72, 275, -25, -253, 103, 104, -161, 84, 163, -198, -105, 210, -38, -108, 171, -18, -246, 99, 188, -123, -33, 135, -144, -99, 221, 35, -171, 95, 47, -177, 90, 199, -147, -125, 146, -33, -75, 181, 42, -210, 45, 138, -105, 26, 160, -134, -131, 179, 64, -112, 77, 26, -169, 52, 185, -77, -68, 119, -81, -98, 188, 72, -165, -6, 64, -100, 31, 158, -91, -138, 101, 17, -61, 115, 54, -183, -10, 145, -27, -18, 89, -85, -120, 135, 96, -95, 24, 39, -127, 9, 163, -38, -107, 40, -20, -67, 117, 79, -144, -46, 74, -48, 6, 124, -60, -138, 56, 58, -52, 50, 25, -140, -32, 123, -1, -34, 47, -54, -109, 86, 105, -84, -35, 27, -62, 5, 139, -11, -106, 13]
5384A3pl0J04rj78J9J50l5j7M3r4p5J46M6r0K7mj04N7J55p2r6L4%j9R3K6j06l6
5413e9N4pL3N0n9j14O0P6jJ0k7p0NQ6J8m5jl4l7O7P0l1o9k1J1M1M5%n6o2L9N2
5445B4J9jl3q2NJ07M3n9l9k2j7N8Q0n6o7J0QMR0Pj48j6Q9J0%N2p2q8Q2Q1o5K1
5477B5J9j19j4J70k0r7M2j7q5J18J04j50m8Q0n0rJ65m5j89P7R6q5O4Q9j71p8J85
5504E7J5j10R2mj90R9J90j28q3J25j08r0K40K3k08N3P9j38N4K06j74j63K00J2
5528D9j37J65M9k66L6K13j17m2J86j48j85K42J01k09O7R0k22M0K74j43j64J82
5550F1m1j76K24J25k97j7K10j38j8K45j39k40K11J06k18J22J40k80m9L22r2j63
5572a02J95o4k37K38J74k90KK12k10o4L22p5k64J67O2k18J80J94l10r7L19j11
$$ y = [13, 6, -24, 80, 71, -107, -88, 62, 27, 10, 53, -41, -116, 30, 76, -14, 13, 9, -95, -38, 117, 45, -51, -17, -17, -36, 57, 83, -23, -59, -5, -12, 21, 71, 12, -102, -42, 34, 33, 43, 16, -54, -49, 37, 55, 10, 9, -25, -62, 5, 75, 44, -25, -46, -35, 6, 51, 51, -5, -67, -28, 24, 43, 42, 9, -73, -68, 39, 82, 23, -16, -38, -55, 3, 83, 27, -40, -30, -22, -18, 72, 79, -69, -85, 4, 14, 14, 66, -6, -94, -12, 69, 4, 25, 44, -75, -89, 81, 61, -36, 6, -11, -96, 22, 126, -24, -72, 8, -42, -51, 114, 69, -120, -43, 53, -32, 32, 121, -50, -128, 57, 72, -38, 54, 50, -140, -41, 149, 21, -62, 63, -45, -135, 105, 128, -80, -27, 52, -86, -32, 174, 0, -163, 37, 49, -88, 77, 126, -140, -104, 109, -8, -50, 136, -12, -197, 45, 146, -63, 4, 94, -128, -88, 186, 43, -121, 61, 20, -156, 68, 193, -104, -121, 89, -49, -67, 178, 39, -201, 10, 116, -102, 20, 160, -120, -169, 153, 61, -102, 93, 29, -208, 30, 204, -86, -84, 128, -82, -146, 176, 101, -163, 4, 66, -152, 28, 222, -88, -185, 134, 23]
5594B3j48K78m8l29J95K04k40M6K00k79j14L77m4k76J89N7k90J71K66k93q9K74
5616A30j62j47L40kl65J40J97k41Q0K60k97j62L65l7k56K52O1l93J41L25k47q4
5638a02K53j98j90L91L7l74J53J95l21O9L48k48k24L04m6k41L18Q4m37R4L56k66
5660d5q0L35j86k95L41J03l21J87J53l98L9M45k18k74L24m5l01L06J68l99N7K99
5682A95k98p0M43j70l93L20J43l20J59K15l84l1M02j82k11L54o5m18K86L09l73
5703h9l2K83k73r6M39j03l69K78J28l98J95L47l82j67L80j14k03L55k5m24K21
5724d9K79l47J3L42k91k26M21K9l38K09Q4l56J51L68l26j53L48j35k59L59J06
5745B29m26J04K56k63J5L36k74k45L64M0l07K21J55l95L2L77j93j61K77j33k64
$$ y = [23, -125, 153, 105, -224, -29, 175, -65, -19, 181, -98, -212, 165, 121, -155, 34, 91, -199, -28, 238, -55, -144, 130, -32, -179, 161, 159, -206, -66, 131, -110, -30, 230, -67, -229, 136, 99, -157, 95, 156, -237, -96, 229, -18, -102, 151, -47, -237, 154, 191, -183, -30, 165, -156, -87, 261, 13, -211, 93, 47, -194, 124, 208, -229, -135, 221, -45, -125, 210, 24, -271, 70, 173, -148, 39, 192, -206, -167, 278, 60, -214, 110, 65, -236, 70, 238, -161, -104, 195, -103, -173, 270, 100, -293, 27, 170, -150, 9, 224, -160, -191, 211, 29, -182, 172, 107, -311, -25, 284, -89, -121, 162, -111, -207, 232, 129, -240, 38, 166, -232, -37, 310, -72, -239, 141, 27, -176, 179, 154, -270, -49, 230, -117, -104, 238, -53, -279, 142, 171, -167, 42, 126, -230, -79, 289, -37, -190, 158, 23, -236, 123, 229, -197, -93, 163, -100, -85, 251, -23, -268, 96, 136, -171, 50, 205, -190, -158, 219, 26, -135, 142, 9, -255]
5766b55L44J43l78O8K47k84l7L73j38k91K32M7k37K18J72l80j8L40j51j36K72
5787A51q1l01K15J74k32M7J71k63n8L62p3k68J91M4k63J80K15k66p1K13j31p3
5809a17K84n7l04J48J65j88N0J88k18j18K52mj69J54Ok55J29K31j84o8J55j18
5831c8r5K30K5k21Q4P2j51Q8J87j90j30J73lr1J41K3k36N3J57r0JJ28j44j31J92
5856C4O8j35M0M5j66O3J69r5q9R3n8q0J79M1j83OQ8o1J5J45j07j30J04N3o5Q4
5882E8Mj60J9J47l5n0O7q1r2J37Q8j05j6J9p3M1J42p4r5K8Oj9Q7N4j26m4N3K7
5910GQO0p1j04P4Q2m4qJ6q5JR4K8l9k5l2m1Q3P8n4o5J4KJ8M9Op9j4QM3M1%p3n4
5944g6N1N8Nk2l8j8RM9L5k0o0k7J7M8N6l3q4j8P1K2KLn4m9L9O6Nj1k7o9K3J19
$$ y = [-255, 89, 232, -146, -78, 169, -115, -152, 221, 83, -208, 24, 71, -166, 52, 224, -156, -174, 166, 15, -121, 151, 70, -231, -16, 158, -74, -27, 144, -119, -177, 185, 112, -156, 35, 79, -184, -4, 211, -55, -126, 87, -44, -117, 167, 110, -194, -46, 119, -69, -19, 169, -49, -167, 85, 81, -88, 66, 72, -183, -54, 177, -7, -75, 80, -38, -133, 97, 122, -99, -15, 57, -94, -6, 181, -9, -139, 34, 31, -60, 81, 104, -132, -79, 78, -12, -11, 117, -27, -158, 34, 102, -33, 7, 52, -114, -51, 118, 23, -66, 27, -31, -111, 68, 109, -74, -68, 20, -41, -26, 119, 12, -118, -14, 39, -26, 58, 62, -98, -79, 68, 33, -17, 50, -31, -123, 14, 102, -3, -19, 0, -73, -32, 110, 36, -59, -31, -25, -44, 43, 97, -29, -73, -20, 7, 15, 75, 4, -100, -26, 56, 12, 4, 20, -65, -64, 30, 58, 19, -6, -38, -79, 4, 82, 28, -37, -23, -21, -3, 46, 52, -27, -41, -33, 10, 51, 51, -22, -76, -25, 33, 38, 16, -22, -40, -31, 18, 53, 33, -27, -54, -37, 11, 67, 34, -50, -68, 3, 25, 27, 30, -24, -73, -34, 32, 37, 26, -1, -70, -47, 72]
5976G2Kq7rJ3m1P1O9p7o8L8nPJ01l5j43K6J09n2J6N4j00n9J20K9p9N5jj26N9J51
6006A10q6q4Q1m4o4J52M4j63%Q6q3L2J53j13j45J24N2r8R3M7j89kJ89p1p1J31
6032H1q3j47J70J07j81QJ07j43rK18n9j71J07K0j49J55J16k10o0J96o7q0J94n5
6056F5k31J50J26j68N1J28k02p0K65l3j89J43J8k04J34J74j97n6J78j15q8K47
6078A26jk80J00J45j69N2J84k01j21K46k6j61J78L8k79Q2K50j59q3J78j30j24
6100a55K52L1k48J10J18k30N0K67j70j75K03m1j34K07N2k95P7K19j78m9K39j38
6122A2k05K27P8k10J14R9k66M2K97j56j72K22n5k03K16J27k66L0J80j94j1K90
6144A96j42k56K29Q5k14J24J43k92%K75j49j18K56q9k80K41J72k56J3J81k08m8
$$ y = [72, 74, -13, -22, -9, -50, 21, 90, 13, -55, -17, -22, -15, 86, 51, -92, -66, 43, -9, 7, 61, -39, -98, 22, 51, -28, 27, 26, -100, -41, 110, 24, -60, 21, -23, -87, 65, 109, -54, -54, 32, -51, -19, 134, 21, -124, 0, 52, -46, 47, 94, -95, -97, 92, 21, -50, 81, -2, -149, 21, 128, -53, -45, 62, -81, -90, 128, 69, -102, 5, 25, -124, 31, 147, -63, -123, 73, 6, -74, 120, 65, -166, -16, 110, -58, -7, 121, -81, -151, 114, 81, -108, 35, 53, -151, -17, 157, -40, -96, 82, -33, -121, 126, 125, -155, -55, 90, -79, -27, 157, -44, -165, 81, 55, -106, 72, 110, -169, -87, 163, 4, -79, 99, -31, -155, 97, 128, -120, -10, 108, -122, -72, 195, 25, -150, 53, 12, -122, 85, 137, -158, -81, 138, -40, -89, 150, 12, -193, 34, 112, -98, 16, 115, -151, -109, 188, 32, -140, 82, 27, -176, 40, 167, -99, -69, 111, -83, -94, 196, 54, -202, 27, 112, -102, 22, 165, -127, -127, 148, -1, -119, 137, 48, -232, 9, 181, -75, -62, 119, -89, -137]
6166a37L05r5k39K23K7k74J92K26l03q2K55j16j00K89r4k93K22J49k65O1K40k53
6188f2j26L13m4k03K03j0k70J86K43l03n8K68j55j77L23Ll02J44J39k64J16K63
6210B27k88j59L36l9k45K39O7l22J04K44k25k9K64k10k03L44O6l24J33J61k74
6231a33M3K95k05j63K76q4k33L01J08l70M1K79j97o2K76j52k37K75O8k73J64J62
6253A79l29j5L65j54k05K41l1k47K29J48l01L6K35k37o2L27q6k94K12J25k54J19
6275AJ72k70n4L04j32j58K64k4l09J67K29k49k1K00j82r5K90l4k47J62P9k37R7
6298d7K46k22j25K23o3j39K18J2k69J10J87k01%K11j52j70K46M1j90J22M8k22
6320a36P4K24j74r9K16j04j44J99P7k21L2J37j52J7J98j41j58K02K5j63J09J00
$$ y = [-137, 168, 73, -166, 57, 84, -190, 2, 228, -75, -157, 98, -18, -118, 171, 77, -216, 6, 155, -110, -49, 191, -62, -188, 125, 81, -122, 81, 71, -199, -13, 230, -73, -131, 137, -18, -195, 128, 131, -171, -27, 112, -152, -36, 227, -61, -220, 116, 77, -168, 71, 138, -184, -80, 164, -61, -90, 174, -36, -239, 105, 171, -153, -20, 141, -133, -90, 205, 0, -163, 113, 29, -204, 97, 205, -165, -124, 155, -42, -104, 172, 20, -217, 58, 126, -147, 17, 179, -150, -165, 200, 46, -159, 82, 51, -196, 33, 181, -120, -84, 151, -86, -148, 179, 93, -201, 11, 136, -118, 1, 173, -97, -151, 153, 21, -137, 127, 103, -206, -39, 190, -59, -80, 120, -62, -157, 133, 99, -148, 14, 93, -144, -47, 199, -23, -148, 75, 12, -127, 91, 103, -166, -56, 131, -70, -70, 141, -11, -181, 65, 106, -84, 38, 86, -136, -62, 162, -12, -111, 105, 1, -143, 56, 133, -88, -56, 81, -71, -54, 144, 3, -155, 47, 72, -91, 18, 118]
6342A18k14JK01r5o4J23o6j37J68Q8j78K6J01j41pJ80n6j30R4J4j00J08P5j57
6366d8l6J33n5l8J29n4j41R1Q4q7J9O8j20l9J46nr4N9Qj00P7R5r0n5P2m1k1J08
6394F5j1j15L8M7o7N6N5q9n8J06Jk8L0j7q2L7O9l0j2L3n9l0R5J8o1j4Nk5M8N0
6424E5m6m3K6qqO0Op5j5L8K2J4lm0l0M7K1rkKl7j4N6J1k0k2k5K1M0J8l4k5jK0
6458@J0J7lm0j7NN5mk4k1j4K5L4kl0qOj0K7L9l3n0KL3J6K6j6o9J9N3k4KL9m7n8
6493f2P1K6l5R%n9L1Q7n1o2N1j3m7Q2L2r1nN8m7MQ8n7r7Q6M4p1L3M5j02pJ16l8
6525A9o2Q7k9j02R6Q0j12nQ2p0m7J46l9j34Q6L9j00O8R4j41n4J41k9p7J21j1j52
6552a05Q2J15j25jJ21j19q0J81J1j66R2O1j61O9J45j28p6J34l5j16J57K9j80N4
$$ y = [118, -96, -95, 106, 11, -53, 70, 4, -133, 35, 123, -55, -29, 72, -69, -76, 104, 48, -82, 12, 26, -74, 34, 109, -48, -84, 49, -6, -44, 85, 31, -110, -19, 65, -22, -3, 65, -55, -94, 52, 47, -47, 12, 20, -80, -3, 92, 2, -53, 19, -22, -43, 65, 54, -61, -23, 24, -43, 13, 68, -21, -79, 27, 28, 0, 30, 13, -69, -32, 37, 7, -5, 28, -31, -61, 34, 52, -9, -23, -18, -43, 5, 55, 9, -34, -8, -16, -24, 36, 42, -33, -48, -10, 12, 26, 23, -17, -47, 0, 21, 12, 10, 12, -25, -39, 17, 28, 8, -14, -39, -18, 22, 40, 6, -19, -20, 0, 10, 27, 24, -16, -33, -28, 27, 23, -1, -22, -36, -11, 23, 21, -9, -17, -11, -21, 6, 45, 12, -38, -36, -3, 13, 39, 23, -46, -27, 26, 2, 4, 43, -4, -62, 9, 35, 0, 9, 9, -50, -19, 68, 17, -45, 6, -7, -54, 28, 60, -31, -36, 22, -25, -21, 67, 10, -87, -1, 43, -28, 5, 50, -52, -59, 57, 19, -43, 44, 15, -87, 9, 89, -23, -28, 54, -16, -63, 83, 44, -90, -4, 35, -65, 3, 97, -44, -98, 43, 14, -63, 58, 47, -105, -23, 92, -33, -34, 87, -32, -112, 69, 80, -86, 6, 67, -94, -25, 120, -8, -84, 50, 15, -101, 56, 85, -95, -41]
6576d1J26j26j4J56r8j31J77K9j66J20O3j93K9J90j15j01J64n1j44J55P8j94N2
6599c5J28j58j4K12j11j52J73L5j79J17J06k10OJ95j10p9J80n6j96J60J09j96
6621g5M2J38j72l0K24q9j58J68K1j96J36J29j93l5J85j19o8J93n7j93J46J05k00
6644i8O7J62j85p0K14n0j38J59J5k19J32J59j93m8K10j30j18K32j6k16J39P9j93
6667a06Q0J79j95r0K35p0j55J74L7k23R4J61j65j9J93j57j18K27Ok06J19Q5j91
6690a05N0J84j55p6K12r3j68K15N8k45P2J65j62j8J98j27j45K11J3k09J58J01
6712A34k41L0K14j56r2K06o5j75K08M7k28Q7J66k03l5K49j13j70K01Jj81J44J07
6735A35k38J8K28j56j07K33n2k14J79J06k19O0J52j96m2K52j06j76K09K5k24J27
$$ y = [-41, 85, -41, -55, 101, 3, -128, 49, 78, -88, 32, 95, -98, -69, 121, 6, -95, 69, 18, -126, 29, 107, -87, -35, 93, -65, -79, 133, 22, -130, 43, 78, -101, 16, 122, -88, -82, 113, 3, -76, 104, 48, -148, 12, 121, -75, -33, 105, -67, -97, 127, 38, -120, 48, 69, -127, 9, 138, -55, -90, 95, -24, -92, 101, 44, -149, -3, 102, -98, -31, 131, -54, -124, 90, 40, -98, 61, 76, -143, -11, 148, -45, -93, 117, -13, -131, 101, 85, -131, 8, 87, -106, -26, 153, -42, -132, 103, 33, -122, 52, 89, -134, -40, 121, -44, -63, 130, -27, -145, 82, 88, -118, 1, 86, -105, -55, 129, -26, -102, 110, 17, -151, 64, 122, -123, -51, 114, -48, -66, 132, 5, -140, 71, 84, -125, 33, 134, -107, -77, 137, -19, -111, 95, 30, -145, 63, 110, -118, -31, 135, -68, -103, 146, 33, -137, 64, 65, -116, 28, 135, -103, -85, 143, -13, -120, 113, 61, -153, 26, 132, -87, -27, 125, -71, -113, 139, 33, -143, 66, 91, -133, -6]
6757fJ54k09k4K10j56q6K30m4k27J65J10k17M9J89j74p8K20p0j53J71M5k38J14
6780b5J77k15rJ99j24j32K21ok09J25J08k05N4J91j67j20K29l2j75J58O2k05O1
6803c9J68j66l6J88j12j48K08L5k05Q5J21j80OJ94j18j06J74k9j55J55P4k07L9
6826e4J68j30p4J84n6j57J55M8j70P5J14j70k0J87p0j19J32J2j46J04Q5j60QJ44
6850I0j18n9J70k7j59J04O1j31N8Q9j10m4J46m9r4J13K0j44P1R8j12lJ01p6o7
6875g2J32kj21P0N0j07K4J10q6m1R2k9p1P2L0j06L1P2p2qQ3m8n2Q2Jq4N7K5o8
6904c6K4N6m6k7M6nn8N6K5o3PM2l1j7N7j2m9M1J6l7J4L0o0QM6k0k3K8ll2K1K4
6936B2l5JK0k4oM1lk9K3lk7J3K9k3kJ0kj3J6kpjOkojNj5J6Oj0lRqj1J1J9j9j1
$$ y = [-6, 148, -61, -85, 125, -31, -117, 113, 69, -158, 7, 117, -100, -51, 138, -36, -114, 106, 36, -117, 54, 99, -139, -25, 152, -63, -72, 127, 3, -129, 92, 86, -123, 2, 110, -95, -41, 150, -17, -137, 92, 60, -115, 43, 105, -100, -39, 129, -37, -73, 115, 3, -145, 63, 98, -107, -22, 99, -81, -75, 119, 1, -105, 69, 40, -115, 40, 114, -93, -54, 114, -16, -90, 94, 38, -119, 36, 84, -86, -11, 103, -67, -87, 100, 30, -89, 43, 55, -91, 13, 98, -62, -54, 90, -28, -87, 83, 56, -103, 1, 62, -69, -11, 78, -32, -76, 70, 21, -73, 40, 60, -84, -13, 85, -27, -30, 71, -5, -72, 60, 58, -63, 7, 57, -50, -26, 84, -2, -43, 49, 20, -51, 21, 51, -55, -24, 48, -24, -32, 51, 3, -49, 33, 34, -50, 7, 32, -36, -12, 44, -2, -29, 17, 12, -46, 10, 35, -28, -21, 21, -10, -27, 30, 18, -31, 10, 26, -11, 3, 33, -27, -19, 27, 7, -16, 12, 9, -23, -2, 22, -13, -12, 8, -16, -22, 19, 16, -13, 10, 7, -20, -7, 22, -1, -3, 7, 5, -8, 8, 6, -1, -2, 4, 2, -4, -5, 0, -15, 1, 7, -3, -6, 3, -5, -16, -5, 14, -5, -16]
6975a6J7OrMJj9PK6k6%J3j6j3K4J8l1KL1j6j4K9k1j7L6pm0L8K7n9J0M0k0k3L1
7009A3Mn3M4K0m9J2N1m7k8O6j9n1N3J2n6K3N0p4NO1l9l7N7J3p0L6N0p0LO8n1m0
7041d3Q8j4p9N3L9r4L7P7q1k9J01m8o7J00Pj10N6O5r7JR2o2n1J07j2r4P2N3j34
7070f7N2P8r0l2J13l4r3J08J7j19N8Q7j06k4J32p4q5J32Kj22P7O6j33K9J19j06
7096a5o9J46m1j03J11L2j31L9J13j27j5J49r0r4J29K5j39R0P0j35JJ38r2p3J51
7121G0l8j32J23N1j42L2J23j17m4J52n6j07J23K7j51Q2J11j66j1J63q5j04J58
7144F2k0j39J04P6j50J8J52j37m8J57l5j35J24M2j48P1J09j46k0J53q3j02J59
7167F4mj60J00Q0j39K7J23j14n8J60m0j30J23L9j65N7J30j39qJ35p4j01J60jj61
$$ y = [-16, 1, 7, -2, 2, 3, -16, -9, 17, -9, -9, 4, -12, -25, -1, 17, -14, -12, 19, 3, -11, 18, -3, -20, 16, 9, -31, 7, 34, -25, -15, 25, 5, -18, 13, 17, -36, 8, 28, -21, -9, 42, -5, -33, 33, 14, -37, 16, 28, -28, -5, 45, -29, -24, 37, -2, -39, 18, 31, -39, -3, 47, -23, -20, 48, -3, -43, 45, 31, -48, 5, 44, -50, -13, 64, -17, -46, 55, 7, -60, 40, 47, -63, -7, 58, -39, -38, 54, -8, -59, 48, 36, -58, 14, 67, -67, -15, 63, -27, -59, 54, 20, -73, 35, 52, -67, -9, 78, -28, -52, 80, 6, -79, 53, 55, -67, 10, 76, -57, -28, 91, -15, -84, 62, 21, -82, 29, 61, -70, -31, 82, -45, -60, 89, -1, -95, 34, 59, -80, 10, 80, -55, -54, 84, -8, -81, 70, 32, -100, 23, 74, -68, -36, 87, -30, -74, 78, 22, -85, 38, 65, -86, -4, 107, -59, -70, 93, 8, -96, 62, 42, -97, 7, 83, -67, -49, 103, -34, -82, 75, 40, -95, 29, 71, -77, -6, 103, -43, -63, 90, 7, -95, 64, 60, -100, 0, 80, -59, -32, 91, -23, -81, 79, 39, -91, 32, 71, -94, -37, 93, -46, -54, 81, 7, -94, 66, 65, -96]
7192i6Q8R8j55PJ54j13q0J71l7j32J35M3j68M5J43j25l3J47q5r7J48J7j66R6P8
7217H3j52J9J50j04r1J57k0j26J10N2j64O3J14j32k5J60p8j07J33K0j32O8Q5j55
7241g2K4J35r9q8J52k5j32J29O4j58M0J09j26j9J66o8j29J38K2j50R3R8j56j7
7265f9J55q2r0J62l6j54J23P3j54L2J31j28n4J71m3j35J32K1j46Q0J13j61j9J56
7289G8q9o8J39rj40R7P9j50M1J15j21p1J68l4j26J25L0j48N5J15j30j4J38r2q2
7314i4J56pj46P8Q2j30RJ42j04p6J31qj23J10M8j45L0J34j07n0J28m3j03J23L3
7339F8j37N0Q6j21mJ43q1p9J08lr7R0M5j33J6J15q3l7J06k6j10Q0O1j14L4Q3j05
7366d5k1J24l9p9Q5kr8O6Q3r1k3Q3m6m9R7j0j02N9M1o9K1P1p4n2J03k1o6P0Oo8
$$ y = [-96, -8, 90, -65, -58, 96, -17, -97, 74, 37, -95, 40, 83, -85, -40, 103, -22, -55, 92, 7, -90, 58, 75, -91, 5, 83, -69, -50, 100, -4, -95, 62, 42, -84, 26, 78, -86, -23, 91, -41, -66, 94, 16, -91, 42, 62, -70, -2, 83, -72, -48, 87, -12, -100, 52, 27, -105, 24, 88, -70, -30, 79, -47, -66, 100, 32, -97, 41, 63, -87, 6, 104, -52, -69, 86, 4, -86, 76, 40, -114, 9, 82, -72, -40, 91, -37, -91, 80, 37, -98, 34, 55, -91, -11, 102, -59, -78, 78, -11, -79, 60, 51, -89, 8, 87, -63, -22, 93, -28, -99, 69, 35, -91, 34, 64, -84, -29, 86, -44, -58, 80, -12, -94, 62, 55, -91, -13, 69, -61, -52, 90, -14, -90, 41, 33, -90, 20, 68, -77, -47, 87, -20, -70, 58, 15, -88, 35, 68, -69, -19, 67, -54, -58, 85, 4, -75, 33, 30, -67, 23, 68, -65, -49, 66, -17, -54, 52, 26, -84, -4, 57, -57, -23, 60, -45, -66, 58, 19, -60, 25, 23, -75, -9, 74, -17, -40, 43, -3, -52, 45, 35, -67, -8, 33, -36, -15, 56, -18, -70, 33, 12, -54, 16, 22, -46]
7396d6J9O9m6l1N5k9m5P8J1p2K1M2o5J5O6m3m8N9lm6M8J3n7%O7k5k5L9j8m8M6
7427AK4l4ML3n5kO0j1l9K2jk2J8K4l5j4K0j0LL5j0l1KL4oj8J6j3k8K6J5oLRm3
7462b9J0L2Ml1%J4%POk4j5J4OrK7Jk8lK1K1k2mj5qJ9K0j6lJroL0J3m0LPQKQj8
7502fk2K9Lj7J9J4m8mM8lj3J7k4k5M4L5n9jK6k8nM0pm6J9J7j8J4L7n3k2N9qk9
7536a7M0j4n1K3N0m4RK6m1j7P0kn3K5%m5L9N5o4k2M9j3l6N9Kp2J7N1n0J8N9o5
7568a4m9Q2J6o7N2J1q8L4Q2o6k8O4l3n5Q4K8r4J5M1n2J9P9n2p9Q4K0q2O9L7j07
7598d9NJ00o0l2R1m4q4P7N1j05M3O0r6j9J14k4p7O4rp0P3O9j21j0J08o7m0J14
7626F2k0j18O7N2q2M0O9j13k7J24k5q1P7J3j03N0Q5r8jQ9p5n3J36oj39O4O0r5
$$ y = [-46, -27, 42, -4, -35, 20, -9, -54, 24, 35, -37, -16, 26, -39, -24, 42, -1, -49, 10, 7, -39, 9, 22, -35, -35, 32, 7, -18, 21, 3, -45, 1, 25, -9, -5, 28, -27, -29, 31, 20, -19, 3, 2, -20, -2, 22, -13, -27, -7, -17, -14, 21, 11, -20, -18, 16, 10, -8, 8, -5, -33, -7, 8, 2, 5, 14, -29, -19, 13, 17, -14, -14, 0, 0, 7, 13, -11, -26, -12, -6, -15, 12, 13, -15, -18, 3, 24, 2, -2, -17, -25, -6, 14, -2, -5, -4, -13, -19, 11, 24, -16, -13, -6, 2, 4, 12, -6, -28, 1, 4, -13, 6, 20, -28, -32, 16, 13, 0, 17, -7, -32, 12, 47, -12, -13, 13, -15, -20, 20, 13, -33, -14, 3, -15, -1, 36, -17, -39, 20, 12, -17, 23, 9, -42, -19, 31, -13, -4, 22, -19, -36, 34, 32, -21, 4, 4, -41, -2, 53, -11, -33, 16, 3, -33, 26, 28, -44, -27, 24, -26, -8, 51, -14, -63, 19, 35, -32, 20, 31, -57, -23, 59, -7, -35, 29, -4, -59, 25, 53, -41, -26, 15, -37, -18, 61, 9, -70, 14, 34, -48, 21, 58, -49, -44, 56, -4, -36, 55, 11, -73, 4, 55, -50, -7, 53, -43, -62, 52, 28, -49, 15, 6, -64, 9, 78, -43, -53, 55, -12, -52, 62, 42, -76, -9, 43, -39, 1, 70, -43, -70, 54, 29, -52, 25, 38, -65, -15, 70, -28, -29, 60, -15, -68, 68, 62, -77, -13, 47, -48]
7654d8K9Q4q3n3J04j8p7R8J7j35M7J11q9l1Q6o0o8J24%j09P5N0j30L2J31o6r5
7681g4R1Kp8R7K5j37M8R0r9rJ30p1j12J03L8q0M1M3j23K2J30p1p8R8%j08R5N8
7709G1j04lP5p8lJ32p2j08R8M3j08N8O4r4k1R3n8k6J01m4j08R7Q2j19oQ6p5l5
7737f2J15k0r0P8lj07R1Q4j13l9J08l9m3Q0j4q7O4M1j03N3Q2r9o4J34Kq9O3Rr0
7766e8O5O3q9j3R5p6n5J09J6j11M1L9q0N3O4r6l7J14k9q1R4L8j30L4P2n9mP5q2
7795b8m4J18J0j10O2M4j11J6J07n8n2P0l1m5J02J0j16L0P9q0rR9m2r4Q2J4o3O7
7823B7J8j07J1J07n2m8P7k4q4P0O1r2J2N9p9jJ14n5r1P7K6o6M2O0q4j9P8m6k8
7852c7R2l0r9O8M8o5J3N9p8k6J03j6p4N5Jp5O2N7p4l2N9j3l2Q0j6r8M2N0m1RO9
$$ y = [-48, -19, 65, -18, -71, 33, 15, -62, 36, 53, -82, -35, 76, -13, -44, 42, -18, -86, 38, 38, -71, 4, 54, -76, -44, 87, 21, -74, 17, 19, -59, 38, 63, -74, -26, 64, -35, -44, 86, 15, -97, 6, 44, -36, 5, 48, -75, -53, 77, 6, -72, 26, 26, -82, 13, 71, -33, -36, 39, -39, -42, 90, 18, -90, 8, 51, -57, 1, 65, -29, -50, 43, -15, -41, 60, 16, -92, 5, 87, -32, -38, 48, -27, -62, 53, 33, -57, 21, 18, -89, 2, 86, -27, -66, 42, 3, -40, 40, 26, -61, 3, 44, -59, -6, 76, -23, -87, 47, 49, -40, 23, 32, -58, 7, 70, -19, -32, 63, -13, -68, 41, 57, -54, -13, 26, -54, -1, 63, -33, -70, 44, 15, -66, 28, 66, -64, -30, 42, -17, -21, 54, -28, -72, 46, 56, -54, 8, 52, -59, -43, 64, 6, -46, 24, -7, -52, 50, 60, -56, -26, 53, -27, -36, 63, 21, -73, 9, 23, -40, 27, 45, -62, -51, 56, 4, -44, 33, 9, -75, -5, 56, -36, -24, 35, -44, -45, 69, 14, -77, 0, 26, -40, 2, 62, -22, -41, 37, -9, -37, 55, 25, -74, -6, 42, -23, -10, 49, -29, -55, 48, 32, -42, 13, 14, -61, 1, 58, -16, -48, 11, -2, -34, 46, 30, -68, -26, 24, -17, -8, 61]
7883F1p6m1O8J8n6M9jo8K9N8l6k8M4l0k8N3L5p9J0K7l7RO6m6m1L6J4k1L0mn2J0
7915b7M4k4kK7k1m9M3L6k7KOm8K1N6j1m7K2Qk6K7K7l7l6K9oK0K4j6n0K9K3j3q
7948dK6k5k1J7K7qJj6l5L0M5k8l5J6J0j2K0J2j6j9kOJ9K4l6l1J8M0Kl3Mj2MJ7
7982EJ6ok0j3jJ4M0k5k7mJ6MOjjj7k0K9K0Rj9m1J5L3Ql0%Kj2J0K0Kk0kpMN0j6
8020B1m9LK4NLRk2j2K9kj3K6j5m5J8N0j3k1lpj5M6mm1K8Jk5K0M6l4l5J9J1kK4
8055B5qn4J6L3j1mK6k9l9M6K3l3OJ2l9J4N0j7m4L8j4l5N6J2m7pL5k3kM6k7m8L5
8088hJ7l6L0J6m7k0O1nl7L9Mo7N0M2n0mM1n2JO0mo9K2L0n3M4L9o3oM7k8j8N5q
8122B3q4N2M6m9J3L0n7k1Q8k0m2L5Np9L2R0o1l6L8j5j4O0kp5M0L6n2J2P4o3n4
$$ y = [61, -15, -56, 12, 30, -26, 23, 22, -46, -17, 41, 5, -23, 21, -9, -37, 16, 51, -28, -18, 9, -28, -19, 47, 1, -40, -4, 10, -11, 19, 15, -37, -27, 17, -7, -9, 18, -3, -52, -9, 27, 0, 2, 8, -40, -19, 37, 26, -21, 1, 9, -17, 10, 37, 0, -36, -7, -13, 7, 31, 15, -35, -6, 17, 4, -4, 22, -3, -24, -7, 20, 12, 13, -3, -38, -8, 37, 9, -26, -10, 0, -12, 8, 20, 4, -15, -17, -11, 8, 32, -4, -35, -17, 23, 25, -8, -4, -16, -12, 5, 21, 15, -5, -18, -19, -5, 35, 10, -17, -21, -5, -1, 5, 4, 3, -14, -34, -5, 15, 24, 5, -36, -21, 12, 20, -10, -10, -8, -20, -10, 10, 12, -8, -10, -17, -13, 37, 21, -28, -25, -1, 4, 7, 16, -6, -18, 11, 9, -4, 22, 7, -38, -20, 30, 17, -4, -7, -14, -29, 17, 13, -28, 0, 1, -24, -4, 42, 8, -27, -8, 3, 1, 25, 17, -37, -21, 12, 1, -3, 23, -6, -45, 1, 24, -9, -3, 9, -30, -16, 34, 17, -27, 11, -3, -38, 18, 30, -17, -24, 11, -12, -14, 32, 5, -43, -8, 9, -27, 3, 19, -28, -48, 13, 8, -29, 10, 14, -53, -3, 39, -11, -15, 26, -26, -25, 35, 31, -38, -16, 14, -39, 5, 44, -19, -25, 22, -6, -24, 31, 23, -61, -9, 37, -12, 1, 31, -26, -47, 41, 21, -21, 14, 19, -60, -28, 62, 1, -35, 3, -12, -26, 34, 32, -43, -3, 33, -19, -7, 67, 4, -50]
8153e0O2J2m9N7jp6J8Q3o3l2P8m2l5M7L0n7J6K8o7K1R3p3o0O6K1o3M4L1p0RN5
8184C3m5kP9n8p6P4N0
$$ y = [-50, 12, 24, -25, 32, 31, -45, -27, 56, -7, -39, 39, -3, -38, 9, 39, -18, -2, 26, -41, -20, 73, 0, -60, 6, 27, -36, 8, 39, -31, -22, 33, -12, -14, 65, 7, -69, 5, 55]
8191E5
$$ Imaginary data points
##PAGE= N=2
##DATA TABLE= (X++(I..I)), XYDATA
0@%%%%%%%%%%%%%%%%%%%%%%%%%%lQj2J5j6J6j6J6j6J8k1K5l0L2l4L7m0M5n1N6
46B9o2O8p4Q2r0R8j09J23j37J52j70J89k13K46k84L31l95M83o13Q15j160J856
68A165l706J6316L0943q1908O584P8848m5410l8081O1065j9403m9289O6672J5920
81C9716q2472K6708O1066o1621j6340P3559k8860n4224N4520J0258n3274L9195
93H231K9181p0962O328P0389l9941l9141N9227n848n6064M2250K9549n4250J1223
106i828M0215m8987r789O6061k2913n3746M5735J8003n1317K2979L7455m8979
118a5111q075M8762k6422k5418N1685p500n5629L4720L5110m6252P25L9763l4222
131g864j8621M8644r603l7709L4814Q907m7069K1934M0152m0441j5790M0351j5537
$$ y = [0, 0, 0, 0, 0, 0, 0, 0, 0, 0, 0, 0, 0, 0, 0, 0, 0, 0, 0, 0, 0, 0, 0, 0, 0, 0, 0, -3, 5, -7, 8, -8, 8, -8, 8, -8, 10, -11, 14, -16, 16, -18, 19, -21, 24, -27, 29, -33, 35, -39, 43, -47, 51, -58, 65, -72, 80, -90, 99, -114, 132, -152, 179, -216, 267, -346, 469, -691, 1165, -2541, 13775, 44718, -37190, -30606, 48242, 2832, -35249, 25816, 6413, -42876, 23796, 39716, -42756, -16048, 45018, -16603, -32943, 40616, 11756, -42468, 12052, 22310, -30964, 8231, 37412, -33550, -27222, 43167, 3226, -35915, 23312, 17464, -38600, 3650, 33199, -21051, -9828, 30387, -18600, -28389, 37672, 14759, -38987, 6748, 24751, -26566, -3587, 33868, -15111, -23186, 25576, -846, -26264, 25421, 17921, -37708, -2988, 32122, -14130, -13405, 26358, -7864, -26485, 22159, 12556, -25153, 9661, 18568, -28501, -6567, 33585, -6856, -22646, 17705, 2168]
144B168k4428L8748O69m1857K2090K3332l6187O321L6780l1276k2940L9789p55
157A2454k9779K4567Q372l7094J3998L0971k8995q689L2323j8095k3811L5167
169A1389O665l4148J3128J7092k7758N963L0291k3894j8018K9936m091k3806K4875
182G624R740l3090O501K4306j9420m075K4695j6442j9805K7254N625k4747J2471
195F37J2436k5586K718K6241j4467j3385J9521o004j7382K1315Q894k5072L710
208f424J6673j5933k001K1972j1202j7646J7531L992j6086J2137R238k1959J56
221i552K0251r410q567J5816o105j6448J6003R474j7129L029J0802j5005j493
234h334J9767o730j4172J1700J361j2846J1359R799j7169k404J3782p146m536
$$ y = [2168, -22260, 16488, 17157, -24700, -2610, 20722, -15465, -9144, 27636, -3640, -26580, 13209, 12454, -17325, 7242, 15614, -21480, -7482, 23489, -5506, -14195, 18128, 33, -23778, 11389, 18054, -16094, -2966, 14126, -13632, -7669, 22622, -1272, -19290, 10646, 6555, -17251, 7624, 17364, -15726, -9225, 15081, -4339, -8414, 16281, -161, -19966, 7288, 12913, -11834, 637, 13073, -12513, -9795, 16446, 1979, -11406, 8115, 2111, -15271, 6044, 14938, -10134, -6424, 10249, -5684, -7685, 14287, 3085, -14561, 2970, 6962, -9124, 3013, 12251, -9708, -9552, 10699, 1289, -7278, 8538, 2433, -14015, 1988, 11462, -5667, -2638, 8164, -6841, -8334, 11433, 4703, -9469, 2231, 3592, -9254, 2105, 11904, -5265, -7669, 6113, -1033, -5569]
247e569J4484m831j5134J0160P794j0707L714P955j3041l375J4996k328q938Q022
261C202p86j1297Q401R628j0448k776P637o111k998J2051j145j1386M228M535
275B735o505M181P221r389n175Q771N5m061O040q48r451L452P733l942j559L715
291B973n203l363Q150K219o000N22R97m030K884O017l486m752J960M54n94M041
307B789O41n513j286L171R44P35R47k840l063J777L403O91j346j768j516K27K786
324G79K409j537l519n21J789J022J567P17m020k655L788K336j461Q51r13m693
340d061J779N966j649l272J921j965k854O215L065o770q77L686l445P49P192l829
356A851p327M837K782m537M212L528r210j572R094j986m095O255k559q667P061
$$ y = [-5569, 8915, 4084, -11050, -890, 6904, -3803, -89, 7866, -5175, -8550, 6446, 4118, -4820, 3202, 2416, -8881, -480, 9148, -1300, -4076, 3561, -2550, -5548, 6503, 5358, -6028, -1800, 2735, -3770, 411, 7632, -1757, -6932, 1839, 1894, -2167, 3873, 3025, -6426, -2974, 4759, 817, -742, 2973, -2230, -5593, 2557, 4776, -1224, -702, 295, -3735, -851, 5166, 1680, -3072, -1112, -658, -1252, 2789, 3430, -2083, -3369, -198, 746, 1481, 2428, -412, -3475, -1698, 1705, 2396, 1050, -718, -2234, -2007, 779, 3188, 1651, -1868, -2389, -600, 422, 1989, 2706, -1314, -3969, -181, 2155, 694, 1545, 632, -4061, -2282, 3684, 2035, -1237, 684, -1281, -4135, 2080, 5145, -1625, -2502, 1184, -2261, -1512, 5680, 1851, -5476, -639, 2143, -2394, 1818, 5346, -3864, -5436, 3658, 1672, -2423, 3832, 1273, -7394, -333]
371c33O845p875n48N821p162k373J1644j484r908N421K739q402N567Q541j0512
386b019m516J0112k914n550J0235l96j3092N587R017q842K55R435r527o681J3702
401D806O18j0907P059L404j2844M688J2936j0016o154J1185m594q453J3477K796
415H001j5401M367R450j0733P05J3455r635j0247J3435J412j1313R206N053j5921
429h166K657J4559r285n669J2741n872j1615J3952N424j4803M174Q920j3083K60
443e806J6438q599j1498J3092L32j2643J1208P580j6915P59J3878r660m279J5455
457I342o784j4649J4107O438j5039N750J0028j5510j497J7419p496j0270J3893
470E732k038j5266J3097J0243j7617j6J3992j1078m774J7337n635j4837J3198
$$ y = [-333, 6512, -1363, -1911, 3910, -3252, -5625, 6019, 4535, -5373, 48, 2787, -5615, -48, 8493, -2019, -6535, 3577, 663, -4887, 5348, 4952, -8140, -2553, 6464, -2378, -2123, 7312, -2215, -8896, 4806, 5424, -5483, 1576, 4980, -7864, -3176, 9760, -256, -6410, 4775, 181, -8272, 5205, 8001, -7400, -3033, 6417, -4316, -3611, 9844, 209, -10038, 3397, 4809, -6504, 2702, 7755, -8166, -5509, 9050, -235, -5904, 6837, 965, -10650, 3302, 8726, -6077, -1903, 7017, -6066, -5806, 10632, 2033, -9465, 3627, 3959, -8684, 2524, 10104, -6811, -6052, 7826, -1834, -6113, 9342, 2558, -12091, 2016, 8454, -6585, -835, 9193, -6317, -7814, 9605, 2109, -8161, 5732, 3694, -11572, 1525, 11768, -5849, -5865, 8127, -2951, -7725, 9612, 3977, -10860, 2338]
483B338M352j5568Q800J2218j7777l993J8070o378r929J4676k190j6513J2527
496F33R929j7007K518J4667j4752p076K0280k970j5959J1946L989j6240R588J3343
510A2889j8322l437J8675r466j1472J9117M46k0175R873J1376j5819L228J5177
523A2090j6413p808K1819l990j7268J5376N837k0843O784J6964j5228m686J6691
536I325j0486j1177K1171P91k2068J0728J3032j8766R20J9403j3001j1331J8064
549F605k649j4787J6453N267k3386O540J9710j6140p194J9765p761j5488J7854
562D789M122j8713J0101J0781k1076J722K3401j3358j5284J9586L74j8093J3933
575B285R301k0561L835J6676j6367m893K3065q744k0374J8109Q836j9673O420
$$ y = [2338, 6690, -8878, -78, 12140, -5637, -9630, 8440, 2062, -7867, 6809, 4619, -11894, 633, 10562, -6445, -3927, 10740, -4012, -11088, 9192, 6222, -9737, 2209, 6198, -10042, -454, 12889, -5433, -8870, 9805, 339, -11133, 7984, 8430, -11745, -1872, 9504, -6315, -3087, 12090, -4323, -12131, 9688, 5698, -11570, 3806, 9643, -11200, -4416, 12548, -2680, -7366, 9325, -1161, -12338, 8833, 9624, -12444, -1716, 11316, -7450, -6530, 12873, -128, -11459, 6605, 3956, -10831, 5622, 10889, -12497, -5957, 13753, -2387, -9581, 10184, 2423, -13065, 4789, 8911, -9802, 299, 11080, -9996, -8274, 15127, 1769, -13515, 6071, 6445, -11648, 2285, 11586, -8975, -5140, 11536, -4831, -9724, 13341, 4597, -15777, 2332, 11168, -8505, -2085]
588b085J3260j8065j606K0292j0949j2286J9853j486k1484J4076J4660j9806j735
601g361J6713j1815o762J9582n699j7566J5914O736k0291P290J7267j7509p681
614a1182J9138n011j2013J5630p0j9093J1800J3271j8584p10J8273j2262j1381
627a2194J9109M52j6613J0516O371j7167O389J6290j5926p714J8561m874j3985
640a0785J5282M660j8226N759J2289j3485o19J5768j1013j1457J7225J888j5812
653h526Q933Q284j5851J583J5196r836p065J3728m454j2242J3693N869j6282L206
667c764J1589j1294k444J4535o638j0925J1923J820j2046Q389P567j4579l55J3756
681G534p059o648J1754k801j1523R999N923j1970K800Q733j0528k458J3373m154
$$ y = [-2085, 11175, -6890, -8496, 11796, 847, -11439, 8414, 6928, -14556, -480, 14180, -5626, -7361, 9352, -2463, -9225, 10357, 4658, -12908, 3006, 9742, -10549, -3259, 14008, -3501, -11182, 7956, 2945, -9068, 6562, 6492, -12601, -801, 12470, -6114, -6824, 11449, -813, -12194, 6915, 7367, -9246, 1270, 7641, -9526, -3137, 13153, -2773, -10487, 8074, 3200, -10785, 4497, 9157, -9069, -3310, 8979, -4506, -5125, 10643, -370, -11827, 5398, 7286, -8526, 407, 8691, -7160, -5577, 9619, -217, -7282, 6446, 1992, -10250, 3443, 9312, -6970, -3764, 7825, -3469, -5913, 8622, 1984, -8941, 2982, 4802, -7244, 1145, 8712, -5867, -6222, 7534, 475, -6173, 5581, 2780, -8743, 1256, 7179, -4791, -1991, 6742, -3786, -6244, 7129, 2975]
695B975r791Q829J702j0069O631P257j1026j229R867n744m519J0460j918j0402
709f977O696N351q400K275O916q480k936J0126k293o737O878N47q795N027O790
724E988p621j433O784m841l503Q761p52q139M548L434o736K695O348o834l268
739d569P291j609m464O108J95p767L446N515n419l53N382m866l418P190K06n712
755b844L370J718n816K407N686m726k742M819j830l161N478O86o131J733L567
770B214l618N53M327l799l289M658O33l361K749R73m878J177M437k475j587K881
786A595j933k540M046J397l770N16J713k607O48L653k027k774K190K84j604K304
802A091R05l393k22K475o68m10J658j366k165J881J531j235Q1K94j675J14K188
$$ y = [2975, -6816, 2013, 3715, -6354, 277, 7534, -3492, -4721, 5146, -598, -5117, 5343, 3425, -6977, -281, 5070, -3330, -1055, 5861, -2619, -5555, 4571, 2278, -4459, 2419, 2966, -5829, -802, 5988, -1633, -3066, 3718, -1123, -4626, 4135, 3383, -4756, -208, 3226, -3510, -815, 5533, -1301, -4569, 2722, 1113, -3351, 2757, 2952, -4815, -1369, 4146, -1273, -1626, 3756, -1110, -4528, 2662, 2868, -2844, 526, 2244, -3572, -1165, 4521, -205, -2947, 1872, 42, -3119, 2359, 3045, -3086, -1353, 2214, -1404, -851, 3476, -323, -3612, 1046, 1679, -1682, 1067, 2040, -2838, -1661, 2776, 301, -1286, 1595, -338, -2878, 1168, 2565, -1205, -689, 1024, -1583, -935, 2718, 691, -2083, 107, 391, -1213, 1091, 1996, -1397, -1619, 856, 188, -222, 1436, 70, -2095, -214, 1317, 82, 163, 457, -1218, -1104, 1084]
819A084%j314m8j69l79J152R86j003j081J14M15N46N16l00j004n84P03J149o1
838G22o74k22n30j12J495O64j521o07P03l93L21J680r52k157J122J101j087R39
856D92R87k613o56K821k59j519J682m42k800K039K579k615o48K230k113j186L991
873A970j80l770J723J527l042J425L434l565k205L989n88k708L607N18n079J710
889a234L964l369o82M013l011l228N162Q94m850K366K369n089R65N579l700l236
905c087M920r99m298M942K077o490J165M916m400j012O122l156n148N703J523
920B778n785L233L560o658l9O891l503l797N939j138o114N389L625p016Q01N472
936C638n257j738P466k443o158N557J767o553L564M965p164j243P317l339m089
$$ y = [1084, 1084, -230, -278, -447, -826, 326, 1312, 309, -772, -658, -243, 303, 819, 519, -485, -1069, -366, 783, 722, 48, -174, -704, -816, 679, 1343, -178, -785, -82, -475, -154, 1526, 574, -1583, -461, 640, -447, 492, 1479, -1134, -1790, 1031, 772, -747, 935, 493, -2307, -268, 2311, -304, -952, 1278, -835, -2021, 1970, 1790, -1980, -257, 1270, -1772, -347, 3087, -478, -2683, 1306, 718, -1990, 1617, 2135, -2944, -1234, 2730, -639, -1321, 2692, -319, -3547, 1615, 2509, -2341, 25, 2394, -2695, -1730, 3849, 149, -3087, 1833, 834, -3464, 1478, 3555, -2935, -1770, 3146, -1254, -2266, 3856, 700, -4448, 1255, 2778, -3007, 226, 3786, -2872, -2911, 3980, 477, -3320, 2619, 1481, -4633, 756, 4381, -2635, -1834, 3638, -1619, -3357, 4109, 1666, -4492, 1065, 2832, -3721, -157, 4808, -2356, -3599, 3718, 379, -3710]
951c710O780p86p275N027M322o982R45O107n991k823Q229j644o497N660J657p427
967d408L775N937p246j562P407l884m490P751p6q047M501M425p077J396O708o469
983a359l413Q374j595o459O196J898q213L111O453o547j484P154m385m762Q244
998C213L23q203M455M422p522J118P404n761l852P627j821o126P013K025r096
1013d781K933O902o725j558P788m345n429P916M42p693N175M032q870J356Q641
1028E784o049m390Q091j949o651P207K338q923L241O362p790r51R243m697o677
1043e811Q114J001p850N187M214q900J246Q321o296l833Q975k373q060P329L667
1058D931q835K465O336p631j064R284m667o508Q510N76q914N627N746r195j01
$$ y = [-3710, 3070, 2284, -4991, 36, 4358, -2624, -1679, 4428, -1563, -4386, 3843, 2199, -4298, 1362, 3019, -4408, -633, 5304, -1942, -3504, 3903, 19, -4471, 3280, 3204, -4843, -342, 4083, -2994, -1598, 5110, -1359, -4772, 3602, 2007, -4452, 1744, 3642, -4571, -1460, 4993, -1554, -3038, 4116, -269, -5031, 3213, 3536, -4667, -212, 4210, -3312, -2194, 5210, -551, -4403, 3224, 1403, -4723, 2290, 4315, -4781, -1848, 5054, -1671, -3229, 4559, 214, -5215, 2701, 3143, -4550, 625, 4657, -4213, -2857, 5784, -265, -4655, 3436, 1487, -5164, 2043, 4381, -4542, -1301, 5061, -2729, -3680, 5563, 866, -5811, 2303, 3304, -4546, 641, 4855, -4045, -2799, 5522, -774, -4607, 4368, 1995, -6065, 1264, 4931, -3904, -1439, 4897, -2734, -3798, 5486, 819, -5689, 2821, 3397, -5517, 110, 5856, -3339, -3440]
1073c440Q427n686l806R107k555q356P731L618r651K987P624q296k556R765l488
1088A425o652Q075M29r181N995O183r752k01R327o047n153R617q86q794O341L826
1104D552r029K944P878q460l265J0248k929p651P950K045r446M068O608q190o03
1119c280Q777n876n684R854J21r473N558N030q860J343Q210o769l749R064k630
1134A636p480Q083K821j0032K953P542p420j821Q660m463o052Q461O57q640N222
1149A27N174q962K59Q783n351m744Q043j304p262O580L337q704K056O982o674
1164a660k398Q470k881o605O673J817p503L738N134p490o29P784m139m597P148
1179B862l80p136M903M027p085R20O125n441k601P439j918o038N536J930o774
$$ y = [-3440, 4987, -699, -4505, 4602, 2047, -6309, 1422, 5040, -4611, -1624, 6000, -2296, -4852, 4913, 1425, -5227, 2848, 3277, -5904, 91, 6274, -3478, -3679, 5648, -399, -5552, 4065, 3179, -5615, 726, 4552, -4477, -1533, 6345, -2115, -5380, 4868, 1939, -5712, 2238, 4283, -5163, -1095, 5513, -2677, -3280, 5497, -379, -6063, 3791, 3912, -5561, -3, 5027, -3833, -2490, 5720, -1049, -4798, 4266, 1636, -5844, 2239, 5060, -4972, -2019, 5523, -1897, -3718, 4942, 479, -5573, 2888, 3545, -5095, 127, 5301, -3661, -3402, 5381, 30, -4714, 3329, 2025, -5237, 1343, 4680, -4024, -1968, 5014, -1660, -4058, 4412, 1531, -5074, 1599, 3416, -4087, -349, 4785, -2705, -3334, 4450, 311, -4286, 2862, 2482, -4654, 249, 4276, -2809, -1889, 4236, -1205, -3806, 3633, 1715, -4323, 1213, 3143, -3631]
1194c631K822N127o065j316O493l074m077O115M5o372L797L743n880N25N439m359
1210f68k790O035r22m967M209J808n667J930M587m572j498N181k227l595M811
1225A655O47n089K410L083m379J34M504l106k678M512l21l914L154J692m486J058
1241a124L708l186j276L914j614l018L631Q62l875J664K385l422mL628k187k142
1257b056L266k71k944K473J449l410N46K747k267q96K996j185k383K539P13k663
1273a346J244J673k553j25K614j346j494K176k24k116J721J135k268L15J724j569
1289d39n17K090p46j621J550M32j666R17J120j714j68J626q22p88J432k93j379
1306i86J055P23j263K26R47j024l16J289l38r03P98J28r12N74O57q75j63O99l57
$$ y = [-3631, -809, 4318, -1747, -3063, 3430, 356, -3721, 2394, 2439, -3933, -136, 3607, -2273, -1748, 3691, -668, -3458, 2577, 1655, -3312, 897, 2705, -2962, -1032, 3555, -1017, -2515, 2666, 439, -3156, 1655, 2302, -2787, -377, 2706, -1673, -1539, 2965, -141, -2819, 1693, 1372, -2542, 612, 2304, -2182, -1124, 2584, -602, -1878, 2036, 422, -2596, 1035, 1897, -1978, -314, 2071, -1351, -1355, 2273, 86, -2056, 1210, 939, -2005, 468, 1917, -1493, -947, 1800, -467, -1363, 1633, 448, -1935, 604, 1317, -1346, -102, 1571, -982, -1107, 1507, 161, -1333, 843, 619, -1497, 224, 1359, -909, -594, 1130, -439, -956, 1134, 388, -1233, 317, 749, -917, 0, 1120, -594, -762, 864, 42, -746, 686, 393, -986, 69, 792, -471, -245, 702, -322, -638, 651, 313, -590, 208, 336, -576, -2, 655, -220, -383, 316, -41]
1325d1l09O73o2o98L34L61l92Q5L18l67j92L71P2j86N5Pj36K7J84O7j72j23J28
1348DN6j24J34J54l70j19M87r7l59M01K6o27L76N52o71j22P16m80m88R57Oj044
1370f32O00O05j096K07J131r75o20J372k84j165J179M58j634N22J381j404m03
1387g58J761q43j354J802K61j969J037J267k001K5K128j382j289K216k09k149
1403a457J755J081k551N31K221k026q58K689r41k211K388O95k861J258K086k754
1419i55l32L046j647j971L002l2l054K081J773l269L49L069k422j481L491q02
1435H46l044K807J201l631J225K861l150q42L727j603k689L416M44l764K044K461
1451B309l702k9L755k485k148L934m40l660K868J763m062R38L488l273j347M213
$$ y = [-41, -350, 323, 261, -437, -103, 258, -134, -49, 269, -98, -290, 81, 153, -33, 22, 29, -107, -80, 104, 171, -1, -124, 4, 60, -64, 70, 224, -146, -265, 222, 125, -234, 167, 193, -434, -58, 494, -177, -299, 417, -63, -551, 406, 412, -632, -32, 573, -523, -316, 815, -160, -780, 592, 308, -857, 322, 780, -854, -332, 1049, -355, -758, 1003, 160, -1194, 608, 869, -1100, -63, 1204, -797, -772, 1356, -26, -1315, 901, 692, -1457, 298, 1379, -1172, -641, 1580, -446, -1304, 1385, 444, -1767, 621, 1316, -1545, -287, 1799, -955, -1287, 1759, 112, -1859, 1143, 1111, -1943, 138, 1911, -1358, -1009, 2060, -362, -1843, 1648, 846, -2198, 609, 1810, -1821, -596, 2265, -885, -1727, 2000, 397, -2292, 1124, 1568, -2196, -152, 2309, -1393, -1422, 2333, -152, -2300, 1634, 1194, -2466, 402, 2165, -1897, -959, 2529, -744, -2091, 2122]
1467B122j441l276L640Q64m241J999K925l945l32M185k457k560M188k32m082K952
1483C09K131m363P79L853l378j627M485j324l590L675J136m448J840L243l997
1498a276o05M365k321k804M227J4m267K771K397m303N07L990l193j902M455j042
1514A013l722L552J330m480J648L423l880p95M359k186k928M197J69m323K682
1529E9K475m359M88M104l254j963M522j087l746L674J288m584J710L434l960p21
1545a920M464k346k980M348J37m352K771K411m444N71M129l273j928M532j171
1560I49l792L782J394m682J621L476l930p18M480k351k996M331J09m392K885K525
1576B691m625M25M302l200j989M529j253l805L918J333m810J822L542m199p70
$$ y = [2122, 681, -2595, 1045, 1909, -2332, -333, 2592, -1353, -1685, 2500, 43, -2517, 1671, 1439, -2643, 309, 2440, -1923, -1144, 2709, -669, -2296, 2189, 865, -2725, 950, 2086, -2362, -522, 2721, -1276, -1881, 2484, 163, -2641, 1586, 1600, -2667, 104, 2501, -1802, -1295, 2695, -498, -2400, 2055, 1013, -2709, 843, 2173, -2307, -659, 2764, -1116, -1911, 2448, 262, -2666, 1531, 1700, -2623, 59, 2534, -1825, -1337, 2767, -487, -2450, 2072, 985, -2761, 913, 2201, -2383, -673, 2761, -1199, -1920, 2544, 198, -2782, 1566, 1703, -2649, 122, 2533, -1911, -1340, 2789, -484, -2412, 2120, 949, -2843, 939, 2333, -2349, -728, 2748, -1182, -1900, 2580, 229, -2767, 1564, 1673, -2719, 166, 2691, -1934, -1509, 2793, -407, -2396, 2133, 880, -2925, 993, 2326, -2484, -662, 2880, -1319, -2089]
1591b089M764k313l148M329O3m411L108K499m883N32M501l378k132M765j068m069
1607b930L742J522m716J778L605m370r05N024k165l500M293M67m572K667K868
1622B808m574J72M426l233k342M938p26m496L468K040m661J281L832l976j300
1637b343M852j852l563M292P11m901K407L336m407k75M475k924k558M767m39m445
1653b867L263K150m734J034M188l712j787M683j421l604L978J014m758J954L400
1668B781m058n55M445k454k989M322K36m237K630K338m345N20M108l040k048M233
1684A887r03l662L407J584m333J155L317l399q55M133j863l040L681N69l873K117
1700g8K482l853r7L806k280k051L645n53l441K809J733l739P31L016k843j100
$$ y = [-2089, 2675, 362, -2786, 1543, 1606, -2805, 303, 2802, -2081, -1549, 2952, -426, -2558, 2207, 1139, -2930, 812, 2334, -2382, -604, 3001, -1369, -2274, 2750, 585, -2915, 1378, 1845, -2727, -60, 2808, -1766, -1594, 2832, -401, -2743, 2195, 1469, -3027, 441, 2481, -2180, -899, 2933, -1043, -2343, 2509, 657, -2906, 1386, 2097, -2804, -397, 2939, -1468, -1743, 2732, -192, -2750, 2017, 1578, -2867, 396, 2546, -2188, -1154, 3034, -678, -2465, 2218, 797, -2807, 1171, 2185, -2573, -619, 2781, -1277, -1832, 2613, 159, -2830, 1492, 1728, -2509, 121, 2459, -1886, -1366, 2742, -298, -2346, 1887, 984, -2678, 729, 2313, -2020, -865, 2452, -947, -1802, 2331, 468, -2572, 1109, 1678, -2195, -78, 2404, -1449, -1546, 2260, -20, -2071, 1574, 1021, -2420, 389, 2122, -1617, -886, 2130, -713, -1813]
1716a813L654j113k838K806P62l280J579K395l110n13L194j565j922K942m1l016
1732a879J840J747k775K80K547k118j316K953m49k406J992Q26k658R67K154k195
1748d90p08K407j047j641K313K57k473J154J473k040J33K073j556j196K148j73
1764F34j758J491O70k116N72J753j478n68J724q19j285J710L56j752P26R88j469
1781f21Q6J606r91r96J372q0j181J093N47j529K24J171q56l20J169n64j012J059
1799A77L89j036M52N71j054L0J121n09o11P59j58p09P48M48q99QN99n18q4P98
1819E22l41o67N01K08m59L48K84o58q9N77j22k12L35j82m35L50L51l02o0J22k62
1840a91lL98jk84k7L3l5J74J58j74k26L8J57J08Mp8j30j10J41K73o4k30J8k6p6
$$ y = [-1813, 1841, 728, -2110, 696, 1458, -1822, -243, 2152, -958, -1471, 1723, 158, -1764, 1178, 1137, -1879, -39, 1708, -1067, -787, 1760, -358, -1674, 1279, 830, -1576, 416, 1242, -1416, -449, 1705, -490, -1198, 1209, 162, -1479, 834, 1091, -1382, -228, 1245, -795, -662, 1411, -145, -1341, 807, 634, -1124, 367, 1037, -1079, -507, 1246, -232, -800, 924, 105, -1180, 530, 886, -866, -140, 848, -621, -535, 1071, 80, -916, 456, 376, -805, 288, 835, -694, -470, 701, -155, -475, 694, 130, -882, 177, 566, -470, -18, 553, -501, -471, 650, 141, -470, 289, 131, -578, 170, 618, -281, -273, 326, -192, -276, 522, 181, -486, 15, 223, -236, 112, 396, -262, -351, 226, 104, -108, 227, 45, -390, -40, 311, 9, -51, 71, -191, -194, 204, 203, -81, -108, -75, -110, 64, 222, 48, -178, -140, 17, 125, 129, 51, -79, -189, -48, 225, 161, -69, -51, -77, -153]
1865a53L03J64l90j52K60o0l6L73j75n28K90L49l37J24K85n68j78P12m8m71L79
1886A43j5o54M51O62o72k36O21m31l49R54j5r91M30M90p63K69Q58q72n77J058
1906C61r9p59Q40J95j288M36J064q94k67J065p17q52J361K37j331O01O92j321
1924f76K45J485j038q97J371k38j161J312N49j792L45J396j208l21J675q89j405
1941a247J649M23j646Q64R96j837QJ980j027j144J691k63j737J538J037k069J85
1958e99J659j488n56K196p19j884J652O63j966R53J519k128m31K279r51j348K020
1975H71j38k274J492J477k169Q8J957j686r74K515l84k147J689P27k332R95K009
1992A716k194p76K396r39j561K263J74k600J263J658k192Q0K284j785j435K603
$$ y = [-153, 150, 314, -76, -228, 32, -28, -64, 309, 134, -394, -104, 245, -92, 32, 317, -251, -429, 283, 235, -236, 143, 128, -526, -75, 587, -85, -321, 300, -131, -480, 474, 459, -532, -102, 388, -375, -106, 752, -120, -697, 361, 262, -497, 343, 538, -750, -314, 750, -144, -411, 654, -63, -915, 446, 683, -648, -47, 645, -676, -431, 1054, 16, -881, 490, 252, -909, 403, 952, -840, -495, 901, -307, -628, 1047, 158, -1247, 402, 825, -821, 43, 1039, -798, -790, 1190, 163, -981, 710, 447, -1290, 248, 1285, -784, -599, 1060, -428, -984, 1212, 493, -1391, 261, 924, -1042, -89, 1430, -698, -1129, 1150, 199, -1149, 871, 733, -1541, -49, 1428, -741, -653, 1304, -382, -1356, 1159, 775, -1372, 317, 1044, -1288, -293, 1716, -478, -1254, 1142, 203, -1358, 905, 1079, -1521, -258, 1400, -792, -712, 1572, -213, -1648, 955]
2008I55o3k212J616Q86k519P38K280j973r41K403r20j888K364O47k669Q91J708
2025A303k091LK421j601j666K463M6k279J706J180k663L16K336j649q72K304j006
2042B51j995K358P57k598Q96J736k267k13K592j274j635K143j50k116J910J198
2058A593k738K39K304j642r10K418p64k107J961P32k218J104J553k478k77K707
2074A477j115j689K076k2k200J607J321k335K99J912j900p19K736p50k304J828
2090B22Q12k155R97J584k241k76K319j277j274K430k94k578J632J566k194K09
2106e18J782j816o59K523q28j914K057M01k569J252K032k217n96K123j138j091
2122a176K330l74k379J695J264k423M71K256j954j216K420l62j712J843K09k486
$$ y = [955, 892, -1320, 296, 1182, -1337, -599, 1681, -292, -1233, 1170, 250, -1638, 726, 1373, -1296, -405, 1303, -788, -785, 1636, 35, -1631, 832, 878, -1401, 305, 1485, -1178, -862, 1474, -175, -1047, 1257, 251, -1744, 614, 1371, -1227, -331, 1405, -862, -1075, 1517, 243, -1392, 751, 601, -1515, 395, 1593, -1145, -906, 1398, -244, -1154, 1264, 500, -1607, 354, 1086, -1132, -28, 1525, -953, -1230, 1477, 362, -1327, 749, 727, -1473, 134, 1455, -880, -581, 1331, -569, -1288, 1448, 698, -1606, 222, 1034, -1121, -124, 1460, -781, -1057, 1262, -15, -1289, 1141, 847, -1731, -99, 1467, -727, -518, 1264, -552, -1211, 1312, 484, -1430, 627, 1028, -1541, -289, 1743, -474, -1070, 1053, -85, -1176, 1154, 780, -1599, 96, 1360, -1063, -592, 1664, -290, -1506, 914, 552, -1160, 683, 892, -1594]
2138a594J322J963k291m58K397j305j600K397K19k279J282R99k263P39K280k108
2154c00j223K553m66j969J989O71k551Q11J830j968j55K334j594j718K578L26
2170A148k394J260J254k348K82K321j595j157K230o36j985K161R62k663M97J931
2186A268j789m30K351j100j842K046M21k129J315J367k437j24K428j182j275K034
2202I22l83k058J727J157k216L63J723j795o06K458o80j932J635M78j944J114
2218c7J476k087l62K033r96j088J984j89k125J270J262j757K18J557j560p95K091
2235H95k73j599J289M60j852P78J621j530o20J585p12j050J698J80j846P36J074
2252H34j362J29J513j172j033J560L7j241J046M44j639L71J449r95n10J213o10
$$ y = [-1594, -272, 1691, -600, -1058, 1339, 34, -1566, 831, 1050, -1229, 53, 1052, -1211, -472, 1808, -300, -1523, 1030, 564, -1405, 584, 1255, -1296, -485, 1345, -623, -778, 1556, -38, -1756, 822, 1148, -1246, 14, 1268, -1080, -798, 1523, -72, -1229, 1001, 365, -1620, 541, 1503, -1160, -663, 1268, -521, -951, 1400, 300, -1542, 504, 925, -1204, 111, 1478, -959, -1083, 1345, 163, -1112, 922, 539, -1519, 208, 1365, -851, -488, 1235, -560, -1166, 1292, 612, -1320, 315, 793, -1151, -37, 1439, -648, -1010, 1023, 27, -1061, 923, 734, -1391, -121, 1141, -616, -398, 1159, -401, -1196, 895, 622, -977, 312, 772, -1080, -302, 1319, -211, -831, 754, 42, -1008, 690, 870, -976, -240, 834, -528, -399, 1114, -58, -1091, 469, 506, -735, 311, 755, -884, -513, 936, -59, -569, 644, 34]
2269C4j028J351M55j369L71P67j118R3J362p59r16R90N2q83Q54N20j284pJ048
2288E33n63l19R52m51r53Q44N17q23K40M87q73r3J043k48o86N36j9o85O23N74
2308F36p99j99N59l41j29P45k05p47L34L66l80K42L48o41k38O36J4k81L03j44
2328G9n05L35M75k93j45J58k92q0N35L9m24K6M4j46K65K77l21k73J39P8O1J88
2350B20r5l47j3K58R4J9l7k41r4K01K23oj63j56l1J17K10O8j87k30L8J82R1O1
2374A82p3k80o4L03J23j01k2j43k12K59L30j88k08O6j31%M17K1m46j4J82j42K09
2397F8L09m25l39M04Q0j79L20l6n97J57N50k43j17L03l73l46O72K02n69J50J75
2418A66n31K00P18m29n11M92o6m18O51K33q97P2O21m29m5P09n06p07P51K99o62
$$ y = [34, -994, 357, 812, -557, -186, 581, -537, -444, 918, 159, -757, 233, 285, -598, 256, 776, -508, -515, 533, -30, -349, 603, 152, -801, 43, 560, -263, -23, 464, -409, -502, 541, 293, -393, 143, 124, -561, 62, 636, -163, -362, 197, -144, -273, 472, 267, -480, -146, 220, -160, 82, 430, -211, -449, 187, 201, -80, 223, 79, -426, -91, 384, 91, -54, 104, -188, -268, 267, 306, -118, -92, -48, -194, 71, 348, 27, -246, -107, -29, 32, 220, 125, -222, -235, 23, 117, 136, 99, -142, -236, -35, 188, 182, 19, -137, -168, -51, 159, 227, 40, -190, -152, 30, 121, 182, 109, -171, -235, 68, 191, 90, 68, -75, -287, -28, 302, 114, -94, -28, -159, -159, 258, 279, -167, -181, 1, -141, 68, 377, -48, -387, 17, 97, -82, 238, 202, -395, -238, 312, 69, -48, 255, -118, -464, 208, 410, -159, -9, 166, -365, -165, 553, 124, -387, 105, 39, -379, 272, 505, -392, -320, 301, -128, -173, 536, 30, -677, 74, 373, -289]
2439b89L84L43r33M1J029m17n39P09k58p69Q71N26j009L1P08p25j21J148m35r89
2459f94P90K86q77N95O87j200k15J163m33n82J015k12j212Q48Q04j086Q2Q84r75
2478c32m40J449k15j159Q27K87j177O64J096j253m34J231n26p29J335Lj523P05
2496a91R16j129J61J169j137p50J543p1j201R67L77j522N03J381j128n02J259
2513F45o63r49J511K89j643N58R92j285O8J523r95j056J400Oj194J122N86j774
2531h59K34J575r96n90J394n83j260J388N46j502N63R45j508n7J796p78j233J280
2549C55P4j308J079Q06j648Q4J377j072m77J674n22j586J217P05j318M89R38j447
2567e80k08J677o89j021J369n4j594J032J151j420j54J146r45m41J603m08j462
$$ y = [-289, 95, 438, -495, -454, 575, 158, -381, 328, 70, -699, 172, 698, -311, -280, 428, -297, -418, 730, 295, -694, 96, 382, -495, 100, 787, -413, -628, 535, 102, -480, 535, 323, -889, -41, 763, -323, -241, 643, -332, -772, 677, 462, -697, 130, 417, -760, -96, 1000, -253, -687, 544, 18, -711, 624, 627, -896, -191, 725, -404, -243, 926, -211, -961, 582, 511, -690, 277, 654, -868, -365, 1016, -112, -614, 645, -18, -967, 544, 833, -810, -252, 740, -545, -477, 1046, 51, -1005, 395, 401, -793, 329, 915, -859, -625, 950, -46, -636, 758, 175, -1085, 303, 849, -653, -90, 855, -653, -710, 1086, 308, -925, 355, 429, -879, 200, 1006, -642, -558, 819, -253, -730, 944, 422, -1164, 53, 758, -560, -71, 867, -580, -788, 889, 200, -821, 548, 494, -1100, -68, 1083, -337, -491, 655, -290, -731, 872, 464, -998]
2584i98J131N75j471N89J274j344o01J402l80p91J247j43j559R67J065j412nJ314
2602H60j023p96J518k7j179Q52K29j341P74J252j403n10J424n20r29J320J72j419
2620g46O13P25j132L77J208j286p81J606o7j204R30L96j377M40J109j026j90J172
2638G67r08q91J608K42j546N41Q06j133J72J220r53o56J244l67j014J333M09j697
2656h23L02J271r04k44J134p59q82J346J10j253Q57O42j530J42J520p85p74J078
2674D48l36r32J229L83j492M30J021j182j60J519o82j163J099K43j033Q15N71
2691G78j472J10J402q33o42J288l49j267J078O90j226K63Q40j146j53J525n64
2708C22j126J070J81j207Q01Q99j326j82J170o84m97J295l17j326R21P01j157
$$ y = [-998, 133, 708, -763, -174, 1100, -244, -845, 557, 177, -614, 633, 490, -1069, -102, 963, -449, -454, 860, -163, -959, 559, 532, -647, 205, 434, -907, -133, 1119, -284, -794, 630, 110, -819, 501, 673, -746, -133, 592, -540, -163, 1045, -241, -1022, 584, 517, -687, 243, 639, -738, -298, 811, -215, -405, 767, -141, -1032, 576, 818, -728, -187, 619, -514, -342, 878, -75, -731, 513, 146, -868, 465, 874, -823, -521, 750, -154, -398, 736, -23, -905, 441, 551, -702, 155, 797, -733, -591, 929, 144, -630, 448, 112, -820, 409, 792, -700, -270, 751, -431, -591, 928, 246, -917, 182, 425, -608, 207, 778, -694, -584, 818, -15, -657, 631, 282, -985, 93, 783, -443, -180, 660, -486, -639, 886, 322, -804, 266, 447, -760, 41, 940, -386, -568, 602, -82, -579, 716, 399, -927, -6, 695, -462]
2725d62L03R55j134m29J358k74r20R35O2j235P16R98j117k59J031o37n95J268
2743E64j9j246N98O10r82K92J028r72o15J134j02q13Q42K23j209L58R90p69k62
2762c50Q97n87p06J084K40j024L78M96q87J40J021o11o56P82p6o63P64L50j041
2781d49O8P89n21j59Q02m45p44P27L43o63K88L84p98k6Q86k87n00N04j05n92N77
2802G9M65o96r6M82l74j32O96j87o56L58K63m22K79L65o05k22N79l6k87L59r3
2823A19n45L02M50l28q1K41l16j53N30P1m25Q7Q6k44K17L44l07k85K37No9K83
2845B19k4m09L6K61l3J4J07k50j89K61J79j06l0m8j88R5K69j0j76n1m6K2J93R5
2869A91j79j57J8J06R5O9p9j92m1J77J32j7r6r4p7Q4K27Lj86p5J4MJ81J06k24
$$ y = [-462, -159, 796, -338, -767, 591, 317, -603, 332, 394, -841, -125, 873, -244, -503, 528, -109, -704, 564, 545, -701, -103, 507, -475, -183, 845, -127, -742, 392, 290, -523, 319, 542, -667, -309, 681, -88, -350, 547, -40, -746, 338, 578, -446, -68, 428, -459, -319, 702, 91, -565, 217, 141, -522, 242, 592, -449, -381, 408, -113, -272, 530, 85, -659, 68, 411, -252, 36, 420, -378, -404, 482, 195, -305, 199, 94, -498, 79, 544, -152, -248, 234, -140, -272, 424, 237, -419, -61, 202, -220, 59, 424, -181, -403, 176, 140, -147, 212, 119, -426, -124, 326, -2, -83, 158, -158, -311, 219, 290, -135, -48, 38, -206, 11, 355, 48, -237, 0, 5, -64, 219, 195, -214, -178, 83, 50, 64, 171, -79, -268, -7, 172, 66, 36, -12, -200, -105, 164, 154, -22, -73, -119, -97, 96, 191, 12, -145, -127, -21, 74, 143, 64, -128, -169, 8, 140, 123, 27, -67, -144, -60, 167, 170, -16, -91, -77, -73, 108, 214, -10]
2894a0j77J25Q2mJ31p2l03N8K56j9rN9k28j51L33J42k20mJ7k45J54L66j69k65
2918a53J49m4j17L47J02m42k9K78j40L5L25k68l82L33J92k60J80J15m89J7N10
2939B59j37k49K70j56l71M47L06m93k1K87l52LN91k22n13L42J23l71L64L11o35
2960b17j22N69j98k05N05j89o13M54M00n21R4L76n66j58P75j40n62M28O7o12M25
2981a0N53o74j99O01l32l04P51p0q23L94M54o06J82O14o84l89Q47p8n80N82R7
3002C26q78L68P56o53k14O98m68m82R14R4r00L98M26p80K09Q55o72n62Q33p9o48
3023d59P21K39j031K33Q25o73j87Q66m85p80R31K92q83L56M95r02O0J042n63o34
$$ y = [-10, -187, -62, 20, 16, 147, 75, -228, -170, 86, 67, 58, 117, -111, -262, 71, 213, -7, -11, 6, -239, -85, 281, 112, -153, -4, -48, -165, 182, 284, -158, -187, 91, -49, -14, 311, 43, -339, -6, 186, -74, 106, 221, -268, -251, 259, 122, -127, 143, -13, -384, 63, 369, -124, -145, 142, -210, -207, 384, 162, -351, -9, 114, -257, 107, 418, -217, -339, 230, 32, -173, 332, 143, -470, -16, 384, -137, -43, 333, -233, -391, 384, 244, -318, 110, 177, -435, -10, 543, -131, -330, 271, -61, -365, 386, 316, -507, -113, 341, -265, -83, 531, -153, -542, 305, 227, -353, 229, 326, -552, -184, 572, -81, -295, 403, -65, -547, 367, 461, -439, -41, 385, -395, -186, 669, -3, -565, 268, 189, -459, 262, 501, -530, -297, 528, -145, -332, 534, 49, -731, 200, 492, -391, -35, 460, -442, -382, 660, 97, -537]
$$ [...]
8191d8
##END NTUPLES=NMR FID
##END=
