##TITLE=1H_IBA1408-2
 CDCl3
 8 sc, 
 15.8.2024
##JCAMPDX= 6.0         $$ Bruker NMR JCAMP-DX V2.0
##DATA TYPE= NMR FID
##DATA CLASS= NTUPLES
##ORIGIN= UXNMR, Bruker Analytische Messtechnik GmbH
##OWNER= root
$$ XWIN-NMR		Version 3.5
$$ Thu Aug 15 14:13:03 2024 Russian Standard Time (UT+4h)  she@DPX200
##.OBSERVE FREQUENCY= 200.1318
##.OBSERVE NUCLEUS= ^1H
##.DELAY= (6, 6)
##.ACQUISITION MODE= SIMULTANEOUS
##.ACQUISITION SCHEME= undefined
##.AVERAGES= 8
##.DIGITISER RES= 18
##SPECTROMETER/DATA SYSTEM= spect
##.PULSE SEQUENCE= zg30
##.SOLVENT NAME= D2O
##.SHIFT REFERENCE= (INTERNAL, D2O, 0, 15.7039)
##AUDIT TRAIL= $$ (NUMBER, WHEN, WHO, WHERE, WHAT)
$$ ##TITLE= Audit trail, XWIN-NMR		Version 3.5
$$ ##JCAMPDX= 5.01
$$ ##ORIGIN= Bruker BioSpin GmbH
$$ ##OWNER= she
$$ F:/spectra/data/she/nmr/H-F/1/audita.txt
$$ ##AUDIT TRAIL=  $$ (NUMBER, WHEN, WHO, WHERE, WHAT)
(   1,<2024-08-15 14:11:42.40 +0400>,<she>,<DPX200>,
      <created by zg, POWCHK disabled, PULCHK disabled
       configuration hash MD5:
       00 E9 B6 7A A2 85 ED C7 34 08 36 98 17 FE 4E 26
       data hash MD5: 16K
       F1 CC 8B 6C A2 7D 78 7E AD 67 5B 96 B6 9F 24 5C>)
$$ ##END=
$$ 
$$ hash MD5
$$ 82 84 00 9C E1 B2 37 92 FC 34 F1 E7 66 AC C5 F4
##$RELAX= 
##$RELAX= 
##$RELAX= 
##$RELAX= 
##$RELAX= 
##$RELAX= 
$$ Bruker specific parameters
$$ --------------------------
##$DU= <F:/spectra>
##$EXPNO= 1
##$NAME= <H-F>
##$PROCNO= 1
##$TYPE= <nmr>
##$USER= <she>
##$AMP= (0..31)
100 100 100 100 100 100 100 100 100 100 100 100 100 100 100 100 100 100 
100 100 100 100 100 100 100 100 100 100 100 100 100 100 
##$AQSEQ= 0
##$AQ_mod= 1
##$AUNM= <au_zg>
##$AUTOPOS= <>
##$BF1= 200.13
##$BF2= 200.13
##$BF3= 200.13
##$BF4= 200.13
##$BF5= 200.13
##$BF6= 200.13
##$BF7= 200.13
##$BF8= 200.13
##$BYTORDA= 1
##$CFDGTYP= 0
##$CFRGTYP= 5
##$CHEMSTR= <none>
##$CNST= (0..31)
1 1 145 1 1 1 1 1 1 1 1 1 1 1 1 1 1 1 1 1 1 1 1 1 1 1 1 1 1 1 1 1 
##$CPDPRG= <>
##$CPDPRG1= <>
##$CPDPRG2= <>
##$CPDPRG3= <>
##$CPDPRG4= <mlev>
##$CPDPRG5= <mlev>
##$CPDPRG6= <mlev>
##$CPDPRG7= <mlev>
##$CPDPRG8= <mlev>
##$CPDPRGB= <>
##$CPDPRGT= <>
##$D= (0..31)
0 1.2 0 0 0 0 0 0 0 0.06 0 0.03 0 0 0 0 0.0002 0 0 0 0 0 0 0 0 0 0 0 0 
0 0 0 
##$DATE= 1723716701
##$DBL= (0..7)
120 120 120 120 120 120 120 120 
##$DBP= (0..7)
150 150 150 150 150 150 150 150 
##$DBP07= 0
##$DBPNAM0= <>
##$DBPNAM1= <>
##$DBPNAM2= <>
##$DBPNAM3= <>
##$DBPNAM4= <>
##$DBPNAM5= <>
##$DBPNAM6= <>
##$DBPNAM7= <>
##$DBPOAL= (0..7)
0.5 0.5 0.5 0.5 0.5 0.5 0.5 0.5 
##$DBPOFFS= (0..7)
0 0 0 0 0 0 0 0 
##$DE= 6
##$DECBNUC= <off>
##$DECIM= 24
##$DECNUC= <off>
##$DECSTAT= 4
##$DIGMOD= 1
##$DIGTYP= 9
##$DL= (0..7)
0 120 120 120 120 120 120 120 
##$DP= (0..7)
150 150 150 150 150 150 150 150 
##$DP07= 0
##$DPNAME0= <>
##$DPNAME1= <>
##$DPNAME2= <>
##$DPNAME3= <>
##$DPNAME4= <>
##$DPNAME5= <>
##$DPNAME6= <>
##$DPNAME7= <>
##$DPOAL= (0..7)
0.5 0.5 0.5 0.5 0.5 0.5 0.5 0.5 
##$DPOFFS= (0..7)
0 0 0 0 0 0 0 0 
##$DQDMODE= 0
##$DR= 18
##$DS= 0
##$DSLIST= <SSSSSSSSSSSSSSS>
$$ [...]
##$SUBNAM2= <"">
##$SUBNAM3= <"">
##$SUBNAM4= <"">
##$SUBNAM5= <"">
##$SUBNAM6= <"">
##$SUBNAM7= <"">
##$SUBNAM8= <"">
##$SUBNAM9= <"">
##$SW= 24.0689170037331
##$SWIBOX= (0..15)
0 0 2 0 0 0 0 0 0 0 0 0 0 0 0 0 
##$SW_h= 4816.95568400771
##$TD= 16384
##$TD0= 1
##$TE= 0
##$TE2= 300
##$TE3= 300
##$TEG= 300
##$TL= (0..7)
0 120 120 120 120 120 120 120 
##$TP= (0..7)
150 150 150 150 150 150 150 150 
##$TP07= 0
##$TPNAME0= <>
##$TPNAME1= <>
##$TPNAME2= <>
##$TPNAME3= <>
##$TPNAME4= <>
##$TPNAME5= <>
##$TPNAME6= <>
##$TPNAME7= <>
##$TPOAL= (0..7)
0.5 0.5 0.5 0.5 0.5 0.5 0.5 0.5 
##$TPOFFS= (0..7)
0 0 0 0 0 0 0 0 
##$TUNHIN= 0
##$TUNHOUT= 0
##$TUNXOUT= 0
##$USERA1= <user>
##$USERA2= <user>
##$USERA3= <user>
##$USERA4= <user>
##$USERA5= <user>
##$V9= 5
##$VALIST= <valist>
##$VCLIST= <CCCCCCCCCCCCCCC>
##$VD= 0
##$VDLIST= <DDDDDDDDDDDDDDD>
##$VPLIST= <PPPPPPPPPPPPPPP>
##$VTLIST= <TTTTTTTTTTTTTTT>
##$WBST= 1024
##$WBSW= 4
##$XGAIN= (0..3)
0 0 0 0 
##$XL= 0
##$YL= 0
##$YMAX_a= 839252
##$YMIN_a= -777684
##$ZGOPTNS= <>
##$ZL1= 120
##$ZL2= 120
##$ZL3= 120
##$ZL4= 120
##$ABSF1= 10
##$ABSF2= 0
##$ABSG= 5
##$ABSL= 3
##$ALPHA= 0
##$AQORDER= 0
##$ASSFAC= 0
##$ASSFACI= 0
##$ASSFACX= 0
##$ASSWID= 0
##$AUNMP= <proc_1d>
##$AZFE= 0.1
##$AZFW= 0.1
##$BCFW= 1
##$BC_mod= 2
##$BYTORDP= 1
##$COROFFS= 0
##$CY= 11.3945322036743
##$DATMOD= 1
##$DC= 2
##$DFILT= <>
##$DTYPP= 0
##$F1P= 15.6554695791079
##$F2P= 12.8336369535428
##$FCOR= 0.5
##$FTSIZE= 0
##$FT_mod= 4
##$GAMMA= 1
##$GB= 0.15
##$INTBC= 1
##$INTSCL= 1
##$ISEN= 128
##$LB= 0.24
##$LEV0= 0
##$LPBIN= 0
##$MAXI= 10000
##$MC2= 0
##$MEAN= 0
##$ME_mod= 0
##$MI= 1.114404
##$NCOEF= 0
##$NC_proc= 0
##$NLEV= 6
##$NOISF1= 3.799351
##$NOISF2= 2.8
##$NSP= 1
##$NTH_PI= 0
##$NZP= 0
##$OFFSET= 15.70392
##$PC= 1
##$PHC0= -26153.11
##$PHC1= 11.58748
##$PH_mod= 1
##$PKNL= yes
##$PPARMOD= 0
##$PSCAL= 0
##$PSIGN= 0
##$REVERSE= no
##$SF= 200.130013532006
##$SI= 16384
##$SIGF1= 3
##$SIGF2= 2
##$SINO= 400
##$SIOLD= 16384
##$SREGLST= <1H.CDCl3>
##$SSB= 0
##$STSI= 0
##$STSR= 0
##$SW_p= 3612.71676300578
##$SYMM= 0
##$S_DEV= 0
##$TDeff= 0
##$TDoff= 0
##$TI= <>
##$TILT= no
##$TM1= 0
##$TM2= 0
##$TOPLEV= 0
##$USERP1= <user>
##$USERP2= <user>
##$USERP3= <user>
##$USERP4= <user>
##$USERP5= <user>
##$WDW= 1
##$XDIM= 8192
##$YMAX_p= 0
##$YMIN_p= 0
$$ End of Bruker specific parameters
$$ ---------------------------------
##NTUPLES= NMR FID
##VAR_NAME=  TIME,          FID/REAL,        FID/IMAG
##SYMBOL=    X,             R,               I
##VAR_TYPE=  INDEPENDENT,   DEPENDENT,       DEPENDENT
##VAR_FORM=  AFFN,          ASDF,            ASDF
##VAR_DIM=   8192,          8192,            8192
##UNITS=     SECONDS,       ARBITRARY UNITS, ARBITRARY UNITS
##FACTOR=    0.0002076,     1,               1
##FIRST=     0,             0,               0
##LAST=      1.7004516,     0,               0
##MIN=       0,             -777684,         0
##MAX=       1.7004516,     839252,          0
$$ Real data points
##PAGE= N=1
##DATA TABLE= (X++(R..R)), XYDATA
$$ [...]
3613b837J0642j1466K032R585j1597L194Q592j1765M090P683j1986N058O761j2068
3627d082N723O077j2059O133N376j1848O646M408j1528P155L310j1076P866K304
3641D405j0763Q360J475j0428Q836P02r923R131l0r295R262p15q643R539j568
3656C45p917R827k431p118J0034l201o365R990l762n616R918m336m832R774m782
3671d72m024R414n308l271R206n821k456Q782o273j728Q413o675j071P916o958
3686c26m27P359p276K70O791p427Q14O180p540J308N636p464J801N059p538K312
3702d68M407p425K767L877p276L212L358p114L614K781o772L931K391o571M232
3717a056J921o252M583J431n747M644R39n289M864N81m945M963J05m511N100k87
$$ plain form
3613 -2837 7805 -3661 -1629 7956 -3641 -447 8145 -3620 470 8153 -3833 1225 7986 -4082
3627 -4082 1641 7718 -4341 1792 7168 -4680 1966 6374 -5154 2001 5311 -5765 2101 4405
3641 4405 -6358 2002 3477 -6951 1885 2587 -7336 1795 1765 -7530 1732 1017 -7626 1913 345
3656 345 -7572 2255 -176 -7294 2740 -461 -6826 3164 -598 -6214 3704 -632 -5464 4310 -472
3671 -472 -4496 4918 -390 -3661 5545 -276 -2732 6050 -223 -1951 6462 -213 -1284 6632 -326
3686 -326 -753 6606 -670 -400 6391 -1036 -222 5958 -1582 -274 5362 -2102 -301 4758 -2780 -468
3702 -468 3939 -3486 -719 3158 -4118 -906 2452 -4662 -1048 1733 -5039 -1108 1283 -5288 -1056
3717 -1056 865 -5387 -804 627 -5120 -476 463 -4826 38 619 -4326 637 742 -3769 1331 1044
3733A044m057M990n82l665M827q65l254M709j243k860M530j553k495M325j846
3748B005k066L959k084j781L675k239j533L469k373j315L143k368r94K719k331
3763a14p25K376k258n81K235k377k11J921k162j42J768j908m5J547j755J15J367
3780i49j407O5J176j128K70R79q82K60R19p33K93Q12m89J85Q13k77M5P52n8j52
3800D94P98qk88O18K59o07N21M40p78N24M66j038N53M88j335P51M67j706R32N09
3820B060k036J023N22k240J288L92k415J515L80k557J820J77k696K154J62k920
3836c371K511R9k950K782r6l044L273k98k997L674n86k908M010q62k839M418j255
3853d39k769M802j632k612N060k026k474N323k421k402N545k957k070N703l563
$$ plain form
3733 1044 -3013 1977 1395 -2270 2557 1692 -1562 3147 1904 -956 3574 2021 -474 3851 2005
3748 2005 -61 3898 1814 33 3708 1469 -64 3405 1032 -283 2860 492 -502 2217 -114
3763 -114 -839 1537 -721 -1302 933 -1444 -1655 266 -1896 -2038 -270 -2178 -2223 -676 -2431 -2316 -949
3780 -949 -2356 -2291 -1115 -2243 -1973 -994 -1876 -1616 -697 -1430 -1137 -325 -814 -629 184 -93 -48 704 646 494
3800 494 1292 1284 996 1614 1873 1266 1787 2227 1449 1973 2439 1401 1954 2442 1107 1858 2325 619 1551 2060
3820 2060 24 1047 1569 -671 617 1009 -1406 109 489 -2068 -248 -71 -2767 -613 -451 -3371
3836 -3371 -860 -761 -3711 -929 -1025 -4069 -796 -1094 -4091 -417 -1003 -3911 99 -763 -3602 816 -439
3853 -439 -3208 1594 -38 -2650 2410 384 -2090 3233 812 -1590 3955 998 -1072 4631 1068
3868A068j775N785l995j587N852m561j243N934n122p98N728n545l80N736o161
3883a064J33N573o574O99N464p126J319N335p577K009M996p795K542M780q049
3898e335L300M385q282M052L992q452M838L496q474N573L006q659O333K469q540
3913f298O952J917q551P576J186q284Q196M14q185Q803l74p998R290j170p714
3928d240R698k016p386J0160k943p172J0499l775o655J0735m667o117J0904n651
3942A374n508J1130o511m955J1284p376m289J1339q254l368J1270q996k518J1132
3956E754r730j491J0915j0356m79J0794j1163N34J0557j1673J557J0115j2063
3969f729K614R525j2294L757Q769j2594M972Q146j3096O134P361j3358P187O607
$$ plain form
3868 1068 -707 5078 1083 -504 5348 787 -456 5478 356 -442 5286 -259 -639 5097 -1064
3883 -1064 -931 4642 -1932 -1233 4231 -2895 -1576 3759 -3818 -1809 3187 -4608 -2066 2714 -5335
3898 -5335 -2035 2350 -5932 -1880 2112 -6340 -1502 1994 -6480 -907 2099 -6560 -227 2242 -6298
3913 -6298 654 2571 -5980 1596 2782 -5502 2694 3108 -5077 3726 3352 -4646 4644 3474 -4240
3928 -4240 5458 3442 -3944 6216 3273 -3899 6600 2825 -3830 6905 2238 -3879 7025 1374
3942 1374 -4134 6996 485 -4470 6814 -562 -4851 6488 -1766 -5134 6136 -2860 -5378 5754
3956 5754 -3976 -5467 5448 -4908 -5387 5407 -5756 -5222 5335 -6338 -4781 5334 -6729
3969 -6729 -4115 5410 -6884 -3127 5642 -6952 -1980 6166 -6930 -796 6565 -6793 394 7001
3983G001j3617Q155N697j3547Q875M724j3323R748L443j3094J0692K113j3019
3996f152J1721Q55j2905J2475mj2742J2870j036j2160J3323k207j1447J3643l550
4010B684j0468J4078n070r533J4748o381r044J5461p323q615J5824q057p740J5449
4024F013q703o294J5135r921m565J4974j1239l131J5183j2629k011J5350j3494
4037e332j068J5194j3809k75J4381j3969J128J3028j4308L048J1662j5321N117
4050e24J1029j6571O330J0825j7284O928J0315j7113P397R111j6512Q298O994
4063I223j5874R900M882j5891J1838L393j6627J3444K779j7259J3995K496j6740
4076a0441J3775J568j5386J3909l97j3651J4777k771j2500J6259m791j2290J7921
$$ plain form
3983 7001 -6616 1539 7236 -6311 2564 7288 -6035 3713 7156 -5938 4754 6867 -6152
3996 -6152 5569 6424 -6481 5994 5990 -6752 6118 5082 -7078 6245 4038 -7409 6234 2684
4010 2684 -7784 6294 1224 -8309 6439 58 -8986 6475 -848 -9463 6361 -1696 -9436 6013
4024 6013 -2690 -8984 6151 -3770 -8335 6639 -4600 -7731 7452 -5177 -7188 8162 -5332
4037 -5332 -6400 8794 -5015 -5290 9091 -4878 -3750 9278 -5030 -1982 9680 -5641 -524
4050 -524 10505 -6066 264 11089 -6195 733 11048 -6065 1332 10443 -6069 2229 9223
4063 9223 -6651 3249 8131 -7760 4078 7471 -9156 4288 7067 -10192 3803 6299 -10441
4076 -10441 3334 4902 -10484 3425 3028 -10623 4154 1383 -11117 5142 351 -11939 5982
4089E982n861j2494J8632n983j2271J8241o265j0506J7016p345q033J6621r702
4102a968n809J7238j2158m559J8322j3569m565J9014j3986m259J8116j3456l206
4115d845J6285j3677o59J4240j4974K175J3323j7198M279J3627j8914M944J3922
4128A2528j9051M696J3252j8097N193J1045j6933O920Q261j6696R557O172j7660
4141a0813J2115N442j9116J3402N700j9342J3074N604j8168J2753M022j6006J3102
4154A769J397j4389J4908j326j4058J7259l039j4596J8691l317j4930J8593l215
4167C747j4081J7609l876j1899J6649n913r319J6876q712p701J8074j1019p292
4180f857J9279j1885p516J9241j1775o967J7955j1694n128J6034j2553k506J4798
$$ plain form
4089 5982 121 -12373 6259 276 -11995 6246 -19 -10525 6491 -854 -8887 7734 -1968
4102 -1968 -7777 9461 -2697 -7256 11066 -2503 -7068 11946 -2040 -6299 11817 -1639 -4845
4115 -4845 11440 -2237 -2896 11344 -3630 -1455 11868 -5330 -1051 12576 -6338 -1394 12528
4128 12528 -6523 -1827 11425 -6672 -1479 9566 -7367 -447 7814 -8882 675 6847 -10813
4141 -10813 1302 6744 -12372 1030 6730 -12612 462 6066 -12102 651 4673 -11333 1769
4154 1769 3166 -11223 3685 2359 -11699 5560 2521 -12075 6616 3299 -11631 6962 3747
4167 3747 -10334 7275 3399 -8500 8149 2236 -7083 9793 1081 -6620 11454 435 -6857
4180 -6857 12422 537 -6979 12262 487 -6480 11475 -219 -5347 10687 -1866 -4372 10426
4193A0426j4476J17J4613j6537J464J5106j7593J788J5158j7262J932J3997j6388
4206g655L132J1810j5860N321R709j6291P766Q412j7295R652Q103j8070J0304
4219i62P997j7833J0437P117j6503J0575N349j5237J1587L135j4464J3225J280
4232E703j4521J4704J20j4672J5336l93j4480J5286r93j3516J4921k270j1895
4245f670J4702m020j0447J5232n993r627J6031p485q991J6427q168q607J6133
4258H517q537p564J5346r143o020J4643j0122m228J4084j1309k672J3969j2341
4271e377j585J3886j2891o62J3368j2978K52J2449j2826J436J1333j3062L021
4284c636J0275j3289M287R393j3670N449Q705j3897O263P868j3738O890O926j3266
$$ plain form
4193 10426 -4050 -3933 10680 -5857 -4393 10713 -6880 -5092 10066 -7196 -5264 8733 -7655
4206 -7655 -4523 7287 -8573 -3252 6457 -9834 -2068 6344 -10951 -1299 6804 -11266 -962
4219 -962 7035 -10798 -361 6756 -9747 828 6177 -9060 2527 5662 -8802 4423 5703
4232 5703 -8818 5886 6006 -8666 6670 6277 -8203 7083 6090 -7426 7495 5225 -6670
4245 -6670 8032 4012 -6435 8797 2804 -6823 9208 1723 -7268 9159 991 -7616 8517
4258 8517 -20 -7584 7762 -1381 -7401 7242 -2880 -7108 6976 -4333 -7005 6964 -5377
4271 -5377 -6962 6924 -5967 -6629 6739 -6239 -5987 6462 -6364 -4928 6405 -6657 -3636
4284 -3636 6639 -6650 -2363 7030 -6640 -1191 7514 -6383 -120 7748 -5990 900 7826 -5440
4298e440P505N697j2943Q255M378j2616R054L231j2363R613K220j2031J0104J256
4312E920j1671J0423L36j1048J0708p45j0304J0881j759r520J1099k688q854J1253
4326D031l555q010J1401m296p299J1397n039o208J1251n673n305J1080o239m412
4340f876J0936o889l354J0488p185k490J0046p633j433R570p934o25R088q200
4354b491J38Q485q382R10P844q544J638P176q621K208O405q653K878N640q641
4369b010L501M805q565L893M207q495M316L529q375M720K749p912M877K143p659
4384d276N285J411p213N509Q56o810N738K96o339N907k09n863N947n35n421O099
4400C82r71m757O002j371m253O009j714l714N954k134l142N854k408k644N635
$$ plain form
4298 -5440 2065 7762 -5181 3074 7452 -5164 3890 7121 -5242 4371 6591 -5440 4664 5920
4312 5920 -5751 4672 5008 -6040 4668 3923 -6381 4500 2741 -6779 4320 1632 -7222 4031
4326 4031 476 -7534 3867 -429 -7728 3669 -1370 -7578 3673 -2000 -7305 3775 -2464 -6876
4340 -6876 4060 -2829 -6183 4305 -2880 -5370 4676 -2957 -4390 5180 -2754 -3379 5709 -2491
4354 -2491 -2353 6132 -2250 -1340 6504 -2040 -402 6774 -1847 361 6766 -1887 991 6631 -2010
4369 -2010 1491 6296 -2269 1624 5831 -2664 1652 5181 -3194 1526 4275 -3637 1240 3383 -4276
4384 -4276 1009 2420 -4793 716 1572 -5238 500 796 -5543 364 155 -5708 239 -296 -5717 382
4400 382 -589 -5346 656 -715 -4968 1041 -673 -4387 1567 -567 -3709 2145 -263 -2907 2728
4415B728k561k270N361k822j731N136l089j354M740l158r46M230l170o48L779
4430D225l263k98L454l394n9L038l316N8K731l256L57K322l250M27J986k974O08
4447f04J647k815P73J337k653R40J153k394Q82J003k024Q31R32j715Q25P49j459
4464b592Q39O24j072P33N75r36P94N48o85O41N53m70L67O64m13K61O35j72r5O99
4484A498K9l11O71Q5o18Q49%p90Q48j14r89J016j64j161J167k20j549J554m25
4503A376j839J743m76j870J851o08j833K078r29j883K496j124j847K733j413j792
4519c337L145j617j764L441j872j608L634k121j356L958k539r99M096k931p04
4534b574M331l283n14M510l616k50M626m066J51M650m557N31M464m777Q73M389
$$ plain form
4415 2728 167 -2103 3258 436 -1295 3841 752 -602 4138 980 34 4264 1094 446 4225
4430 4225 962 664 4118 724 665 3703 387 445 3176 -80 277 2599 -651 -224 1762 -1212 -604
4447 -604 1043 -1772 -999 338 -2315 -1375 -222 -2616 -1734 -731 -2755 -1924 -992 -2707 -1882 -1133 -2592
4464 -2592 -1753 -1129 -2201 -1468 -893 -1829 -1035 -487 -1172 -531 22 -448 -81 583 170 431 1066 894 799 1498
4484 1498 1527 1216 1887 1972 1354 2203 2203 1413 2261 2147 1158 2174 2010 849 2016 1796 247 1801 1376
4503 1376 -463 1280 804 -1066 785 177 -1656 422 -507 -2390 106 -1018 -2865 -132 -1545 -3337
4519 -3337 -192 -1809 -3573 -132 -2004 -3612 22 -2099 -3455 503 -2036 -3035 1061 -1870 -2574
4534 -2574 1757 -1526 -2040 2470 -1146 -1396 3230 -836 -685 3965 -592 -61 4403 -374 499 4888
4550D888n255J263M242n740J771M061o170K282L687o470K657L460o789L264K979
4565D130p008L830K654p215M287K246p350N055J595p419N605J190p356O024P07
4580I75p260O771j1o987P305n99o862P823j138o566Q314j876o152Q793k580n786
4596e836R180l328n299R554m023m901R791m761m307R931n651l597J0012o414l042
4611b691J0019p208k359R966p994j702R957q770r77R686r424k08R393j0014O68
4626a658Q973j0648J582Q622j1194K501Q138j1609L349P628j1958M360P088j2319
4640g145N374O374j2426O284N720j2541P409M771j2503Q365M002j2488R239L166
4654C601j2171R925K128j1850J0796J125j1575J1666J3j1209J2343j088j0767
$$ plain form
4550 4888 -367 896 5138 -602 1169 5230 -940 1342 5029 -1441 1216 4676 -2113 1151 4130
4565 4130 -2878 952 3606 -3609 678 2924 -4426 629 2224 -5195 410 1600 -5756 268 975
4580 975 -6285 486 475 -6512 793 194 -6668 1155 17 -6549 1765 -111 -6263 2530 -50 -5836
4596 -5836 3344 16 -5283 4271 248 -4653 5138 377 -3930 6001 350 -3247 6765 351 -2691
4611 -2691 7328 120 -2239 7727 -267 -1969 7988 -782 -1759 7927 -1497 -1705 7688 -2326 -1658
4626 -1658 7315 -3333 -1751 6871 -4323 -1822 6316 -5293 -1944 5684 -6274 -1914 5174 -7145
4640 -7145 -1771 4603 -7823 -1539 4181 -8360 -951 3820 -8683 -318 3684 -8804 435 3601
4654 3601 -8570 1355 3483 -8367 2429 3554 -8021 3645 3658 -7551 4792 3704 -7063
4667g063J2835k111j0127J3127l127r566J3528m358q823J3863n711p935J4273
4680H805o988p342J4492p832o692J4484q788n645J4218r753m498J3990j0733l291
4694e573J3802j1902j965J3603j2826q42J3485j3619Q3J3153j3982J185J2421
4707G023j4145K505J1342j4635M195J0503j5364N763R854j5931O993R304j6272
4720h865P897Q560j6102Q714P320j5616R806N598j5177J1107L940j5141J2582
4733D623K566j5344J3747J679j5394J4234Q71j4671J4113m32j3417J4300k201
4746D674j2157J5038m278j1272J6145n984j0939J7095o886j0728J7215p358r935
4759i370J6787q064q283J5990r329o220J5802j1114m542J6395j3039l479J7045
$$ plain form
4667 -7063 5772 3661 -6466 6661 3534 -6032 7496 3138 -5685 8178 2467 -5468 8805
4680 8805 1817 -5525 8967 1135 -5557 8927 139 -5506 8712 -1041 -5539 8451 -2282 -5573
4694 -5573 8229 -3673 -5638 7965 -4861 -5703 7782 -5837 -5754 7399 -6583 -5398 7023
4707 7023 -7122 -4617 6725 -7910 -3715 6788 -8576 -2813 7041 -8890 -1897 7407 -8865
4720 -8865 -968 7592 -8510 204 7524 -8092 1714 7312 -7865 3242 7182 -7959 4623
4733 4623 7189 -8155 5592 7271 -8123 6111 6982 -7689 6424 5992 -7425 6875 4674
4746 4674 -7483 7555 3277 -7995 8150 2166 -8773 8322 1436 -9292 7923 565 -9370
4759 -9370 7417 -647 -8930 7060 -2269 -8489 7313 -3801 -8343 8052 -4987 -8466 8579
4772H579j3974k943J7122j4083k256J6067j3820q84J4541j4214J503J3189j5493
4785f666L835J2630j7115N405J2622j7992N871J2497j7952O323J1245j7072P057
4798F88R164j6363Q799O874j6442J1004N059j7205J2852M315j8034J3648M087
4811H446j7827J3367L256j6389J3186J363j4571J3859j257j3265J5512l575j2937
4824a0832J7171m802j3236J8016n031j2968J7607n345j1523J6727o335r216J6156
4837F389q327o957J6592j0656n639J7631j2181n234J8249j2696n035J7911j2543
4850b496l908J6383j2667j896J4719j3678M77J3862j5419K504J3671j6918L551
4863a815J3788j7510L799J3407j7114M234J1738j6280N617R404j6076P643P658
$$ plain form
4772 8579 -5395 -8338 8784 -5299 -7555 8512 -5308 -6192 8349 -5865 -4362 8827 -6666
4785 -6666 -2831 9799 -7316 -1911 10711 -7281 -1410 11087 -6865 -542 10703 -6369 688
4798 688 9852 -6511 2288 9162 -7280 3724 8783 -8422 4430 8745 -9289 4359 8446
4811 8446 -9381 3986 7242 -9147 4039 5402 -9169 4690 3433 -9832 5680 2105 -10832
4824 -10832 6339 1537 -11699 6317 1286 -11682 5925 580 -10943 5784 -551 -9767 6389
4837 6389 -1938 -8895 7697 -2959 -8598 9033 -3148 -8382 9867 -2829 -7864 10047 -2496
4850 -2496 -6404 9979 -2688 -4584 10135 -3543 -3066 10796 -4623 -2119 11552 -5366 -1815
4863 -1815 11973 -5537 -1738 11669 -5445 -1211 10527 -5753 -136 9268 -6808 835 8493
4876H493j6687R699O495j7368J0872O069j7635J1312N550j7062J1430M339j5666
4889a0159J1906K299j4318J2978J19j3510J4473j471j3482J5691k283j3249J6028
4902E022k873j2426J5704l586j1115J5442m917r428J5370o698p891J5790q290
4915A04p048J6256r351o388J6311r927n788J5815j0290m591J4801j0990k950J3984
4929I948j1996j423J3489j3109r2J3075j3963Q78J2761j4356J732J1877j4242
4942e421K508J0836j4183L793R644j4393N247Q488j4636O645P439j4613P475O676
4956E505j4458Q273N800j4080Q999M615j3424R605L464j2787J0294K227j2293
4969h260J1156R29j1647J1666m1j1134J2007r66j0417J2101j930r672J2320k951
$$ plain form
4876 8493 -8194 1505 8000 -9368 1504 7573 -10062 1250 6800 -10262 1168 5507 -10159
4889 -10159 1747 4046 -10272 2706 2825 -10685 3788 2317 -11165 4526 2243 -11006 5022
4902 5022 2149 -10277 5427 1841 -9274 6168 1251 -8177 7193 495 -7396 8394 104
4915 104 -6944 9312 -39 -6427 9884 -43 -5831 9984 -306 -4897 9904 -1086 -4036 9948
4929 9948 -2048 -3471 10018 -3091 -3183 9892 -4071 -3193 9568 -4788 -3056 8821 -5421
4942 -5421 -2913 7923 -6260 -2467 7177 -7216 -1969 6519 -8117 -1472 5967 -8646 -1171 5505
4956 5505 -8953 -680 5120 -8960 39 4654 -8770 835 4299 -8488 1806 4033 -8260
4969 -8260 2896 3825 -7822 3844 3803 -7331 4676 3710 -6707 5394 3464 -6208 6112 3161
4983C161q821J2203l844p923J2227m839p231J2410n869o273J2184o604n458J1955
4997G278p204m672J1634p879l746J1223q381k837J0724q793j784J0275r325q19
5011d306R733r690N2R269r867R34Q717j0076J776P978r959K546P350r973L283
5026b233O588r751M032N660r613M807M915r482N391M202r321N912L453q941O211
5041A830K726q590O491J909q143O760J208p722O930M11p210P121l72o748P241
5056C842r56o405P320j531n890P166j981n244O923k460m693O959l025m072O855
5071B808l429l468O622l765k950O524l965k431O234m173j808N916m306j208N529
5086B130m409p35N241m469j99M904m555K75M429m530O35M183m471R51L711m398
$$ plain form
4983 3161 -5660 6543 2699 -5224 7003 2164 -5067 7343 1474 -4799 7385 781 -4677 7278
4997 7278 74 -4598 7036 -843 -4589 6634 -1747 -4584 6140 -2653 -4437 5838 -3487 -4306
5011 -4306 5427 -4263 -4211 5058 -4809 -3875 4842 -5234 -3458 4520 -5439 -2893 4457 -5516 -2233
5026 -2233 4355 -5396 -1364 4296 -5317 -510 4405 -5077 314 4516 -4805 1107 4560 -4381 1830
5041 1830 4556 -4034 2457 4366 -3777 2983 4191 -3531 3399 3810 -3400 3721 3349 -3399 3842
5056 3842 2886 -3519 3801 2270 -3620 3546 1565 -3679 3244 784 -3909 3050 25 -4047 2808
5071 2808 -621 -4089 2533 -1232 -4182 2342 -1623 -4054 2180 -1993 -3801 2115 -2191 -3399 2130
5086 2130 -2279 -3014 2227 -2242 -2441 2463 -2092 -1817 2612 -1918 -1283 2900 -1571 -620 3091 -1307
5102a307J229L228m196J477K818m051J702K325l890J842J942l709J900J582l567
5117f75J977J250l373J950R63l112J919O93k902J988M05k521J761J81k216J701
5133a1J8j981J737p8j772J640p4j628J501p7j315J304n9j034J083L7q39R87%p31
5153a292R72Kn28P56J50n54N97L54n30M25M55m48J51N89l94k3P01m71j33Q11o57
5174I33k12R29q35j57J145j133l47J433j293m29J570j430m14J612j611m11J790
5191A140j808k93J783j918o4J852k265J92K112k635L13K239k793N18K283k949
5207b293P92K309l194J119K237l442J542K181l664J863K135l901K313J883m052
5222b172K543J857m297K907J571m324L308J221m486L612Q82m507L998M67m505
$$ plain form
5102 -1307 -78 3150 -1046 431 3249 -802 900 3225 -665 1177 3119 -590 1310 2892 -675
5117 -675 1302 2552 -821 1129 2092 -1020 899 1592 -1310 678 1083 -1438 323 504 -1712 -11
5133 -11 7 -1974 -237 -315 -2087 -447 -521 -2149 -648 -725 -2040 -736 -795 -1829 -746 -709 -1548 -561 -561 -1292
5153 -1292 -320 -318 -846 -90 60 -494 103 457 -73 352 807 359 510 1099 705 682 1383 912 779 1590 933
5174 933 721 1650 815 658 1803 670 323 1756 463 34 1604 174 -240 1372 -239 -650 1140
5191 1140 -668 -961 822 -1096 -1160 692 -1573 -1381 731 -1904 -1591 648 -2145 -1627 656 -2293
5207 -2293 -1501 808 -2386 -1267 970 -2472 -930 1251 -2413 -550 1585 -2316 -3 1880 -2172
5222 -2172 371 2228 -2069 838 2409 -1915 1393 2614 -1872 1740 2622 -1885 2113 2580 -1925
5237a925M441l3m710M906m37m619N149r05m499N361j352m307N719j929m083O040
5253B817k539l787O239l045l421O541l535l122O627m106k624O763m476k143O765
5268B954n039j527O822n591r01O694o018l59O761o508J74O578o861P81O472p297
5284b865J422O141p645K056N783p958K861N322q309L508M890q580M253M335q856
5299c642M803L892q935N388L314r087O112K555r028O666J905q975P387J043q862
5314e464P982L50q742Q511k95q449Q911j094q010R332j881p505R739k828o996
5329f439J0145l651o464J0443m336n863J0703n184n168J0748n911m375J0732o613
5343a233l604J0685p397k793J0704q261j889J0469q740j125J0168r323l21R816
$$ plain form
5237 -1925 2516 2483 -2227 2679 2242 -2377 2772 1867 -2632 2729 1377 -2930 2789 860 -3223 2817
5253 2817 278 -3509 2730 -315 -3736 2805 -730 -3852 2775 -1331 -3955 2808 -1668 -3811 2954
5268 2954 -2085 -3612 3210 -2381 -3282 3412 -2606 -2965 3796 -2712 -2538 4040 -2821 -2040 4432 -2865
5284 -2865 -1443 4698 -2947 -891 4892 -3066 -205 5117 -3192 316 5206 -3374 879 5214 -3642
5299 -3642 1161 5053 -3882 1506 4820 -4267 1845 4400 -4628 2038 3943 -5032 2355 3398 -5464
5314 -5464 2518 2868 -5874 2637 2342 -6107 2804 1710 -6300 3032 1151 -6354 3385 557 -6439
5329 -6439 3706 55 -6409 4034 -302 -6165 4538 -646 -5814 4934 -977 -5352 5380 -1233
5343 -1233 -4837 5848 -1549 -4342 6362 -1899 -3788 6681 -2059 -3184 6984 -2339 -2660 7156
5357G156r948O96R340j0360J501Q890j0935K459Q397j1409L337P922j1771M120
5371f05P274j1994N105O432j2037O014N572j2220O976M788j2234P823L968j2196
5385g334Q554L104j1962R252K306j1748R998J213j1272J0711J1j0748J1502j039
5399B548j0403J1944j834r932J2414k841r240J2619l738q327J2639m711p430J2786
5413F494n919o583J3116p035n752J3155p830n001J3049q386m153J2614r061l042
5427d334J2144r941j687J1630j0811n53J1489j1702M34J1219j2273J223J0743
5440G581j2405J997R996j2509K978R065j2726M415Q037j3100N634P331j3626O751
5454e81O787j3929P537O162j3666Q097N125j3149Q767L836j2607R827K441j2363
$$ plain form
5357 7156 -2792 -2096 7244 -3116 -1615 7275 -3660 -1201 7196 -4213 -876 7046 -4725 -605
5371 -605 6669 -5325 -220 6212 -5825 189 5761 -6459 517 5305 -6929 894 4862 -7334
5385 -7334 1220 4324 -7638 1614 3920 -7828 2170 3383 -7889 2822 2833 -7915 3587 2548
5399 2548 -7855 4089 2255 -7677 4737 1896 -7344 5275 1537 -6790 5849 1138 -6292 6494
5413 6494 575 -6008 7108 73 -5679 7476 -354 -5355 7694 -692 -4845 7769 -1292 -4334
5427 -4334 7810 -2131 -3818 7812 -2999 -3552 7937 -3765 -3331 7888 -4385 -3162 7581
5440 7581 -4824 -2827 7169 -5340 -2362 6703 -6023 -1608 6429 -6671 -1037 6294 -7332 -581
5454 -581 6206 -7723 -186 5976 -7690 407 5532 -7617 1150 4986 -7621 2206 4647 -7716
5468g716J0874J250j2214J1719L59j2068J2171k80j1585J2299j197j0631J2352
5481E333k556r391J2617m027q433J3102n326p848J3559o199p300J3705o903o597
5495f264J3253p332n495J2740q089m169J2345r207k686J2128j0293j730J2176
5508G377j1158q97J2007j1416k47J1325j1457O90J0516j1621J932R522j2159L541
5522b045Q589j2649M666Q129j3097N520P659j3239O040P053j3001O649N897j2451
5536f280P542M447j2225Q624L320j2188R613K353j2106J0308J513j1952J0766
5549C735P23j1261J0817k54j0367J0984j439r452J1395k801q714J1950l823q217
5563f724J2305m660p571J2262n245o756J2028n924n774J1754o755m559J1445p639
$$ plain form
5468 -7716 3158 4408 -7806 3913 4272 -7796 4375 4095 -7490 4809 3612 -7019 5333
5481 5333 2777 -6614 6003 1976 -6457 6645 1319 -6529 7030 831 -6469 7236 333 -6264
5495 -6264 6989 -343 -5838 6902 -1187 -5356 6989 -2218 -4904 7224 -3069 -4799 7377
5508 7377 -3781 -4678 7329 -4087 -4334 6991 -4466 -3776 6740 -4881 -2949 6573 -5586 -2045
5522 -2045 6544 -6105 -1439 6690 -6407 -887 6772 -6467 -427 6626 -6375 274 6171 -6280
5536 -6280 1262 5709 -6516 2108 5428 -6760 2853 5206 -6900 3408 4921 -7031 3735
5549 3735 4458 -6803 4014 3760 -6607 4377 2938 -6514 4881 2080 -6634 5316 1493 -6724
5563 -6724 5581 921 -6650 5612 367 -6389 5639 -285 -6059 5695 -1060 -5619 5826 -1813
5577a813l370J1196q404k550J1267r150j733J0990r497r91J0401r699lR720j0111
5592c747J044R088j0443J985Q477j0880L157P786j1117L735P330j1196M340O626
5606F185j1126N084N674j0898N822M755j0878O648L790j0691P290L010j0485P905
5620B085K164j0248Q383J395r834Q729N05r258Q985l70q503R190j249p985R587
5635C576k070p490R773k790o707R736l502n991R754m165n337R749m897m436R482
5650D685n411l700R288n855l002R081o430k237Q786o840j541Q462p229q28Q143
5665E372p589j17P706p828N61P066p905J226O569q063J842O136q315K502N517
5680D680q252L109M884q235L662M371q182M030L782q065M567L156p852N088K409
$$ plain form
5577 -1813 -5183 6013 -2391 -4941 6326 -2824 -4557 6433 -3064 -4055 6346 -3353 -3356 6364 -3747
5592 -3747 -2703 6385 -4058 -2073 6404 -4476 -1319 6467 -4650 -915 6415 -4781 -441 6185
5606 6185 -4941 143 5817 -5081 741 5496 -5382 1266 5056 -5635 1655 4665 -5820 2085
5620 2085 4249 -5999 2384 3779 -6055 2674 3179 -6079 2906 2536 -5967 3223 1974 -6011 3576
5635 3576 1506 -5984 3789 999 -5708 4028 526 -5465 4289 124 -5213 4536 -361 -4797 4685
5650 4685 -726 -4426 4862 -993 -3995 5086 -1344 -3581 5205 -1635 -3176 5286 -1943 -2771 5372
5665 5372 -2217 -2334 5372 -2456 -1895 5171 -2734 -1508 5061 -3002 -1160 4976 -3339 -837 4680
5680 4680 -3572 -463 4421 -3814 -152 4219 -3963 67 3849 -4216 351 3507 -4345 743 3152
5695C152p535N398J801p338N785J238o990N979O61o552O133J62o183O252l72n680
5711d089O382j032n211O502j496m849O595k104m209O492k455l786O357k804l262
5726b969O178l181k754O044l542k252N790l804j753N572m044j366N343m193r26
5741a857N066m358m34M736m509n1M342m525L89M056m602P17L733m637J084L353
5757B503m557J377L062m565J639K725m342J801K354m183K111J907m040K330J569
5772A691l880K473J312l707K592R53l420K640O46l211K708L25k913K741R4k733
5788a689K676m0k531K677m01k140K593n57j942K442o26j740K384q08j496K254
5804A056q28j341K187r42j109J955r44r57J867j045p21J693j027o32J552r76m49
$$ plain form
5695 3152 -4383 1015 2816 -4522 1263 2501 -4489 1490 2151 -4401 1732 1894 -4289 1963 1591 -4089
5711 -4089 2293 1261 -3950 2552 1056 -3793 2802 698 -3511 2981 526 -3260 3097 293 -2969
5726 -2969 3209 28 -2726 3318 -224 -2476 3314 -490 -2243 3329 -715 -2081 3262 -931 -1857
5741 -1857 3209 -1149 -1583 3153 -1356 -1407 2935 -1590 -1201 2855 -1747 -1030 2703 -1934 -850 2503
5757 2503 -2054 -677 2385 -2180 -541 2184 -2158 -357 1997 -2186 -75 1832 -2208 122 1691
5772 1691 -2189 284 1596 -2111 481 1434 -1986 654 1300 -1911 797 1122 -1791 950 1044 -1689
5788 -1689 987 947 -1584 1093 692 -1448 1145 588 -1354 1088 462 -1278 1106 298 -1198 1056
5804 1056 228 -1113 1074 132 -977 978 34 -923 944 -101 -822 871 -156 -788 764 -212 -661
5821f61J314q80l94J187q03l23J071p04k12P98n59k37P61n29k12P17l83k11O05
5840C45l54k18M79j85l02M56j26l33L62M4l49K67J87n63L98J69n99L86K61p39
5860d14N21K66q08N19L87j014N60M94j056O11M80j205P53O19j484R69M28j453
5878h27J064M68j575J211L13j673J470K31j827J615J61j837J820O1j956J944j11
5895E52j891K193k97k008K344l46k030K546o84j860K705j027j725K864j135j810
5911a609L003j378j598L138j648j503L230j855j328L323k204j111L451k518q83
5926a490L490k766n64L380k943l70L443l304k6L488l589L29L287l784O43L087
5942B311l875R55K984m061J200K883m287J648K637m454K078K385m605K360K141
$$ plain form
5821 -661 653 -227 -621 566 -237 -560 511 -193 -405 393 -166 -403 358 -171 -383 334 -49 -260 345
5840 345 -9 -227 252 67 -235 221 95 -238 124 168 -181 86 273 -290 108 277 -322 64 325 -414
5860 -414 107 373 -435 84 471 -543 17 511 -545 66 546 -659 94 713 -771 198 626 -827
5878 -827 237 705 -870 341 654 -1019 451 682 -1145 470 631 -1206 614 675 -1281 663 552
5895 552 -1339 854 557 -1451 893 547 -1483 1063 379 -1481 1224 197 -1528 1336 201 -1609
5911 -1609 1394 16 -1582 1556 -92 -1595 1635 -220 -1548 1775 -429 -1540 1911 -607 -1490
5926 -1490 2000 -766 -1330 2050 -893 -1263 2180 -1124 -1150 2338 -1251 -922 2365 -1419 -776 2311
5942 2311 -1564 -609 2375 -1686 -486 2397 -1890 -242 2395 -2059 19 2404 -2201 159 2300
5957B300m702K814J872m828L173J591m881L493J126m753L787P47m724M092N04
5972A611m662M426P5m609M788l62m536N136q48m272N376j310m024N494j752l710
5988c179N684k204l441N872k683k984N860l019k740N986l574k349O166m007j912
6003b524O076m430j431N997m868q82N811n198m00N663n530Q3N508n893O31N243
6019C856o078J094M969o313J630M590o576K214M245o706K686L891o921L326L411
6034C318o966L841K937o979M254K538o927M719K033o898N105J621o828N614Q60
6049B242o504N953L52o335O405k32o279O833p90n927P086j336n683P252j924n210
6065d097P561k593m796P601l167m255P748l770l829P762m345l315P894m899k739
$$ plain form
5957 2300 -2402 412 2284 -2544 629 2220 -2661 832 1958 -2795 992 1739 -2985 1107 1611
5972 1611 -3051 1375 1450 -3159 1629 1267 -3269 1867 1019 -3253 2123 813 -3211 2283 531 -3179
5988 -3179 2505 301 -3140 2732 49 -2935 2925 -94 -2834 3152 -422 -2771 3395 -612 -2524
6003 -2524 3552 -878 -2309 3688 -1180 -2062 3749 -1449 -1849 3814 -1716 -1633 3875 -2018 -1387 3856
6019 3856 -2222 -1128 3841 -2472 -842 3748 -2828 -614 3631 -3075 -389 3502 -3419 -93 3318
6034 3318 -3648 193 3130 -3849 405 2943 -3984 735 2768 -4130 975 2596 -4232 1382 2242
6049 2242 -4262 1691 2043 -4292 2113 1881 -4398 2435 1645 -4282 2804 1468 -4215 3037 1113 -4097
6065 -4097 3464 871 -3925 3676 509 -3746 4002 232 -3597 4165 -180 -3495 4399 -500 -3239
6080c239P709n271k222P553n799j558P382o234r58P250o743k74O920p052L65O649
6096D478p293R37O236p537J565N789p608K190N397p924K913M865q082L565M420
6111C911q184M105L963q082M504L393p972N028K781p862N590K057p706O114J420
6126C060p616O656Q27p594P093L52p349P300l04o848P388r80o329P751j812n974
6142d379Q085k553n554Q398l204n207Q518l645m698Q320m025m077Q104m564l351
6157c832Q087n272k618Q015n962j927P946o313j407P736o542j002P444o738l23
6172b708P037p063M82O546p281J251O134p688J980N820q021K524N500q014K875
6187f26N062p965L379M342p799M013L544p802M708L008p837N280K403p919N757
$$ plain form
6080 -3239 4470 -801 -3023 4530 -1269 -2827 4555 -1679 -2637 4613 -2130 -2404 4516 -2536 -2171 4478
6096 4478 -2815 -1878 4358 -3179 -1614 4175 -3433 -1243 4154 -3770 -857 4008 -4074 -509 3911
6111 3911 -4273 -168 3795 -4287 217 3610 -4362 666 3447 -4415 1175 3232 -4474 1640 3060
6126 3060 -4556 2100 2927 -4667 2426 2778 -4571 2729 2425 -4423 2965 1985 -4344 3407 1595 -4379
6142 -4379 3706 1153 -4401 3997 793 -4414 4104 459 -4239 4081 56 -4021 4083 -481 -3832
6157 -3832 4255 -1017 -3635 4380 -1582 -3509 4437 -1876 -3283 4453 -2089 -3091 4353 -2385 -2708
6172 -2708 4329 -2734 -2252 4294 -2987 -1736 4398 -3290 -1310 4510 -3511 -987 4513 -3501 -626
6187 -626 4436 -3529 -150 4192 -3607 406 3950 -3852 856 3864 -3973 1307 3710 -4209 1548
6202A548K008p786N905J524p497O202R06p111O527mo510O890p83o364P392j495
6218A352n985P625j921n718P585k188n290P600k793m533P465l390l872P629m212
6233f46l203P636m766k703P632n078k344P587n324j811P092n544j121O686n795
6248a702l65O253o188L67O081o616Q30N840o914J400N461o919J737M984o791K142
6264d00M413o775K775L744o838L359L286o963L900K854p028M265K483o880M583
6279G78J969o688M802J431o302N176P32n980N456J01n571N762l69n509O103q04
6295A087n177O182j274m727O214j735m231O221k202l683O141k740l230O290l164
6310b8k823O249l575k467O231l815k021N939m187j428N593m319j059N416m637
$$ plain form
6202 1548 3556 -4230 1675 3199 -4298 1904 2810 -4301 2226 2222 -4288 2602 1819 -4545 2847 1352
6218 1352 -4633 2992 1071 -4647 2938 750 -4540 3060 267 -4266 3199 -191 -4063 3566 -646
6233 -646 -3849 3787 -979 -3682 3950 -1128 -3472 4115 -1209 -3020 4072 -1472 -2593 4093 -1702
6248 -1702 -2067 4186 -2002 -1635 4446 -2170 -1340 4500 -2414 -1014 4447 -2472 -735 4249 -2542 -400
6264 -400 4013 -2762 13 3757 -3081 278 3564 -3399 501 3355 -3673 592 3075 -3805 778
6279 778 2747 -3941 861 2292 -4010 1166 1898 -4082 1374 1475 -4096 1666 1297 -4212 1891 1087
6295 1087 -4090 2092 818 -3909 2305 570 -3661 2560 358 -3325 2816 76 -3154 3136 -28
6310 -28 -2851 3398 -177 -2644 3587 -228 -2249 3690 -497 -1925 3668 -651 -1710 3706 -931
6325i31m64N061m950K4M834n092L87M529n177Q30M213n294J233L797n283J594
6341f89L341n260K056L049n265K426K543n201K700K390n265L054J955n099L374
6356A09J633m945L608J151m715L864P36m424L987L04m173M167n0l965M378m58
6372A207l714M430p96l489M483j104l171M387j392k725M387j847k436M356k181
6387C95k033M326k472j862M263k621j560M072k860j186L845k882q57L534k971
6402h69n30L383l146j48L145l329J69L104l421L71K839l320O53K597l227Q42K304
6419A417l251J090K037l172J390J814l170J686J583l176J792J433l078J941J102
6434A438k935K074Q92k740K102N54k535K170L53k416K220J10k315K343j48k154
$$ plain form
6325 -931 -1395 3666 -1284 -1260 3574 -1518 -1131 3398 -1779 -949 3264 -2030 -797 3000 -2283 -689
6341 -689 2652 -2608 -552 2497 -2768 -342 2201 -3000 -300 2090 -3175 -121 1834 -3265 109
6356 109 1742 -3203 405 1556 -3159 705 1441 -2983 1004 1308 -2865 1302 1252 -2713 1665 1207
6372 1207 -2507 1923 1127 -2362 2121 1017 -2154 2233 841 -1884 2503 656 -1780 2576 395
6387 395 -1638 2688 216 -1646 2617 -4 -1564 2508 -352 -1538 2307 -575 -1432 2102 -869
6402 -869 -1399 1984 -1162 -1310 1835 -1494 -1325 1779 -1642 -1271 1568 -1752 -1099 1498 -1729 -887 1417
6419 1417 -1834 -744 1293 -1879 -489 1325 -1845 -159 1424 -1752 40 1473 -1605 336 1438
6434 1438 -1497 577 1469 -1271 831 1385 -1150 1020 1373 -1043 1177 1287 -1028 1315 1167 -987
6450i87K267k57k083K303m05j854K244o94j644K197p72j460K129q88j275J963
6466G84r68j070J855r49r85J897j117p53J784j157n40J596j130l35J489j146k59
6483a004J459j073q7J184j138Q7J150j133J29J148j073J02J026r72J07R88q99
6500AK20P08r12K97P00r23M01N28q56L45M74p91K44M43o91R1M58o38J19K25m47
6521dJ00J86m61K00L1l20P7J09k98oK25l84l0L15k28k10L29q9k93L08lk62L02
6544d06Pk00L56n3k62M82j21l36O51p5m71P40p2n25P74n2n91P78r3n12Q10l11
6566E18m69Q80m71m48J116n57n68J163o57o73J300p72o31J261q12n41J208q20
6584B7n50J362j205k66J429j382k35J517j506k02J537j407j59J614j658P1J476
$$ plain form
6450 -987 1280 1023 -1060 1243 838 -1016 1228 534 -1110 1087 315 -1145 984 96 -1179 784
6466 784 -184 -1254 601 -348 -1333 564 -553 -1306 478 -679 -1219 377 -753 -1088 401 -745 -1004
6483 -1004 455 -618 -705 479 -659 -572 578 -555 -426 722 -351 -249 777 -195 -88 900 1
6500 1 221 929 17 314 1014 91 492 1020 164 509 983 192 436 879 188 279 737 99 218 443 -4
6521 -4 96 282 -179 21 52 -268 -191 -82 -380 -386 -161 -545 -575 -260 -488 -698 -369 -458 -751 -443 -446 -708 -406
6544 -406 -399 -599 -243 -296 -558 -76 -197 -533 118 43 -428 312 240 -285 489 437 -154 624 531 19 829 518
6566 518 49 929 458 10 1126 569 1 1164 507 -166 1134 362 -269 992 180 -361 847 27
6584 27 -523 839 -366 -632 797 -585 -820 697 -809 -1011 526 -881 -1040 574 -1084 -1013 463
6601D63j687J83J569j857N15J380j865O58J423k106R17J377k184J006J253k182
6617a137J211J205k316J374R80k296J595P68k281J714O87k426K006M66k411K069
6633A208J55k254K059J73k339K245j31k281K393l04k304K652o87k038K734r21
6649C60j985K774j144j894K936j236j767L039j537j524L003j749j264L031j870
6664h27j134L200k283q07L244k533n30L178k637l95L242k840j16L203l051J92
6680h94K962l093M84K821l300Q30K655l637J244K480l670J355K280l710J642K088
6696B537l832J908J705l749K127J430l795K529J101l892K769R09l930K941O47
6711A405l768L046M52l653L230N6l382L455m10l207L813q41l235M115r63l111
$$ plain form
6601 463 -1224 -1041 528 -1329 -814 566 -1299 -641 782 -1324 -407 970 -1214 -208 1045 -1137
6617 -1137 74 1279 -1037 337 1317 -979 616 1384 -897 817 1504 -922 1084 1550 -861 1208
6633 1208 1363 -891 1168 1341 -998 1247 1116 -1165 1228 924 -1380 1272 585 -1453 1281 360
6649 360 -1625 1149 5 -1889 1047 -189 -1956 1083 -454 -1978 1025 -724 -1988 1043 -827
6664 -827 -1961 1239 -1044 -1851 1393 -1140 -1670 1508 -1129 -1524 1718 -1122 -1238 1965 -1086 -894
6680 -894 2068 -1025 -541 2280 -1020 -190 2465 -1172 72 2552 -1118 237 2517 -1193 449 2537
6696 2537 -1295 613 2318 -1431 696 2126 -1669 860 1961 -1931 838 1747 -2183 758 1405
6711 1405 -2363 683 1135 -2518 712 768 -2614 841 431 -2776 1037 196 -3039 1076 113 -2998
6727b998M174j198k861M162j451k485M208j929j994M265k290j780M390k582j601
6742a970M484k925j294M464k991j116M228l249o67M061l547k25L845l885J84L896
6758C293m316N23L714m310N77L553m423R54L219m347J305K793m544J901K360m667
6774b415K252K236m740K470K118m847K662J874m591K857J426m417L283Q91m271
6789c212L718L74m194M097K37m303M283Qm074M235j55l780M274o53l315M449j274
6806G15k972M824j916k900N120k190k854N156k300k609M938k452k251M724k837
6821A96j641M576l415r99M595m021o98M662m301n64M728m337m05M418m199j15
6837a520L867m091M59L408m540J327L297m974J696L247n161J859L337n111J835
$$ plain form
6727 -2998 1176 -22 -2883 1279 -172 -2657 1551 -378 -2372 1893 -397 -2177 2213 -369 -1970
6742 -1970 2514 -411 -1705 2759 -232 -1348 2880 -369 -1036 3025 -522 -747 3098 -787 -603 3293
6758 3293 -1023 -500 3214 -1096 -519 3034 -1389 -435 2784 -1563 -258 2535 -2009 -108 2252 -2415
6774 -2415 -163 2073 -2667 -197 1921 -2926 -264 1610 -2981 -124 1302 -3115 168 1059 -3212
6789 -3212 506 880 -3314 783 1020 -3283 1000 1008 -3066 1169 1014 -2766 1508 855 -2460 1989 715
6806 715 -2257 2567 651 -2249 2871 681 -2173 2983 683 -1926 3012 560 -1691 3033 196
6821 196 -1445 3131 -284 -1283 3312 -709 -1407 3255 -1046 -1610 3118 -1219 -1624 2794 -1405 -1520
6837 -1520 2347 -1744 -1285 2123 -2417 -1090 2207 -2767 -1071 2176 -2985 -1126 2211 -2900 -1065
6852a065L048m751K056K479m518K609J804m515L279J241m548L713J190m940L967
6867A049J179m920L881J033m429L641N22l986L911k69l568M298j007l434M781
6882B682j320l718N048j385l678M812j387l351M573j681k711M403k321k030M393
6897B329k923j625M704l454j513M890l550j479M838l442j259M363l309p49L986
6912A807l608J04L598m014O35L719m517R50L746m574R84L696m469J113L298m141
6928a673J401K640m014J908K107m176K502J851m388K771J776m573K966J539m441
6943a804K871J298m095K845R40l820L069L22l594L469k46l423L701m95l511L933
6959A460o70l425L985q97l124L860j103k695L724j474k147L770j877j899L916
$$ plain form
6852 -1065 1983 -2768 -712 1767 -2751 -142 1662 -2853 426 1667 -2881 832 2022 -2918 1049
6867 1049 2228 -2692 1189 2222 -2207 1434 1956 -2030 1881 1612 -1956 2342 1335 -2099 2682
6882 2682 1362 -2356 2692 1307 -2371 2441 1054 -2297 2276 595 -2116 2287 -34 -2064 2329
6897 2329 -594 -2219 2485 -969 -2482 2408 -1142 -2621 2217 -1225 -2484 1879 -1430 -2179 1807
6912 1807 -1801 -1697 1901 -2113 -1478 2241 -2276 -1326 2420 -2154 -1170 2526 -1943 -830 2468 -1673
6928 -1673 -272 2368 -1646 262 2369 -1807 695 2546 -1842 929 2705 -1868 1098 2637 -1804
6943 -1804 1067 2365 -1730 1115 2055 -1765 1304 1626 -1968 1501 1255 -2168 1533 1038 -2473 1460
6959 1460 790 -2635 1350 453 -2671 1189 86 -2609 1115 -359 -2506 1264 -613 -2512 1404
6974A404k218j650M059k482j499M068k478j383M012k540j034L613k655n08L326
6989B035k847j45L225l145K88L105l420M93L075l500N92K907l442P21K571l255
7005g42R19K248l336J318J766l308J690J511l457J831J418l468K007J217l379
7020a765J995J087l259K128O83k922K148M16k664K410O1k671K730j91k574K854
7036D66l58k469K877m14k290K791n10k061K746q35j631K812j219j369K868j413
7052ij231K934j610j131K945j711j015K791j747p89K415j638n33K288j965r1K111
7069B014k115JK094k302Q0K111k312Q1J933k245K76J672k184N13J405k176P33
7086d21J245k280J007J039k172J106R92k252J190Q69k048J254Q09j937J318M82
$$ plain form
6974 1404 -814 -2464 1595 -887 -2386 1682 -796 -2179 1833 -707 -1741 1872 -783 -1291 2035
6989 2035 -812 -957 2268 -877 -589 2516 -904 -411 2664 -836 -244 2663 -779 -58 2513 -742
7005 -742 177 2425 -911 407 2173 -1135 555 2066 -1391 440 1858 -1610 397 1614 -1765
7020 -1765 230 1317 -1942 186 869 -2053 95 511 -2153 257 318 -2353 377 186 -2388 466
7036 466 108 -2361 516 102 -2188 603 93 -1968 778 -57 -1688 1124 -95 -1464 1404 -9
7052 -9 -1240 1694 84 -1047 1898 187 -828 1963 216 -573 1842 204 -329 1959 -6 -97 2014
7069 2014 -101 -100 1994 -308 -228 1883 -429 -348 1585 -660 -384 1288 -896 -383 1022 -1154 -421
7086 -421 824 -1456 -449 590 -1582 -476 516 -1736 -546 323 -1725 -471 338 -1599 -281 201
7102B01j770J463L23j614J564J69j633J683K9j511J706lj484J700j77j273J590
7119I63k41j180J612m15j014J517n89q34J520p11q18J546p86p76J487r12n43J313
7137A139r34n35J349j052l97J149j013k22J038r67j30R06j055%R16j075L8R90
7155A45j065P7R24j106K26P60q66K48N78p31K45N64p46M57M12p80N66M28q99O06
7175D3M77q29M82N15o73L52L49n88L98J26m16N53o3n34O21m1n54N37o6n03L73
7196E59N7n46L35K8l30J20l8j34R6k69j16L04k68k23K81j79l42L54p2l03J22J45
7218d19j95oR0kj34J36N2Rm1N6Q1L2rJ25J54j85J04L87k56q9M60l4k48L73K5j80
7244B86K51J3r4K27j84M5K48l29l3M60n31m3N76n59j68N82m48k50M88m19j92M07
$$ plain form
7102 201 -1569 -106 217 -1397 167 336 -1297 386 415 -1096 610 607 -877 823 646 -627 963
7119 963 722 -458 1154 739 -275 1242 653 -181 1339 628 -190 1356 570 -206 1281 369 -174 1139
7137 1139 205 -330 1019 -33 -430 719 -294 -516 522 -445 -575 331 -724 -724 192 -883 -845 145
7155 145 -920 -843 81 -1025 -799 -39 -905 -657 -79 -810 -565 -1 -747 -290 122 -658 -92 336 -563 43
7175 43 520 -309 173 688 15 367 716 128 526 652 236 789 726 192 813 772 218 755 689 186 559
7196 559 616 70 405 433 103 223 185 51 147 -122 -238 66 -202 -425 -144 -323 -665 -311 -383 -686 -564 -419
7218 -419 -614 -620 -530 -532 -666 -530 -478 -469 -510 -454 -373 -341 -350 -225 -71 -256 -152 235 -21 -110 350 316 68 441 466 286
7244 286 537 550 456 683 499 544 792 463 430 890 359 316 892 333 165 747 299 49 537 118 -74 333
7266C33m99N7L35o91J67M53r25K76O20r55J99O29q16Q9O37q08L28M17p77M31L99
7287a01q95O52L32r47Q08L23j014Q36L26r27P67L02r56Q36K27q89R38J13r25R95
7307H01Or49J178k03j002J200k10r87J189k73r75J195l59q72J230n67q81J327
7325H48o30q08J349q57o73J409r98n81J479j064n67J481j064m55J493j173l32
7342a143J437j213j61J384j319O8J401j441J38J483j601K49J489j662M28J349
7358H86j612N17J213j612O55J070j667R26Q91j754J096P74j847J145P60j901J165
7375G05P24j899J158O15j836J283L31j717J489M7j783J651m6j837J751m0j904
7392a308J710Qj831J784k35j552J757n19j392J994q55j157K193j125j189K229
$$ plain form
7266 333 -166 -109 226 -465 -298 155 -770 -494 126 -829 -630 -1 -817 -728 -91 -899 -571 -154 -931 -500 -101
7287 -101 -996 -344 -12 -959 -151 172 -842 -6 320 -607 160 462 -494 342 569 -320 618 731 -194 801
7307 801 807 -142 1036 833 -169 1031 821 -166 1023 750 -225 970 611 -261 969 402 -479 848
7325 848 218 -590 759 -98 -771 638 -360 -941 538 -526 -1093 388 -676 -1131 362 -811 -1143
7342 -1143 294 -919 -1080 304 -1015 -947 454 -987 -849 634 -967 -718 771 -891 -463 886
7358 886 -726 -209 1004 -608 47 1117 -550 376 1267 -487 609 1383 -464 681 1441 -460 705
7375 705 1429 -470 688 1303 -533 750 1081 -636 853 900 -883 768 722 -1115 636 596 -1308
7392 -1308 402 410 -1421 363 128 -1424 333 -186 -1578 416 -439 -1596 597 -528 -1717 512
7408E12j015j182K349j075j088K112r98p83J972j236m58K039j661k61K215j873
7424d31j34K216j922j91K170j836j13J947j858J79J692j925L95J595k299Q59J488
7441A832k482Q61J550k507P21J602k399Q54J179k183J003Q81k181J415N74k312
7457a592J730O01k578J888N88k511J723O23k247J608L39j937J890j04j816K211
7473D16m10j794K406n51j866K623n25j880K492m14j707K196n62j332K180r84r75
7490f87K359j493q66K694j719j001K750j684j035K601j620p98K235j657m31J894
7506A542j819m8J959k378K95K219k755K41K369k663J11K218k406J48J859k136
7522a244N35J376k319J209J097k593J572J159k835J618J471k904J328J539k610
$$ plain form
7408 512 -503 -1685 664 -411 -1499 613 -385 -1168 804 -432 -890 1149 -512 -773 1442 -431
7424 -431 -565 1651 -271 -462 1708 -128 -241 1706 -152 27 1719 -206 189 1784 -515 344 1832
7441 1832 -650 211 1761 -746 -25 1577 -822 32 1211 -972 31 912 -1269 146 720 -1592
7457 -1592 138 739 -1839 49 637 -1874 -151 472 -1775 -167 172 -1765 125 21 -1795 416
7473 416 6 -1788 618 67 -1799 824 299 -1581 911 497 -1210 986 424 -908 1272 288 -687
7490 -687 1672 179 -687 2007 288 -713 2037 353 -682 1919 299 -499 1736 79 -352 1542
7506 1542 -277 -325 1634 -744 -449 1770 -985 -744 1625 -1038 -927 1291 -1115 -967 892 -1244
7522 -1244 -709 667 -1652 -443 654 -1939 -367 792 -2043 -425 1046 -1858 -530 1009 -1601
7537a601J225J141k119J428N11j863J821J61k105K352J1k391K527J85k633K438
7553A088L02k411K061J32j872J944l84j495K211r87j410K579j272j612K912j355
7569D31j726K865j178j663K492j102j266K166j370p54K152j902k58K259k219k78
7585a351K546k270m39K654k267l98K362j812k28J961j874K81J644k123P80J622
7601A088k411Q98J813k635Q70J900k553P87J868k405Q55J449k214J140R53k133
7617g30J487O46k260J833N59k595J970P09k620J756O92k382J619M37k043J542
7633F20J20j796J870m47j746K242o78j845K435o87j932K426o00j817K315o02j603
7650a725K091p13j165K036j102q40K198j477o72K435j653p06K442j593o59K316
$$ plain form
7537 -1601 -376 765 -1354 74 585 -1278 543 704 -1401 951 962 -1429 1098 1283 -1350 1088
7553 1088 1390 -1021 1040 1172 -700 1244 860 -635 1576 589 -821 1758 486 -1126 1786 431
7569 431 -1295 1570 392 -1271 1221 119 -1147 1019 -351 -1105 1047 -855 -1113 1146 -1073 -1351
7585 -1351 1195 -1075 -1514 1140 -1127 -1525 837 -975 -1203 758 -1116 -835 809 -1314 -534 1088
7601 1088 -1323 -425 1388 -1247 -377 1523 -1030 -243 1625 -780 75 1524 -690 450 1403 -730
7617 -730 757 1403 -857 976 1535 -1060 910 1619 -1001 755 1447 -935 684 1121 -922 620
7633 620 740 -1056 814 367 -1379 863 185 -1660 775 88 -1844 582 -18 -1835 480 -122 -1725
7650 -1725 366 -347 -1512 524 -578 -1418 780 -697 -1369 1066 -587 -1293 1149 -444 -1103 1213
7666A213j535n26K045j381l63J891j567P9J692j926L55J730k085M47J811k258
7682c78L88J760k100L48J598j832L35J215j801P10Q75j891J018P61k027J174P80
7699I33k192J160Q88k164J202P28j947J111O16j690J181K92j602J553p4j485J669
7716A79j60j560J819j76j594J875j09j492J692k33j224J547l45r06J554o84p97
7733f14J829r90p57J877r67q16J788q89q32J698r23o28J435r18m03J271j067k04
7751a10J243j305j0J305j425m8J349j407p5J256j320oJ041j172J71Q66j246L63
7769e30P75j373N45P52j235M97P85j341O60O87j242O63N81j044N79N38j053P80
7787B4L25j002Q81K25r77R84J11r42R73N6r41J012K7r57J016j08q18J028k23p09
$$ plain form
7666 1213 -322 -848 1197 -184 -547 1344 -223 -144 1548 -378 -23 1707 -378 69 1880 -378
7682 -378 10 1770 -330 18 1616 -216 119 1334 -467 243 1118 -773 245 1006 -1021 153 933
7699 933 -1259 -99 789 -1375 -173 555 -1392 -281 335 -1355 -174 118 -1484 69 -5 -1490 179
7716 179 19 -1541 278 102 -1492 383 274 -1218 474 241 -983 564 219 -687 867 183 -614
7733 -614 1215 225 -532 1345 378 -438 1350 461 -371 1327 404 -224 1211 293 -110 1161 94 -110
7751 -110 1133 -172 -182 1123 -302 -350 999 -408 -483 773 -547 -553 488 -684 -513 353 -893 -530
7769 -530 245 -1128 -583 169 -1066 -569 216 -1125 -465 222 -1020 -357 224 -820 -241 297 -756 24
7787 24 349 -653 228 453 -524 460 571 -371 602 658 -283 729 756 -201 815 707 -111 917 694 -15
7807a5Q40k92n30Q56m73m40Q13n11m40Q70n96m47Q97n78m16P51n39k28N99m92
7827c71k05N20m54j06N42o56J59M63n86K2O00p08Q6O55n83J46M62m13P6L78l32
7848c05J72K79l99L53K48n68M87K27n73L73L39n03K35K60l17J29J24j64K13j46
7868D64j1K05k51j90L65k93k59L42rl73J93j8k45P0m8kp8j92J76ql74K13J31l19
7892e11J4K08k96K7J59l0j64L3J15J93k40L3L61k48n1L68j44j26K68R1j39J73
7914I4j1R8L6j18L04O4l63L32K95n37K87K39m54J51K19l14J31Q9k76L03k19l06
7936D4N28k48m47N87j99n60N75j68n41M79j14m32M54k63k08M69m26j74O35o00
7956f09j45P63o62j97P91m78k64Q87n72j13P06n96O6O39o89K36O84q57L58O47
$$ plain form
7807 -15 825 533 3 859 386 -54 759 248 -192 678 82 -365 532 -46 -462 289 -250 -478 121 -371
7827 -371 -576 -56 -510 -616 -74 -730 -571 -108 -694 -672 -72 -780 -694 -39 -622 -476 -14 -427 -351 27 -305
7848 -305 -133 146 -253 100 348 -220 267 494 -79 294 633 130 365 625 308 437 561 397 610 464
7868 464 453 658 407 217 582 289 30 372 363 -10 183 165 -80 -10 -58 -60 -138 -330 -154 -162 -536 -323 -192 -511
7892 -511 -497 -289 -585 -558 -399 -429 -593 -560 -445 -252 -492 -459 -98 -346 -397 -29 -173 -299 -31 60 -79 94
7914 94 83 181 217 99 403 467 104 436 731 194 481 720 266 417 636 322 453 542 266 569 350 44
7936 44 572 324 -123 464 265 -295 280 112 -429 50 -64 -496 -42 -305 -513 -44 -470 -644 -9 -609
7956 -609 -754 9 -653 -850 -59 -537 -801 86 -486 -599 107 -489 -423 216 -473 -237 447 -410 -52 595
7976E95q71K40P78p90K96O84q51K50N49r51N48M30r51N51M56j056O33L60j138
7995b38Q08K79j254Q99J33j132Q93J00j115R44L7j112R86j51j002J071k03j068
8013a125J268l46j043J353l74j001J463n34q67J387n54o88J325o63n81J448q37
8030c69n41J515r29l52J551j098l29J582j168k34J542j242j55J485j353O9J382
8047A356j438K15J332j690M12J303j762L97J320j802N04J158j796M99J098j753
8063f47O92Q29j750R27N48j745J209N98k031J307O26k044J379N36j956J408L15
8080B01j685J503K6j529J657k13j504J840j63j595K080l77j711K056k26j627K014
8097G47l85j289J936p30r91J980j077r08K272j295r30K336j315r90K286j349p85
$$ plain form
7976 595 -276 -36 742 -48 248 932 81 331 880 -71 477 907 -44 507 963 -93 540 900 -238
7995 -238 570 849 -405 494 627 -505 388 488 -627 317 354 -758 228 77 -925 146 -57 -1125
8013 -1125 143 -203 -1246 107 -267 -1268 195 -339 -1206 181 -373 -1061 264 -399 -980 468 -369
8030 -369 -910 605 -324 -676 875 -223 -552 1030 -138 -372 1170 -72 -227 1258 -95 -26 1356
8047 1356 -82 133 1465 -225 187 1490 -272 125 1445 -357 147 1305 -491 8 1106 -647
8063 -647 45 874 -876 51 599 -1146 63 661 -1370 -63 563 -1481 -102 434 -1522 -114 201
8080 201 -1484 19 45 -1484 173 -40 -1544 296 133 -1462 618 241 -1470 586 360 -1267 747
8097 747 362 -927 1009 279 -712 1268 191 -717 1555 260 -670 1666 351 -639 1647 298 -487
8114d87K066j400n17J844j633j79J798j936R4J892k163J11J991k312Q0K046k199
8131i04J64J706k012M04J411k113Q45J237k341J205J163k580J410J318k663J284
8147d66J286k418J303J012k065J412O20k127J830K56k113K182Q0k216K288J95
8163A059k390K269K27k234K140Lj962K092m19j490K195q87j536K653j197j626
8179a103K824j177j709K618j036j519K336j134j100K283j575p29
8191a021
$$ plain form
8114 -487 1579 179 -338 1506 -127 -306 1492 -444 -350 1542 -621 -510 1481 -831 -751 1295 -904
8131 -904 -740 966 -1046 -642 769 -1344 -499 738 -1603 -398 765 -1815 -405 913 -1750 -466
8147 -466 820 -1598 -295 717 -1348 64 684 -1443 387 643 -1470 712 792 -1424 864 1059
8163 1059 -1331 938 1165 -1069 1071 1074 -888 1204 785 -705 1490 603 -933 1720 523 -1103
8179 -1103 1721 544 -1165 1453 417 -1102 1234 100 -1000 1283 -292 -1021
8191 -1021
$$ Imaginary data points
##PAGE= N=2
##DATA TABLE= (X++(I..I)), XYDATA
0@%%%Qk4L2l2L5m7P0r7J22j45J70k05K51l05L67m33N00n79O80p96R21j054J197
26F36j360J548j759J990k238K507k804L135l501L904m343M816n335N912o551P255
42C812q030Q885r838J0913j2133J3521j5112J6962j9145K1768k4994K9065l4368
55a8694M1579n1988O8334r7591J64464n43497l0614J307259j398950K07167J066298
66G13767j176823K33728Q81350j154987M93310O15095j183612P11990N38449j347166
76f74899Q77556N35156j416156Q61032N80600j379873P91532N03201j200417P46742
86B24474L07888j029176Q41998N1615r51623J012949j20596r96390J161839j69123
96C33855j061150J188169j32963j048143J103885j26190r09739R93423k22254
$$ plain form
0 0 0 0 0 8 -16 16 -16 19 -28 42 -55 67 -78 92 -113 138 -167 200 -233 267 -312 368 -428 493 -561 636
26 636 -724 824 -935 1055 -1183 1324 -1480 1655 -1846 2058 -2285 2531 -2804 3108 -3443 3812
42 3812 -4218 4667 -5171 5742 -6391 7130 -7982 8980 -10165 11603 -13391 15674 -18694
55 -18694 22885 -29103 39231 -58360 106104 -437393 -468007 839252 -559698 -352531 713767
66 713767 -463056 -229328 652022 -502965 -9655 605440 -578172 133818 672267 -674899
76 -674899 202657 737813 -678343 182689 763289 -616584 174948 678149 -522268 224474
86 224474 532362 -496814 345184 396799 -554824 458125 337529 -658861 502978 333855
96 333855 -727295 460874 327911 -720232 383653 257463 -652276 341147 118893
105A18893p05660R60356m10303n40202J032927n95563m83231J146954o85716n07401
115f68946J198737o66265n16594J137828o13699m33089J007154o18403k63138
124d36415Q94129p12652p8410Q61215q52483L9393Q99038r53374O5583R35041
134F61065r62305M9839Q97928q98993P0763P74529q37141J70698O22615q39254
144b90256L17809N14616r02072M42642M76477r69909M97840M74873r84003M91946
154F9963M50513r28065M75876L66262q36078N02567K34126p65679N82930J07948
164B60363p47014O76786L0584p60756P35090M319p58536P36329j1123p07466P08210
175A66786n4809o17306O88115j35778n19498P01098k35233m49706P41177l15876
$$ plain form
105 118893 -586767 373589 -36714 -576916 456011 -139552 -622783 524171 -161545 -668946
115 -668946 529791 -136474 -653068 484760 -128939 -562028 445126 -173277 -436415
124 -436415 457714 -254938 -333348 527867 -324616 -285223 613815 -339559 -273976 661065
134 661065 -301240 -251401 646527 -252466 -181703 592826 -244315 -73617 548998 -290256
144 -290256 27553 542169 -359903 82739 559216 -410693 87147 562020 -421983 69963
154 69963 520476 -407589 68287 434549 -401529 101038 335164 -430515 152415 260363
164 260363 -486651 190135 220719 -540037 195053 199372 -559164 177165 166042 -541424 166786
175 166786 111977 -505329 182786 47008 -472490 228608 -6625 -456331 284846 -31030
185c1030m16016P75501l57243l96327P74477l68139l57112P34182l81659k84494
195c07860O82014m19900j95622O43878m78062j16237O27920n34675o2747O20399
205D59108n68709l0184O00307n74979j043N54391n65456M3769M88439n61783J06672
216d9468M24639n73060J69770L77054n87837K18118L42508n92930K48061L10052
226B86907n79580K67698K68211n51976K89345K16406n19784L17395J60408m91448
236c36418L51643J10072m72302L81022P3589m53300L96864M3475m26982M03161
246G0824J3337l92602M04164k2111l53483M07304o1265l17511M11762r8142k85526
257b23249M14732j30139k57803M12925j54891k30558M03318j76043j99928L88142
$$ plain form
185 -31030 -447046 328455 -28788 -425115 349362 -18777 -375889 358293 -23366 -307860
195 -307860 374154 -45746 -241368 402510 -75552 -191789 436131 -98544 -161291 459108
205 459108 -109601 -139785 460522 -114457 -115500 438891 -126565 -82796 405643 -156140 -49468
216 -49468 375171 -197889 -28119 348935 -238902 -20784 321724 -271206 -23145 286907
226 286907 -292673 -24975 243236 -308740 -19395 197011 -322773 -5378 155030 -336418
236 -336418 15225 125297 -347005 34017 107606 -345694 51170 94645 -332337 70824
246 70824 84161 -308441 95723 73612 -279871 127433 66168 -251343 160419 62277 -223249
257 -223249 191483 61344 -196459 216466 61575 -168983 234335 58292 -141636 246506
267B46506j97718j66535L71797k20606j33921L56027k41356j03581L39957k58521
277g951p5818L21965k70208m9250L01049k78152k3446K78782k82122J757K54377
288A70983k83093K7927K30307k83168N2368K08232k80245P3690J86395k73832
298a70436R2367J64440k63816J09029J41940k52001J24239J20411k39208J36475
308c6560R9845k25071J46238P9433k10805J54393O0284j96777J59388M2686j81989
319a08935J61717K5457j66383J61818Q808j51831J60299o097j37988J56219j9498
330H3586j24003J50768l1971j10466J44847m3287r8074J38102n2335q6329J29561
341A00399n9187p3920J19794o5097o1715J11253o8884n1204J02212o9847m0754
$$ plain form
267 246506 48788 -117747 254050 33444 -100477 255550 14194 -89387 250570 -7951
277 -7951 -83769 238196 -32012 -81262 219787 -58365 -81811 196971 -85151 -83394 170983
288 170983 -112110 -84183 146124 -137044 -84676 123556 -156689 -82999 103396 -170436
298 -170436 -78069 86371 -177445 -68416 73524 -178477 -54238 66173 -173035 -36560
308 -36560 63285 -161786 -15548 63885 -146920 7473 67757 -129020 30368 73054 -108935
319 -108935 52782 78239 -88144 73674 82482 -69349 90950 84853 -53135 103084 83586
330 83586 -40417 110351 78380 -32086 112761 69474 -28600 109502 57167 -29162 100399
341 100399 41212 -32708 87086 21989 -39726 71527 2643 -48561 53651 -16196 -56950
352e6950R2890o9627l0891Q4140o7764k1789P6005o4644j3876O8232n9219p005
364g0498N9685n3158o61N2364m7062L250M5648l9594N779L9199l2203O924L3239
377B912k4835O983K7954j8355N043K3483j1523J593J8574n072k269J4926%p646
391C1768J2891M549j4486J1827Q959k2096J0817J2775k8926J0863J4838l6020
403A7759J3326J6749m3895J6549J8980n1006K0315J9824n7188K6367J9789o3702
415d6133L4066J9437o9364M2130J8780p3606N0548J6523p6612O0134J2895p9434
427i0636P0543Q780q1759Q0398L747q2133R0461l611q2078J00977j1525q1753
439g8589J09718k0124p9582J17101l0335p5919J24220m2083p1835J30861n4051
$$ plain form
352 -56950 35940 -33687 -64578 19562 -48202 -69991 6014 -58630 -72506 -4274 -63493 -70498
364 -70498 -10813 -63971 -64632 -12268 -59330 -56080 -10432 -50026 -44247 -5048 -37251 -30327 2912
377 2912 -21923 -14940 13014 -5341 -298 23185 11662 13255 31829 26757 24488 39414 39414 31768
391 31768 44659 49208 34722 46549 55508 33412 44229 57004 28078 38941 53779 17759
403 17759 31085 47834 3939 20488 39468 -11538 8777 28601 -28587 -2220 17569 -46133
415 -46133 -12067 7370 -61994 -19864 -1084 -74690 -24142 -7619 -84231 -24097 -11202 -90636
427 -90636 -20093 -11313 -93072 -12674 -8927 -91060 -599 -4210 -86288 14689 3164 -78589
439 -78589 31129 11005 -68577 48524 18189 -57730 66490 24407 -47428 83433 29382
450B9382o7750J35838o5653o2293J38614p8733n4595J41272r2301m7356J42851
461A19276j04395l8645J42053j16576k8042J40710j28751j6714J38957j40381
471c2508m935J36698j50123P699J32324j58757K2549J27065j67518L7791J21514
482G1799j74490N3188J14229j80141O9536J05990j85003Q6051R7155j88807J01875
493b8618Q7494j90716J17070P5161j91007J33337O1208j91554J49226M7175j90730
504a21954J63216L2085j87880J75634J5585j83558J87106k086j78255J97302k0080
515G7115j71231K05522l9316j62227K13713n9661j53177K20937p8281j43650K25230
526A34974r5621j31457K26679j12917j16212K26842j30870r9521K27093j48527
$$ plain form
450 29382 -38368 97470 31817 -30476 108138 29405 -25190 116082 23781 -23575 119276
461 119276 14881 -23764 118289 1713 -26329 114381 -14370 -31084 107873 -32508
471 -32508 -37443 99255 -50868 -43169 89155 -69602 -47053 80012 -87506 -49715 71799
482 71799 -102691 -49503 64726 -115415 -45879 60111 -124892 -38841 58314 -130493 -28618
493 -28618 58876 -131840 -14770 60391 -130616 2721 63929 -127625 21601 68776 -121954
504 -121954 41262 73347 -114533 61101 76686 -106872 80234 78148 -100107 97195 77115
515 77115 -94116 111406 72090 -90137 123576 63915 -89262 131675 53394 -90256 134974
526 134974 39353 -92104 134575 21658 -94554 132288 1418 -98103 128990 -19537
536a9537q2256K26462j65217o4379K25391j80486m7089K22987j92530k9508K16917
547A10755k01659r250K07020k11131J4548J96185k22635L8704J87105k34011O0322
558f4047J78420k42498P9468J67968k47372R7277J53830k48354J15290J34714
568A24696k47125J36045J11518k47075J59735Q9163k50684J81941P1193k54019
578a24612J97486N5690k51588K06668L7090k41239K14268J2387k26437K24828
588A04541j7041k11655K39150m6658k01258K55527p0632j95346K66667q5565j87272
599a49542K67221r6763j69632K60146j12977j41849K53955j37961j11894K55637
609A16341j66483q8792K63276j89522p4352K69322k01309o4428K65550k02833
$$ plain form
536 -19537 -101793 124669 -40548 -104927 120464 -60022 -107111 115876 -76654 -106162 110755
547 110755 -90904 -100154 106866 -104265 -89717 106468 -116167 -77463 109642 -124369 -64047
558 -64047 114373 -128125 -48657 119311 -128061 -30784 123046 -125308 -10018 124696
568 124696 -122429 13616 125134 -121941 37794 126957 -123727 58214 129407 -124612
578 -124612 72874 128564 -123024 83644 120734 -120505 93763 106150 -120287 104541
588 104541 87500 -124155 114995 68337 -132921 122606 51974 -143372 123295 37730 -149542
599 -149542 117679 20916 -148716 111430 -1547 -143396 110559 -27402 -139296 116341
609 116341 -50142 -138934 124342 -65180 -139532 129790 -71519 -135947 129603 -73230
619g3230m9021K48372k04114k1058K25254k15082J5709K08418k37637M9231K04327
630A51169k60840O8465K05894k71875P5655K00096k67348Q1629J78369k54647
640i3433R9045J43482k47778J31064J08633k55534J68388Q7231k73846J94281
650F1533Q2176k85992K00044P9336k77865J94146O2569k51625J94273K6278k22571
661a37698K12144j8342k07597K43670n2932k10350K71994o6571k18510K80300
671I6108o4086k12704K65824o5247j82321K44765q7142j37829K38318j27779j01047
682a33140K53014j68183q6639K76131j88395r0094K86024j84737r1177K70306
692A43110j72198p1778K36150j72443k9676K05091j96491J7651J95604k33806
$$ plain form
619 -73230 -122251 126121 -77993 -99051 126203 -88879 -73170 135248 -102389 -53158 151169
630 151169 -109671 -41206 164688 -107187 -31532 168564 -98784 -17155 161214 -93433
640 -93433 5612 149094 -98684 32380 141013 -114521 53867 141098 -132748 61533
650 61533 143709 -142283 57761 137097 -140768 53378 115947 -135678 58595 84873 -137698
661 -137698 74446 56104 -151493 92177 39245 -171105 100889 34318 -184192 96108
671 96108 32022 -180682 85142 19895 -162426 82339 -4803 -142632 95686 -32093 -133140
682 -133140 119874 -48309 -134948 141183 -47212 -137306 148718 -36019 -127196 143110
692 143110 -29088 -100866 135284 -37159 -66835 138256 -58235 -40584 155020 -78786
702g8786M6993K06728k61068N0855K17891k62456M2770K08143k42700M5937J72986
713A47293k23071P4016J28131k23077J18933R6862k44862J58668R0257k70878
723a47728J74367R8988k77983J66202R9564k56945J54381P4690k21324J60951
733B5163K9244j95037J91266j5493j92596K29441l8537k06597K52015l7466k15569
744a74166K47706k8978k00816K25116l5867j62717K07625o7163j20578K11664
754A01826j10957r6014K34579j43710r5468K55113j51300j03894K54366j40953
764C588r9865K29933j32379p2861J97635j42904l1159J78305j72259M601J80194
775A42829k03805J9556J93127k18582J6297J96812k10541J2305J79010j92518
$$ plain form
702 -78786 -31793 174935 -86133 -35278 182613 -79843 -37073 171070 -71630 -25693 147293
713 147293 -75778 -1762 126369 -96708 22225 119087 -125775 32893 123150 -147728
723 -147728 26639 125627 -152356 13846 113410 -143535 10846 85536 -135788 25163
733 25163 54407 -140630 50636 35143 -157453 71988 33451 -173146 78869 41403 -174166
744 -174166 73540 44562 -156254 68862 32995 -129722 77903 10740 -109838 101826
754 101826 -9131 -105145 129434 -14276 -109744 145369 -5931 -109825 144541 3588
764 3588 -96277 133656 1277 -71584 126051 -16853 -48012 130293 -41966 -37365 142829
775 142829 -60976 -41420 151707 -66875 -50578 146234 -64307 -52002 127008 -65510
785f5510K5036J45341j83298N6385J13440j92087R2857R7995k12249J17215R9235
796I4360k26506J22297J03166k22153J16288R4362k00986J15235O7543j77474
806a13868J30011L2883j66377J56344O238j70149J79718l986j77759J87633l582
817E7106j75326J80168o086j57521J68124k1319j30510J64043m8300j07766J72407
828I5020p5120r7492J85136r0930r6868J90897r3686r5524J83260r1423q3422
839g0152J66903r5328o1200J52374j08542l7057J46383j26519j9551J48082j40124
850d4731j1747J49790j43737q312J44098j39436j179J29848j34495J3862J12449
861F6410j35602L3912R9171j42477N1340R2771j49252O2016Q8901j50766O7281
$$ plain form
785 -65510 -40474 104867 -78431 -22046 91394 -100693 -7836 90159 -122090 -4875 94360
796 94360 -132146 -9849 93317 -128836 -12548 81814 -119172 -3937 63606 -113868
806 -113868 16143 49026 -117351 38993 45231 -124918 54800 50814 -126945 60688 57106
817 57106 -118220 61948 55862 -101659 66465 45146 -85364 78679 30379 -77387 95020
828 95020 19900 -77592 107544 16614 -80254 110643 16957 -78567 104693 13270 -70152
839 -70152 96751 1423 -59777 92597 -15945 -53002 93381 -33138 -52689 95393 -44731
850 -44731 -56478 93312 -50425 -58737 85361 -54075 -55254 74594 -59901 -46039 66410
861 66410 -69192 -35280 63891 -78586 -27246 65525 -83727 -21711 67190 -83576 -16295
872a6295Q2910j45651P0911P1142j36778P7729N4929j29768Q8653L8684j26694
883g0228J00418K6385j26339J08375J8585j24165J10801J1339j17383J10058J851
894D9697j07300J09551j0272r6458J10757k3289q7299J13907l4660q0617J15771
905E9788m2367p4668J14823m7656o7156J10741n2361n6991J05774n8490m5846
916e4409J01892o4966l5541R8815p0482k6706R5878p4496j9041R2314p6663j1683
928d5088Q7382p7724l809Q1020p8325M677P4316p9705J3099O8259q1093K0303
940a6688O2652q1459K5971N6721q0600L1160N0145p9300L6024M3195p7530M0397
952A0688L5767p5240M4583K8575p2939M8143K1853p0413N0851J5803o7171N2388
$$ plain form
872 -16295 66615 -79036 -8125 63017 -73761 3968 58897 -70871 17782 56466 -70228
883 -70228 30190 56575 -69764 38611 57196 -66969 43832 55171 -62212 47846 49697
894 49697 -57603 51948 41676 -54782 55975 32686 -54613 59294 24634 -55983 59788
905 59788 17421 -57247 57576 9920 -57236 53505 1144 -55847 49927 -8563 -54409
916 -54409 47483 -17483 -53024 45791 -24691 -51397 44481 -30015 -49056 43258 -33405 -45088
928 -45088 42294 -35430 -39239 41781 -36544 -31867 42449 -37256 -24157 44102 -36991 -16688
940 -16688 45964 -35495 -9524 47197 -33403 -2243 47902 -31398 4626 47821 -29709 10688
952 10688 46455 -28785 15798 44373 -28566 19577 41430 -28983 21868 37671 -29500 22888
964B2888R548o3087N3514L620n8990N4505j747n4659N5008o690m9942N4871j1224
977G615m4898N4541j5405l9977N3768j8414l5206N2306k0966l0033N0752k3509
989i426k5047M9051k5536k0446M6971k6852j6163M4359k8029j1714M1787k9005
1001a0050p865L9132k9638m564L6170k9608j635L2803k9687J356K9646k9746L539
1014a47K6695k9182N536K3237k8473P370J9977k7832Q768J6995k6797R645J4098
1027A9890k5106J0272J1235k3518J0969Q853k2072J1310O856k0165J1101N097
1039D722j8003J1028L302j5834J1031K182j3793J0271J533j1515R438Q92r470
1052a4216Q684N34p735P900N36o215O735R09m611N323R97l189M144J282k459K820
$$ plain form
964 22888 32436 -30651 22863 26483 -32507 21998 20251 -34408 20600 13910 -36032 18839 7615
977 7615 -37283 17258 1853 -38124 15644 -2770 -37976 14330 -6636 -36669 14083 -9426
989 -9426 -34473 14578 -10958 -31404 15567 -11285 -27448 16911 -11118 -22832 18955 -10050
1001 -10050 -17915 21217 -8421 -12985 23185 -6423 -8058 24745 -4942 -3586 26060 -3686 -147
1014 -147 26548 -2634 2902 26139 -2334 5036 25013 -2819 5949 22944 -3853 5792 19890
1027 19890 -5216 5056 16291 -7227 3742 12595 -9477 1833 8689 -11476 -375 4722
1039 4722 -13281 -2253 1049 -14785 -3754 -1572 -15365 -5094 -3561 -15076 -5638 -4746 -14216
1052 -14216 -5532 -4998 -12733 -4833 -4297 -10512 -3777 -2868 -7479 -2156 -1159 -4348 -204 1078 -1381 1439
1068A439J994j686J115K663j213j21L401j312j410M371j544k893N342j755m418
1083C973O399k178n414P273k979o057Q557m280o831J0126n408p323J1240o629
1097D69p376J2722q048p223J4231r532o883J5610j0933o257J6692j2507n031J7943
1111C877j4521l718J9211j6391k218K0060j8051n38K0512j9918J421K0726k1709
1124a1257L261K0863k3352N317K0351k5021P753J9708k7005J0251J8817k8818
1136i132J2355J7746l0041J4527J6043l1167J7143J4155l2444J9581J2143l3130
1148a2221K1854R749l3670K4314P294l4251K7104M684l4412K9449K291l3991L1587
1161I781q34l3013L3957l954l2114L6304p022l0768L8539j0131k9189M0483j3394
$$ plain form
1068 1439 3433 1747 2862 5525 4312 4191 7592 6280 4870 9241 7697 4804 10146 8391 3973
1083 3973 10372 8194 2780 10053 7074 1017 9574 5294 -1537 8589 3181 -4142 7098 469
1097 469 -6907 5815 -2233 -9456 4775 -4757 -11640 3970 -6963 -13220 3472 -9035 -14066 3877
1111 3877 -10644 -14362 4849 -11542 -13760 6300 -11751 -12289 8223 -11695 -10274 10452 -11257
1124 -11257 -7996 12867 -10485 -5168 15183 -9838 -2085 17623 -9382 869 19686 -9132
1136 -9132 3223 20969 -9072 5455 21498 -9669 7474 21629 -10815 8766 20909 -12221
1148 -12221 9633 19382 -14288 10026 17320 -16931 10173 14857 -19555 9894 12185 -21806 9781
1161 9781 8947 -24066 9891 5937 -26177 10127 3105 -27663 10876 745 -28444 12039 -1355
1174a355k7170M2356j6698k5141M3776j9923k2499M4722k3394j9387M5656k6952
1186f009j6403M6267l0238j3415M6372l3245j0207M5952l6519o703M5402l9491
1198h237l094M4178m2189O06M2651m4876M535M0747m7258Q143L8866m9389J1665
1211c652L6613n0803J5289L3768n2040J9410L0671n3355K3533K7535n4166K7347
1223A50K4374n4664L1032K1296n4724L4456J7826n3976L7745J3853n2940M1243
1235E671R473n1714M5086M926n0713M8725R66m9544N1561k965m7462N3622p151
1248A0481m4829N5366j1996m1348N7027j7199l7918N8938k2519l4798O0798k7229
1260D774l2116O1969l1225k9069O1699l4663k4921O0265l8442j9608N8779m3115
$$ plain form
1174 -1355 -28525 13831 -2867 -28008 15768 -4155 -26654 18068 -5326 -24713 20943 -6009
1186 -6009 -22412 23855 -6383 -19798 26574 -6671 -16878 29074 -7445 -14148 31254 -8237
1198 -8237 -11331 32847 -9342 -8736 33915 -10961 -6426 34321 -12937 -4794 34072 -15317 -3652
1211 -3652 32961 -17842 -2553 31215 -20825 -1415 29256 -24099 -566 26969 -27197 150
1223 150 24524 -30140 892 22188 -32536 1920 19746 -34230 3515 17368 -35572 5671
1235 5671 15144 -36570 8516 13442 -37271 11454 12420 -37124 14437 11472 -35990 17632 10481
1248 10481 -34348 21018 9022 -32326 24701 7502 -30416 28522 6003 -28795 32003 4774
1260 4774 -27342 34627 3402 -25667 36032 1369 -23552 36713 -1729 -21337 37442 -5673
1272e673j4081N7977m7872r389N7668n1959n584N6761n4106k392N4781n5270J820
1285a7319N1064n6129P443M6597n7892J3986M2954o0900J9719M0971o3372K3714
1297i164L9325o4115K6409L6596o2843K9078L1809o0780L3335K5521n9548L9071
1309D694J9484n9812M5123J5105o1084M9280J2611o1291N0849J0026n8884N1275
1321A7376N250n4339N2492j743m9841N6050r655m7130O0768j5852m6499O4518
1333C1395j9431m5953O5291k1351m3013O3113k3783l7120O0711k9232k9549O0200
1345C1278l6609k3366O2392m3463k0125O5019m7109j8870O5385m7436j6659O1886
1357C2323m6820j1240N6268m8268l217N1638n2871N149N0018n8840J0657N1029
$$ plain form
1272 -5673 -19754 38223 -9649 -19038 38630 -13329 -18913 37848 -16258 -18650 36131 -19139 -17319
1285 -17319 33745 -22384 -14941 31656 -26236 -12250 30704 -30196 -10477 30494 -32878 -9164
1297 -9164 30161 -33954 -7545 29051 -33792 -4714 27095 -33685 -350 25171 -34377 4694
1309 4694 24178 -35634 9489 24594 -36490 12790 25401 -35890 14959 24985 -33899 17376
1321 17376 22626 -31713 20779 19036 -30805 25245 15590 -31540 29228 13376 -33123 31395
1333 31395 11964 -33989 31302 9951 -33062 30051 6268 -30852 29859 627 -28922 31278
1345 31278 -5331 -28697 33695 -9768 -29893 35126 -11983 -30853 34532 -12904 -29563 32323
1357 32323 -14497 -25737 30531 -17737 -20954 30684 -22187 -17038 32980 -25860 -15203 35826
1369C5826o2622J2383N1301o2274J2994M7786n9179J5774M0685n6865K2250L2980
1381C1039n7965L0701K7705o1685L7320K6015o5228L9944K5784o5339L9575K3429
1393C1295o1288L9468J6716n5594M2716P649n2274M9347m46n2545N5968m708n4376
1406c8072N9432n760n4263N8621o688m9964N5990j0696m2399N4841j8414l5008
1418c2380N7342k7046l1159O2166l2864l0632O5286l4279l0413O4042l3478k7032
1430c0447N9451l4298j9903N4716l8728j1436N2733m5362m908N3864n1069k251
1442a7638N5653n3071j978N4596n1633m64M9562m9693M469M2769n0251J1983L7595
1455C1899n3858J9240L5358n8061K3322L5216o0090K4518L4083n8619K4902L0084
$$ plain form
1369 35826 -26796 -14413 36888 -25386 -12392 35394 -23785 -8011 32674 -24191 -1941 31039
1381 31039 -26926 3775 31480 -30205 7115 33130 -32098 7846 33630 -31709 7866 31295
1393 31295 -29993 9475 26191 -29403 13313 20962 -31312 18035 17589 -34956 21012 16304 -38072
1406 -38072 21360 15600 -38663 19958 13270 -36694 19296 8600 -33799 21042 2628 -32380
1418 -32380 24962 -2084 -33243 28923 -3941 -34573 30713 -3566 -33979 30063 -3415 -30447
1430 -30447 29004 -5294 -25197 29519 -9209 -20645 32088 -13274 -18182 35682 -15387 -17638
1442 -17638 38015 -15056 -17034 37562 -14071 -14535 35027 -14666 -10197 32572 -17679 -5696 31899
1455 31899 -21959 -2719 32639 -25422 -2100 33116 -26974 -2456 31627 -26992 -2090 27994
1467B7994n5004K7453K3241n2121L2736J6246n2074L9243J1668n3675M3689R511
1479A8907n4286M5189Q027n2410M5080M945m7998M5124n38m2980M7022p246l9329
1492c0493N0515j2974l7815N3711j6255l7037N4638j7723l5033N3250j9522l0665
1504b5403N0910k2904k5137M9543k7518k0166M9631l2097j6691N0281l5272j4618
1516a9441N0138l6732j2589M8171l7054r241M4716l7953m494M1439m0117N46L9351
1529B6740m2853M635L8041m4830P469L6565m5328R718L4312m5048J2460L0876
1541B2757m4260J5872K6815m4022J9974K3154m4455K3780K0254m4755K6454J7903
1553A9471m4286K8325J5128m2818L0034J1497m0876L1863P642l9001L3925L576
$$ plain form
1467 27994 -27010 443 23684 -28437 4299 20545 -31529 7714 19382 -34293 9396 18907
1479 18907 -35379 9810 17837 -34573 10507 15452 -32546 12578 12040 -30940 16082 8836 -30493
1492 -30493 20022 7048 -30767 22944 6689 -30348 24290 6567 -28466 24784 5262 -25403
1504 -25403 25507 2603 -22534 27009 -509 -20675 28956 -3141 -19832 30449 -4823 -19441
1516 -19441 30697 -6035 -18624 29547 -7507 -16748 27968 -9985 -14479 26960 -13157 -12611 26740
1529 26740 -16113 -11478 26563 -18267 -10798 25767 -19561 -9843 24469 -20579 -8119 22757
1541 22757 -21503 -5631 21184 -22838 -2864 20290 -24165 -385 19869 -24886 1568 19471
1553 19471 -24815 3510 18638 -24180 5854 17351 -23525 8338 15980 -23021 10904 14480
1565A4480l7231L5936J34l5862L7456k753l4209L8030n261l1916L7951q040k9139
1578b0424L8035j1211k6290L8171j4095k3651L8228j6610k1200L7993j8814j8758
1590a8626L7374k0552j6159L6317k1969j3474L4991k3415j0454L3788k5052p614
1602a4845L2676k6426n088L1380k7308k684K9798k8046k8K8002k8583K442K6007
1615A7297k8865M793K3984k9196P037K2028k9408R176J9998k9347J1049J7986
1627A6532k9089J2870J5460k8479J4632J3043k7904J6118J0829k7143J7310Q604
1639A2783k6004J8320O425k5076J9343M332k3840J9945K358k2440K0398M25k0851
1652a3882K0740j412j9346K1000l052j7732K0949m521j6043K0610n788j4352K0395
$$ plain form
1565 14480 -22751 13185 13319 -22543 14913 12160 -22049 15981 10720 -21196 16755 8715 -20424
1578 -20424 17611 6400 -19890 18281 4186 -19465 18763 2153 -19047 18946 132 -18626
1590 -18626 18748 -1804 -17963 18354 -3615 -17089 17902 -5513 -15967 17821 -7231 -14845
1602 -14845 17831 -8595 -13683 17697 -9611 -12295 17503 -10543 -10571 17431 -11152 -8710 17297
1615 17297 -11568 -6775 17209 -11987 -4950 17078 -12330 -3154 16844 -12503 -1454 16532
1627 16532 -12557 313 15773 -12706 1926 14969 -12935 3183 14012 -13131 4179 12783
1639 12783 -13221 5099 11524 -13552 5791 10123 -13717 6228 8586 -13854 6544 6969 -13882
1652 -13882 6858 5446 -13900 7100 4048 -13684 7265 2744 -13299 7311 1523 -12829 7566
1665G566p037j2715J9991q045j1044J9364q910r368J8589r767p826J7947j0387
1678a642o450J7010j0774n051J6060j1215l622J5090j1588k484J4104j1821j287
1691c670J2957j1896j79J1725j1850Q88J0586j1772J736R474j1419K443Q254j1047
1705c770L052P157j0629L609O152j0046L987N183r420M359M229q693M530L395
1719C095q069M658K609p245M613K012o230M294J513n522M229J074m794L748Q67
1734H52m043L375N48l236K880M45k626K404L78k119J791M88j548J063O93j210
1750A35M73Q96r35j56J216o95p41J693p32j281K001n56k054K680p72k496L392
1767B068r45k981L903j137l391M684j643l589N274k171l725O142k788l829O862
$$ plain form
1665 7566 529 -12186 7805 -240 -11284 8080 -830 -10198 8391 -1376 -9202 8745 -1642
1678 -1642 -8092 8918 -1856 -6907 9153 -2062 -5684 9406 -2182 -4666 9438 -2383 -3670
1691 -3670 9287 -2609 -2788 8937 -2913 -2025 8561 -3211 -1475 7999 -3420 -977 7277 -3770
1705 -3770 -718 6439 -4190 -581 5571 -4475 -488 4695 -4725 -366 3863 -4830 -300 3095
1719 3095 -4974 -316 2293 -4952 -339 1673 -4557 -263 1250 -4272 -43 1031 -3763 -15 852
1734 852 -3191 184 732 -2504 376 821 -1805 599 977 -1142 649 1137 -411 652 1345 135
1750 135 608 1504 569 413 1629 934 193 1886 1154 -127 1874 1318 -736 1944 1172 -1324 2068
1767 2068 1123 -1858 2045 908 -2483 2201 558 -3031 2243 72 -3653 2489 -299 -4128 2734
1782B734l401l812P649m198l662Q247m967l443Q916n849k983R396o750k529R918
1797E266p779j793J0410q882j212J0707r828m08J0777j0927O02J0862j1891J558
1811b538J0906j3050K790J0648j3945L843J0254j4744N062R861j5778O464R292
1824I065j6507P796Q596j7128R094P751j7687J0615O657j8169J2133N530j8473
1837a0727J3645M324j8668J5156K996j8798J6610J536j8625J8022j23j8258J9318
1850F408j901j7749K0827l837j7088K2050n700j6313K3186p707j5387K4266r863
1863A192j4145K5018j1824j2767K5645j3900j1153K6007j6037r417K6395j8040
1875c026p731K6489k0027n806K6400k1825l724K5964k3497j626K5409k5168O07
$$ plain form
1782 2734 -667 -4479 3170 -1028 -4690 3557 -1410 -4853 4063 -1786 -4769 4627 -2123 -4652 5266
1797 5266 -2513 -4306 6104 -2778 -3990 6717 -3111 -3519 7258 -3669 -3067 7795 -4096 -2538
1811 -2538 8368 -4682 -1892 8756 -5189 -1346 8908 -5836 -774 9087 -6691 -227 9065
1824 9065 -7442 354 8950 -8178 916 8667 -9020 1595 8252 -9917 2216 7746 -10727
1837 -10727 2918 7242 -11426 3730 6726 -12072 4538 6074 -12551 5471 5348 -12910 6408
1850 6408 4507 -13242 7585 3748 -13340 8710 3010 -13303 9883 2176 -13211 11055 1192
1863 1192 -12953 12065 241 -12526 13119 -781 -11934 14073 -1964 -11381 15014 -3026
1875 -3026 -10757 15732 -4295 -10101 16299 -5526 -9250 16714 -6783 -8409 17000 -8168 -7561
1888g561K4793k6774K884K3880k8131N346K2729k9459P709K1601l0449R988K0182
1901A6738l1331J2481J8363l1988J4947J6598l2667J7501J4565l2839J9863J2221
1913A4452l2845K2182J0031l2886K4451P552l2583K6660M906l1990K8795K078
1925A0803l1187L0842q18l0189L2588l693k8873L4130o766k7331L5622r829k5581
1938b0282L6838j2887k3474L7715j5989k1214L8307j8914j8811L8786k1924j6170
1950a8019L9040k4609j3537L8859k7153j0602L8342k9558p673L7778l1913m707
1962a3752L6916l3901j560L5626l5737J606L4236l7487M850L2666l8901P838L0738
1975B3138l9982J1004K8727m1214J4332K6428m1930J7421K3859m2444K0479K1143
$$ plain form
1888 -7561 17232 -9542 -6658 17222 -10909 -5563 17166 -12293 -4584 17017 -13432 -3444 16738
1901 16738 -14593 -2112 16251 -15737 -790 15808 -16859 642 15207 -17632 2231 14452
1913 14452 -18393 3789 13820 -19066 5385 12937 -19646 7014 11920 -20070 8725 10803
1925 10803 -20384 10458 9640 -20549 12039 8346 -20527 13603 6837 -20494 15128 5299 -20282
1938 -20282 16556 3669 -19805 17910 1921 -19293 19014 100 -18711 20075 -1849 -18019
1950 -18019 21021 -3588 -17125 21734 -5419 -16021 22321 -7237 -14910 22868 -9045 -13752
1962 -13752 23164 -10737 -12297 23329 -12408 -10802 23434 -14053 -9203 23463 -15438 -7600 23138
1975 23138 -16844 -5840 22887 -18327 -3995 22433 -19497 -2076 21783 -20661 -182 20961
1987B0961m2644K3500J8186m2686K6459J5142m2475K9262J1937m1874L1991Q477
1999A6236m0999L4439M998l9829L6697J420l8368L8777k215l6514M0623o055l4452
2012b5242M2174r486l2401M3375j3065k9599M4202j6631k6902M4892k0182k3909
2024b2774M5490k3521k0812M5232k6476j7479M4759k9346j4085M4166l2048j0703
2036a7597M3268l4458p110M1838l6681l470M0403l8797k4L8819m0410L305L6825
2049B5911m1784O784L4427m2767J0398L1783m3725J3859K9272m4562J7228K6488
2061B3312m5111K0549K3616m5245K3523K0700m4970K6275J7246m4096K9046J3505
2073A8350m3262L2102R635m2429L4877O202m1398L7101K753l9736L8767o87l7776
$$ plain form
1987 20961 -21683 1817 20003 -22683 3776 18918 -23557 5705 17642 -24232 7759 16236
1999 16236 -24763 9676 14674 -25155 11542 12962 -25406 13371 11156 -25358 15265 9210 -25242
2012 -25242 16932 7446 -24955 18420 5355 -24244 19958 3327 -23575 21317 1135 -22774
2024 -22774 22716 -805 -21617 23615 -2861 -20340 24419 -4927 -19012 25154 -6894 -17597
2036 -17597 25671 -8787 -15897 25941 -10740 -14210 26193 -12604 -12628 26191 -14219 -10914 25911
2049 25911 -15873 -9089 25338 -17429 -7031 24752 -18973 -5114 24158 -20404 -3176 23312
2061 23312 -21799 -1250 22366 -22879 644 21344 -23626 2649 19895 -24201 4845 18350
2073 18350 -24912 7190 16825 -25604 9273 15475 -25923 11178 13931 -25805 12962 12275 -25501
2086b5501M0255m444l5294M1557q465l2517M2823j2437k9904M4079j6072k7496
2098b3416M4745j8982k4779M4623k1804k1549M3946k4690j7842M3225k7680j4195
2110a8398M2495l0568j0624M1734l3132p398M0824l5144m492L9336l6325j364
2122a3056L7080l7370K413L4459l8731O381L2066m0221R950L0064m1376J2938
2134e403K7872m1694J5563K5393m1689J8260K2252m0980K1124J8553m0390K4183
2146C044J4982m0012K7383J1760l9756K9789Q862l8764L1513N966l7185L2894
2158A0476K467l5068L4266j221l2810L5789n025l0541L7236q565k8510L8371j1532
2171E333k6530L8737j3947k4044L8449j6508k0889L7951j9294j7453L7387k2126
$$ plain form
2086 -25501 14754 10310 -24984 16573 8108 -24409 18414 5977 -23927 20152 4080 -23416
2098 -23416 21329 2347 -22432 22191 387 -21162 22784 -1906 -19748 23477 -4203 -18398
2110 -18398 24097 -6471 -17095 24639 -8493 -15891 24933 -10211 -14703 24633 -11692 -13056
2122 -13056 24024 -13346 -10933 23526 -15205 -8824 23242 -16979 -7029 23035 -18341 -5403
2134 -5403 22469 -19225 -3662 21731 -19958 -1698 20554 -20426 698 19251 -21139 3044
2146 3044 18026 -21986 5397 17157 -22599 7190 16052 -22712 8801 14767 -22418 10476
2158 10476 12943 -22125 12141 10920 -21890 13899 8874 -21667 15569 7004 -21506 16865 5333
2171 5333 -21197 17540 3593 -20451 17998 1490 -19399 18552 -742 -18195 19192 -2934
2183b934j4361L7094k4651j1563L6578k6639q880L5617k8011o300L4212k9115
2195h953l441L2274l0223r0L0198l1506L059K8442l2709N871K6742l3371Q228
2208e479K4879l3694J0544K2592l3568J2710K0093l3428J5157J7381l3116J7617
2220A688J4527l2797K0022J1983l2560K1817R686l1697K3197P157l0538K4490
2232F975M308k8833K5736J434k7308K7026j327k5695K8002l978k4022K8748o301
2245D765k2273K9165q350k0308K9189j0467j7930K8947j2520j5577K8731j4541
2257a169j3333K8431j6325j1184K7965j7752r019K7149j9035o834K6116j9953
2269d943m748K4794k0866k509K3445k1703l03K2019k2351J595K0746k3020L461
$$ plain form
2183 -2934 -17295 19799 -4852 -16415 20163 -6476 -15356 20261 -7750 -14050 20162 -8953
2195 -8953 -12394 19880 -10343 -10433 19765 -11741 -8682 19760 -12949 -7078 19664 -13707 -5479
2208 -5479 19400 -14294 -3750 18842 -14726 -2016 18077 -15351 -194 17187 -15929 1688
2220 1688 16215 -16582 3440 15423 -17137 4680 14366 -17331 5866 13023 -17515 6975
2232 6975 11283 -17550 8186 9620 -17688 9338 8011 -17684 10318 6340 -17682 11066 4765
2245 4765 -17508 11657 3307 -17001 12188 1721 -16209 12738 218 -15359 13372 -1169
2257 -1169 -14502 13929 -2396 -13580 14385 -3367 -12386 14763 -4272 -11106 15010 -4943
2269 -4943 -9691 15103 -5763 -8272 15173 -6530 -6833 15186 -7165 -5570 15176 -7844 -4383
2282d383J9242k3177N171J7427k3215O854J5713k3163Q511J3792k2905R994J2075
2295A1936k2634J1437J0157k2188J2761Q307k1472J3729O575k0562J4673M734
2307G453j9702J5653K915j8611J6363J222j7509J6844l55j6220J7235j985j4871
2320a1568J7452l235j3640J7469m571j2088J7238n708j0770J7053o897r334J6755
2333H156p876p954J6254q670o683J5608r366n296J4889r978m186J4112j0322l031
2347d343J3253j0711j953J2338j0916q94J1535j1200O8J0580j1146Q41R574j1041
2361d015J773Q609j0938K574P724j0670L132O846j0367L753N965j0091M454M986
2375C735r529M833M205q980N245L328q410N524K645p886N720J891p195N728J386
$$ plain form
2282 -4383 14859 -8318 -3147 14280 -8935 -2081 13632 -9531 -1020 12772 -10133 -139 11936
2295 11936 -10698 739 10896 -11292 1469 9776 -11696 2033 8608 -11954 2719 7453
2307 7453 -12249 3404 6319 -12292 4071 5293 -12216 4628 4273 -11947 5288 3303 -11568
2320 -11568 5884 2649 -10991 6478 1907 -10181 7057 1349 -9421 7632 735 -8599 8156
2333 8156 280 -7674 8580 -90 -6773 8835 -531 -5827 9062 -916 -5102 9010 -1312 -4343
2347 -4343 8910 -1801 -3754 8584 -2332 -3226 8309 -2891 -2823 7757 -3389 -2548 7026 -4015
2361 -4015 -2242 6367 -4571 -1997 5727 -4943 -1811 5035 -5332 -1579 4386 -5705 -1251 3735
2375 3735 -5794 -961 3244 -5736 -491 2837 -5573 -49 2596 -5290 430 2321 -4874 854 2240
2390B240o651N814O27n780N631J37n149N462l46m525N184p48l914M914j014l473
2406a591M575j214k978M176j355k505L658j496k019L111j368j677K653j356j272
2421f58K068j082j145J691r11r67J260n83r67R56j79q12M62J34p76L06M81q29
2439a551J03R40j045j79J461j221k77J856j315m42K227j694k93K652k201k53L028
2456A796k502j95L308k958JL540l452K03L802m041N32L939m525Q63L901n088J407
2473E31L790n579J776L785o074K250L655o486K871L320o867L536L038p352M164
2488C58K799p602M722K442p859N546J866p960O315J307q101O985P99q144P622
2503A095K70p971Q326n15p850R029j250p716R631j930p401J0153k922o912J0728
$$ plain form
2390 2240 -4411 1403 2030 -3750 1881 2018 -3131 2331 1985 -2540 2644 1896 -2018 2896 1882 -1591
2406 -1591 2984 1770 -1208 2968 1613 -892 2766 1270 -749 2362 994 -683 1970 614 -658
2421 -658 1410 328 -817 874 -37 -1004 256 -327 -1294 -338 -517 -1329 -867 -733 -1509 -1203 -722 -1551
2439 -1551 -1448 -508 -1553 -1732 -271 -1492 -1769 87 -1228 -1670 557 -1137 -1430 1222 -979 -1232 1796
2456 1796 -706 -901 2407 -551 -550 2990 -462 -259 3543 -498 34 3973 -552 311 4212 -876 531
2473 531 4321 -1258 518 4303 -1771 479 4134 -2352 519 3839 -3028 508 3546 -3806 358
2488 358 3157 -4445 277 2719 -5140 406 2272 -5688 627 1934 -6167 818 1617 -6527 1095
2503 1095 1365 -6606 1720 1205 -6645 2384 1134 -6582 3049 1119 -6282 3871 949 -5963 4765
2518D765l839o577J1270m628o150J1575n740n381J1819o625m828J2108p704m062
2532c997J2164q694l113J2145r732k105J2039j0737j249J1903j1590j53J1518
2545H399j2392R43J1186j3188K235J0632j3854L369J0093j4435M621R370j4943
2558g964O004Q576j5383P238P831j5498Q257O953j5606R573N822j5724J0840M730
2572E649j5681J2002L566j5552J3038K438j5192J3935J210j5001J4923r5j4529
2585i289J5717j498j3823J6324k934j3132J7018m420j2503J7732n869j1588J8117
2598I852p458j0674J8528q926r568J8653j0133q325J8588j1689o827J8607j3227
2611b599n267J8569j4671l925J8403j5674k495J8060j6644j009J7414j7450P30
$$ plain form
2518 4765 926 -5651 5619 991 -5159 6416 676 -4705 7114 489 -4339 7769 65 -3997
2532 -3997 8167 -527 -3640 8505 -1227 -3332 8707 -2030 -3279 8624 -2966 -3119 8399
2545 8399 -3993 -3050 8136 -5052 -2817 7815 -6039 -2670 7423 -7012 -2391 6979 -7964
2558 -7964 -1960 6616 -8767 -1529 6302 -9196 -939 6014 -9592 -19 5803 -9921 919 5649
2572 5649 -10032 1970 5536 -10016 3022 5460 -9732 4203 5413 -9588 5335 5240 -9289
2585 -9289 6428 4930 -8893 7431 4497 -8635 8383 3963 -8540 9192 3323 -8265 9852
2598 9852 2394 -8280 10248 1322 -8246 10407 274 -8051 10537 -1152 -7979 10628 -2599
2611 -2599 -7866 10703 -3968 -7893 10510 -5164 -7659 10401 -6243 -7252 10162 -7288 -6558
2624f558J6595j8269K580J5565j9109M519J4738j9941O224J3974k0608P618J3173
2637A0501k0938Q972J1872k0770J0333J0221k0632J2014Q504k0682J3726O942
2649A0063k0916J5175N694k1062J6357M461k0815J7099K973j9962J7671J201j8791
2662a0852J8584j156j7829J9905l295j7243K1158m908j6864K1905o133j6022K2081
2675I331p345j4424K1713q882j2427K1721j1184j0181K2075j3494q605K2838j5245
2688d109p529K3209j6153o532K2765j6690m777K1360j7333k323J9943j8656M61
2701f364J8917k0499K828J8777k2146M177J8714k2824M957J7769k2381N820J5812
2714A3557k1770P760J3276k1793J0296J1126k2714J2842R904k3886J4362R449
$$ plain form
2624 -6558 10037 -8232 -5652 9913 -9196 -4677 10061 -9880 -3656 10318 -10290 -2672 10501
2637 10501 -10437 -1465 10407 -10363 -30 10191 -10441 1573 10077 -10605 3121 10063
2649 10063 -10853 4322 10016 -11046 5311 9772 -11043 6056 9029 -10933 6738 7939 -10852
2662 -10852 7732 6576 -11253 8652 5357 -11886 9272 4364 -12500 9405 3272 -12750 9331
2675 9331 1986 -12438 9275 393 -12034 9687 -1497 -11678 10397 -3097 -11702 11136 -4109
2688 -4109 -11638 11571 -4582 -11114 11651 -5039 -9816 11544 -5789 -8112 11831 -6825 -6364
2701 -6364 12553 -7946 -5118 13659 -8487 -4310 14404 -8420 -3463 14306 -8075 -2255 13557
2714 13557 -8213 -453 12823 -8970 1326 12452 -10262 2580 12484 -11402 2960 12409
2726A2409k4369J4743Q830k3469J4736P106k1788J5413M291k0109J7193J255j9742
2739a3501J9697p46k0244K1446j591k0491K1869j819j9451K1020k843j7027K0464
2752F783n295j4258K0993q391j2206K2491j1180j1497K4151j2435j1560K4363
2764A1959j2358j0850K3064j2579q406K0974j3769n147J9718j6267k112J9774
2776A4001j8916m18K0479k0476j37K0643k0404P6J9306j9446J331J6677j9099
2789f383M142J3945j9880P275J2464k1774R626J2356k3174J0344J2498k3002J0094
2802a469J1641k1482J0267R377j9722J1782O283j8927J4377L780j9343J6872K588
2815F024k0152J7919K579k0127J7713K259j8691J6910N64j6074J6953k093j4156
$$ plain form
2726 12409 -11960 2783 11613 -11856 2880 9986 -11802 3611 7902 -12207 4986 6241 -13501
2739 -13501 6196 5450 -14794 6652 5061 -15430 6439 4620 -14831 6189 3346 -13681 6783
2752 6783 1488 -12770 8223 -168 -12374 10117 -1063 -12560 11591 -844 -12404 11959
2764 11959 -399 -11249 11815 -764 -9170 11804 -1965 -7112 12606 -3661 -5773 14001
2776 14001 -4915 -5333 15146 -5330 -5467 15176 -5228 -5152 14154 -5292 -3961 12716 -6383
2789 -6383 -2241 11704 -8176 -901 11563 -10211 -585 11771 -11403 -1059 11439 -11563 -1469
2802 -1469 10172 -11310 -1043 8334 -11388 394 6677 -12250 2127 5907 -13436 3436 6024
2815 6024 -14128 3791 6370 -13757 3956 6215 -12476 4434 4998 -11076 5877 3784 -10372
2828a0372J8220n004j3089J9902o999j3116K1040p582j3044K0743p718j1942J9345
2841A0384q317r527J7964j0162o754J7594j2483m886J8135j4532l947J8667j5315
2854c179l727J8436j5197l016J6907j4676j262J4929j5129J179J3456j6249L491
2867d037J2814j7552M783J2857j8235N375J2571j7698N602J1408j6774O451R582
2880G147j6057Q096P537j6037J0036O179j6400J1291N556j6646J1882M990j6336
2893h762J1883M177j5214J1984K466j3880J2596N04j3044J3622j155j2615J4417
2906F979k301j2270J4863l126j1646J4613l874j0528J4137m803r185J4014o280
2919E93p610J4034p732o559J4213q629n737J4107r124m923J3707r457l901J3087
$$ plain form
2828 -10372 7848 2844 -10245 9657 2658 -10458 10582 3000 -10044 10699 2981 -8961 10384
2841 10384 2067 -7460 10504 342 -6412 11182 -1301 -6187 11948 -2584 -6531 12136 -3179
2854 -3179 -6906 11530 -3667 -6683 10224 -4452 -5714 9215 -5914 -4735 8721 -7528 -4037
2867 -4037 8777 -8775 -3992 8865 -9370 -3995 8576 -9122 -3520 7888 -8886 -2435 7147
2880 7147 -8910 -814 6723 -9314 722 6901 -9499 1792 7348 -9298 2584 7574 -8762
2893 -8762 3121 7298 -7916 4068 6534 -7346 5250 5754 -7290 6332 5177 -7438 6979
2906 6979 4678 -7592 7271 4145 -7501 7112 3238 -7290 6847 2044 -7141 6873 593
2919 593 -7017 7017 -715 -7274 6939 -1690 -7427 6680 -2444 -7367 6340 -3117 -7018 6069
2933F069r902k484J2272j0420j158J1627j0921jJ1202j1529R75J0893j1696J686
2947c387J0187j1666K473R282j1585L300Q425j1640M305P461j1602N041O546j1597
2961d457N796N793j1544O274N051j1355O618M210j0989P119L193j0536P630K184
2975D987j0165Q069J242r653Q275N42r295Q734l58q669Q896j086q044Q993j771
2990F97p231Q929k498o385R021l124n782R067l708n032Q982m140m269Q772m612
3005a313l507Q535n049k809Q233n285k155P840n528j601P590n887q56P061o052
3020g83l32O612o205R9O059o260O19N504o256R79N090o316J390M506o235J670
3036A41M077o140J933L562n939K257L067n868K550K584n568K880K039n291L073
$$ plain form
2933 6069 -3833 -6317 5955 -4465 -5623 6004 -4917 -4918 6284 -5245 -4270 6623 -5073 -3387
2947 -3387 6800 -4866 -2393 6889 -4696 -1396 7029 -4611 -306 7155 -4447 594 7140 -4457
2961 -4457 1339 7132 -4412 1862 6913 -4442 2176 6386 -4603 2516 5709 -4827 2803 4987
2975 4987 -5178 2891 4133 -5520 2755 3297 -5998 2736 2378 -6291 2605 1519 -6525 2468 697
2990 697 -6534 2395 -103 -6488 2533 -591 -6373 2694 -1014 -6046 2936 -1204 -5473 3299 -1313
3005 -1313 -4820 3715 -1334 -4143 4090 -1195 -3350 4490 -1038 -2639 4951 -936 -1792 5269 -783
3020 -783 -1115 5497 -708 -609 5450 -810 -191 5313 -943 36 5126 -1190 200 4706 -1529 141
3036 141 4218 -1922 11 3573 -2366 -109 2958 -2910 -360 2224 -3344 -464 1575 -3716 -643
3051f43J696n001L147J404m656L321R56m225L470O51l895L466M05l539L522Q2
3067A61l175L553j75k872L469l56k447L255n41k101L149p87j825K897r18j498
3083b11K667r60j433K502j085j142K147j065r85J891j104q80J585r94p54J319
3099A498r68n98J110r59n50R14p78n02P83o47m01M57m18m05M22k06m49L28N2l71
3119a688K20K98m07J09M65n08J45P62o62J83R09p49J58J242j021K36J341j227
3137a94K10J513j470L56J641j769M72J638j979O13J685k328P44J687k566Q62J716
3154B831k859J095J548l066J305J547l313J538J418l672J944J263l766K294J017
3169A124l956K687Q87m144L050P65m160L413M52m149L747K52m195M201p5m139
$$ plain form
3051 -643 1053 -3948 -801 603 -4053 -732 224 -4001 -531 120 -3775 -309 96 -3443 79 161
3067 161 -3014 539 364 -2508 961 605 -1842 1413 872 -1229 1920 1133 -692 2205 1287 -211
3083 -211 2456 1496 63 2565 1480 338 2485 1420 435 2326 1222 342 1927 933 179 1498
3099 1498 530 -68 1042 83 -467 447 -331 -833 -50 -697 -1098 -641 -1059 -1464 -1042 -1248 -1697 -1369 -1317 -1688
3119 -1688 -1468 -1170 -1577 -1468 -1003 -1511 -1366 -604 -1266 -1083 -174 -923 -765 477 -544 -308 1033 -194
3137 -194 16 1529 59 415 2056 287 759 2397 418 1031 2716 388 1132 2819 253 1115 2831
3154 2831 -28 1067 2615 -451 854 2401 -912 626 2044 -1628 316 1579 -2187 107 1124
3169 1124 -2832 -145 742 -3402 -352 413 -3747 -334 118 -4031 -284 -32 -4227 -26 -101 -4240
3185d240M583m06m027N058q07l964N350j132l860N617j540l696O011k122l402
3200b577O113k636l144O415l158k895O482l632k534O537m237k183O688m785j845
3215a391O648n335j329O544n846p76O410o356l38O328o801K97O192p257Q73O064
3231C927p707J513N773p905K168N442q154K843N076q386L570M762q669M300M419
3246B972q844N053L799q789N608L380q745O155K752q792O977K102q793P571J454
3261C860q816Q170Q08q683Q608P6q506R121p94q170R448j595p799R849k619p358
3277d400J0221l393p097J0659m361o607J0863n123o002J0900n837n234J0934o712
3291a189m435J1005p547l548J1029q467k645J1087r094j863J0943r644j057J0713
$$ plain form
3185 -4240 343 -63 -4090 968 161 -3803 1547 415 -3445 2172 632 -3064 2947 825 -2577
3200 -2577 3536 900 -2244 4171 1013 -1882 4600 968 -1566 4971 734 -1449 5239 454 -1391
3215 -1391 5257 -78 -1407 5137 -709 -1485 4925 -1431 -1769 4559 -2242 -1945 4247 -3010 -2137 3927
3231 3927 -3780 -2267 3506 -4399 -2231 3211 -4943 -2100 2976 -5410 -1840 2922 -5747 -1447 2972
3246 2972 -5872 -819 2980 -5809 -201 3179 -5566 589 3341 -5451 1526 3628 -5165 2406 3860
3261 3860 -4956 3214 4022 -4661 3947 4023 -4483 4638 3844 -4326 5122 3527 -4272 5577 2958 -4400
3277 -4400 5821 2428 -4669 5990 1629 -4978 5885 762 -5240 5660 -177 -5411 5523 -1189
3291 -1189 -5624 5381 -2166 -5714 5315 -3152 -5797 5290 -3804 -5667 5276 -4368 -5425 5288
3305E288j0072K9J0170j0449J095R596j1081K284R337j1779L261Q998j2241M190
3319a374Q492j2464M757P953j2519N523O996j2499O699N714j2593P803M913j3138
3333e737Q953M148j3443R573L528j3377R973K750j2886J0320J524j2205J1069
3346D190L6j1687J2114j500j1403J3101k479j1459J3814l012j1054J3841l511
3359I91j0196J3718m589q700J3721o179p283J4261p805o400J5091r034n859J5610
3373G347r549n527J5374r709m556J4337j0116k724J3355j1290o49J2859j2872
3386c720P45J3275j4304J374J3470j4746J518J3078j4439K053J1706j4137L534
3399e93R863j4421N653Q352j5441P623P783j6662Q581Q058j7317Q701P821j6626
$$ plain form
3305 5288 -4784 -4755 5415 -5034 -3939 5657 -5424 -3140 6197 -5582 -2321 6677 -5564 -1374
3319 -1374 7118 -5346 -589 7364 -5155 368 7364 -5135 1564 7278 -5315 2488 7401 -5737
3333 -5737 3216 7364 -6079 3494 7022 -6355 3618 6368 -6518 3802 5326 -6879 4190
3346 4190 4226 -7461 4653 3153 -8250 4851 2372 -9087 4727 1715 -9339 4502 991
3359 991 -9205 4513 -76 -8776 4945 -1234 -8517 5744 -2061 -8461 6630 -2404 -8263 7347
3373 7347 -2202 -7729 7645 -2064 -6620 7717 -2399 -5123 8232 -3058 -3707 9152 -3720
3386 -3720 -2975 10300 -4004 -2630 10840 -3906 -2388 10690 -3749 -1696 10010 -4127 -593
3399 -593 9270 -5151 502 8854 -6587 1036 8819 -7843 738 8796 -8521 180 8001 -8625
3413h625Q674O545j5317R356M343j4322J1042K181j4372J3265Q32j5193J4845
3426C254N74j5719J4995P00j4901J4301j5j3035J4002k219j0955J4783m823r670
3440h728J6378o781r716J7743p546j0058J8100p514r654J6947p452p920J5378
3453I177q610n290J4600j0968l092J5244j3412k203J6352j4576k291J6489j4284
3466b864k346J5427j3491j190J3356j3563J255J1481j4624L947J0828j6549N653
3479b680J1230j7863N993J1761j7666N639J1145j6428O023R170j5251P790O546
3492E409j4964J0150M885j5948J2284M390j6944J3089M568j7053J2759M347j5736
3505h764J2213K638j3737J2633O4j2379J4212k398j2232J5945l715j2590J6794
$$ plain form
3413 -8625 49 6594 -8723 633 4976 -9346 1696 3877 -10495 2770 3602 -11591 3254
3426 3254 3828 -11891 3104 3804 -11097 3204 3189 -9846 4156 1937 -9018 5765 942 -8728
3440 -8728 7650 869 -8847 8896 1350 -8708 9392 1878 -7776 9171 1719 -6201 9177
3453 9177 567 -4723 9877 -1091 -4183 11061 -2351 -4554 11798 -2778 -5069 11420 -2864
3466 -2864 -5210 10217 -3274 -4464 8892 -4671 -3416 8065 -6559 -2612 8216 -8333 -2680
3479 -2680 8550 -9313 -3320 8441 -9225 -3586 7559 -8869 -2846 6324 -8927 -1137 5409
3492 5409 -9555 595 5480 -10468 1816 6206 -10738 2351 6919 -10134 2625 6972 -8764
3505 -8764 3449 6087 -7650 4983 5047 -7332 6880 4482 -7750 8195 4480 -8110 8684
3518H684m084j2610J6376m144j1611J5334m973r574J4521o874p315J4701r079
3531f48o097J5661j0718n673J6234j1149n517J6041j1020m782J4812j0988l004
3544f848J3402j1588r13J2647j2903Q69J2519j4298K013J2850j4886K402J2606
3557G872j4545K832J1457j3968L961R808j3768N529Q321j4063P187P371j4684
3570f690Q294O857j5132Q907O305j4850R148N270j4076R433L860j3186J0110K153
3584F403j2707J1181O79j2445J2051l24j2268J2587j164j1827J2544j872j0752
3597g914J2418k940r510J2394m223q282J2708n475p420J3125o499o652J3201p000
3611b069n827J2906p475m865J2536p983l646J2027q675k370J1522r212j327J1204
$$ plain form
3518 8684 4600 -8010 8366 4222 -7389 7945 2972 -6602 7919 1045 -6270 8431 -648
3531 -648 -6745 8916 -1802 -7475 8759 -2390 -7907 8134 -2886 -7668 7144 -3844 -6848
3544 -6848 6554 -5034 -5947 6700 -6203 -5334 7185 -7113 -5100 7750 -7136 -4734 7872
3557 7872 -6673 -3841 7616 -6352 -2391 7417 -6351 -822 7499 -6564 623 7994 -6690
3570 -6690 1604 8461 -6671 2236 8541 -6309 2839 8109 -5967 3466 7326 -5860 4250 6403
3584 6403 -6304 4877 5556 -6889 5162 4838 -7430 5157 3993 -7834 4710 2838 -7914
3597 -7914 4504 1564 -7946 4448 225 -8057 4651 -824 -8244 4881 -1618 -8270 4931 -2069
3611 -2069 -7896 5010 -2465 -7330 5206 -2777 -6423 5604 -3071 -5441 6081 -3131 -4458 6746
3625F746r867m81J0869j0202L40J0325j0387R14R609j0478J806Q729j0704K802
3639B1P826j0841L632P106j1131M328O427j1113M916N639j1055N421M770j0739
3653d793N978L854j0430O587K932j0099P054K133r676P419J428r312P879N97q650
3668g099Q180j73q065Q340p88p411Q619j538o657Q593k137o013Q830k877n353
3683e549Q813l307m690Q589l721l966Q353m233l308Q118m649k717P837n024k178
3698a632P541n453j566P042n623j070O703n994m30O103o145L7N685o279N83N120
3714D622o342R54M692o289J322M224o200J758L745o097K152L206n901K536K810
3729A192n621K748K313n310L216J921n040L286J641m652L449J256m334L609Q99
$$ plain form
3625 6746 -3121 -3602 7267 -2935 -2595 7730 -2657 -1743 7866 -2612 -806 7923 -2781 21
3639 21 7847 -2994 638 7744 -3387 941 7368 -3745 1171 6810 -4245 1176 5946 -4793
3653 -4793 1185 5039 -5391 1196 4128 -5971 1083 3216 -6460 959 2387 -6925 954 1551 -7099
3668 -7099 1081 908 -7157 1183 395 -7016 1603 65 -6592 2001 -136 -6149 2681 -196 -5549
3683 -5549 3264 -43 -4733 3856 135 -3831 4522 289 -3019 5099 450 -2267 5570 546 -1632
3698 -1632 5909 456 -1110 5932 309 -761 5942 -52 -482 5621 -524 -487 5198 -1081 -498 4622
3714 4622 -1720 -766 3926 -2363 -1041 3183 -3017 -1259 2486 -3611 -1459 1747 -4154 -1618 1192
3729 1192 -4429 -1681 632 -4678 -1462 459 -4581 -1295 346 -4306 -857 399 -3935 -326 573
3744E73l904L673M55l469L748J22l169L640q9k873L534l11k615L446o37k246L101
3761B979p31j913K831j028j663K545j059j522K359j212j280K061j170j164J808
3776A841j250r13J525j191q25J263j039o91J016r00m53P81o88n08P97o07m81P21
3794a602k56m58N70k1l97M36L09m57M11M87m97L92O99o00L34R83p75L57J123r62
3814G6L27J363j250L64J523j530L71J572j770L88J706k127N18J689k408P41J638
3831C191k747R53J590l107J168J520l351J367J541l702J706J445l846K044J129
3846I01l937K359J126m206K985P80m316L415O20m357L759M79m423M268J16m340
3862d771M731k02m287N082o08m157N632j045m090O070j512m036O281j934l783
$$ plain form
3744 573 -3331 342 797 -2672 1076 1198 -1971 1669 1580 -1293 2241 1930 -685 2761 2124 -122 2979
3761 2979 2248 335 3166 2138 475 3020 1961 439 2798 1586 306 2367 1197 33 1841
3776 1841 591 -322 1203 12 -813 450 -589 -1280 -264 -1164 -1617 -836 -1524 -2032 -1235 -1842 -2323 -1602
3794 -1602 -1858 -2316 -1746 -1767 -2164 -1728 -1419 -1876 -1465 -978 -1475 -1083 -384 -984 -650 333 -442 -85 1038 76
3814 76 403 1766 516 880 2403 873 1244 2816 1046 1434 3140 1013 1531 3220 812 1553 3191
3831 3191 444 1397 2987 -120 1048 2568 -783 584 2125 -1577 129 1574 -2272 -228 901
3846 901 -3036 -677 449 -3757 -772 8 -4308 -893 -273 -4630 -871 -392 -4815 -547 -431 -4771
3862 -4771 -40 -242 -4529 553 -55 -4212 1420 375 -3715 2355 843 -3193 3088 1154 -2629
3877b629O638k632l566O933l264l163O951l850k819P168m522k546P255n132k111
3892a289P360n810j654P213o315j071P113o951m13P044p613K28O872q019R19O541
3908D155q450J705O288q867K466O024r161L174N724r428M064N200r592M903M715
$$ plain form
3877 -2629 4009 1377 -2189 4744 1480 -1683 5268 1418 -1401 5767 1245 -1301 5954 822 -1289
3892 -1289 6071 261 -1393 5820 -495 -1566 5547 -1404 -1817 5227 -2386 -2158 4714 -3305 -2386 4155
3908 4155 -4295 -2590 3698 -5169 -2703 3321 -5840 -2666 3058 -6370 -2306 2894 -6698 -1795 2920
$$ [...]
##END NTUPLES=NMR FID
##END=
