##TITLE=1H_IBA1408-1
 CDCl3
 8 sc, 
 15.8.2024
##JCAMPDX= 6.0         $$ Bruker NMR JCAMP-DX V2.0
##DATA TYPE= NMR FID
##DATA CLASS= NTUPLES
##ORIGIN= UXNMR, Bruker Analytische Messtechnik GmbH
##OWNER= root
$$ XWIN-NMR		Version 3.5
$$ Thu Aug 15 14:05:44 2024 Russian Standard Time (UT+4h)  she@DPX200
##.OBSERVE FREQUENCY= 200.1318
##.OBSERVE NUCLEUS= ^1H
##.DELAY= (6, 6)
##.ACQUISITION MODE= SIMULTANEOUS
##.ACQUISITION SCHEME= undefined
##.AVERAGES= 8
##.DIGITISER RES= 18
##SPECTROMETER/DATA SYSTEM= spect
##.PULSE SEQUENCE= zg30
##.SOLVENT NAME= D2O
##.SHIFT REFERENCE= (INTERNAL, D2O, 0, 15.7039)
##AUDIT TRAIL= $$ (NUMBER, WHEN, WHO, WHERE, WHAT)
$$ ##TITLE= Audit trail, XWIN-NMR		Version 3.5
$$ ##JCAMPDX= 5.01
$$ ##ORIGIN= Bruker BioSpin GmbH
$$ ##OWNER= she
$$ F:/spectra/data/she/nmr/H-F/1/audita.txt
$$ ##AUDIT TRAIL=  $$ (NUMBER, WHEN, WHO, WHERE, WHAT)
(   1,<2024-08-15 14:04:06.82 +0400>,<she>,<DPX200>,
      <created by zg, POWCHK disabled, PULCHK disabled
       configuration hash MD5:
       00 E9 B6 7A A2 85 ED C7 34 08 36 98 17 FE 4E 26
       data hash MD5: 16K
       51 9F 7B 1A C2 66 81 AC 6F 6A 4B AE EF 23 2E E7>)
$$ ##END=
$$ 
$$ hash MD5
$$ 34 E3 28 36 2D 05 4C 47 87 A9 C7 6A FD 22 41 00
##$RELAX= 
##$RELAX= 
##$RELAX= 
##$RELAX= 
##$RELAX= 
##$RELAX= 
$$ Bruker specific parameters
$$ --------------------------
##$DU= <F:/spectra>
##$EXPNO= 1
##$NAME= <H-F>
##$PROCNO= 1
##$TYPE= <nmr>
##$USER= <she>
##$AMP= (0..31)
100 100 100 100 100 100 100 100 100 100 100 100 100 100 100 100 100 100 
100 100 100 100 100 100 100 100 100 100 100 100 100 100 
##$AQSEQ= 0
##$AQ_mod= 1
##$AUNM= <au_zg>
##$AUTOPOS= <>
##$BF1= 200.13
##$BF2= 200.13
##$BF3= 200.13
##$BF4= 200.13
##$BF5= 200.13
##$BF6= 200.13
##$BF7= 200.13
##$BF8= 200.13
##$BYTORDA= 1
##$CFDGTYP= 0
##$CFRGTYP= 5
##$CHEMSTR= <none>
##$CNST= (0..31)
1 1 145 1 1 1 1 1 1 1 1 1 1 1 1 1 1 1 1 1 1 1 1 1 1 1 1 1 1 1 1 1 
##$CPDPRG= <>
##$CPDPRG1= <>
##$CPDPRG2= <>
##$CPDPRG3= <>
##$CPDPRG4= <mlev>
##$CPDPRG5= <mlev>
##$CPDPRG6= <mlev>
##$CPDPRG7= <mlev>
##$CPDPRG8= <mlev>
##$CPDPRGB= <>
##$CPDPRGT= <>
##$D= (0..31)
0 1.2 0 0 0 0 0 0 0 0.06 0 0.03 0 0 0 0 0.0002 0 0 0 0 0 0 0 0 0 0 0 0 
0 0 0 
##$DATE= 1723716246
##$DBL= (0..7)
120 120 120 120 120 120 120 120 
##$DBP= (0..7)
150 150 150 150 150 150 150 150 
##$DBP07= 0
##$DBPNAM0= <>
##$DBPNAM1= <>
##$DBPNAM2= <>
##$DBPNAM3= <>
##$DBPNAM4= <>
##$DBPNAM5= <>
##$DBPNAM6= <>
##$DBPNAM7= <>
##$DBPOAL= (0..7)
0.5 0.5 0.5 0.5 0.5 0.5 0.5 0.5 
##$DBPOFFS= (0..7)
0 0 0 0 0 0 0 0 
##$DE= 6
##$DECBNUC= <off>
##$DECIM= 24
##$DECNUC= <off>
##$DECSTAT= 4
##$DIGMOD= 1
##$DIGTYP= 9
##$DL= (0..7)
0 120 120 120 120 120 120 120 
##$DP= (0..7)
150 150 150 150 150 150 150 150 
##$DP07= 0
##$DPNAME0= <>
##$DPNAME1= <>
##$DPNAME2= <>
##$DPNAME3= <>
##$DPNAME4= <>
##$DPNAME5= <>
##$DPNAME6= <>
##$DPNAME7= <>
##$DPOAL= (0..7)
0.5 0.5 0.5 0.5 0.5 0.5 0.5 0.5 
##$DPOFFS= (0..7)
0 0 0 0 0 0 0 0 
##$DQDMODE= 0
##$DR= 18
##$DS= 0
##$DSLIST= <SSSSSSSSSSSSSSS>
$$ [...]
##$SUBNAM2= <"">
##$SUBNAM3= <"">
##$SUBNAM4= <"">
##$SUBNAM5= <"">
##$SUBNAM6= <"">
##$SUBNAM7= <"">
##$SUBNAM8= <"">
##$SUBNAM9= <"">
##$SW= 24.0689170037331
##$SWIBOX= (0..15)
0 0 2 0 0 0 0 0 0 0 0 0 0 0 0 0 
##$SW_h= 4816.95568400771
##$TD= 16384
##$TD0= 1
##$TE= 0
##$TE2= 300
##$TE3= 300
##$TEG= 300
##$TL= (0..7)
0 120 120 120 120 120 120 120 
##$TP= (0..7)
150 150 150 150 150 150 150 150 
##$TP07= 0
##$TPNAME0= <>
##$TPNAME1= <>
##$TPNAME2= <>
##$TPNAME3= <>
##$TPNAME4= <>
##$TPNAME5= <>
##$TPNAME6= <>
##$TPNAME7= <>
##$TPOAL= (0..7)
0.5 0.5 0.5 0.5 0.5 0.5 0.5 0.5 
##$TPOFFS= (0..7)
0 0 0 0 0 0 0 0 
##$TUNHIN= 0
##$TUNHOUT= 0
##$TUNXOUT= 0
##$USERA1= <user>
##$USERA2= <user>
##$USERA3= <user>
##$USERA4= <user>
##$USERA5= <user>
##$V9= 5
##$VALIST= <valist>
##$VCLIST= <CCCCCCCCCCCCCCC>
##$VD= 0
##$VDLIST= <DDDDDDDDDDDDDDD>
##$VPLIST= <PPPPPPPPPPPPPPP>
##$VTLIST= <TTTTTTTTTTTTTTT>
##$WBST= 1024
##$WBSW= 4
##$XGAIN= (0..3)
0 0 0 0 
##$XL= 0
##$YL= 0
##$YMAX_a= 641651
##$YMIN_a= -594821
##$ZGOPTNS= <>
##$ZL1= 120
##$ZL2= 120
##$ZL3= 120
##$ZL4= 120
##$ABSF1= 10
##$ABSF2= 0
##$ABSG= 5
##$ABSL= 3
##$ALPHA= 0
##$AQORDER= 0
##$ASSFAC= 0
##$ASSFACI= 0
##$ASSFACX= 0
##$ASSWID= 0
##$AUNMP= <proc_1d>
##$AZFE= 0.1
##$AZFW= 0.1
##$BCFW= 1
##$BC_mod= 2
##$BYTORDP= 1
##$COROFFS= 0
##$CY= 11.3945322036743
##$DATMOD= 1
##$DC= 2
##$DFILT= <>
##$DTYPP= 0
##$F1P= 15.6554695791079
##$F2P= 12.8336369535428
##$FCOR= 0.5
##$FTSIZE= 0
##$FT_mod= 4
##$GAMMA= 1
##$GB= 0.15
##$INTBC= 1
##$INTSCL= 1
##$ISEN= 128
##$LB= 0.24
##$LEV0= 0
##$LPBIN= 0
##$MAXI= 10000
##$MC2= 0
##$MEAN= 0
##$ME_mod= 0
##$MI= 1.114404
##$NCOEF= 0
##$NC_proc= 0
##$NLEV= 6
##$NOISF1= 3.799351
##$NOISF2= 2.8
##$NSP= 1
##$NTH_PI= 0
##$NZP= 0
##$OFFSET= 15.70392
##$PC= 1
##$PHC0= -26152.96
##$PHC1= 10.78748
##$PH_mod= 1
##$PKNL= yes
##$PPARMOD= 0
##$PSCAL= 0
##$PSIGN= 0
##$REVERSE= no
##$SF= 200.130013532006
##$SI= 16384
##$SIGF1= 3
##$SIGF2= 2
##$SINO= 400
##$SIOLD= 16384
##$SREGLST= <1H.CDCl3>
##$SSB= 0
##$STSI= 0
##$STSR= 0
##$SW_p= 3612.71676300578
##$SYMM= 0
##$S_DEV= 0
##$TDeff= 0
##$TDoff= 0
##$TI= <>
##$TILT= no
##$TM1= 0
##$TM2= 0
##$TOPLEV= 0
##$USERP1= <user>
##$USERP2= <user>
##$USERP3= <user>
##$USERP4= <user>
##$USERP5= <user>
##$WDW= 1
##$XDIM= 8192
##$YMAX_p= 0
##$YMIN_p= 0
$$ End of Bruker specific parameters
$$ ---------------------------------
##NTUPLES= NMR FID
##VAR_NAME=  TIME,          FID/REAL,        FID/IMAG
##SYMBOL=    X,             R,               I
##VAR_TYPE=  INDEPENDENT,   DEPENDENT,       DEPENDENT
##VAR_FORM=  AFFN,          ASDF,            ASDF
##VAR_DIM=   8192,          8192,            8192
##UNITS=     SECONDS,       ARBITRARY UNITS, ARBITRARY UNITS
##FACTOR=    0.0002076,     1,               1
##FIRST=     0,             0,               0
##LAST=      1.7004516,     0,               0
##MIN=       0,             -594821,         0
##MAX=       1.7004516,     641651,          0
$$ Real data points
##PAGE= N=1
##DATA TABLE= (X++(R..R)), XYDATA
0@%%%%Oj5K5l2L2m0N7p6R9j21J42j70K09k58L10l63M22m93N78o77P85r00J025
27E45j166J330j514J715j932K167k426K715l037L389l768M180m634N138n697O310
43C315o981P721q550R484j0536J1728j3092J4669j6519J8734k1436K4813k9167
56a5817L5025m3389N6427q0339J85403o00628N13021N59626j100892N97330L96439
67E02206q98493N12225L29008q74175O36742J77411q72848P15435J85982r81203
77e67710P68830K31276j008122O93509L08116r67433O09719K78959q39857N68017
87G5304J84020p59134O33756P6111p57170P23626N3713q25047P70120J05471q69206
98e88436P25114J74727q37575O40763J77118p40383N91713J03578o54496O23593
$$ plain form
0 0 0 0 0 0 6 -9 16 -16 16 -24 33 -43 56 -65 77 -93 116 -142 168 -195 227 -266 312 -365 420 -480 545
27 545 -621 709 -805 910 -1022 1145 -1281 1434 -1603 1786 -1982 2198 -2436 2702 -2995 3315
43 3315 -3666 4055 -4495 4989 -5547 6181 -6911 7758 -8761 9973 -11463 13350 -15817
56 -15817 19208 -24181 32246 -48093 137310 -463318 49703 609329 -491563 105767 502206
67 502206 -396287 115938 444946 -429229 207513 384924 -487924 227511 413493 -567710
77 -567710 201120 432396 -575726 117783 425899 -541534 68185 347144 -492713 75304
87 75304 259324 -499810 133946 210057 -547113 176513 230226 -594821 175299 280770 -588436
98 -588436 136678 311405 -526170 114593 291711 -448672 143041 246619 -407877 215716
108B15716P653o41616P00447l2768o95482P46487N66p48061P18203N7985p38550
119d09420O44261P1086o68839N90495J8313n93568O00985o2142n70358O58255
129B79068j07092o04197P03496q9683o47644O92930m0108o46690O37010j5060
139A62030n90834N86477m4614n19466N83724j05134m82603O23490j48209m93739
149d28878O64090j44101n23602O64393j08155n26980O23638q3522m89044N76196
159B24035r9047m31321N59775j46406l94772N79085j87810l95193O06256j97053
169A17549m16801O07818j77653m23168N77634j61218m00498N38883j68116l58031
179b63601N17868k00503l23824N25656k32786l14490N44385k45179l22735N52154
$$ plain form
108 215716 223369 -418247 282200 249432 -446050 300437 301003 -447058 271145 329130 -409420
119 -409420 234841 305927 -362912 227583 245896 -347672 253313 191171 -379187 279068
129 279068 171976 -432221 271275 181592 -466052 226878 186770 -459920 177090 162030
139 162030 -428804 157673 113059 -406407 177317 72183 -410420 213070 64861 -428878
149 -428878 235212 91111 -432491 231902 123747 -403233 220405 136883 -352161 224035
159 224035 124988 -306333 253442 107036 -287736 291349 103539 -291654 314602 117549
169 117549 -299252 308566 130913 -292255 285379 124161 -276337 262546 94430 -263601
179 -263601 254267 53764 -270060 255596 22810 -291680 252705 7526 -315209 236945
189B36945k33072l27050N34766k15513l08088N06836k14216k73806M87634k30322
199c5886k40712M86601k52723k25278M97031k62497k25559M99743k55971k26127
209b41378M85935k42922k14763M59356k38749j89553M36388k49840j65951M26307
219B64830k63686j53258M22568k71684j50297M17620k68532j50344M02803k59756
229i736j42608L81764k54604j27528L61510k55231j08674L48451k61026r5337
239a63019L43900k61997q9056L38105k57001q3785L29899k48444p7109L16722
249A48215k40229o4517L03367k37261n1181K93544k37075l9928K86875k37561
259g5751l3870K81168k34010l0784K72179k29155k6426K60693k25108k0721K48856
$$ plain form
189 236945 3873 -323177 211589 -3924 -312012 194824 -19392 -293198 194436 -35886
199 -35886 -276598 210003 -42720 -267998 229033 -33464 -259023 240720 -15251 -241378
209 -241378 244557 1635 -213128 246228 7479 -182074 254314 4474 -161477 264830
219 264830 1144 -152114 270454 -1230 -151527 266093 -2439 -152783 250020 -9736
229 -9736 -152344 229420 -25184 -152712 208798 -46433 -155107 193344 -67682 -163019
239 -163019 180881 -81116 -170172 167933 -89068 -172853 157046 -91398 -168507 148215
249 148215 -92014 -156531 146836 -90425 -141606 151938 -85137 -125065 161810 -75751
259 -75751 -109621 171547 -62463 -93247 178932 -50223 -76649 184044 -41064 -61785 187071
270A87071k23716j4723K38140k23250r298K28221k23017n436K19452k20394k693
281d9643K09697k16679P77K00328k12042M473J90294k06987R793J81421k02244
292i0812J5122J73594j96646K0498J66637j90728K4716J60007j82928K8396J52099
303G9955j75458L2511J44708j68365L5704J37225j61916L8410J30096j56077M0064
314b3143J22526j50603M0909J14995j45373M0993J06754j39984M1062R8480j35314
325b8698M0378R1258j30592L9026Q3669j25795L8127P6754j21106L7593P0509
336G1123j16430L7369O5393j10845L6425O0504j04043L6238N5637r7691L6356
347b9964N2140r0664L5895M8803q3453L5794M6031p6732L5074M3073o9729L4356
$$ plain form
270 187071 -36645 -51368 186772 -36478 -45776 182445 -40572 -46008 173444 -46950 -49643
281 -49643 160054 -56625 -55848 144480 -67562 -63089 127205 -79782 -69989 111432 -90812
292 -90812 -75690 97904 -98742 -78244 88393 -102335 -77619 82388 -100540 -72144 79955
303 79955 -95503 -62992 81716 -86649 -50945 86280 -75636 -37226 92870 -63207 -23143
314 -23143 99383 -51220 -10311 104684 -40689 304 107058 -32926 8136 106616 -28698
325 -28698 11680 102938 -27654 11372 95041 -30754 7373 84127 -36979 614 71123
336 71123 -45307 -7938 57455 -53390 -16965 43539 -60504 -24266 31371 -66320 -29964
347 -29964 22176 -68488 -32593 16210 -67243 -31449 14582 -62150 -27076 15997 -53732 -19376
359a9376L9883o3373L2422L6745n6471L0212L2721n0728K7362K9685m5124K3240
371A7198K5470l9800J9686K1622l5365J5344J7985l0720J1286J4700k6300O505
383A7611J1652k0872K200Q453j5991j679O430j0828n879N399n282r718M828N29
397a3147j3121M544O275j5932M741J2065j9040N404J7797k2334O231K3563k5933
410b8887P008K8735k9928Q197L3298l4760Q694L7504l9399R325M0781m4616R747
423E699M4084n0060J0021M6637n5916J0430M9164o1769J0848N0986o7609J2587
435E102N2985p3855J3917N5619p8753J5418N7245q3031J7778N9318q7289K0499
447b5047O1500r1092K3904O4019r4735K7243O6356r7547L1303O8200j01086L5226
$$ plain form
359 -19376 20507 -42866 -10444 26301 -30170 42 32763 -17965 9397 39082 -6042 17198
371 17198 42668 2868 22554 44176 8811 24155 42140 11420 22706 37406 11106 17611
383 17611 29263 8391 10591 19044 3053 1374 7804 -3024 -8903 -3504 -8786 -18504 -13676 -13147
397 -13147 -26268 -21724 -15449 -31381 -26640 -14575 -33615 -28211 -10414 -32748 -26517 -2954 -28887
410 -28887 -21879 6856 -23072 -14875 18423 -16337 -7643 29861 -9538 -213 40568 -4048 5699
423 5699 49783 -277 9744 56381 465 10895 60059 -1710 9138 60124 -7485 5102
435 5102 58087 -15768 -1851 53768 -24985 -9567 47678 -35353 -17575 41743 -45546 -25047
447 -25047 36453 -54639 -30735 33284 -61451 -34208 32148 -65399 -34096 34104 -66982 -31756
459c1756P0491j03744L8596P1690j06419M2407P2751j09674M5475P3505j13001
470d9679M8323P3773j17077N1049P3295j21113N4026P2459j25710N6546P1865
481H7757j29683N8929P0211j33621O2070O8969j38064O5298O8219j42264O8581
492F402O7730j45668P2159O6612j48559P7098O5487j51728Q2034O4896j54130
503i7667Q7061O4061j56229R2574O3447j58116R7572O2735j59798J02401O1708
514E9749j60971J06981N9500j62524J12407N7006j64853J17238N4669j66776J20813
525C3239N1988j68578J23784M8718j70009J26487M4861j71190J29278M0448j72258
536h3232J32805L5677j73914J37279L1485j76179J41030K8875j77538J43431K6312
$$ plain form
459 -31756 38735 -65009 -26413 45277 -61142 -18735 54016 -55658 -10183 63322 -49679
470 -49679 -1356 72417 -44660 6389 79684 -41429 12597 85056 -40654 15892 87757
481 87757 -41926 17003 87214 -46407 15663 84632 -53432 11866 80085 -62179 6402
492 6402 74132 -71536 623 67235 -81324 -4226 61261 -90467 -8433 56463 -97667
503 -97667 -10606 53455 -102774 -10200 53247 -104869 -7297 55438 -104360 -1959 59749
514 59749 -101222 5759 65259 -97265 15142 72148 -92705 24533 79202 -87574 33239
525 33239 85227 -83351 40433 89151 -80858 45629 90490 -80700 48578 89026 -83232
536 -83232 49573 85250 -88664 48615 80100 -96079 44951 73826 -103712 39719 66031
547F6031j76724J45881K2243j74610J49733J7421j73379J55472J2659j73457J62031
558C3301R365j74670J67699P820j75366J71016O602j73540J72824K969j69476
569a21456J75820m164j66084J81763j1897j66242J88884j7439j69011J94363j9960
580F4577j71787J95587k1556j70553J93827k6140j65413J93112l5187j59233J96841
591I4075m6531j57210K04908n3975j60523K11166n5044j63722K11559n3313j61383
602a29993K06929n4574j52043K03772o2946j41090K07358p4897j35085K16725
612H4156q3754j36963K25936q3987j41701K26757p8760j40203K19842p7368j29668
623a15713K12608q5548j15726K13734j01375j08274K23753j14106j11384K34342
$$ plain form
547 66031 -110693 35188 57431 -117179 32554 49975 -123404 32068 44727 -128730 33301
558 33301 42666 -132004 35695 43515 -131851 39165 45767 -127773 45051 48020 -121456
569 -121456 54364 50200 -115884 65879 53982 -112260 76624 59185 -109826 84537 64577
580 64577 -107210 88377 66821 -103732 90095 63955 -101458 91654 56467 -102766 94075
591 94075 47544 -109666 95242 41267 -119256 91910 36866 -126856 84703 31390 -129993
602 -129993 76936 22362 -129681 74091 11145 -129945 77413 2516 -132569 84156
612 84156 402 -136561 89375 5388 -136313 90444 11684 -128519 91323 13955 -115713
623 -115713 96895 11347 -104379 109355 7980 -100294 123459 9353 -102031 132311
633A32311j16827j19734K36380j10850j22386K26760j06864j12657K14948j14816
643F265r5958K12638j32968q4485K23335j49803q6638K38013j53500r6575K42788
654A23112j44779j01350K33522j35324r1431K18234j38444p0463K12119j55592
664e0396n3642K22013j74325n2621K39084j79857o4295K47162j69023p3362K37088
675A27826j54655o6303K17439j53289m5402K05106j69212k6176K10391j90644
685d4919k3189K26802k00025l6334K36843j90745m9949K28396j74172m7487K06638
696A31859j68279k7441J89598j81914m728J91737k04366K823K08680k16928p424
707h6383K23232k09943k2149K19983j91594k2696K00144j81075l592J80918j90299
$$ plain form
633 132311 15484 -104250 132130 21280 -101106 125654 18790 -93867 121081 6265
643 6265 -89693 122945 -10023 -94508 128827 -20976 -107614 130399 -23101 -119676 123112
654 123112 -21667 -123017 110505 -24819 -116250 101984 -36460 -106923 105196 -50396
664 -50396 -104038 117975 -56350 -108971 130113 -49744 -114039 133123 -35900 -109262 127826
675 127826 -26829 -93132 124307 -28982 -74384 130722 -38490 -64666 145725 -44919
685 -44919 -68108 158694 -41331 -77665 159178 -31567 -81516 146880 -27292 -74779 131859
696 131859 -36420 -63861 125737 -56177 -60905 130832 -73534 -70711 137969 -78959 -86383
707 -86383 136849 -73094 -95243 124740 -66854 -89550 110594 -70481 -74073 106845 -83454
718h3454K2342J78886k12785L5528J94831k29521K8104K12109k26342J1483K12265
729A43446k08388N835J93167j93896K0388J69067j98465M6503J60022k20274O3165
740a9430J70878k39960N8778J87988k40961M0737J91382k22984L0124J73881k04490
751g4057M0126J48336k02310O4526J34723k19087Q4209J42069k37883Q4268J59311
762A24231k40406O8517J66776k23448N5693J53880k02092O1376J30077j95184
772a00580Q3077J13998k07108J03733J17096k25328J07284J32043k31405R4163
782a3027J40624k19330Q0252J31214k00255Q0928J09136j91422R7800R1296k00183
793i2967J16822Q9625k17071J22824J00952k25703J12972J09985k17466R9581
$$ plain form
718 -83454 -61112 117774 -95011 -59483 135348 -94173 -66069 146040 -80302 -68819 143446
729 143446 -64942 -59107 134060 -59836 -39448 129619 -68846 -22343 137679 -82595 -19430
740 -19430 151448 -88512 -29734 158254 -82707 -41970 149412 -73572 -43448 130433 -74057
751 -74057 -33931 114405 -87905 -23379 111344 -107743 -23534 118535 -119348 -35080 124231
762 124231 -116175 -47658 119118 -104330 -48637 105243 -96849 -35473 94604 -100580
772 -100580 -17503 96495 -110613 -6880 110216 -115112 -7828 124215 -107190 -13027
782 -13027 127597 -91733 -11481 119733 -80522 406 109542 -81880 15920 107216 -92967
793 -92967 23855 113480 -103591 19233 120185 -105518 7454 117439 -100027 -446
803d46J04053j99759R7418Q5721j88231J10300O8708j91722J27595O5028k03850
814a25185J35487P3902k11207J29252Q3375k04430J17260Q1435j88340J12724
824D273O7609j75097J20685N1949j74303J33814M6321j82153J40383N0941j88016
835a03594J35738N7646j84097J25358N6387j72196J19039M5705j60902J22136
845D1220L2205j57921J30806K4882j62453J36565K6106j67213J34215L0475j64747
856i5860J27048L0104j56018J22273K3448j46160J23726J3426j41072J30322P114
867C8351j41609J35638O210j43204J36209Q663j41149J31784R099j33846J27911
878C4057M377j25660J27828k909j20202J30598r053j18753J33587j1685j18907
$$ plain form
803 -446 103607 -96152 1266 86987 -101244 9056 77764 -113958 13637 78665 -125185
814 -125185 10302 84204 -127003 2249 85624 -118806 -1546 79889 -108451 4273
824 4273 71882 -103215 17470 69419 -104884 28930 75251 -106902 33481 84422 -103594
835 -103594 32144 89790 -94307 31051 87438 -84758 34281 79986 -80916 41220
845 41220 73425 -84496 46310 71192 -91261 45304 71410 -95803 38412 68887 -95860
856 -95860 31188 61292 -94726 27547 50995 -95165 28561 41987 -99085 31237 38351
867 38351 -103258 32380 38590 -104614 31595 40258 -100891 30893 39992 -93854 34057
878 34057 38434 -87226 40602 37693 -82509 48089 39036 -79717 53870 42185 -76722
889g6722J32848j1513j17097J28964j1953j12532J24007j4796j06025J20929k0063
900C6047j00930J20768k4761r8419J21071k6956r6943J19726k7039r4557J16398
911D4405k6726r0214J12400k7647q4754J09818k9975p9584J08767l2160p5766
922g1436J08512l3389p3298J07760l3328p0682J05498l3243o6976J02760l3892
933H286o3016J00149l5444n9395R8350l7117n6646R6780l8948n4496R5234m0112
945A3625n2730R2981m0914n0589R0253m1651m7866Q7327m3058m4888Q5115m4304
957C301m2527Q3098m4899m0235Q1228m5200l7800P9192m5024l5201P7069m4893
969a1891l2328P4826m4428k9288P2578m3933k6539P0512m3381k3982O8375m2332
$$ plain form
889 -76722 56126 44613 -72484 56480 44527 -68005 56002 41206 -64819 56110 36047
900 36047 -64883 55885 31124 -67295 53776 26820 -70123 49603 22564 -71993 44405
911 44405 17679 -72535 39865 12218 -72536 37282 7307 -72277 36490 4330 -71436
922 -71436 37076 3687 -69611 38149 4821 -65861 39637 6394 -60582 42178 8286
933 8286 -54730 45419 9975 -49420 48930 11813 -44833 51947 12999 -41497 53737 13625
945 13625 -39105 53876 12962 -37627 52626 10975 -36891 50436 7378 -37510 47605 3301
957 3301 -39226 43872 -1027 -41262 39966 -5234 -43034 36158 -8866 -44067 33002 -11891
969 -11891 -44219 30607 -13821 -43109 29469 -14464 -41003 29509 -13872 -37854 30521 -11811
981a1811k1878O5813m1468j9566O3349m0978j7895O0838m0128j6163N7795l9551
993a643j4485N4886l8991j3198N1836l8430j2102M9153l7585j1379M6115l6658
1005b481r880M3551l6177r106M1293l4861q012L8672l3913o721L6675l2505n562
1018a9027L4413l0890m345L2782k9307l349L0935k7481k091K9206k5997j337K7657
1031A1169k4010m80K5540k2287L91K3749k0874O42K1901j9231Q42J9631j7607
1044f24N85J7693j6014M76J5304j4652J99J3557j3332l90J1363j1736o01R422
1058A1250j0300j067P666q445j430O144o556j895M767m436k204L377k511k366
1072h006K492m84k648J452J637k816M90L765l018m15N830l643j393Q146m375k319
$$ plain form
981 -11811 -33689 32124 -9344 -28910 34439 -6539 -24434 36404 -3724 -19887 37908 -1643
993 -1643 -16128 38758 -233 -13431 38405 -25 -12127 37026 -559 -11938 34177 -2481
1005 -2481 -12361 31190 -4987 -14093 27200 -7661 -15673 22999 -10914 -17635 19040 -13465 -19027
1018 -19027 15386 -15504 -19849 12933 -16374 -19723 11212 -16269 -18360 10846 -15151 -16488 11169
1031 11169 -12841 -13321 12219 -10068 -9677 14072 -6802 -6160 15741 -3490 -2648 16983 -624
1044 -624 -39 17654 1640 2116 17420 2768 2967 16524 3192 2802 14165 2429 1828 11250
1058 11250 950 -117 7549 -896 -2326 3818 -2738 -4633 134 -4302 -6506 -3129 -5640 -8006
1072 -8006 -5514 -5998 -8646 -7194 -5557 -8373 -7883 -4118 -7136 -7551 -1721 -5364 -6757 1389 -2986 -5305
1088e305R979n052l197J1754o185m037J3429p483m931J5070q930o173J6866j0137
1102E668p391J8362j1750q003J9964j3508q654K1556j5166r232K3237j6734r537
1115a1188K4844j8205r588K6738j9671r829K8730k0942r739L0544k2291r580L2327
1128A2150k3494r137L4123k4942q770L5824k6288q012L7207k7992p653L8846k9370
1141g508p637M0079l0983p233M1203l2605p024M2159l4626o499M3155l6622o337
1154a0478M3899l8398n896M4399m0496n230M5428m2387n013M6355m4156m129M7097
1167C0995m6150l237M8194m7829k227M9090m9533r47N0262n1190K15N1068n2666
1180b3955J883N1897n4293L014N2815n5695M645N3286n7530O067N4352n9265P180
$$ plain form
1088 -5305 4674 -378 -3575 8179 1994 -2043 11386 3903 -1028 14042 5112 -1061 15805 5668
1102 5668 -1723 16639 4889 -3114 16850 3342 -5312 16244 1078 -8154 15083 -1651 -11188
1115 -11188 13656 -4549 -14137 12601 -7070 -16899 11831 -9111 -18850 11694 -10597 -20177 12150
1128 12150 -11344 -20481 13642 -11300 -20070 15754 -10534 -18546 18661 -9331 -16984 21862 -7508
1141 -7508 -15145 24934 -6049 -13282 27921 -4684 -11708 30451 -4175 -10674 32481 -4141 -10478
1154 -10478 33421 -4977 -10873 33526 -6970 -12200 33228 -9159 -14172 32183 -11973 -16102 30995
1167 30995 -15155 -18392 29802 -18027 -20254 28836 -20697 -21644 28618 -22572 -22357 28711 -23955
1180 -23955 -22072 29825 -24468 -21454 31361 -24334 -19689 33597 -23933 -17866 36486 -22779 -15599
1193a5599N4683o0822Q474N4920o2423R601N4706o4051J0968N4675o5791J2031
1205h628N4605o7525J3142N4470o9041J4043N4269p0393J5147N3928p1694J6665
1217a1012N3282p2886J8482N2908p4183K0093N2792p5425K1808N2714p6490K3323
1229a4594N2651p7108K5201N1841p7762K7368N1093p8597K9782N0194q0091L2297
1241g725M9796q1531L4036M9475q2542L5527M8753q3199L6832M7418q3627L8929
1253B142M5211q4655M1678M3382q6513M4271M2447q8278M5863M1825q9172M6740
1265D941M0781q9039M7643L8805q8416M9241L6365q8184N2005L4051q8895N5012
1277D310L2835r0109N7011L2925r0766N7446L2770q9617N7504L1073q7363N8456
$$ plain form
1193 -15599 39084 -21738 -13264 41656 -20767 -11166 43540 -20511 -9543 45132 -20659 -8628
1205 -8628 45977 -21548 -8406 46064 -22977 -8934 45335 -25058 -9911 44017 -27677 -11012
1217 -11012 42270 -30616 -12134 40774 -33409 -13316 39476 -35949 -14141 38573 -37917 -14594
1229 -14594 38057 -39051 -13850 37991 -39771 -12403 38690 -39907 -10125 40069 -40022 -7725
1241 -7725 42071 -39460 -5424 44051 -38491 -2964 45789 -37410 -578 46840 -36787 2142
1253 2142 47353 -37302 4376 47758 -38755 5516 47963 -40315 5548 47373 -41799 4941
1265 4941 45722 -43317 4326 43131 -45285 3956 40321 -47863 4142 38193 -50702 4310
1277 4310 37145 -52964 4047 36972 -53794 3652 36422 -53195 4309 35382 -51981 6475
1289F475K8169q5936O1122K5313q6352O4383K3643q8014O6542K3723q9190O6424
1301A6302K3967q8279O5324K2422q5708O5413J8376q3665O8129J4118q4167P1862
1313B4094J1783q6345P4572J1713q8233P4666J2460q7505P3384J1112q4520P3072
1325B0253P105q1081P5674J734q0120Q0703j558q2271Q4674j266q4609Q5257M25
1338B4920q4128Q3121K17q0093Q1586l902p5175Q3372j0012p3161Q8203j4549
1350B0399p4858R2480j4947p7975R2745j2452p8050Q9091j1737p3764Q5646j5494
1362B1084o7941Q5913k2234o4711R0101k7415o6231R4606k8193o9462R5351k5503
1374A5365o9986R1802k3694o5850Q7467k6282n9043Q6747l2936n4470R1012l8888
$$ plain form
1289 6475 34644 -51292 9830 35143 -51209 13174 36817 -51197 15345 39068 -50122 16302
1301 16302 40269 -48010 17314 39736 -45972 19441 37817 -45848 22281 36399 -47768 24094
1313 24094 35877 -50468 24104 35817 -52416 22250 34710 -52795 20589 31701 -52819 20253
1325 20253 27358 -53723 21951 23685 -56435 24268 22710 -59561 25113 23847 -60762 24495 24920
1338 24920 -59208 23913 24130 -55963 25623 21721 -53454 29918 19906 -53255 34948 20399
1350 20399 -54459 38021 23074 -54901 37844 25392 -52658 36433 24696 -49068 36578 21084
1362 21084 -46857 39056 16822 -47889 42212 14797 -51434 43172 14979 -54483 40868 15365
1374 15365 -54621 37181 13487 -52363 35104 8822 -50221 36526 3590 -50880 40132 1244
1386A244n4934R6450m0380n7995R8197l7630n9141R4901l5138n5328R0196l7176
1398C266m8498Q8505m3390m3101R1635n0136m2585R6808n2585m5780R8733n0591
1410B281m7405R5842m8037m4638R0590m8975l8193Q7570n4322l2466Q9232o0449
1422h970l1033R3396o3464l3237R5921o1705l5665R3735n8010l3851Q8494n7217
1434a1606k8023Q4507o0576k1991Q4691o5700j9619Q8060o8469k0973R0609o7362
1446a6452k3084Q9366o3876k2508Q4743o2097j8030Q0076o4268j2361P9019o8939
1458a8411r163Q1151p2434r662Q3307p2438j1281Q2490p0104j1364P8834o8377
1470a7452q048P4388o9513k707P2156p3272J150P3074p6686K088P4961p7458P60
$$ plain form
1386 1244 -53690 42760 2380 -55615 42582 4952 -54189 40712 5574 -49754 40442 3266
1398 3266 -45232 43273 -117 -43218 48417 -1719 -44304 52504 -81 -45861 52872 2281
1410 2281 -45124 50718 2681 -41957 48633 -342 -38535 49035 -5287 -37753 51479 -8970
1422 -8970 -40003 53393 -10071 -43308 52613 -9092 -44757 48978 -9032 -42883 45611 -11606
1434 -11606 -39629 44878 -15698 -37689 47002 -18698 -38317 49743 -18726 -39699 50910 -16452
1446 -16452 -39536 49830 -14046 -36554 48189 -13908 -31938 48138 -16130 -28491 50528 -18411
1458 -18411 -27574 53577 -18857 -28519 54788 -17650 -28931 53559 -16545 -27909 50925 -17452
1470 -17452 -25500 48888 -20625 -23332 48824 -24448 -23298 49776 -26910 -24822 50139 -27319 -26559
1483b6559P5079p5316M68P2139p2845K895O8099p2678P307O5312p4870J1386O5074
1496D5491p7542J2820O6257p8235J1944O6574p6269J0985O4145p3525J2192O0073
1508D4910p2365J5373N6908p3478J8472N5914p5377J9719N6332p5952J9111N6244
1520D5811p4506J7985N4389p2034J8385N0971p0344K0758M7870p0672K3577M6511
1532C8701p1989K5108M6741p2494K5004M6511p1221K4669M4949o9249K5271M2349
1544C4350o7547K7164L9589o7269K9573L7992o7896L1207L7367o8083L1559L6878
1556C4884o7187L1344L5338o5531L1832L2927o4118L2921L0508o3442L4359K8550
1568C2385o3241L5230K7457o2883L5447K6582o1985L5088K5440o0296L4930K3436
$$ plain form
1483 -26559 48520 -26796 -26328 45811 -27034 -24139 43960 -28718 -21411 43901 -30969 -19583 45491
1496 45491 -32051 -19231 47026 -31209 -19265 47309 -28960 -17975 46170 -27355 -15163 44910
1508 44910 -27455 -12082 44826 -28652 -10180 45734 -29643 -9924 46408 -29544 -10433 45811
1520 45811 -28695 -10710 43679 -28355 -9970 41001 -29343 -8585 39285 -31387 -7810 38701
1532 38701 -33288 -8180 38561 -33933 -8929 37582 -33639 -8970 35979 -33270 -7999 34350
1544 34350 -33197 -6033 33556 -33713 -4140 33852 -34044 -2837 34530 -33553 -1994 34884
1556 34884 -32303 -959 34379 -31152 680 33607 -30511 2410 32918 -30524 3835 32385
1568 32385 -30856 4374 31831 -31052 4395 30977 -31008 4080 29520 -30776 4154 27590
1580B7590n8590L5426K1342n7266L5949J9951n6280L6321J8921n5347L6273J8208
1592B2498n3962L5810J7109n2317L5706J5798n0646L5574J4323m9111L5872J3014
1604A9668m8002L5907J2091m6900L5549J1193m5601L5155J0126m4274L4789R029
1616A8730m2988L4568P887m1817L4302O734m0768L4057N718l9717L3910M717l8540
1629b3207L3389L989l7320L2903L218l6067L2515K328l4799L2214J441l3501L1805
1642H908Q25l2274L1338J87l0886L0830l67k9776L0375r89k8317K9654j604k7047
1656a9143K9015j920k5946K8168k312k4746K7525k880k3522K6661l404k2338K5793
1669A0951l718k1356K4876m013k0225K3946m382j9092K3041m603j8166K2176m857
$$ plain form
1580 27590 -31000 4426 25768 -31498 4451 24402 -31878 4443 23364 -31983 4290 22498
1592 22498 -31464 4346 21455 -30862 4844 20642 -30004 5570 19893 -29218 6654 19668
1604 19668 -28334 7573 19664 -27236 8313 19506 -26095 9060 19186 -25088 9701 18730
1616 18730 -24258 10310 18197 -23620 10682 17416 -23352 10705 16423 -23294 10616 15333 -23207
1629 -23207 10182 14171 -23149 9754 12972 -23095 9420 11748 -23051 9163 10604 -22897 8908
1642 8908 9733 -22541 8797 8984 -21902 8928 8561 -21215 9160 8171 -20146 9508 7904 -19143
1656 -19143 9872 7952 -17994 10174 7862 -16884 10641 7761 -15761 10900 7496 -14842 10951
1669 10951 7233 -14123 10753 6740 -13485 10461 6079 -13013 10028 5425 -12741 9435 4578
1682D578j7221K1488n188j6083K0675n446j4909J9844n691j3898J9041n666j2906
1695a1382J8125n731j1888J7378n719j0995J6600n782r994J5860n804r157J4983
1708F494n732q303J4075n585p621J3122n450o693J2156n271o102J1202n019n560
1722d287J0248m818n042R374m472m543Q358m051m014P305l630l512O483l272l092
1737b965N479k615k807M549k021k408L883j643k010L057r52j815K247l12j517
1752a850J368K94j113M94J026r51k69J725q48j000K369q48j727L024p57k452L596
1769B081p30l287M459q08m023N066p50m744N731p84n531O486j088o200P301j092
1785B087o861Q009j261p414Q760j419q024R600j597q702J0348j714r202J1213
$$ plain form
1682 4578 -12643 8845 3657 -12426 8249 2803 -12106 7738 2047 -11851 7190 1524 -11382
1695 -11382 6743 1012 -10876 6502 783 -10212 6388 606 -9388 6472 668 -8489 6494
1708 6494 762 -7541 6534 949 -6672 6450 1000 -5693 6463 1192 -4910 6292 1273 -4287
1722 -4287 5961 1143 -3899 5475 1003 -3540 4818 767 -3247 4058 428 -3084 3399 127 -2965
1737 -2965 2514 -101 -2908 1641 -380 -2788 1095 -548 -2558 499 -453 -2268 -21 -333 -1850
1752 -1850 -482 -188 -1301 -807 219 -732 -1001 724 -124 -1124 1245 397 -1330 1694 937 -1515 2081
1769 2081 1351 -1936 2523 1715 -2308 2758 2008 -2736 2995 2211 -3320 3166 2078 -4122 3179 2087
1785 2087 -4774 3235 1974 -5440 3320 1901 -6123 3477 1880 -6822 3526 1812 -7390 3823
1799C823j961r766J2229k295j0396J3115k563j0859J4014k966j1272J4765l224
1812B644j1653J5455l608j2184J6351l877j2643J7058m345j2993J7947m850j3530
1825a0228J8773n291j3818J9514n779j4177K0335o344j4414K1067o861j4877K2056
1838I956p439j5036K2658q033j5118K3579q770j5303K4520r361j5561K5362j0120
1851A334j5523K6072j0816j5458K6822j1579j5463K7712j2378j5392K8434j3198
1863E67j5326K9213j4150j5220K9951j4901j5139L0594j5699j4948L1292j6569
1875c35j4738L1847j7466j4603L2431j8185j4446L2957j8951j4121L3528j9846
1887a928j3933L4047k0430j3671L4450k1174j3429L4911k1991j3044L5355k2661
$$ plain form
1799 3823 1862 -7904 4325 2030 -8366 4749 2186 -8673 5341 2375 -8897 5868 2644
1812 2644 -9009 6446 2838 -9346 7005 3128 -9515 7543 3198 -9795 8152 3302 -10228
1825 -10228 8545 3254 -10564 8950 3171 -11006 9329 2985 -11429 9638 2777 -12100 9956
1838 9956 2517 -12519 10139 2106 -13012 10567 1797 -13506 11014 1653 -13908 11454 1334
1851 1334 -14189 11883 1067 -14391 12431 852 -14611 13101 723 -14669 13765 567
1863 567 -14759 14454 304 -14916 15035 134 -15005 15589 -110 -15058 16234 -335
1875 -335 -15073 16774 -692 -15295 17136 -1049 -15495 17462 -1489 -15610 17918 -1928
1887 -1928 -15861 18186 -2244 -15915 18535 -2639 -16068 18843 -3148 -16192 19163 -3498
1899c498j2874L5918k3372j2549L6282k4067j2177L6622k4831j1790L7061k5698
1911d973j1387L7545k6374j0940L7742k7303j0324L8176k8223r865L8427k9027
1923f526r296L8733k9931q588L8871l0858p899L9155l1782p219L9342l2635o451
1936a5084L9365l3578n618L9525l4407m959L9676l5215m256L9611l5836l366L9442
1949B5300l6644k656L9623l7345k008L9357l7999j044L9238l8543l90L9093l9017
1962a3035K36L8875l9538Q86L8679l9926J695L8240m0471K462L8128m0872L081
1975a1560L7762m1208L750L7438m1528M410L7102m1855N169L6621m2182O098L6152
1988B6169m2664O906L5827m3109P616L5609m3586Q364L5184m3776R184L4393m4018
$$ plain form
1899 -3498 -16372 19546 -3826 -16375 19907 -4160 -16337 20285 -4546 -16336 20725 -4973
1911 -4973 -16360 21185 -5189 -16129 21613 -5690 -16014 22162 -6061 -15926 22501 -6526
1923 -6526 -15822 22911 -7020 -15608 23263 -7595 -15494 23661 -8121 -15340 24002 -8633 -15084
1936 -15084 24281 -9297 -14915 24610 -9797 -14756 24920 -10295 -14551 25060 -10776 -14142 25300
1949 25300 -11344 -14000 25623 -11722 -13730 25627 -12372 -13416 25822 -12721 -13111 25982 -13035
1962 -13035 -12799 26076 -13462 -12576 26103 -13823 -12128 26112 -14359 -11897 26231 -14641 -11560
1975 -11560 26202 -15006 -11256 26182 -15346 -10936 26166 -15689 -10520 26101 -16081 -9983 26169
1988 26169 -16495 -9589 26238 -16871 -9255 26354 -17232 -8868 26316 -17460 -8276 26117 -17901
2001a7901J0193L3940m4604J1223L3363m5039J2103L2973m5547J2908L2547m5781
2013a9622J3677L1857m5872J4543L1012m5948J5502L0069m6227J6722K9439m6678
2025b1526J7573K9018m6921J8172K8493m6787J8696K7823m6586J9361K6761m6445
2037b2368K0389K5810m6529K1347K5100m6673K2061K4668m6809K2452K4313m6557
2049b2796K2653K3500m6115K3222K2408m5770K4098K1380m5820K5127K0623m6196
2061b3686K5965J9985m6117K6312J9460m5878K6651J8574m5174K7148J7292m4773
2073b4241K8166J5906m4546K9278J4956m4828L0334J4246m4824L0936J3493m4389
2085b5513L1197J2677m3636L1662J1351m2971L2509R893m2474L3494Q769m2459
$$ plain form
2001 -17901 -7708 26232 -18372 -7149 26214 -18825 -6722 26251 -19296 -6388 26159 -19622
2013 -19622 -5945 25912 -19960 -5417 25595 -20353 -4851 25218 -21009 -4287 25152 -21526
2025 -21526 -3953 25065 -21856 -3684 24809 -21978 -3282 24541 -22045 -2684 24077 -22368
2037 -22368 -1979 23831 -22698 -1351 23749 -22924 -863 23805 -23004 -552 23761 -22796
2049 -22796 -143 23357 -22758 464 22872 -22898 1200 22580 -23240 1887 22510 -23686
2061 -23686 2279 22264 -23853 2459 21919 -23959 2692 21266 -23908 3240 20532 -24241
2073 -24241 3925 19831 -24715 4563 19519 -25309 5025 19271 -25553 5383 18876 -25513
2085 -25513 5684 18361 -25275 6387 17738 -25233 7276 17169 -25305 8189 16958 -25501
2097b5501L4405P910m2316L4899P323m1946L5035O440m1057L4942N394m0039L5238
2110A0727M180l9412L5790K969l8931L6403K160l8850L6784J719l8419L6624J229
2123A2973l7690L6331N96l6539L6215o80l5502L6622j879l4826L7251k799l4703
2136b4630L7751l155l4442L7650l434l3707L7254m003l2448L6950n160l1254L7267
2149A4639o645l0495L7977p683l0245L8388q147l0044L8284q331k9433L7775r043
2162F997k8142L7386j0118k6955L7416j1408k6010L7864j2479k5743L8354j2882
2174D280k5640L8134j2856k4997L7432j3049k3991L6795j3684k2639L6549j4654
2186A680k1662L6882j5523k1360L7068j5764k1103L6834j5606k0712L6143j5493
$$ plain form
2097 -25501 8904 16814 -25502 9397 16720 -25226 9809 16249 -24808 10134 15528 -24511 10727
2110 10727 14907 -24505 11285 14254 -24677 11726 13886 -24964 11820 13539 -24880 11744 12973
2123 12973 -24717 11614 12210 -24329 11886 11206 -24296 12326 10447 -24379 12872 10073 -24630
2136 -24630 13121 9966 -24476 13174 9740 -23967 13287 9284 -23164 13786 8626 -22628 14639
2149 14639 7994 -22501 15476 7793 -22452 15936 7789 -22255 16029 7698 -21735 16040 6997
2162 6997 -21145 16241 6123 -20832 16584 5176 -20834 17030 4551 -21192 17162 4280
2174 4280 -21360 16774 3918 -21079 16353 3304 -20687 16108 2424 -20215 16334 1680
2186 1680 -19982 16900 1377 -19983 17085 1321 -19782 17052 1446 -19266 16877 1384
2198A384j9746L5406j5973j8548L4873j6807j7629L4962j7487j7228L4991j7747
2210D51j7063L4662j7671j6535L3984j7842j5697L3235j8102j4743L2710j8800
2222a411j3780L2623j9503j3240L2609j9870j2790L2333j9888j2185L1677j9938
2234c363j1282L0939k0312j0148L0441k0720r311L0148k1108q584K9773k1246
2246d773q058K9426k1205p636K8844k1170o861K8026k1261o017K7343k1393n332
2259a0067K6774k1446m880K6157k1370m536K5700k1350m063K4958k1009l707K4258
2272A5419k0814l212K3512k0631k812K2899k0545k339K2415k0315k078K1845k0030
2285f686j638K1222j9754j220K0583j9468p40K0014j9226l54J9407j8856N5J8802
$$ plain form
2198 1384 -18362 17044 1071 -17477 17396 589 -17040 17922 435 -16793 18198 451
2210 451 -16612 18050 379 -16156 17828 -14 -15711 17524 -578 -15321 17389 -1411
2222 -1411 -15191 17432 -2071 -15311 17298 -2572 -15362 16971 -2917 -15102 16575 -3363
2234 -3363 -14645 16294 -4018 -14166 16275 -4445 -13756 16392 -4716 -13300 16473 -4773
2246 -4773 -12831 16595 -4610 -12246 16598 -4572 -11433 16593 -4668 -10685 16658 -4735 -10067
2259 -10067 16707 -4739 -9619 16538 -4832 -9368 16332 -5018 -9081 15877 -5132 -8839 15419
2272 15419 -5395 -8607 14905 -5726 -8538 14361 -6184 -8523 13892 -6423 -8501 13344 -6686
2285 -6686 -8324 12898 -6856 -8076 12507 -6961 -7701 12313 -6913 -7267 12140 -6716 -6661 12141
2299A2141j8787O15J8209j8584R01J7640j8296J293J6946j8019J564J6422j7819
2312e774J934J5731j7577K148J5197j7385K455J4497j7106K685J3898j6790K921
2325c166J3294j6434L074J2731j6058L310J2226j5675L420J1719j5298L480J1260
2338G883j4827L666J0703j4313L932J0201j3917L987R738j3412L932R366j2864
2351e925L982R029j2660M110Q503j2099M056Q057j1718M100P557j1273M008P061
2365F788j0888M117O497j0417M018O063j0017L885N663r598L808N317r317L770
2379c11M791q730L805M385q326L719M023p819L642L734p311L532L317o784L499
2394h34L051o226L356K811n848L211K641n325K979K387m836K804K062m357K552
$$ plain form
2299 12141 -6646 -6031 12178 -6406 -5505 12135 -6161 -4868 12078 -5941 -4377 12045 -5774
2312 -5774 -3840 11891 -5686 -3538 11659 -5726 -3271 11226 -5880 -3195 10703 -6087 -3166
2325 -3166 10128 -6306 -3232 9499 -6559 -3249 8977 -6698 -3278 8441 -6857 -3377 7883
2338 7883 -6944 -3278 7425 -6888 -2956 7245 -6672 -2685 7053 -6359 -2427 6939 -5925
2351 -5925 -1943 7086 -5574 -1464 7039 -5060 -1004 7053 -4665 -565 6992 -4281 -273 6788
2365 6788 -4100 17 6514 -3903 115 6178 -3839 46 5709 -3889 -81 5236 -4081 -311
2379 -311 4480 -4250 -445 3940 -4386 -667 3356 -4463 -821 2913 -4398 -866 2451 -4333 -834
2394 -834 2217 -4009 -653 2158 -3690 -479 2162 -3163 -184 2203 -2633 171 2233 -2124 428
2409D28K024l967K294J631l365J934J507l109J629J401k846J370J154k289R32
2424G28R62j912O31Q85j600L00Q19j163j37P35o73m64P16l64o95O54j3r58P21
2443h28M65j313P12Q41j615P29J187j828Q56J445k163R10J926k661R81K203k903
2460a056J012K344l130R92K610l587J156K821l928J230L043m411J294L166m803
2475a247J443L385n283J639L556n672J785L633n928J826L908o246J990M140o634
2490c705K327M126o897K613M368p289K887M574p596L153M675p842L418M800q092
2505d480L672M935q468L902N028q786M263N033r058M446N155r540M681N121r926
2520d022N047N020j0129N253M955j0515N599M802j0937O060M734j1374O425M598
$$ plain form
2409 428 2452 -1515 779 2410 -955 979 2486 -623 1006 2407 -439 931 2085 -204 728
2424 728 1690 -222 409 1294 -306 -6 813 -350 -487 248 -425 -889 -173 -537 -1232 -578 -591 -1549 -828
2443 -828 -363 -1676 -964 -123 -1738 -1009 178 -1650 -794 651 -1512 -602 1324 -1337 -356 1847 -1056
2460 -1056 -44 2300 -830 162 2772 -815 341 3162 -766 464 3507 -904 390 3556 -1247
2475 -1247 196 3581 -1702 -63 3493 -2179 -394 3239 -2689 -863 3045 -3201 -1211 2929 -3705
2490 -3705 -1378 2748 -4149 -1536 2832 -4457 -1570 3004 -4592 -1439 3236 -4606 -1188 3612 -4480
2505 -4480 -808 4127 -4341 -439 4589 -4197 66 5099 -3959 487 5642 -3898 783 5904 -4022
2520 -4022 1025 6045 -4084 1169 6124 -4391 1208 6010 -4927 1133 5867 -5507 918 5516
2534E516j1603O726M579j1934P144M482j2173P578M291j2399Q199M057j2621Q607
2548D49M074j2945R152L939j3110R502L905j3422J0050L720j3476J0325L533j3732
2562h036J0794L310j3921J1169L134j4280J1659K831j4438J1900K747j4658J2130
2575D341K418j4765J2437K139j5060J2924J813j5244J3325J554j5544J3725J398
2588E461j5611J4034J143j5627J4286Q68j5575J4755M70j5629J5375J87j5809
2601a1672J5938j28j5845J6332k26j5934J6673o08j5680J6946j177j5520J7462
2614F561j699j5546J7920k115j5627J8355k472j5812J8780k953j5810J8843l188
2627E237j5622J9031l823j5370J9304m522j5258J9765m947j5417K0202n238j5599
$$ plain form
2534 5516 -6087 639 5218 -6716 428 4910 -7263 315 4606 -7793 406 4463 -8158 449
2548 449 4523 -8422 730 4669 -8441 1061 4966 -8456 1594 5314 -8162 2163 5696 -8036
2562 -8036 2758 6068 -7853 3316 6450 -7830 3829 6660 -7778 4122 6869 -7789 4341
2575 4341 6759 -8006 4431 6570 -8490 4434 6247 -8997 4328 5882 -9662 4063 5461
2588 5461 -10150 3884 5027 -10600 3686 4554 -11021 3734 4204 -11425 3950 4137 -11672
2601 -11672 4266 4138 -11707 4625 4399 -11535 5138 4530 -11150 5796 4619 -10901 6561
2614 6561 4862 -10684 7236 5121 -10506 7849 5377 -10435 8345 5392 -10418 8425 5237
2627 5237 -10385 8646 4823 -10547 8757 4235 -11023 8742 3795 -11622 8580 3342 -12257
2640a2257K0450n172j5552K0380n515j5069K0425n906j4621K0797o613j4398K1414
2653H363p102j4459K1964p204j4732K2256p109j4691K2020p152j4121K1843p830
2666B046j3396K2075q695j3139K2762r500j3284K3308r721j3610K3302r621j3589
2679a1062K2986r698j2954K2404j0354j1986K2553j1562j1459K3272j2639j1418
2691a1917K4018j2815j1872K4174j2513j1859K3757j2344j1029K2955j2777r667
2703a1889K2768j3924q691K3501j5049q665K4571j5435r277K5040j4820r600K4198
2716A2728j4111q878K3013j4426p405K2526j5676o363K3055j7050o302K4190j7605
2729b304p151K4645j6978p873K3894j6047p353K2414j6049n660K1392j7342m054
$$ plain form
2640 -12257 8193 3021 -12531 7849 2334 -12735 7690 1784 -12837 7960 1347 -13051 8363
2653 8363 1261 -13198 8766 1562 -13170 9086 1977 -12714 9306 2154 -11967 9876 2046
2666 2046 -11350 10725 2030 -11109 11653 2153 -11131 12177 2456 -11154 12148 2527 -11062
2679 -11062 11924 2226 -10728 11676 1322 -10664 11889 327 -11132 12140 -499 -11917
2691 -11917 12101 -714 -12586 11588 -925 -12784 10973 -1371 -12400 10555 -2222 -11889
2703 -11889 10879 -3045 -11736 11765 -3284 -11949 12622 -2813 -12090 12950 -1870 -11470 12728
2716 12728 -1383 -10261 12752 -1674 -9079 13447 -2229 -8592 14463 -2587 -8889 15301 -2304
2729 -2304 -9455 15190 -1788 -9661 14233 -1814 -9167 13247 -2802 -8462 12930 -4412 -8466
2742h466K1812j8984l672K3128j9757m566K4012j9056n301K3337j7791m758K1637
2755A1575j7438k925K0415j8599q59K0513k0404j18K1820k1266r90K2942k0768
2768f102j877K2217j9322j652K0353j8731P9J8654j9722K229J8264k1417K982
2781d045J9483k2727K278K0549k2340J104K0059k0663Q27J8350j9772K222J6524
2794A1849k0194M144J6131k1794N224J7191k3016M818J8327k2674L587J8404k1091
2807i094L064J6925j9737M160J5131j9880O192J4420k1295P461J5123k2554P296
2820b788J6180k2517O236J6298k1337N657J4910k0022O349J3053j9859Q005J1954
2833A2119k0973R311J2150k2339R516J2999k2543Q700J3188k1559Q018J2182k0305
$$ plain form
2742 -8466 13346 -5638 -9310 13818 -5939 -10505 13507 -5549 -10850 12487 -5304 -10062 11575
2755 11575 -5863 -8788 11627 -6972 -7831 12682 -7722 -7840 13980 -7286 -8276 14666 -6102
2768 -6102 -7979 14238 -5084 -6736 13617 -5114 -5035 13619 -6103 -3874 14390 -7027 -4045
2781 -4045 15438 -7289 -5011 15538 -6802 -5698 14361 -6302 -5475 12875 -6897 -4675 11849
2794 11849 -8345 -4201 11930 -9864 -4640 12551 -10465 -5647 12680 -9994 -6407 11997 -9094
2807 -9094 -6030 10895 -8842 -4682 10449 -9431 -3239 11181 -10114 -2653 12470 -10084 -2788
2820 -2788 13392 -9125 -2889 13409 -7928 -2271 12639 -7383 -1034 12019 -7840 165 12119
2833 12119 -8854 457 12607 -9732 -216 12783 -9760 -1060 12128 -9431 -1413 10769 -9536
2846i536Q385J0534j9864R869R437k0378J1209R258k1213J1643R909k1559J1220
2859a086J0323k0826J0484R847j9558J0560Q610j8817J1489P392j8944J2558P022
2872I054j9615J3042P408k0040J2681P770j9688J2036P429j8800J1733O410j8043
2885h623J2191N242j7903J2958M664j8372J3403M761j8712J3302M980j8427J2812
2898B276M841j7750J2654M103j6916J2934L151j6481J3655K519j6555J4210K365
2911E006j6591J4258K550j6208J3896K358j5616J3772J787j4890J3901J154j4576
2924i199J4253M90j4352J4480K19j4412J4546J2j4189J4208n1j3838J3805m36
2938E536j3284J3753r75j2991J3812j506j2766J3848j678j2669J3798j701j2386
$$ plain form
2846 -9536 -1151 9383 -10481 -612 8825 -11553 -344 8914 -12299 -656 9253 -12306 -1086
2859 -1086 9237 -11589 -1105 8742 -10816 -256 8354 -10463 1026 8418 -10526 2032 9054
2872 9054 -10561 2481 9889 -10151 2530 10300 -9388 2648 10077 -8723 3010 9420 -8623
2885 -8623 3568 8810 -9093 3865 8529 -9843 3560 8321 -10391 2911 7891 -10536 2276
2898 2276 7117 -10633 2021 6124 -10792 2142 5293 -11188 2467 4986 -11569 2641 5006
2911 5006 -11585 2673 5223 -10985 2911 5269 -10347 3425 5212 -9678 4223 5377 -9199
2924 -9199 5054 5544 -8808 5672 5891 -8521 6025 6037 -8152 6056 6005 -7833 5972 5536
2938 5536 -7748 6005 5030 -7961 5851 4345 -8421 5427 3749 -8920 4878 3177 -9209
2951i209J3602j777j1957J3313j892j1582J3219k008j1209J3190k167j0879J3265
2964C909k296j0616J3179k393j0230J3014k465r856J2788k646r521J2654k806
2977B715r216J2517l053q926J2250l197q655J2088l429q514J1850l706p972J1509
2991F261l882p759J1218m019p500J1056m119p240J0758m159o905J0514m180o647
3005f603J0430m283o299J0365m327o019J0110m177n677R909m201n318R562l949
3019d77n058R322l917m787R117l909m538Q854l943m292Q537l868m166Q266l893
3034A248m032P926l715l941P629l848l704P241l755l529O811l726l341O603l763
3049A04l246O332l603l066O126l642k701N746l394k556N521l225k269N251l121
$$ plain form
2951 -9209 4393 2616 -9341 3972 2080 -9502 3717 1709 -9500 3690 1523 -9356 3909
2964 3909 1613 -9003 4176 1783 -8447 4567 2102 -7754 5034 2388 -7133 5521 2715
2977 2715 -6501 6016 2963 -5963 6287 3090 -5565 6523 3094 -5420 6430 2724 -5248 6261
2991 6261 2379 -5380 5838 1819 -5681 5375 1256 -5984 4774 615 -6290 4224 44 -6603
3005 -6603 3827 -456 -6755 3610 -717 -6736 3374 -803 -6480 3429 -772 -6090 3472 -477
3019 -477 -5535 3787 -130 -4917 4200 291 -4247 4607 664 -3628 4909 1041 -3125 5141 1248
3034 1248 -2784 5142 1427 -2514 5115 1267 -2437 4804 1049 -2480 4331 605 -2736 3867 104
3049 104 -3142 3190 -413 -3479 2647 -995 -3696 2050 -1344 -3900 1621 -1604 -3873 1378 -1743
3064a743j885N016k962j814M826k775j608M687k579j391M301k510j237M051k299
3079G8j103L715k167j031L428j970j084L124j926r99K814j846r18K415j624r54
3095d8K215j599r08J991j500q57J601j134p76J284r66p83J185o59p03R30m95n91
3113a813Q16k35n53O80R9n60M62M09n19M24O12m63J03Q90m11j06J072n18k86J329
3133A432n66n12J512o70o83J567p82r09J880r67j147J983r97j357K134j220j444
3150g46K313j309j523K569j473j648K730j585j722L024j606j889L343j672j909
3165c103L643j885j851L827j826j940M187j980j949M383k151j865M638k309j976
3180b157M950k436k122M992k509k228N209k709k322N253k902k283N385l192k376
$$ plain form
3064 -1743 -3628 1388 -1574 -3388 1438 -1337 -2945 1742 -837 -2228 2073 -437 -1674 2377 78
3079 78 -1025 2690 523 -508 2920 950 -134 2990 1064 65 2879 1033 115 2530 906 -48
3095 -48 2167 568 -340 1651 151 -706 895 -239 -1015 269 -697 -1480 -295 -954 -1657 -727 -1222 -1813
3113 -1813 -997 -1232 -1785 -1105 -1006 -1566 -1104 -695 -1214 -790 -178 -641 -538 352 -59 -165 907 389 103 1432
3133 1432 866 354 1866 1196 513 2080 1298 389 2269 1302 155 2138 1141 -216 1918 698 -746
3150 -746 1567 258 -1265 1304 -169 -1817 913 -672 -2394 630 -976 -2865 478 -1194 -3103
3165 -3103 540 -1345 -3196 631 -1195 -3135 1052 -928 -2877 1506 -645 -2510 2128 -181 -2157
3180 -2157 2793 357 -1765 3227 718 -1510 3699 990 -1332 3921 1019 -1264 4121 929 -1447
3195a447N552l357k468N753l704k554N968l956k513O187m128k548O288m351k404
3210c682O504m579k211O687m807k153O934m988j894P042n170j834P272n237j655
3225c771P302n409j472P465n690j357P595n948j226P826o234j262P868o401j108
3240a822P853o670j047P833o990q29P896p342q30Q024p573p63Q079p877n21Q052
3256E473p998n11Q065q122l63Q129q282j11Q275q690J62Q460q802M16Q470q927
3272d356N27Q655r072Q26Q556r144J031Q518r298J435Q444r644J709Q499r912
3287c226J786Q607j0112J852Q446j0232K113Q270j0527K430Q036j0772K699P900
3301G270j1107K950P988j1498L122P909j1485L188P837j1558L432P565j1483L842
$$ plain form
3195 -1447 4105 748 -1720 4033 329 -2225 3743 -213 -2726 3461 -667 -3215 3073 -1278 -3682
3210 -3682 2822 -1757 -3968 2719 -2088 -4241 2693 -2295 -4189 2853 -2317 -4151 3121 -2116 -3771
3225 -3771 3531 -1878 -3350 4115 -1575 -2932 4663 -1285 -2511 5315 -919 -2181 5687 -714 -1822
3240 -1822 6031 -639 -1686 6147 -843 -1672 6224 -1118 -1948 6076 -1497 -2260 5819 -2058 -2579 5473
3256 5473 -2525 -3036 5029 -3093 -3456 4673 -3609 -3720 4555 -4135 -3973 4487 -4315 -3899 4571 -4356
3272 -4356 -3829 4826 -4246 -3420 5136 -4008 -2977 5541 -3757 -2322 6122 -3522 -1813 6686 -3226
3287 -3226 -1440 7167 -2945 -1093 7353 -2879 -766 7504 -3023 -593 7443 -3329 -630 7270
3301 7270 -3837 -887 7101 -4397 -1275 6634 -4851 -1663 6174 -5384 -1952 5613 -5870 -2028
3315b028P298j1676M274P340j2038M659P548j2250M748P689j2164M714P598j1967
3329f255M926P222j1833N328O940j2200N905O917j2674O171P177j3139O098P365
3343G948j3039N837P058j2720N892O424j2559O458N789j2847P090N706j3526P402
3357I13O018j4008P404O190j3773P007O049j3198P112N306j2822P854M520j2964
3371h392Q781M361j3639R357M807j4108R171N265j3857Q736N135j3034Q572M301
3385E456j2438R153L355j2565J0232K887j3368J0892L297j4105J0606L896j4045
3398f747R751L929j3203R281L098j2391R730J834j2379J0885J209j3187J1686
3411C496J680j4135J1619K506j4149J0713K834j3150J0097J972j1913J0523P00
$$ plain form
3315 -2028 5270 -6406 -2132 5208 -6830 -2171 5377 -6873 -2125 5564 -6600 -1886 5712 -6255
3329 -6255 -1329 5893 -5940 -612 6328 -5872 33 6950 -5724 447 7624 -5515 583 7948
3343 7948 -5091 746 7804 -4916 976 7400 -5159 1299 7088 -5759 1331 7037 -6489 913
3357 913 6931 -7077 327 6517 -7256 -249 5800 -7398 -286 5020 -7802 52 4572 -8392
3371 -8392 389 4750 -8889 468 5275 -8833 338 5603 -8254 482 5617 -7417 1155 5456
3385 5456 -6982 2171 5526 -7039 3193 6080 -7288 3604 6901 -7204 3402 7298 -6747
3398 -6747 3004 6933 -6270 3011 6109 -6282 3448 5282 -7097 3788 4997 -8190 3496
3411 3496 5176 -8959 2660 5166 -8983 1730 4564 -8586 1511 3483 -8430 2093 2793
3424B793j1498J1625r8j2292J2882J94j3213J2889J111j3252J1955J524j2311
3437g691J0995R63j1006J1090o42j0254J2181j852j0861J3433j860j2049J3656
3450F103r12j2500J2566k23j1739J1407p21j0252J1062k171r316J1983l499r595
3464g807J3379l796j0659J3866k826j1318J3032j660j0807J1795j767r192J1164
3477C404k845q023J1955m355p995J3350m718q992J4056l976r922J3558k824r656
3491f983J2125k591q250J1328l733o942J1685n160o842J2858n856p675J3549n447
3505B066q467J3170m526q330J1802m093p304J1011n000n903J1100o345n361J1976
3519E796p020n823J2843o792o595J2776n910o564J1747n326n545J0789n816m228
$$ plain form
3424 2793 -8705 2920 2822 -9470 3412 3606 -9607 3282 4393 -8859 3096 4620 -7691
3437 -7691 3304 4267 -6739 4351 3709 -6545 5636 3784 -7077 6356 4496 -7553 6103
3450 6103 5191 -7309 5257 5034 -6705 4702 3981 -6271 4791 2620 -6696 5287 1788 -7807
3464 -7807 5572 1776 -8883 4983 2157 -9161 3871 2211 -8596 3199 1432 -7760 3404
3477 3404 559 -7464 4491 136 -7859 5491 773 -8219 5837 1861 -8061 5497 2673 -6983
3491 -6983 5142 2551 -5699 5629 1896 -5046 6639 1479 -5363 7495 1639 -6036 7513 2066
3505 2066 -6401 6769 2243 -6087 5715 1622 -5682 5329 329 -5574 5526 -819 -6180 5796
3519 5796 -1224 -7047 5796 -996 -7591 5185 -725 -7289 4458 -868 -6413 4376 -1440 -5668
3533e668J0686o812l611J1315p536l827J2052p512m384J1912o753m675J1256o267
3547A76m057J0272o450l165J0006p314k533J0206q008k634J0714q095l065J0764
3561F817p689l364J0265p138l064R470p113k310R152p625j662R232q097j504R625
3576D995q280j617R749p896j710R407p503j404Q833p347q58Q456p513l28Q295
3591E279p880K6Q371q082j4Q409p961j61Q214p830J7P754p707L18P232p774N75
3608a214P078p957Q19O939q090P79O906q035Q30O799p930Q75O475p735J072O276
3624C887p700J393O025p710J658N891p573J680N869p476J816N827p396J894N717
3639C802p208J978N438p082K151N264p128K317N047p091K388M946p065K408M718
$$ plain form
3533 -5668 5018 -1794 -5405 5910 -1626 -5453 6599 -913 -5297 6615 -138 -4813 6443 176
3547 176 -3881 6391 -59 -3224 6782 -532 -3065 7141 -867 -3501 7213 -882 -3947 6817
3561 6817 -872 -4236 6029 -1109 -4173 5297 -1816 -4126 5026 -2599 -4261 4971 -3126 -4630 4995
3576 4995 -3285 -4902 4847 -3049 -4759 4648 -2855 -4259 4574 -2773 -3631 4825 -2688 -3016 5279
3591 5279 -2601 -2575 5796 -2286 -2300 6109 -1852 -2013 6201 -1629 -1612 6142 -1565 -1247 5985 -1789 -1214
3608 -1214 5864 -2093 -1274 5665 -2425 -1646 5260 -2775 -1945 4854 -3076 -2201 4274 -3461 -2389 3887
3624 3887 -3813 -2420 3605 -4105 -2447 3444 -4129 -2449 3420 -4056 -2240 3587 -3809 -1915 3802
3639 3802 -3406 -1428 4010 -3072 -921 4343 -2785 -468 4579 -2512 -124 4822 -2243 165 4883
3654D883o925K371M424o930K544M223o830K470M012o781K575L786o628K578L579
3669C351o510K625L443o437K828L132o250K866L101o045K861K968n923K991K887
3684A888n647K959K776n619L118K607n354L152K430n220L256K307n121L180K232
3699B944n065L119K085m815K954J943m666K905J692m595K831J635m613K809J603
3714B766m592K790J366m381K671J265m227K612J226m007K437J110l857K485J039
3729G03l681K481J077l646K496J016l322K457R38l074K352R21k952K302Q41k757
3745a848K270Q40k666K239O50k507K221N64k376K010M48k274J890M29k176J684
3761A398L12k084J570K60j914J410J86j861J287O2j595J118J98j545J019J59j463
$$ plain form
3654 4883 -2042 329 4753 -2177 367 4590 -2240 230 4242 -2539 36 3822 -2806 -228 3351
3669 3351 -3159 -534 2909 -3528 -700 2432 -3818 -952 2149 -3896 -1035 1933 -3990 -999 1888
3684 1888 -3759 -800 1976 -3643 -525 2082 -3272 -120 2310 -2910 346 2653 -2468 712 2944
3699 2944 -2121 998 3083 -1732 1222 3165 -1501 1404 3096 -1499 1332 2967 -1646 1163 2766
3714 2766 -1826 964 2330 -2051 620 1885 -2342 270 1496 -2511 -74 1036 -2821 -336 703
3729 703 -2978 -497 580 -3066 -570 446 -2876 -419 519 -2555 -203 718 -2234 68 909 -1848
3745 -1848 422 1262 -1404 835 1485 -1022 1199 1763 -613 1397 1845 -429 1461 1890 -286 1398
3761 1398 1710 -374 1196 1456 -458 952 1138 -723 564 626 -969 149 347 -1198 -179 -20 -1483
3778a483J000J83j252P44L13j066P10L39r70O26M21p81M81M46o07M82M21n06L25
3797a74N32m14J53N50k49j2N93k70r2M48j28k02M41r9m93N17l5o49N00j0p17M42
3819F32Q2r30M53K12j123N79K42j201O01M20j407P36N11j404Q34N52j538R05O14
3838b30j488J080O42j619J120P86j758J280R32j964J364R41k011J405J028k139
3854f31J437R60k269J536R94k447J621R43k682J704R55k841J694J033l000J738
3870G45R93l096J846R08l170J860J045l336K118J004l423K230R88l488K308J129
3886F61l544K409J148l607K607J141l619K779J084l633K828J068l715L049J085
3901A741l899L226R58l910L263R94m023L297Q22m030L334P41m159L450O45m278
$$ plain form
3778 -1483 -483 -300 -1552 -808 -495 -1561 -851 -512 -1482 -856 -435 -1216 -735 -289 -896 -414 7 -499 -174
3797 -174 358 -56 97 647 398 386 979 709 617 1065 937 735 1176 1077 584 1101 1066 417 917 907 190 632
3819 632 714 -216 237 449 -674 -95 147 -1054 -453 -33 -1440 -704 -193 -1597 -763 -211 -1749 -844 -230
3838 -230 -1718 -638 4 -1615 -495 291 -1467 -187 745 -1219 145 1086 -925 480 1508 -631
3854 -631 806 1766 -503 1033 2027 -420 1201 2144 -538 1166 2121 -720 974 2007 -993 745
3870 745 1738 -1358 488 1396 -1774 86 1131 -2205 -87 917 -2506 -276 712 -2776 -468 661
3886 661 -2883 -474 674 -2933 -326 815 -2804 -25 1059 -2574 254 1322 -2393 656 1741
3901 1741 -2158 1068 2026 -1884 1379 2373 -1650 1647 2469 -1561 1773 2514 -1645 1805 2450 -1828
3917a828L645M72m386L666N29m530L727N04m702L850M16m601M036K42m601M159
3933E98K57m663M361K22m690M496K09m653M519K96m785M679L08m739M823J69m759
3950c352N003l6m720N147o4m830N187j59m853N309k65m915N311l96m899N390o26
3967B232m891N426p69m956N570r23m928N677j025m973N661j070m889N699j190
3982F51m789N845j245m766O020j424m776O222j447m765O328j498m609O309j555
3997E01m518O403j677m500O620j884m537O812j988m581O806j906m684O779k034
4012A612m616O772k205m437O763k531m374O978k801m548P190k825m682P241k825
4027G12m667P081k753m472O920k890m177P060l325l905P338l622l994P662l520
$$ plain form
3917 -1828 1817 2289 -2097 1569 2098 -2432 1295 1799 -2903 947 1363 -3238 798 1040 -3561 598
3933 598 855 -3808 553 775 -3915 581 790 -3863 656 952 -3833 846 1154 -3585 1238 1407 -3352
3950 -3352 1651 1615 -3105 2042 1978 -2852 2335 2176 -2677 2632 2367 -2548 2763 2367 -2532 2858 2232
3967 2232 -2659 2767 1998 -2958 2612 1689 -3239 2438 1413 -3560 2101 1031 -3858 1841 651
3982 651 -4138 1707 462 -4304 1716 292 -4484 1738 291 -4474 1854 356 -4253 2056 501
3997 501 -4017 2386 709 -3791 2829 945 -3592 3220 1232 -3349 3457 1551 -3133 3646 1612
4012 1612 -3004 3768 1563 -2874 3889 1358 -3016 3962 1161 -3387 3803 978 -3704 3537 712
4027 712 -3955 3126 373 -4099 2821 -69 -4246 2814 -511 -4416 2922 -700 -4694 2968 -552
4042e52m179P737l429m172P582l182l862P264l410l463P342l919l093P596m300
4057d0l243P934m390l546Q100m207l693P727l966l516P291m109k959P092m565
4072i0k645P423n221k695P825n277l098Q146m997l479P917m638l199P398m661
4087a291k557P091n052k011P437n701j980Q033n805k508Q482n380k912Q225m952
4102h81k674P557m883k005P207n412j318P318o108j251P930o397j798Q327o109
4117d97k376Q134n582k201P208n272j647O763n796r36O818o606o39P477p082j023
4133c257P840o678j576P667n957j620O990n680r04O405n903j41O406o657K67P061
4149D263p141j16P600o919o35P557o364p88P006n996l16O316o084M26O058o749
$$ plain form
4042 -552 -4731 3006 -423 -4595 2987 -195 -4057 3207 -203 -3666 3676 -243 -3336 4260 -40
4057 -40 -3283 4651 261 -3285 4815 608 -3085 4642 676 -2840 4451 342 -2617 4475 -90
4072 -90 -2735 4688 -533 -3228 4597 -680 -3778 4368 -629 -4108 3809 -829 -4028 3370 -1291
4087 -1291 -3848 3243 -1809 -3820 3617 -2084 -4064 3969 -1836 -4344 4138 -1242 -4154 4071 -881
4102 -881 -3555 4002 -881 -2886 4321 -1091 -2409 4909 -1199 -2450 5480 -917 -2715 5612 -497
4117 -497 -2873 5261 -321 -2522 4686 -586 -2233 4530 -1266 -2202 4616 -1990 -2629 4848 -2234 -3257
4133 -3257 4583 -2095 -3671 3996 -1961 -3581 3409 -2271 -3175 3230 -2673 -2814 3592 -3065 -2798 4263
4149 4263 -2878 -2994 4606 -2313 -2948 4609 -1755 -2543 4463 -1533 -1849 4467 -1617 -1191 4867 -1882
4165a882P50O482p299M87P062p429n4P215o890m01O694o371r9N938o385O24N554
4182C996o799J059N827p392J140O341p532P16O543p023M04O166o401N65N611o287
4198c066J143N229o516J742N195p041J883N723p211J521N913o905J188N644o389
4213a947J181N059o252J675M496o404K134M494o832K206M801p187K030N001o970
4228b515J684M812o542J607M378o214J940L947o380K388L867o585K586M017o732
4243c742K402M335o602K172M323o326K304L939n975K439L525n906K704L511o159
4258c056L000L485o326L033L493o176K896L388o048K702L252n801K782K853n723
4273b246K935K670n754K935K656n806L020K553n730K856K590n658K921K348n443
$$ plain form
4165 -1882 -1132 5350 -1949 -1462 5600 -1829 -1883 5332 -1558 -1959 4735 -1636 -1735 4203 -2182 -1558 3996
4182 3996 -2803 -1744 4083 -3309 -2169 4172 -3360 -2644 3899 -3124 -2720 3446 -2955 -2390 3221 -3066
4198 -3066 -1923 3306 -3210 -1468 3727 -3314 -1431 4292 -2919 -1398 4515 -2390 -1202 4442 -1947
4213 -1947 -766 4293 -1959 -284 4212 -2192 -58 4436 -2396 -190 4611 -2576 -546 4455 -2515
4228 -2515 -831 3981 -2561 -954 3424 -2790 -850 3097 -3283 -895 2972 -3613 -1027 2990 -3742
4243 -3742 -1340 2995 -3607 -1435 2888 -3438 -1134 2805 -3170 -731 2794 -3112 -408 3103 -3056
4258 -3056 -56 3429 -2897 136 3629 -2547 349 3737 -2311 391 3643 -2158 624 3477 -2246
4273 -2246 689 3359 -2395 540 3196 -2610 410 2963 -2767 89 2679 -2979 -58 2290 -3153
4288c153K963K194n283L075K059n271L184J957n154L252J960n178L307J918n035
4303c205L325J798m833L244J756m839L378J602m624L310J512m672L374J393m559
4318b040L344J246m571L367J168m532L324J058m488L300J024m398L234Q28m232
4333b368L233P81m226L146P22m005L121O91l926L204N63l899L276N37l757L183
4349B76M81l601L194M51l389L154L83l358L243K36l217L209K66l206L153K00l137
4366a662L131J15k997K896O9k860K898j63k714K895j95k721K763k30k702K680
4382A203k53k617K689l37k526K716m62k406K556l38k292K517l59k264K533m57
4398i7k028K585m48k071K495l29j956K395l28j910K427l85j678K315m68j607K207
$$ plain form
4288 -3153 -190 2004 -3279 -204 1855 -3416 -232 1725 -3429 -177 1783 -3395 -88 1830 -3205
4303 -3205 120 1918 -2915 329 2085 -2754 624 2226 -2398 912 2424 -2248 1126 2519 -2040
4318 -2040 1304 2550 -2021 1346 2514 -2018 1306 2364 -2124 1176 2200 -2198 1036 1864 -2368
4333 -2368 865 1646 -2580 566 1288 -2717 404 1095 -2831 373 936 -2963 313 850 -2907 276
4349 276 757 -2844 350 801 -2588 566 949 -2409 834 1070 -2147 1062 1328 -1878 1275 1475 -1662
4366 -1662 1469 1584 -1413 1483 1552 -1308 1590 1427 -1287 1608 1413 -1308 1455 1225 -1477 1203
4382 1203 950 -1667 1022 685 -1841 875 413 -1993 563 225 -2067 450 91 -2173 360 -97
4398 -97 -2125 460 12 -2059 436 107 -1849 546 218 -1692 735 350 -1328 987 519 -1088 1119
4415A119m28j561K125m37j467K016m71j407J881m85j415J863n26j415J783n23
4431F52j223J538n71j221J583n28j190J557o02j145J452n46r43J326m75r69J256
4448d9l89p90J172l76p24J162m21n45J042l03n90J031k40m85R29k32m27P30j21
4467C74m04O55n4m67O25j13l10M96m7m61L38m1k92J89O0l63R1J06l37K2N7k97
4489a73J7J32l23q3K20k46j92L27j87k88M11j04l86N64j26m29O52j08m14P03r5
4510a28m81Q20r5n58Q63j05o67J037j71p84J118r8q84J135k39q56J155k12j091
4529b41J219j60j190J296k23j286J428l06j335J481l41j465J596l41j438J635
4545C29l83j530J769l57j526J921l78j672K158m45j716K211l66j773K349l76j719
$$ plain form
4415 1119 691 -870 1255 818 -649 1367 896 -511 1370 885 -530 1333 807 -608 1175 652
4431 652 -571 967 396 -825 758 230 -960 597 -5 -1150 302 -244 -1187 139 -336 -1305 -49
4448 -49 -438 -1228 -56 -432 -1156 6 -415 -960 82 -221 -811 220 -20 -505 424 192 -235 495 374
4467 374 -30 625 571 104 729 616 306 802 755 294 632 591 299 488 548 185 276 382 45 67 124 -173
4489 -173 -156 -24 -347 -430 -210 -456 -648 -321 -508 -796 -385 -489 -875 -311 -437 -866 -214 -322 -736 -33 -128
4510 -128 -609 211 116 -442 421 316 -351 686 515 -269 849 751 -133 1002 763 -93 1062 850 -241
4529 -241 978 818 -372 924 701 -585 843 537 -798 683 342 -1123 473 132 -1306 329
4545 329 -54 -1584 185 -172 -1698 223 -155 -1827 331 -114 -1830 381 15 -1758 591 215 -1504
4562a504K307m32j807K550n41j851K655o42j888K696o24k040K777o73j969K804
4578A818q39k104K912r75k005K898j035k005K978j138k173L182j193k251L261
4593A331j227k188L307j347k145L420j412k138L523j463k110L639j577k126L866
4608A353j617k129L917j657k101L979j669k128M000j731k098M172j855k163M219
4623B492k023k147M374k177k194M464k283k139M475k443k123M447k533k146M613
4638B657k605k131M712k918k021M779k967k027M823l001j990M915l097j927M995
4653B197l241j797N038l303j708N132l411j556N155l486j514N297l649j435N295
4668C014l738j341N308l789j393N372l808j374N385m021j199N304m212j140N356
$$ plain form
4562 -1504 803 371 -1436 1114 573 -1278 1377 735 -1153 1543 919 -1121 1656 983 -986 1818
4578 1818 979 -1125 1787 812 -1193 1705 670 -1335 1643 505 -1668 1514 321 -1930 1331
4593 1331 104 -2084 1223 -124 -2269 1151 -261 -2399 1124 -339 -2449 1190 -387 -2513 1353
4608 1353 -264 -2393 1524 -133 -2234 1745 76 -2052 1948 217 -1881 2291 436 -1727 2492
4623 2492 469 -1678 2696 519 -1675 2789 506 -1633 2842 399 -1724 2723 190 -1956 2657
4638 2657 52 -2079 2633 -285 -2306 2473 -494 -2521 2302 -699 -2689 2226 -871 -2798 2197
4653 2197 -1044 -2841 2197 -1106 -2814 2318 -1093 -2649 2506 -980 -2494 2803 -846 -2281 3014
4668 3014 -724 -2065 3243 -546 -1939 3433 -375 -1749 3636 -385 -1584 3720 -492 -1632 3724
4683C724m428r34N409m575r70N479m735r51N576m904q41N510m878p66N434m942
4699a792o37N480n091m10N564n263l73N675n424k69N812n468k03N735n447o2N700
4716C527n616K43N646n818M11N653o001N65N743o129N00N723o099M70N625o123
4732a680O69N389o182Q11N270o447J190N240o733J258N414o944J350N417o847
4747b825J218N356o788J423N122o815J829M776o793K111M863p208K307N118p379
4762c685K288N226p396K309N147p133K263M904p133K691M633p400L147M542p686
4777c283L270M703p862L085M952p959L030M728p674L029M428p564L164M102p699
4792c550L785L862q133M142L963q450M124M230q409L909M271q047L781L791p692
$$ plain form
4683 3724 -704 -1638 3771 -804 -1774 3705 -1030 -1981 3595 -1309 -2150 3360 -1518 -2284 3150 -1792
4699 -1792 -2429 3051 -2040 -2450 3114 -2149 -2522 3153 -2271 -2540 3272 -2196 -2399 3336 -2111 -2173 3527
4716 3527 -2089 -1846 3800 -2018 -1607 4046 -1955 -1390 4353 -1776 -1276 4447 -1652 -1182 4443 -1680
4732 -1680 -1011 4378 -1804 -993 4277 -2170 -980 4260 -2473 -1215 4199 -2745 -1395 4022 -2825
4747 -2825 -1607 3749 -3039 -1616 3506 -3309 -1480 3296 -3497 -1386 3477 -3731 -1424 3694 -3685
4762 -3685 -1397 3829 -3567 -1258 3889 -3244 -981 3923 -3210 -519 4114 -3286 -139 4403 -3283
4777 -3283 -13 4690 -3172 -87 4865 -3094 -64 4664 -3010 19 4447 -3117 47 4149 -3550
4792 -3550 235 4097 -4036 106 4069 -4381 -257 3973 -4436 -527 3744 -4303 -522 3269 -4423
4807d423M124L445p807M731L129q046N073L319q413N064L601q344M716L667q023
4822d187M699L244p683M929K714p719N410K406p980N771K549q451N872K665q443
4837d204N581K740q177N351K448p873N588J860p829O053J558q008O440J502q295
4852e265O538J761q361O330J902q162O190J684p827O347J276p587O663Q48p542
4867e205O989P98p789P133R35p867P024J061p687O809Q19p292O674M65p071O979
4883B775O4p076P246j91p210P435j67p363P293o4p235P082j31o932P000m80o624
4900d578P133q79o594P493j053o670P662j045o794P605q62o588P479r86o339P362
4916B346j112o048P421j502n827P625j620n880P767j701n865P720j648n843P576
$$ plain form
4807 -4423 -299 3146 -4661 70 3199 -4847 226 3545 -4868 196 3797 -4547 169 3836 -4187
4822 -4187 512 3756 -3927 1002 3716 -4003 1407 3813 -4167 1604 4153 -4298 1574 4239 -4204
4837 -4204 1377 4117 -4060 1291 3739 -4134 1454 3314 -4515 1538 3096 -4912 1528 3030 -5265
4852 -5265 1273 3034 -5327 1003 2905 -5257 933 2617 -5210 1137 2413 -5174 1489 2337 -5205
4867 -5205 1784 2582 -5207 1926 2861 -5006 2018 3079 -4608 2201 3020 -4272 2402 2867 -4204 2775
4883 2775 2839 -4237 3009 2818 -4392 3043 2876 -4487 2806 2742 -4493 2589 2458 -4474 2526 2046 -4578
4900 -4578 2555 1676 -4918 2575 1522 -5148 2514 1469 -5325 2280 1418 -5170 2309 1323 -5016 2346
4916 2346 1234 -4814 2607 1105 -4722 2903 1283 -4597 3170 1469 -4396 3324 1676 -4167 3409
4931C409j603n716P496j916n447P464k107n300P501k389n245P593k440n204P523
4946C619k530n100P394k513m860P184k618m689P124k800m457P250l023m266P229
4961B944l098m196P233l040m071P160l082l879P060l179l608O963l282l436O905
4976C394l403l287O850l423l250O922l581l074O751l652l006O660l603k933O540
4991C905l727k763O401l832k616O245l752k631O207l863k503O193l961k260N988
5006C031l929k144N968m023k034N967m063j854N737l931j629N627l954j537N581
5021B813l933j441N528m025j235N408m039j057N207m005r79N062l870r26M841
5036C349l952p39M685l903p06M549l912n98M507m005n85M418l983m91M113l799
$$ plain form
4931 3409 1806 -3910 3586 1670 -3777 3687 1580 -3720 3781 1392 -3853 3740 1300 -3904 3619
4946 3619 1089 -4011 3383 870 -3990 3194 576 -4113 3011 211 -4246 3004 -19 -4285 2944
4961 2944 -154 -4350 2883 -157 -4228 2932 -150 -4029 3031 -148 -3756 3207 -75 -3511 3394
4976 3394 -9 -3296 3554 131 -3119 3803 222 -2852 3899 247 -2759 3901 298 -2635 3905
4991 3905 178 -2585 3816 -16 -2632 3613 -139 -2770 3437 -426 -2929 3264 -697 -2957 3031
5006 3031 -898 -3042 2926 -1097 -3131 2836 -1227 -3081 2656 -1275 -2904 2723 -1231 -2768 2813
5021 2813 -1120 -2561 2967 -1058 -2293 3115 -924 -1981 3226 -779 -1758 3304 -566 -1492 3349
5036 3349 -603 -1342 3343 -560 -1266 3283 -629 -1227 3280 -725 -1310 3108 -875 -1366 2747 -1052
5052a052l80L981l794l04L904l839j42L739l690j13L729l739M7L558l619R6L504
5069A886l517J18L450l467L02L170l350L72L089l326M36L107l290L65K932l219
5085i42M72K789l107M41K709l144N43K498k941M77K285k855N37K237k874O00K061
5102A786k771N79J953k633N05J931k582N01J838k389N10J640k271O60J562k252
5118a433O72J509k078O23J543k014O59J383j861N87J355j773N96J238j573N63
5134dJ141j491N10R85j344N09Q57j282M35P81j177K89Q10j060K40P24j033J91
5152H1N80q39R6N88p69k2N31n79r1M67n32q6M70l97j58M78k51k58L59L7l35L08
5174c22J36l58K88K47l71K31M21n92L58M81o96L32N42q71M28O25r27K88P89j011
$$ plain form
5052 -1052 -1432 2549 -1245 -1549 2355 -1484 -1626 2113 -1577 -1690 2039 -1700 -1653 1905 -1714 -1618 1886
5069 1886 -1631 -1513 1937 -1530 -1228 1942 -1408 -1036 2053 -1273 -837 2270 -1020 -655 2277 -942
5085 -942 -470 2319 -788 -347 2362 -782 -239 2259 -682 -205 2080 -775 -238 1999 -875 -275 1786
5102 1786 -985 -406 1547 -1086 -581 1350 -1232 -731 1107 -1282 -772 868 -1403 -743 819 -1433
5118 -1433 -761 748 -1330 -707 836 -1178 -519 864 -997 -410 945 -828 -232 1006 -567 -4
5134 -4 1137 -354 156 1141 -203 306 1163 -119 316 1097 -80 209 1019 -41 199 923 -110 81
5152 81 661 -178 -82 506 -263 -285 246 -333 -424 43 -489 -575 -105 -502 -660 -182 -433 -691 -332 -295 -630 -322
5174 -322 -186 -544 -256 -9 -380 -149 272 -320 38 519 -177 155 697 -174 254 879 -48 240 1029 18
5194A8K06Q60j164L02R28j360K20J076j462L17J133j629K47J300j796L40J381
5211I17j869L90J418j949M16J455k000N33J513k152N39J806k345N50J834k311
5227a255N44J990k511O88K036k740Q30K088k786Q61K192l015R31K209l135J023
5243e0K314l268R44K235l239J031K302l543J163K476l836J336K318l845J316K482
5259B136m008J441K428m051J537K490m276J792K458m276J767K502m394J898K543
5274A987m578K091K551m621K182K585m659K267K550m745K335K577m932K538K545
5289B673n097K782K460n228K826K546n408K984K486n512L130K351n585L067K478
5304B953n746L289K345n856L487K310o041L656K289o083L717K248o123L847K231
$$ plain form
5194 18 224 1084 -80 222 1150 -210 10 1086 -376 -59 1074 -555 -308 992 -804 -464 917
5211 917 -952 -562 856 -1093 -677 778 -1222 -689 824 -1328 -789 1017 -1328 -778 1056 -1255
5227 -1255 -711 1279 -1232 -544 1492 -1248 -418 1670 -1116 -255 1937 -1078 -147 2062 -1073 -50
5243 -50 2264 -1004 -60 2175 -1064 -33 2269 -1274 -111 2365 -1471 -135 2183 -1662 -346 2136
5259 2136 -1872 -431 1997 -2054 -517 1973 -2303 -511 1947 -2329 -562 1940 -2454 -556 1987
5274 1987 -2591 -500 2051 -2570 -388 2197 -2462 -195 2355 -2390 -55 2522 -2410 128 2673
5289 2673 -2424 358 2818 -2410 416 2962 -2446 538 3024 -2488 642 2993 -2592 475 2953
5304 2953 -2793 496 2841 -3015 472 2782 -3259 397 2686 -3397 320 2568 -3555 292 2523
5319B523o222M010K153o319M237K062o374M434J932o368M594J866o401M750J778
5334B655o499M874J709o481M928J665o574N159J479o606N285J297o550N438J169
5349B948o710N567J046o656N622R70o720N846P29o776N987O76o798O106M92o731
5365d402O257L37o786O418L03o834O566J79o868O695Q6o817O891p8o760P023l15
5382A895o706P218m80o719P370n92o692P513p12o817P693q53o706P662j040o524
5398d490P824j330o465P946j607o431Q120j804o389Q154j921o348Q251k010o185
5413d685Q169k253o033Q241k488n812Q394k753n718Q513k862n788Q723l041n661
5428e054Q707l074n583Q732l272n343Q803l538n129Q855l775m974R001l903n057
$$ plain form
5319 2523 -3699 311 2464 -3855 382 2444 -3930 504 2436 -3932 662 2528 -3873 877 2655
5334 2655 -3844 1030 2739 -3742 1186 2851 -3723 1436 2915 -3691 1594 2891 -3659 1779 2948
5349 2948 -3762 1805 2851 -3805 1817 2787 -3933 1913 2642 -4134 1853 2529 -4269 1837 2329 -4402
5365 -4402 1855 2192 -4594 1824 2127 -4707 1859 2038 -4830 1865 1951 -4866 2025 1947 -4813 2210 1895
5382 1895 -4811 2407 1927 -4792 2578 1986 -4706 2807 2095 -4722 2971 2118 -4588 3074 2034 -4490
5398 -4490 3334 2004 -4461 3485 1878 -4553 3567 1763 -4626 3528 1607 -4741 3510 1500 -4685
5413 -4685 3484 1231 -4802 3439 951 -4861 3533 780 -4938 3575 713 -5075 3648 607 -5054
5428 -5054 3653 579 -5004 3728 456 -4887 3916 378 -4751 4104 329 -4645 4356 453 -4604
5443d604R083m032n000R178m213m941R281m409m721R171m652m467R240m878m341
5458d305R297n080m352R399n200m273R467n356m114R341n359m024R403n668l581
5473d405R218n878l352R387o177l268R536o337l159R547o330l104R370o303k814
5488d069R178o507k456R084o729k246R189o956k169R248p123k012R185p163k013
5503c559R158p200j752Q916p340j482Q811p478j308Q847p770j132Q921p986r64
5518c318Q934q008r64Q811p933q24Q642p963n40Q510q207j51Q405q458P8Q468
5534E482q455P6Q503q638K05Q415q569L89Q108q512O30P907q629R56P732q850
5550c250J195P802q974J261P704r036J411P515r034J597P323q890J748P070q978
$$ plain form
5443 -4604 4479 447 -4553 4625 412 -4529 4752 343 -4378 4793 141 -4326 4914 36 -4305
5458 -4305 4992 -88 -4440 4959 -241 -4514 4953 -403 -4517 4824 -535 -4559 4844 -824 -4405
5473 -4405 4813 -1065 -4417 4970 -1207 -4475 5061 -1276 -4435 5112 -1218 -4322 5048 -1255 -4069
5488 -4069 5109 -1398 -3854 5230 -1499 -3745 5444 -1512 -3681 5567 -1556 -3568 5617 -1546 -3559
5503 -3559 5599 -1601 -3353 5563 -1777 -3259 5552 -1926 -3234 5613 -2157 -3289 5632 -2354 -3318
5518 -3318 5616 -2392 -3356 5455 -2478 -3302 5340 -2623 -3163 5347 -2860 -3011 5394 -3064 -2986 5482
5534 5482 -2973 -2897 5606 -3032 -2827 5588 -2981 -2592 5516 -2996 -2366 5541 -3088 -2132 5600 -3250
5550 -3250 -2055 5747 -3227 -1966 5738 -3298 -1887 5628 -3406 -1809 5514 -3376 -1628 5442 -3536
5565c536K013O835r102K293O799r198K365O797r181K491O462r001K578O403r027
5580d009K677O189q911K951N956r099L226N911r117L327N778r073L403N666r051
5595d176L571N460q979L583N355r008L884N143q974L970M893q926M064M890q992
5610d242M170M741q997M313M536q831M384M272q807M678M032q701M668L883q617
5625d518M822L622q396M819L525q420M959L433q327M963L239q210N014L117q081
5640d439N152K807p864N170K696p879N244K521p700N355K344p635N284K311p537
5655d170N305K114p416N398J896p237N394J661p084N458J628p036N466J435o859
5670d047N359J334o659N455J070o517N413J060o512N505Q73o349N483Q05o290
$$ plain form
5565 -3536 -1523 5312 -3790 -1497 5302 -3896 -1531 5266 -3915 -1424 5038 -3963 -1385 5018 -4009
5580 -4009 -1332 4857 -4054 -1103 4853 -4246 -1020 4891 -4226 -899 4879 -4194 -791 4875 -4176
5595 -4176 -605 4855 -4124 -541 4814 -4194 -310 4833 -4141 -171 4722 -4204 -140 4750 -4242
5610 -4242 -72 4669 -4328 -15 4521 -4310 74 4346 -4461 217 4249 -4452 216 4099 -4518
5625 -4518 304 3926 -4470 349 3874 -4546 413 3846 -4481 482 3721 -4489 525 3642 -4439
5640 -4439 713 3520 -4344 826 3522 -4357 887 3408 -4292 1063 3407 -4228 1056 3367 -4170
5655 -4170 1135 3249 -4167 1231 3127 -4110 1284 2945 -4139 1319 2947 -4089 1377 2812 -4047
5670 -4047 1312 2646 -4013 1442 2512 -4005 1408 2468 -4044 1461 2334 -4015 1468 2273 -4017
5685d017N580N73o059N540M77n857N455K77n752N481K02n524N370J11n434N431
5701A854r2n210N313j54n146N375l63m948N219l44m801N204m62m604N093n70m486
5718c122M962o44m310N018p57m223M980q05m046M858q85l861M700j015l667M645
5734A828j026l459M461j055l420M524j171l242M403j233l107M315j225k968M209
5749A834j278k894M095j227k731L993j335k682L979j377k562L863j297k409L681
5764A653j370k294L631j335k131L502j415k083L446j477j830L232j415j788L179
5779A505j410j684L043j370j482K844j351j491K786j381j320K677j352j243K520
5794A291j333j135K351j238j028K167j076j027K099j124j000K075j065r27J930
$$ plain form
5685 -4017 1563 2136 -3923 1617 2094 -3763 1692 1969 -3783 1698 1900 -3624 1746 1857 -3577 1854
5701 1854 1762 -3448 1865 1711 -3435 1940 1577 -3371 1848 1504 -3297 1907 1445 -3159 1934 1364 -3122
5718 -3122 1840 1196 -3114 1904 1147 -3076 1904 1099 -2947 1911 1026 -2835 1865 850 -2817 1828
5734 1828 802 -2657 1804 749 -2671 1853 682 -2560 1843 610 -2497 1818 593 -2375 1834
5749 1834 556 -2338 1757 530 -2201 1792 457 -2225 1754 377 -2185 1678 381 -2028 1653
5764 1653 283 -2011 1620 285 -1846 1656 241 -1842 1604 127 -1703 1529 114 -1674 1505
5779 1505 95 -1589 1454 84 -1398 1446 95 -1396 1390 9 -1311 1366 14 -1229 1291
5794 1291 -42 -1177 1174 -64 -1092 1075 -1 -1028 1071 -53 -1053 1022 -43 -970 960
5809I60j048q10J789j022o82J558q49o87J538q66o55J451o43p32J341o48n90J205
5827F10o39n27J158n98m88R85m72m38Q59l34m71O95j87m66O32j34m84N40Rn12
5847b62L74J17m42K37K03m82K50K90m57J45K54m73R8M81n88pN92m64k23O56n32
5868b33k01Q31o21k31Q52n86l48J061o99l25J112p56m06J306p99n57J474r33n70
5887f29J581r30o41J550r62n92J692j095p31J853j181p79K055j258q83K159j430
5904b21p47K233j529q69K392j531q91K435j633q58K560j766q52K662j864q81K852
5921A492j951q61K930k088r32L056k086r61L196k259q11L127k353q55L351k468
5937d73q37L445k577q52L514k754p95L642k797q68L622k920p64L706l011p26L897
$$ plain form
5809 960 -88 -898 891 -131 -813 745 -104 -791 747 -119 -774 677 34 -698 643 -5 -595 610
5827 610 -29 -556 602 4 -484 501 29 -409 450 116 -355 340 153 -313 319 185 -299 241 250 -262
5847 -262 112 229 -213 24 227 -255 -5 285 -172 -27 227 -246 -148 333 -255 -262 330 -134 -357 299 -233
5868 -233 -434 397 -224 -455 397 -189 -537 524 -175 -500 612 -144 -550 756 -43 -600 874 -59 -629
5887 -629 952 22 -619 931 -31 -623 1069 -26 -757 1096 -85 -864 1191 -67 -950 1209 -221
5904 -221 -968 1265 -264 -1133 1259 -272 -1163 1272 -361 -1219 1341 -425 -1277 1385 -479 -1360 1492
5921 1492 -459 -1320 1610 -478 -1410 1646 -440 -1401 1795 -464 -1275 1852 -501 -1356 1995 -473
5937 -473 -1310 2135 -442 -1294 2220 -534 -1329 2313 -484 -1352 2270 -650 -1414 2292 -719 -1445 2452
5954B452l287o16L914l375p49M095l501o35M258l708n27M166l642n81M280l874
5970a330l20M223l973l22M427m199j66M551m417r3M593m431l1M569m516pM624
5987C182m695J59M631m794K39M696n070L81M765n198M27M802n327N32M836n408
6003a842N52M783n459O58M730n570Q41M732n780J044M728n858R89M881n962J176
6019a357M803o134J377M658o072J524M605o184J672M662o412J833M713o551J944
6034i19M687o583K074M607o622K133M468o687K333M475o881K541M400o961K596
6049c39M373p053K573M440p151K761M388p279L010M105p316L161M100p420L368
6064b79L985p558L573L965p637L579L896p484L644L859p578L890L668p676M179
$$ plain form
5954 2452 -835 -1451 2463 -912 -1661 2434 -1067 -1702 2556 -1152 -1679 2487 -1155 -1736 2544 -1330
5970 -1330 -1650 2573 -1400 -1722 2705 -1494 -1660 2891 -1526 -1619 2974 -1457 -1488 3081 -1435 -1442 3182
5987 3182 -1513 -1354 3277 -1517 -1278 3418 -1652 -1271 3494 -1704 -1277 3525 -1802 -1270 3566 -1842
6003 -1842 -1290 3493 -1966 -1308 3422 -2148 -1307 3425 -2355 -1311 3417 -2441 -1452 3429 -2533 -1357
6019 -1357 3446 -2688 -1311 3347 -2725 -1201 3404 -2780 -1108 3554 -2858 -1025 3688 -2863 -919
6034 -919 3768 -2815 -741 3866 -2756 -623 3845 -2842 -509 3966 -2915 -374 4026 -2935 -339
6049 -339 4034 -3019 -446 3994 -3157 -396 3992 -3287 -277 3828 -3488 -327 3773 -3647 -279
6064 -279 3706 -3852 -279 3686 -3951 -372 3524 -3960 -316 3543 -4035 -145 3523 -4153 26
6079B6L516p649M347L418p773M483L352p779M483L324p747M590L144p587M701
6094H49K834p624M968K705p768N143K627p852N238K594p829N212K431p751N329
6109A106K270p712N491J998p690N633J978p836N925J841p903O017J814p727N901
6124A106J747p752O100J524p539O245J290p545O516J066p629O703J040p701O800
6139A971J034p651O737R23p524O690P03p299O840K91p119P060O8p223P276o5p441
6156d729P418n0p389P322j09p136P220m78o809P267q01o528P410r59o668P706
6172B687j057o765P739r79o731P744j213o365P567j262o038P585j716n896P884
6187C184j929n846Q091k147n918Q162k083o011Q088k082n802P950k245n454P902
$$ plain form
6079 26 3542 -4107 240 3658 -4115 368 3720 -4059 424 3748 -3999 591 3735 -3852 849
6094 849 3683 -3941 1027 3732 -4036 1107 3734 -4118 1120 3714 -4115 1097 3528 -4223 1106
6109 1106 3376 -4336 1155 3153 -4537 1096 3074 -4762 1163 3004 -4899 1118 2932 -4795 1106
6124 1106 2853 -4899 1201 2725 -4814 1431 2721 -4824 1692 2758 -4871 1832 2872 -4829 1971
6139 1971 3005 -4646 2091 3014 -4510 2180 2883 -4416 2424 2715 -4404 2656 2724 -4499 2777 2712 -4729
6156 -4729 2689 2639 -4750 2572 2463 -4673 2547 2069 -4740 2527 1726 -4802 2608 1649 -5019 2687
6172 2687 1630 -5135 2604 1625 -5106 2638 1425 -4940 2627 1365 -4673 2912 1196 -4700 3184
6187 3184 1255 -4591 3500 1353 -4565 3597 1514 -4497 3591 1509 -4293 3657 1412 -4042 3860
6202C860k653n313Q138l024n222Q334l154n381Q428l104n364Q226l035n179Q091
6217C648l236m821Q073l576m477Q120l869m394Q347m008m466Q504m088m364Q412
6232C805l983m193Q171m057l829P984m171l623Q071m542l333Q102m676l369Q201
6247D558m685l427Q120m631l317P873m684l020P769m898k797P683n110k586P731
6262D579n392k492P758n356k548P759n400k420P617n306k299P458n465j928P359
6277C924n641j675P358n821j507P420n879j391P393n906j402P299n790j215P080
6292D247n843r41O896n912p09O790o094o23O815o097m85O641o173m60O646o260
6308a562l12O387o190j54O190o206qN944o146K00N876o230K94N847o349M04N695
$$ plain form
6202 3860 1207 -4106 4032 1008 -4214 4120 966 -4415 4013 909 -4455 3771 736 -4443 3648
6217 3648 412 -4409 3664 88 -4389 3731 -138 -4532 3815 -193 -4659 3845 -243 -4607 3805
6232 3805 -178 -4371 3800 -257 -4086 3898 -273 -3896 4175 -367 -3700 4402 -274 -3643 4558
6247 4558 -127 -3554 4566 -65 -3382 4491 -193 -3213 4556 -342 -3139 4544 -566 -3152 4579
6262 4579 -813 -3305 4453 -903 -3451 4308 -1092 -3512 4105 -1201 -3500 3958 -1507 -3435 3924
6277 3924 -1717 -3392 3966 -1855 -3362 4058 -1821 -3212 4181 -1725 -3127 4172 -1618 -2833 4247
6292 4247 -1596 -2537 4359 -1553 -2262 4528 -1566 -2189 4626 -1471 -1956 4685 -1488 -1948 4698 -1562
6308 -1562 -1874 4513 -1677 -1831 4359 -1847 -1855 4089 -2057 -1857 4019 -2211 -1917 3930 -2419 -2015 3680
6325C680o242M73N624o205N98N500o070P16N295n980Q63N107o004J067N021n992
6341b549J178N013o102J316M904o025J292M777n857J282M563n834J468M310n710
6356a974J462M290n851J644M155n927J723M124n855J570M117n816J653L872n555
6371b368J562L661n519J859L452n475K029L342n486K121L299n405K057L283n241
6386b829K053L149n116K190K905m933K186K837m831K257K655m765K328K530m708
6401b092K384K473m641K220K317m518K330K236m421K202K067m291K234J887m255
6416a868K267J766m170K250J807m158K218J650l980K113J602l863K208J495l744
6431b407K199J379l517K214J238l481K266J276l411K242J230l301K249J167l175
$$ plain form
6325 3680 -2562 -2089 3535 -2670 -2072 3428 -2642 -1926 3369 -2611 -1748 3359 -2645 -1578 3443 -2549
6341 -2549 -1371 3642 -2460 -1144 3760 -2265 -973 3804 -2053 -771 3792 -2042 -574 3736 -1974
6356 -1974 -512 3778 -2073 -429 3726 -2201 -478 3646 -2209 -639 3478 -2338 -685 3187 -2368
6371 -2368 -806 2855 -2664 -805 2647 -2828 -799 2543 -2943 -822 2477 -2928 -871 2412 -2829
6386 -2829 -776 2373 -2743 -553 2352 -2581 -395 2442 -2389 -132 2523 -2242 86 2616 -2092
6401 -2092 292 2765 -1876 344 2661 -1857 473 2709 -1712 490 2557 -1734 500 2387 -1868
6416 -1868 399 2165 -2005 245 2052 -2106 112 1762 -2218 -105 1497 -2366 -158 1337 -2407
6431 -2407 -208 1171 -2346 -132 1106 -2375 -109 1167 -2244 -2 1228 -2073 176 1343 -1832
6446a832K055J104k907K009R86k686J966Q22k658J976P74k690J928P51k660J924
6462H62O34k496J838N46k439J752N04k298J562M77k138J569L31k018J490L62k006
6479a468J458L57j888J432L88j799J284M89j724J277L68j467J232K43j240J067
6495IL41j291J190K87j221J075L36j247J000L97j164Q55L31r31O42L15q95N92
6513F21K11p97N24J42p92N35K38q32L02L63q05K26M29p64N5L68n06J9K69l84l
6534e81L07l64NM31m65o2O35m59j44P15l35l61O82r9m07P26q7m06O81r2l85O83
6556F18j39n36Q56k81n07Q91j74p82J064j95j011J037j05r97R41r8j055J094k10
6575D11j089J200k82j280J414l28j329J506j95j485J525j29j490J576j05j440
$$ plain form
6446 -1832 223 1327 -1580 429 1415 -1271 695 1517 -1141 835 1609 -1081 847 1598 -1062 862
6462 862 1496 -1000 838 1384 -1055 697 1201 -1097 465 942 -1196 373 704 -1314 176 538 -1468
6479 -1468 -10 347 -1541 -109 279 -1520 -236 253 -1471 -194 174 -1293 -61 182 -1058 9
6495 9 350 -941 249 536 -685 390 726 -521 479 876 -288 567 898 -33 609 924 29 621
6513 621 832 35 559 701 -91 444 682 -150 152 515 -290 -64 365 -399 -344 24 -482 -463 -194 -578 -581
6534 -581 -274 -638 -633 -202 -667 -729 -94 -553 -697 18 -317 -678 4 -95 -502 224 137 -269 412 320 -65 618
6556 618 479 -57 799 518 11 902 728 -54 1010 815 -196 841 736 -261 680 582 -473 621 411
6575 411 -678 522 240 -1040 374 46 -1283 223 28 -1457 68 -61 -1551 25 -80 -1520
6591a520J662k04j424J706j88j513J913k54j558K074k67j734K213k34j788K181
6607A065k09j852K350m37j811K355m97j726K294n40j897K473o29k025K560o29
6623H45k158K579p02k080K721q14k169K752p55k168K784q76k065K967j021k104
6639b264L216j164k121L229j100k129L378j080k184L451j149k155L538j236k096
6654a866L588j469k003L746j568k009L822j612k164L948j639k324L970j671k290
6669a541M031j868k178M046k094k115M045k200k100M229k328k169M397k404k202
6684b451M422k414k196M439k422k030M440k655j833M571k850j693M728k893j782
6699b619M814k862j872M916k889j815M888k953j550M796l149j436M817l340j390
$$ plain form
6591 -1520 142 -62 -1486 220 32 -1481 432 178 -1380 694 427 -1307 906 672 -1116 1065
6607 1065 856 -996 1354 917 -894 1461 964 -762 1532 992 -905 1568 939 -1086 1474 845
6623 845 -1313 1266 564 -1516 1205 391 -1778 974 219 -1949 835 -41 -2106 861 -160 -2264
6639 -2264 952 -212 -2333 896 -204 -2333 1045 -35 -2219 1232 83 -2072 1466 230 -1866
6654 -1866 1722 253 -1750 1996 428 -1581 2241 629 -1535 2413 774 -1550 2420 749 -1541
6669 -1541 2490 622 -1556 2490 396 -1719 2326 126 -1974 2255 -73 -2242 2155 -249 -2451
6684 -2451 1971 -443 -2639 1800 -622 -2652 1788 -867 -2700 1871 -979 -2672 2056 -837 -2619
6699 -2619 2195 -667 -2539 2377 -512 -2327 2561 -392 -1942 2854 -295 -1731 3086 -254 -1644
6714a644N003l431j517M997l521j512N051l557j456M905l651j314M907l921j146
6729a807M953m175j030N071m219j176N286m353j102N214m236j045N217m363q46
6744b611N205m497n95N219m594n75N409m734m95N397m646n11N263m584l73N177
6760C455m810J5N060n024J24N188n273J30N215n204J9N141n151kM997n164K23
6777a061M775n339N00M715n653O28M921n761O35M971n775N77M922n560O33M695
6793B823n579R56M543n629J249M516n909J441M703o008J419M836n975J302M799
6808C487n859J385M469n778J794M116n879K128M026o260K268M269o430K145M330
6823D211o439K023M145o126K024L817o011K197L540o224K774L413o562K882L478
$$ plain form
6714 -1644 3359 -72 -1589 3408 -113 -1625 3426 -131 -1587 3318 -333 -1647 3260 -661 -1807
6729 -1807 3146 -1029 -2059 3012 -1207 -2383 2903 -1450 -2552 2662 -1574 -2619 2598 -1765 -2611
6744 -2611 2594 -1903 -2498 2721 -1873 -2448 2961 -1773 -2268 3129 -1517 -2028 3235 -1349 -1722 3455
6760 3455 -1355 -1340 3720 -1304 -1180 4008 -1265 -1135 4080 -1124 -1105 4036 -1115 -1117 3880 -1284 -1061
6777 -1061 3714 -1625 -1125 3590 -2063 -1435 3486 -2275 -1640 3331 -2444 -1867 3055 -2505 -1872 2823
6793 2823 -2756 -1800 2743 -2886 -1637 2879 -3030 -1589 3114 -2894 -1475 3361 -2614 -1312 3487
6808 3487 -2372 -987 3482 -2296 -502 3614 -2265 -137 3889 -2371 -103 4166 -2264 -119 4211
6823 4211 -2228 -205 3940 -2186 -162 3655 -2356 -159 3381 -2843 -69 3344 -3218 -336 3142
6838C142o660K838L750o569K570L667o226K624L277n931K959K834o028L477K780
6853B504o355L742K934o592L669L214o450L333L244o128L184K819n764L428K351
6868C133n800L914K010o169M282K110o493M163K503o620L955K382o208L713J938
6883B813n742L829J498n732M332J217o097M671J295o271M823J476o380M654J604
6898A990o136M361J516n628M387J061n382M728P08n461N203M91n781N405Q24n858
6914c572N116R92n683M755Q46n196M726M05n041M989j80m912N280k85n292N421
6930B369r2n517N402j1n339M989l4m932M790l71m576M902p30m473N218r74m581
6947c960N602r62m802N589p82m728N332n76m501N254q01m070N119j145l800N443
$$ plain form
6838 3142 -3518 -680 3070 -3499 -929 2738 -3488 -864 2413 -3518 -559 2275 -3753 -276 2504
6853 2504 -3851 -109 2825 -3767 -98 3116 -3334 -1 3243 -2885 299 3118 -2646 782 3133
6868 3133 -2667 1247 3257 -2912 1370 3480 -3013 1150 3653 -2967 988 3370 -2838 875 2813
6883 2813 -2929 900 2398 -3334 998 2215 -3882 789 2084 -4187 636 2112 -4268 386 1990
6898 1990 -4146 215 1731 -3897 490 1551 -3831 897 1605 -3856 1347 1838 -3943 1462 2286 -3572
6914 -3572 1544 2536 -3147 1608 2454 -2742 1984 2389 -2652 2337 2157 -2755 2525 2240 -3052 2369
6930 2369 2277 -3240 2162 2151 -3188 1801 1767 -3165 1625 1254 -3322 1580 850 -3623 1595 621 -3960
6947 -3960 1642 680 -4122 1467 685 -4043 1289 713 -3788 1466 665 -3405 1714 569 -3231 2212
6963B212j471l853N669j510m062N843j454m171N625j295l926N261j440l726N182
6978B884j638l426N105j934l364N291k191l373N440k252l415N426k163l468N262
6993B184k075l228N011k132k900M970k343k716N145k547k550N173k554k645N340
7008B133k511k687N232k378k562N068k289k383M909k504k003M810k782j871M929
7023C111k910j961M956k873k028M952k802k085M682k669k029M499k781j709M339
7038B692k977j502M340l133j521M521l257j539M508l118j556M432k912j546M231
7053A663k835j214M053k883r91M004l046q56M075l087p68M104k925j031M065k799
7069d71r63L900k709q35L689k741p07L587k968m25L444k959m74L397k970n67L374
$$ plain form
6963 2212 741 -3112 2557 1047 -3015 2828 1374 -2797 2828 1533 -2393 2868 1428 -2298 2884
6978 2884 1246 -2180 2925 991 -2373 2918 727 -2646 2794 542 -2873 2553 390 -3078 2184
6993 2184 109 -3119 1892 -240 -3140 1830 -513 -3229 1916 -631 -3181 1992 -562 -3207 2133
7008 2133 -378 -3065 2167 -211 -2773 2295 6 -2377 2532 28 -1975 2835 53 -1818 3111
7023 3111 201 -1760 3196 323 -1705 3247 445 -1640 3042 373 -1656 2843 62 -1647 2692
7038 2692 -285 -1787 2553 -580 -2101 2420 -837 -2376 2132 -986 -2542 1890 -1022 -2568 1663
7053 1663 -1172 -2386 1667 -1216 -2207 1797 -1249 -2105 1970 -1117 -1885 2219 -706 -1737 2328 -471
7069 -471 -1434 2466 -243 -1078 2611 -130 -837 2750 -218 -643 2801 -158 -632 2765 -205 -772 2602
7086B602k905o55L275k824n44L098k752m89K940k802k24K858k865k68K891k767
7102a431k05K893k730k05K807k511k81K731k363o4K597k336j4K511k331P9K472
7119A619k402J93K491k380J20K389k383J25K332k223M1K177k115J7J998k136J60
7136B3J840k100J33J788k116J29J713k104J41J717k064J44J660j916K3J620j740
7153a109L8J451j595J79J353j613L41J310j607M30J325j547K66J434j347J13J426
7170H48j238J07J224j043J20J143j106J90J045j146K92R56j198J91J035j118p5
7187B27J066r86k14R09q18k21O54p97l7N94p92k0N73q19l5P24q04j72Q57o37l53
7208a101Q07m27k81O26j40l16M76j32j26O08l25j15P25k84l43R27k79m69Q15K8
$$ plain form
7086 2602 -303 -958 2317 -507 -1051 2047 -705 -1194 1746 -1056 -1280 1578 -1287 -1555 1336 -1431
7102 -1431 -1636 1257 -1473 -1678 1129 -1382 -1663 1068 -1295 -1359 1238 -1098 -1112 1399 -932 -853 1619
7119 1619 -783 -590 1901 -479 -359 2030 -353 -228 2104 -119 -78 2099 -16 1 1999 -137 23
7136 23 1863 -237 -104 1684 -432 -303 1410 -694 -553 1164 -900 -756 904 -1012 -989 631 -1109
7153 -1109 -1071 380 -1215 -1036 317 -1296 -955 355 -1252 -822 503 -1044 -778 656 -691 -578 848
7170 848 -390 -283 941 -102 18 1161 55 245 1290 144 436 1392 194 385 1420 302 227
7187 227 1293 307 93 1002 184 -37 617 -180 -217 377 -415 -435 138 -681 -716 8 -796 -968 -111 -748 -1101
7208 -1101 -294 -721 -1002 -376 -516 -832 -356 -488 -614 -6 -331 -446 279 -5 -348 579 300 -169 646 674
7228F74o05N75J91n51M37J71m89M28k4n12N22o8p44O69l7q44O09K26j106N07M59
7249D88j107L24M11r22L43L10r08O32J84r86P52K77j176Q64N39j236P43O83j299
7268a084O98P87j240P65O97j215P76N92j172Q37O00j357R78O24j557R64Q10j702
7286a99Q95P93j679Q28P32j804R32O50j684R31O93j919R40P06k029J162P09k094
7304a437J152O89j966J142P69k072J222Q13k041J206Q46k041J310Q74k103J416
7320b21R03k209J663P89k274J645R48k333J622Q94k273J608Q62k331J604P63k388
7337g28J740O62k526J940O11k734K079M67k694J969N92k822J978N26k768K041
7353C33M91k790K161M35k767K270L31k886K470L79k959K573N10k946K476M96k830
$$ plain form
7228 674 69 644 835 284 721 892 403 831 807 295 817 749 5 674 637 -207 402 628 -478 29 488
7249 488 -619 -295 116 -806 -463 -153 -1061 -429 -245 -1231 -479 -202 -1378 -514 25 -1211 -468 215 -1084
7268 -1084 -386 401 -839 -74 623 -592 184 776 -396 441 1041 -316 662 1286 -271 693 1503 -199
7286 -199 696 1489 -190 638 1370 -434 498 1148 -536 395 1088 -831 109 815 -1214 -52 657 -1437
7304 -1437 -285 404 -1562 -420 349 -1723 -501 312 -1729 -523 323 -1718 -408 466 -1637 -221
7320 -221 682 -1527 136 925 -1349 296 1244 -1089 533 1427 -846 762 1624 -707 897 1660 -728
7337 -728 1012 1674 -852 1088 1699 -1035 1044 1511 -1183 786 1378 -1444 534 1060 -1708 333
7353 333 824 -1966 195 630 -2137 133 464 -2422 48 427 -2532 41 551 -2395 81 577 -2253
7370b253K490M55k700K622K61k848K911J61k859K934K13l036L025L14l140K874
7386A424L01k993K759J75k886K766Rk969L037k93k991L139k98l179L295j97l311
7403b212L138j30l145L098k28l079L208m46k920L445o03l013L680n65l146L706
7419G88m74l106L685m83k911L621n42k818L749q92k678L946r71k865M047q85l077
7436a866M129q81l038L842q45k899L745j094k731L914j425k638M068j507k951
7451b177M288j560l035M240j360k950M014j347k769L973j610k485M181j900k453
7466b950M430j941k646M614j715k771M475j555k607M240j550k315M213j874k065
7481b017M379k243k075M735k340k291M774k238k454M645k077k388M316k058k150
$$ plain form
7370 -2253 237 692 -2008 614 875 -1973 938 1099 -1760 1174 1387 -1649 1376 1690 -1450 1424
7386 1424 1725 -1268 1491 1666 -1220 1546 1555 -1414 1623 1330 -1661 1478 1180 -1999 1296 1099 -2212
7403 -2212 926 796 -2349 749 521 -2558 650 204 -2716 729 126 -2887 793 228 -2918 788
7419 788 314 -2792 893 410 -2501 1120 578 -2240 1509 617 -2061 1885 914 -1951 2096 1211 -1866
7436 -1866 2263 1382 -1656 2186 1341 -1558 2187 1093 -1638 2276 851 -1787 2281 774 -2177
7451 -2177 2111 551 -2484 1756 396 -2554 1460 113 -2656 1317 -293 -2778 1403 -497 -2950
7466 -2950 1480 -461 -3107 1507 -208 -2979 1496 -59 -2666 1574 24 -2291 1922 48 -2017
7481 -2017 2362 119 -1956 2779 439 -1852 2922 684 -1770 2875 798 -1590 2726 668 -1482
7496a482M186k440j834M436k893j892M668k946k079M785k681k329M669k523k173
7511b528M270k509j736M093k674j391M300l187j202M691l352j443M904l117j785
7526b666M766k625j711M335k556j230M079k862r21M178l283p88M509l571j090
7541a436M838l409j435M598l003j501M235k923j066L751l201n47L821l789l37
7556a404M189m069n37M455l888r42M403l451r54M032l247n47L595l398J7L612
7572A866l869K42L929m038O1M273m036j46M287l637l72L934l388k7L452l378L29
7589e18L366l847O50L487m204O49L767m290K86L958m094L3L607l631J65L084l598
7606a130N65K697l747R69K856m227J007L159m322P98L465m224N66L313l791O36
$$ plain form
7496 -1482 2704 264 -1570 2866 -27 -1919 2749 -197 -2276 2509 -172 -2501 2168 -355 -2528
7511 -2528 1742 -767 -2503 1590 -1084 -2475 1825 -1362 -2564 2127 -1225 -2668 2236 -881 -2666
7526 -2666 2100 -525 -2236 2099 -457 -1687 2392 -470 -1391 2787 -496 -1284 3225 -346 -1436
7541 -1436 3402 -7 -1442 3156 153 -1348 2887 -36 -1102 2649 -552 -1099 2722 -1067 -1404
7556 -1404 2785 -1284 -1821 2634 -1254 -2196 2207 -1244 -2198 1834 -1413 -1960 1635 -1763 -1746 1866
7572 1866 -2003 -1761 2168 -1870 -1809 2464 -1572 -1718 2569 -1068 -1440 2494 -894 -921 2531 -847 -518
7589 -518 2848 -999 -349 3138 -1066 -417 3350 -940 -654 3304 -790 -757 2850 -781 -616 2468 -1130
7606 -1130 -565 2132 -1615 -646 2210 -2017 -1010 2149 -2173 -1375 2090 -2134 -1568 1745 -2046 -1410
7622a410K870l507R02K651l664J373K544l906J553K767m177J484L012m128J185
7637d51L052l913J124K734l621J225K320l599J583K082l876J897K114m143J854
7652C82K310m278J650K406m015J420K224l784J428K003l656J621J687l685K005
7667b82J608l905K183J733l980K037J982l936J968J948l670J821J707l260J953
7682i3J382l268K292J224l435K496J241l554K399J530l710K208J548l527K031
7697G64J404l296K025J016l054K192O72l158K414P31l394K420Q20l506K310J054
7713A414l434K132R84l148K045O80k909K281M66k877K501L06k925K706M53l154
7729b479K684N61k978K458O87k789K299N81k542K323K88k478K516P7k518K679
$$ plain form
7622 -1410 1460 -2047 -1145 1506 -2158 -785 1759 -2147 -594 2173 -2004 -520 2492 -1636 -451
7637 -451 2601 -1312 -188 2546 -1075 150 2470 -1129 454 2536 -1340 557 2671 -1472 382
7652 382 2692 -1586 64 2470 -1545 -125 2099 -1685 -257 1746 -1910 -289 1398 -2287 -282
7667 -282 1326 -2579 -396 1337 -2643 -606 1376 -2560 -592 1356 -2314 -493 1214 -2046 -93
7682 -93 1289 -1979 313 1537 -1898 598 1839 -1715 684 2214 -1496 712 2260 -1267 764
7697 764 2168 -1128 897 1913 -1141 1051 1723 -1435 979 1710 -1684 736 1556 -1950 360 1414
7713 1414 -2020 112 1096 -2052 -7 673 -2236 45 511 -2366 135 441 -2484 222 675 -2479
7729 -2479 205 766 -2212 246 933 -1856 443 1024 -1518 805 1093 -1385 1131 1208 -1310 1369
7745A369J0k631K726J28k739K478J51k536K281Q9k373K154r7k128K161k23k253
7762a433K330l40k253K335j72k384K347q0k348K222q4k218K229j32j975K221l27
7779f2j826K278l73j716K268k81j912K383k72j829K302l09j750K239k79j711K139
7796A289l61j631K028l22j592J961m68j582K050m91j608K040n47j596J918n07
7812E81j540J751m63j551J787n04j371J653m82j268J681n69j301J760n21j239
7828a596J717l62j315J670j81j276J570k37j022J458k58q99J374m43p58J400m34
7845D08q33J532m92r49J471k75j044J210r3j072J070j97p89R18l58p37J007n44
7863B33o57J103n62q76J133k94j022J012j53q56O92Jp22N90o6m91N97k37l24Q33
$$ plain form
7745 1369 1379 -1252 1474 1602 -1137 1341 1492 -1044 1237 1326 -1047 1107 1010 -1118 1043 820 -1433
7762 -1433 897 557 -1696 639 467 -1917 430 350 -1998 224 140 -2078 151 19 -1956 265 -62
7779 -62 -1888 390 17 -1699 569 288 -1624 759 487 -1342 960 651 -1099 1140 861 -850 1289
7796 1289 928 -703 1325 1003 -589 1372 904 -678 1372 881 -727 1313 766 -830 1088 581
7812 581 -959 792 329 -1222 565 61 -1310 343 -139 -1407 274 -295 -1596 164 -357 -1596
7828 -1596 121 -241 -1556 114 -67 -1343 227 -10 -1032 426 168 -731 643 200 -558 842 408
7845 408 -425 1107 615 -334 1137 862 -182 1028 935 -137 933 736 -53 865 507 -230 777 233
7863 233 -424 679 117 -759 374 80 -942 70 -83 -939 -247 -246 -968 -378 -444 -935 -338 -575 -899 -66
7883f6l18n79J013j39q28Q90K65p59N94L39o05M35L29m63M03N1l29N34o9n56O70
7904H12%o75N17L41q50K19L80o17O1L32m19n6J86m23J72L6m63K28K00p19K31M92
7926a5q04N6P07p19j32P50n14j03N49l87M4M18l55J85M99n87K09P46p92J88R04
7947H47p87j68J026n49k72Q38m65k02P52o95N3O88q04l6Q96r55j83R66q80l95
7967c25J062q94m34J020p98k84Q96q54k01J008r93j19J104j038k14J261j075k19
7985a097J344r25l65J415q58l96J424r15k03J375j097j09J452j105j79J547j184
8002A24k29J515j157k51J475j216l33J551j296l22J606j443l20J636j491l12J600
8019A137j535k07J567j594j70J606j637j74J697j703j41J776j710r6J747j642
$$ plain form
7883 -66 -384 -963 50 -89 -917 -27 238 -521 73 412 -193 242 571 108 511 562 233 767 698 142 812
7904 812 812 137 654 995 145 364 744 127 188 520 101 45 231 -192 -20 16 -447 -219 -19 -738 -507 -15
7926 -15 -819 -763 -56 -775 -907 -157 -671 -774 -225 -612 -568 -150 -505 -320 179 -408 -199 547 -245 -57 847
7947 847 60 -108 918 369 97 935 470 268 1020 325 378 1066 262 226 1122 167 -16 950 70 -325
7967 -325 737 -157 -591 429 -369 -653 243 -611 -812 196 -797 -916 188 -850 -1064 197 -878 -1097
7985 -1097 247 -678 -1043 372 -486 -882 542 -373 -576 799 -298 -407 1045 -60 -239 1308 124
8002 124 -105 1410 253 2 1477 261 -72 1479 183 -139 1467 24 -296 1340 -151 -463 1137
8019 1137 -398 -605 962 -632 -802 804 -833 -1007 690 -1013 -1154 622 -1088 -1184 563 -1079
8035a079j28J821j696R1J787j745J44J763j860J63K038j995J23K042j905O4J894
8052A522j814J00J924j907J78J813k021L13J819k278L05J928k316K18J952k267
8068e31O5K012k219Q3J812k212L35J750k290M53J736k487N33K027k642N26K104
8085A055k577M19K113k457N14J924k348O81J833k436Q95J833k703J005J975k763
8101a037Q86K066k717P69K017k626Q79J772k658J050J592k800J153J750l165J228
8117A59J752l035J064J941l159J056J759k909J097J554k948J324J428l024J516
8132d25J544l239J559J700l206J468J743l108J374J811k965J422J502k895J746
8147C1J299l112K025J357l273K007J614l393J837J692l233J687J549l150J746
$$ plain form
8035 -1079 -1207 614 -1082 -991 796 -949 -805 958 -902 -739 1299 -696 -573 1469 -436 -372 1522
8052 1522 -292 -192 1732 -175 3 1816 -205 108 1927 -351 -46 1882 -434 -216 1736 -531
8068 -531 -466 1546 -673 -590 1222 -990 -655 1095 -1195 -742 994 -1493 -960 1067 -1575 -1049 1055
8085 1055 -1522 -1103 1010 -1447 -933 991 -1357 -676 1157 -1279 -384 1449 -1254 -249 1726 -1037
8101 -1037 -151 1915 -802 -33 1984 -642 237 2009 -649 401 1993 -807 346 2096 -1069 159
8117 159 1911 -1124 -60 1881 -1278 -222 1537 -1372 -275 1279 -1669 -345 1083 -1941 -425
8132 -425 1119 -2120 -561 1139 -2067 -599 1144 -1964 -590 1221 -1744 -322 1180 -1715 31
8147 31 1330 -1782 243 1600 -1673 334 1948 -1445 392 2084 -1149 538 2087 -1063 683
8162F83J245l096J983J119l417K294J078l564K278J217l623K082J334l449J919
8177H3J238l241K071Q15l143K313P16l293K550Q59l605K684J031l585
8191b507
$$ plain form
8162 683 1928 -1168 815 1934 -1483 811 1889 -1675 603 1820 -1803 279 1613 -1836 83
8177 83 1321 -1920 151 966 -2177 136 852 -2441 109 968 -2637 47 1078 -2507
8191 -2507
$$ Imaginary data points
##PAGE= N=2
##DATA TABLE= (X++(I..I)), XYDATA
0@%%%Qj7J9k0K6l7N3p3R0j05J23j50J84k25K70l15L64m23M96n79O68p64Q71r92
27e28J130j283J448j629J824k043K289k556K847l163L507l887M311m780N292n851
43c072O473p172P959q849R858j1015J2361j3952J5866j8216K1175k5026L0266
56A6656l7834M9722p0994J19652l96169k3014R67906j004796R8783Q27453q38773
67b91408O6948P44399q29694K05670O16564q63942K97757O37754r80953L38303
77e8602O93770j009001K63206P52278r62594J90304P02123q48483J75773N90015
87D88789p92513K62398M84816q20285L59687M72096r02085L98655N28409r44213
97d64246L49654N86640r03690K75313N70292q06625K51657M84632p34491L09419
$$ plain form
0 0 0 0 0 8 -9 10 -10 16 -21 32 -41 49 -56 67 -83 101 -124 146 -169 195 -228 268 -311 357 -407 464 -528
27 -528 602 -681 767 -862 962 -1081 1208 -1348 1499 -1664 1843 -2044 2267 -2513 2779 -3072
43 -3072 3401 -3771 4188 -4661 5197 -5818 6543 -7409 8457 -9759 11416 -13610 16656
56 16656 -21178 28544 -42450 77202 -318967 -341981 625925 -378871 -280088 547365 -291408
67 -291408 -224460 519939 -309755 -104085 512479 -351463 -53706 584048 -396905 -58602
77 -58602 635168 -373833 -110627 641651 -320943 -130639 571484 -276999 -101226 488789
87 488789 -303724 -41326 443490 -376795 -17108 454988 -447097 -48442 479967 -464246
97 -464246 -114592 472048 -431642 -156329 413963 -392662 -141005 343627 -390864 -81445
107h1445L92103p39291M00613L65359q02180M47775M09486q49263M18586M64720
117D26463q28066L53125M65101p54115L19368M00321o88219L50892L17372o82224
127c19982M19461K78348p29526M63589K99872p76042M47569L42895p71248L92025
137D6961L51249p15007L52247L04620o52767L65044K34840o31467M16422J92218
147B64360o55106M60145J99024o88275M60154K32322o86816M23324K47077o43180
157c86971L88894K20474n85593L90606J67544n54779M26767J27949n61535M63385
167I6741J22663n83671M69793J42164n85963M44513J51752n58338M15397J34038
177B49089n16893M06408R2709m89162M24816N5037m89081M48491M0114n03468
$$ plain form
107 -81445 310658 -428633 -28020 337339 -464841 -17066 392420 -456843 -38257 426463
117 426463 -401603 -48478 416623 -337492 -18124 382197 -306022 44870 362242 -319982
127 -319982 99479 377827 -351699 111890 411762 -364280 83289 426184 -345064 46961
137 46961 398210 -316797 35450 340070 -312697 52347 287187 -344280 72142 264360
147 264360 -390746 69399 268423 -419852 40302 272624 -414192 9132 256209 -386971
157 -386971 1923 222397 -363196 27410 194954 -359825 66942 194891 -366644 96741
167 96741 219404 -364267 105526 247690 -338273 106240 257992 -300346 115051 249089
177 249089 -267804 138604 231313 -257849 166967 222004 -267077 181414 221528 -281940
187b81940M56909M6896n09798M40199N5200m90866M15930M4129m58188M05068
197A23539J7093m29667M12827j1971m18548M30323k4679m20934M37996k0683m19010
208c23714M29287j3165m02423M10562j5949l72427L97643l4022l45293L98701
218A29200n2847l30868M03682o3870l25233M04228o4766l21670L93572o1979l09639
229b00190L76239o5563k91246L60522p5854k71463L51138r0814k58350L48896
239A83315j00450k53003L43761j02891k47210L35052j02289k38911L22755j01910
249C8219k24336L11181j06610k08739L04680j12651j95442L01580j17467j86199
259a95784K99664j17211j78901K94088j14845j69356K86546j13730j58295K78765
$$ plain form
187 -281940 174969 221865 -287933 152266 207466 -283400 132530 176659 -281529 123539
197 123539 140632 -289035 123792 111821 -306727 123596 98917 -322017 115979 95296 -323714
208 -323714 105573 92408 -310015 100547 84598 -287829 109814 75792 -269501 129200
218 129200 76353 -254515 149167 85297 -239936 164292 99526 -222144 171428 109449 -200190
229 -200190 176049 110486 -180760 179762 103908 -167555 183583 92769 -165581 183315
239 183315 82865 -170138 173623 70732 -176478 158574 56285 -182626 140129 38219
249 38219 -186117 125064 18454 -190285 114395 1744 -193698 107882 -9585 -195784
259 -195784 103880 -13331 -192232 101856 -12989 -182345 104201 -9529 -167824 110941
269A10941j14985j47273K72524j17529j37702K66501j20360j29933K60742j21780
$$ plain form
269 110941 -4044 -151317 121207 3678 -134024 132477 12117 -117816 142926 21146
$$ [...]
8191h60
##END NTUPLES=NMR FID
##END=
