##TITLE=1H_IBA1203-3
 CDCl3
 8 sc, 
 13.3.2024
##JCAMPDX= 6.0         $$ Bruker NMR JCAMP-DX V2.0
##DATA TYPE= NMR FID
##DATA CLASS= NTUPLES
##ORIGIN= UXNMR, Bruker Analytische Messtechnik GmbH
##OWNER= root
$$ XWIN-NMR		Version 3.5
$$ Wed Mar 13 14:20:38 2024 Russian Standard Time (UT+4h)  she@DPX200
##.OBSERVE FREQUENCY= 200.1313
##.OBSERVE NUCLEUS= ^1H
##.DELAY= (6, 6)
##.ACQUISITION MODE= SIMULTANEOUS
##.ACQUISITION SCHEME= undefined
##.AVERAGES= 8
##.DIGITISER RES= 18
##SPECTROMETER/DATA SYSTEM= spect
##.PULSE SEQUENCE= zg30
##.SOLVENT NAME= CDCl3
##.SHIFT REFERENCE= (INTERNAL, CDCl3, 0, 15.7039)
##AUDIT TRAIL= $$ (NUMBER, WHEN, WHO, WHERE, WHAT)
$$ ##TITLE= Audit trail, XWIN-NMR		Version 3.5
$$ ##JCAMPDX= 5.01
$$ ##ORIGIN= Bruker BioSpin GmbH
$$ ##OWNER= she
$$ F:/spectra/data/she/nmr/H-F/1/audita.txt
$$ ##AUDIT TRAIL=  $$ (NUMBER, WHEN, WHO, WHERE, WHAT)
(   1,<2024-03-13 14:19:28.04 +0400>,<she>,<DPX200>,
      <created by zg, POWCHK disabled, PULCHK disabled
       configuration hash MD5:
       00 E9 B6 7A A2 85 ED C7 34 08 36 98 17 FE 4E 26
       data hash MD5: 16K
       6A A7 ED 27 02 A0 0C B0 CD 04 88 61 46 36 B8 BC>)
$$ ##END=
$$ 
$$ hash MD5
$$ A1 E0 84 8B 76 3E 7E 80 53 EA CA F7 92 A4 45 E0
##$RELAX= 
##$RELAX= 
##$RELAX= 
##$RELAX= 
##$RELAX= 
##$RELAX= 
$$ Bruker specific parameters
$$ --------------------------
##$DU= <F:/spectra>
##$EXPNO= 1
##$NAME= <H-F>
##$PROCNO= 1
##$TYPE= <nmr>
##$USER= <she>
##$AMP= (0..31)
100 100 100 100 100 100 100 100 100 100 100 100 100 100 100 100 100 100 
100 100 100 100 100 100 100 100 100 100 100 100 100 100 
##$AQSEQ= 0
##$AQ_mod= 1
##$AUNM= <au_zg>
##$AUTOPOS= <>
##$BF1= 200.13
##$BF2= 200.13
##$BF3= 200.13
##$BF4= 200.13
##$BF5= 200.13
##$BF6= 200.13
##$BF7= 200.13
##$BF8= 200.13
##$BYTORDA= 1
##$CFDGTYP= 0
##$CFRGTYP= 5
##$CHEMSTR= <none>
##$CNST= (0..31)
1 1 145 1 1 1 1 1 1 1 1 1 1 1 1 1 1 1 1 1 1 1 1 1 1 1 1 1 1 1 1 1 
##$CPDPRG= <>
##$CPDPRG1= <>
##$CPDPRG2= <>
##$CPDPRG3= <>
##$CPDPRG4= <mlev>
##$CPDPRG5= <mlev>
##$CPDPRG6= <mlev>
##$CPDPRG7= <mlev>
##$CPDPRG8= <mlev>
##$CPDPRGB= <>
##$CPDPRGT= <>
##$D= (0..31)
0 1.2 0 0 0 0 0 0 0 0.06 0 0.03 0 0 0 0 0.0002 0 0 0 0 0 0 0 0 0 0 0 0 
0 0 0 
##$DATE= 1710325167
##$DBL= (0..7)
120 120 120 120 120 120 120 120 
##$DBP= (0..7)
150 150 150 150 150 150 150 150 
##$DBP07= 0
##$DBPNAM0= <>
##$DBPNAM1= <>
##$DBPNAM2= <>
##$DBPNAM3= <>
##$DBPNAM4= <>
##$DBPNAM5= <>
##$DBPNAM6= <>
##$DBPNAM7= <>
##$DBPOAL= (0..7)
0.5 0.5 0.5 0.5 0.5 0.5 0.5 0.5 
##$DBPOFFS= (0..7)
0 0 0 0 0 0 0 0 
##$DE= 6
##$DECBNUC= <off>
##$DECIM= 32
##$DECNUC= <off>
##$DECSTAT= 4
##$DIGMOD= 1
##$DIGTYP= 9
##$DL= (0..7)
0 120 120 120 120 120 120 120 
##$DP= (0..7)
150 150 150 150 150 150 150 150 
##$DP07= 0
##$DPNAME0= <>
##$DPNAME1= <>
##$DPNAME2= <>
##$DPNAME3= <>
##$DPNAME4= <>
##$DPNAME5= <>
##$DPNAME6= <>
##$DPNAME7= <>
##$DPOAL= (0..7)
0.5 0.5 0.5 0.5 0.5 0.5 0.5 0.5 
##$DPOFFS= (0..7)
0 0 0 0 0 0 0 0 
##$DQDMODE= 0
##$DR= 18
##$DS= 0
##$DSLIST= <SSSSSSSSSSSSSSS>
$$ [...]
##$SUBNAM2= <"">
##$SUBNAM3= <"">
##$SUBNAM4= <"">
##$SUBNAM5= <"">
##$SUBNAM6= <"">
##$SUBNAM7= <"">
##$SUBNAM8= <"">
##$SUBNAM9= <"">
##$SW= 18.0517328524113
##$SWIBOX= (0..15)
0 0 2 0 0 0 0 0 0 0 0 0 0 0 0 0 
##$SW_h= 3612.71676300578
##$TD= 16384
##$TD0= 1
##$TE= 0
##$TE2= 300
##$TE3= 300
##$TEG= 300
##$TL= (0..7)
0 120 120 120 120 120 120 120 
##$TP= (0..7)
150 150 150 150 150 150 150 150 
##$TP07= 0
##$TPNAME0= <>
##$TPNAME1= <>
##$TPNAME2= <>
##$TPNAME3= <>
##$TPNAME4= <>
##$TPNAME5= <>
##$TPNAME6= <>
##$TPNAME7= <>
##$TPOAL= (0..7)
0.5 0.5 0.5 0.5 0.5 0.5 0.5 0.5 
##$TPOFFS= (0..7)
0 0 0 0 0 0 0 0 
##$TUNHIN= 0
##$TUNHOUT= 0
##$TUNXOUT= 0
##$USERA1= <user>
##$USERA2= <user>
##$USERA3= <user>
##$USERA4= <user>
##$USERA5= <user>
##$V9= 5
##$VALIST= <valist>
##$VCLIST= <CCCCCCCCCCCCCCC>
##$VD= 0
##$VDLIST= <DDDDDDDDDDDDDDD>
##$VPLIST= <PPPPPPPPPPPPPPP>
##$VTLIST= <TTTTTTTTTTTTTTT>
##$WBST= 1024
##$WBSW= 4
##$XGAIN= (0..3)
0 0 0 0 
##$XL= 0
##$YL= 0
##$YMAX_a= 589027
##$YMIN_a= -687115
##$ZGOPTNS= <>
##$ZL1= 120
##$ZL2= 120
##$ZL3= 120
##$ZL4= 120
##$ABSF1= 10
##$ABSF2= 0
##$ABSG= 5
##$ABSL= 3
##$ALPHA= 0
##$AQORDER= 0
##$ASSFAC= 0
##$ASSFACI= 0
##$ASSFACX= 0
##$ASSWID= 0
##$AUNMP= <proc_1d>
##$AZFE= 0.1
##$AZFW= 0.1
##$BCFW= 1
##$BC_mod= 2
##$BYTORDP= 1
##$COROFFS= 0
##$CY= 11.3945322036743
##$DATMOD= 1
##$DC= 2
##$DFILT= <>
##$DTYPP= 0
##$F1P= 15.7292609196834
##$F2P= 12.9074282941183
##$FCOR= 0.5
##$FTSIZE= 0
##$FT_mod= 4
##$GAMMA= 1
##$GB= 0.15
##$INTBC= 1
##$INTSCL= 1
##$ISEN= 128
##$LB= 0.24
##$LEV0= 0
##$LPBIN= 0
##$MAXI= 10000
##$MC2= 0
##$MEAN= 0
##$ME_mod= 0
##$MI= 1.114404
##$NCOEF= 0
##$NC_proc= 0
##$NLEV= 6
##$NOISF1= 3.799351
##$NOISF2= 2.8
##$NSP= 1
##$NTH_PI= 0
##$NZP= 0
##$OFFSET= 15.70392
##$PC= 1
##$PHC0= -25459.74
##$PHC1= 9.187313
##$PH_mod= 1
##$PKNL= yes
##$PPARMOD= 0
##$PSCAL= 0
##$PSIGN= 0
##$REVERSE= no
##$SF= 200.130013532006
##$SI= 16384
##$SIGF1= 3
##$SIGF2= 2
##$SINO= 400
##$SIOLD= 16384
##$SREGLST= <1H.CDCl3>
##$SSB= 0
##$STSI= 0
##$STSR= 0
##$SW_p= 3612.71676300578
##$SYMM= 0
##$S_DEV= 0
##$TDeff= 0
##$TDoff= 0
##$TI= <>
##$TILT= no
##$TM1= 0
##$TM2= 0
##$TOPLEV= 0
##$USERP1= <user>
##$USERP2= <user>
##$USERP3= <user>
##$USERP4= <user>
##$USERP5= <user>
##$WDW= 1
##$XDIM= 8192
##$YMAX_p= 0
##$YMIN_p= 0
$$ End of Bruker specific parameters
$$ ---------------------------------
##NTUPLES= NMR FID
##VAR_NAME=  TIME,          FID/REAL,        FID/IMAG
##SYMBOL=    X,             R,               I
##VAR_TYPE=  INDEPENDENT,   DEPENDENT,       DEPENDENT
##VAR_FORM=  AFFN,          ASDF,            ASDF
##VAR_DIM=   8192,          8192,            8192
##UNITS=     SECONDS,       ARBITRARY UNITS, ARBITRARY UNITS
##FACTOR=    0.0002768,     1,               1
##FIRST=     0,             0,               0
##LAST=      2.2672688,     0,               0
##MIN=       0,             -687115,         0
##MAX=       2.2672688,     589027,          0
$$ Real data points
##PAGE= N=1
##DATA TABLE= (X++(R..R)), XYDATA
$$ [...]
$$ plain form
2811 1604 4001 -1983 -2340 1307 -1252 -771 4010 609 -3880 -88 1232 -1299 1670 2645 -2684 -2543
2827 -2543 1578 420 38 2323 -834 -3522 510 2090 -272 919 908 -2853 -1576 2494 1294 -383
2843 -383 410 -1270 -2138 1251 2269 -207 -437 -484 -1905 69 2709 792 -1357 -811 -800 -450 1786
2860 1786 1718 -827 -1609 -722 -41 1261 1697 -271 -1800 -1020 294 1063 1337 236 -1512 -1630 8
2877 8 1565 1268 -67 -1031 -1338 -521 1274 1805 26 -1341 -1094 -465 785 2048 368 -1725 -996 -79
2895 -79 67 1644 1530 -1730 -2054 469 757 604 1475 -552 -2650 -95 1537 291 935 682 -2660
2912 -2660 -1568 2302 1123 -650 782 -911 -2841 1135 2840 -686 -561 334 -2343 -632 3565
2927 3565 664 -2227 437 -416 -2159 2275 3030 -2379 -1789 1282 -1304 -170 3757 -415 -3653 789
$$ packed form
2811A604K397n984l57L647k559M81M781l401m489L792J320k531K969R75n329J41
2827b543M121j158l82K285l157k688M032J580k362J191j1l761J277M070j200j677
2843c83P93j680q68L389J018k476k30m7j421J974K640j917k149N46J1L50K236
2860A786o8k545p82Q87O81J302M36j968j529P80J314P69K74j101j748j18J638
2877HJ557k97j335r64l07Q17J795N31j779j367K47O29J250J263j680k093P29R17
2895g9J46J577j14l260l24K523K88j53Q71k027k098K555J632j246O44k53l342
2912b660J092L870j179j773J432j693j930L976J705l526J25Q95k677J711M197
2927C565k901k891K664q53j743M434P55n409N90L071k586J134L927m172l238M442
$$ plain form
2943 789 902 -1688 2430 2301 -3948 -1712 2940 -599 -536 3352 -1333 -4375 2027 2339 -1931 1515
2959 1515 1545 -4472 -865 4470 -663 -1720 2712 -1726 -4107 3558 3134 -3315 208 1753 -3944 -52
2975 -52 5358 -1370 -3209 2553 -968 -3305 4410 2803 -4985 -394 2910 -3160 164 5438 -2371
2990 -2371 -4423 3229 479 -2977 4070 1930 -6092 18 4408 -2646 -292 4777 -3380 -4640 4657
3005 4657 1491 -3643 3048 1353 -6207 883 5549 -2807 -1485 4019 -3353 -3792 5960 1611 -5023
3020 -5023 2279 1810 -5579 1686 6190 -3663 -2964 3987 -2255 -3034 6217 942 -6362 2042 2880 -4931
3036 -4931 1793 6067 -4819 -3939 4996 -754 -2951 5382 227 -6850 2528 4101 -4566 1137 5190
3051 5190 -5509 -3712 6364 29 -3768 4309 -237 -6509 3541 4772 -4926 21 4560 -5141
$$ packed form
2943G89J13k590M118j29o249K236M652l539O3L888m685l042O402L12m270L446
2959A515L0o017L607N335n133j057M432m438k381P665m24o449L523J545n697L892
2975e2N410o728j839N762l521k337P715j607p788M591L304o070L324N274p809
2990b371k052P652k750l456P047k140q022O110M390p054K354N069q157j260R297
3005D657l166n134O691j695p560P090M666q356J322N504p372m39R752m349o634
3020e023P302m69p389P265M504r853O99O951o242p79R251n275p304Q404Q38p811
3036d931O724M274j0886Q80Q935n750k197Q333n155p077R378J573q667N703M053
3051E190j0699J797J0076o335l797Q077m546o272J0050J231r698M947M539r701
$$ plain form
3065 -5141 -2667 7140 -220 -4894 3477 3 -5497 4423 4702 -6075 -932 4830 -4101 -2118 7097
3080 7097 -860 -5932 3201 1105 -4416 4341 3750 -7101 -948 6013 -3189 -2318 6447 -1518 -6370
3095 -6370 3740 2441 -3957 3215 2532 -7159 -4 7049 -3137 -3085 5734 -1704 -6023 4625 3202
3110 3202 -4510 1786 2041 -6227 1124 7192 -3723 -3871 5194 -1469 -5125 5354 2964 -5633 908
3125 908 2463 -5041 1725 6660 -4691 -4439 5471 -515 -4362 5160 2003 -6381 1062 3591 -4021
3140 -4021 1393 5532 -5358 -4278 6434 423 -4567 4097 1341 -6384 1688 4564 -3680 370
3154 370 4395 -5321 -3276 7347 427 -5505 3308 1427 -5794 2300 5077 -4150 -867 3714 -4374
3169 -4374 -1951 7389 -586 -6332 3206 1980 -4982 2719 4657 -5068 -1597 4213 -2981 -1324 6430
$$ packed form
3065e141K474R807p360m674Q371l474n500R920K79j0777N143N762q931J983R215
3080G097p957n072R133k096n521Q757n91j0851O153O961r202Q71Q765p965m852
3095f370J0110j299o398P172o83r691P155P053j0186N2Q819p438m319J0648j423
3110C202p712O296K55q268P351O068j0915j48R065o663l656J0479k390q597O541
3125I08J555p504O766M935j1351K52R910n986l847R522l157q384P443K529p612
3140d021N414M139j0890J080J0712o011m990Q664k756p725Q072K876q244M050
3154C70M025r716K045J0623o920n932Q813j881p221Q094K777r227L283M581q088
3169d374K423R340p975n746R538j226o962P701J938r725L471N810p194J657P754
$$ plain form
3184 6430 -1745 -6454 3766 2651 -4534 2424 3767 -5703 -1435 5293 -1995 -1838 5115 -2178 -5852
3199 -5852 4614 3297 -4651 1437 3045 -5492 -704 6047 -1890 -2977 4121 -1825 -4996 5157
3213 5157 3329 -5424 424 3178 -4346 31 5928 -2481 -3860 3837 -768 -3837 5064 2414 -6218
3228 -6218 280 3939 -3353 -22 5061 -3089 -4097 4087 310 -3196 3992 1285 -6169 911 4702
3243 4702 -2885 -642 4117 -3272 -3650 4718 1167 -3572 2553 830 -5197 1612 4899 -3015 -1603
3258 -1603 3382 -2694 -2760 5141 1076 -4404 1474 1391 -3832 1791 4415 -3402 -2327 3235 -1463 -1905
3274 -1905 4597 299 -4930 1366 2305 -2929 1373 3367 -3687 -2387 3638 -311 -1704 3293 -529
3289 -529 -4508 1831 2919 -2359 587 2302 -3482 -1640 4027 118 -2245 1883 -518 -3408 2220
$$ packed form
3184F430q175m709J0220j115p185O958J343r470M268O728p288J57O953p293l674
3199e852J0466j317p948O088J608q537M788O751p937j087P098n946l171J0153
3213E157j828q753N848K754p524M377N897q409j379P697m605l069Q901k650q632
3228f218O498L659p292L331N083q150j008Q184l777l506P188k707p454P080L791
3243D702p587K243M759p389l78Q368l551m739O125j723o027O809L287p914J412
3258a603M985o076o6P901m065n480N878q3n223N623K624p817J075N562m698m42
3274a905O502m298n229O296R39n234M302J994p054J300O025l949j393M997l822
3289e29l979O339J088n278K946J715n784J842N667l909k363M128k401k890N628
$$ plain form
3304 2220 2947 -2448 -493 1590 -2540 -633 3968 -290 -2906 1223 220 -2188 2221 2356 -2823
3319 -2823 -1225 1685 -1089 -106 2947 -870 -2988 1163 1010 -1203 1648 1312 -2907 -1070 2261 -4
3335 -4 -285 1593 -1188 -2425 1389 1535 -792 558 259 -2371 -222 2484 74 -959 451 -879
3351 -879 -1319 1656 1528 -1005 -554 -116 -1025 669 1986 -351 -1400 -44 -146 -173 1433 769 -1472
3368 -1472 -1019 261 301 738 866 -762 -1406 -46 606 566 654 -187 -1391 -689 877 948 185 -299 -818
3387 -818 -835 281 1228 644 -566 -883 -490 114 962 945 -462 -1180 -256 237 525 1129 93 -1525 -686
3406 -686 777 448 404 585 -951 -1538 581 1178 73 295 -274 -1659 -112 1675 269 -522 341 -976
3424 -976 -1273 1604 1508 -1051 -475 83 -1233 413 2157 -368 -1500 467 -386 -817 1979 1079 -2204
$$ packed form
3304B220P27n395J955K083m130J907M601m258k616M129j003k408M409J35n179
3319b823J598K910k774R83L053l817k118M151j53k213K851l36m219J837L331k265
3335dk81J878k781j237L814J46k327J350k99k630K149K706k410j033J410j330
3351h79m40K975j28k533M51M38r09J694J317k337j049J356j02k7J606o64k241
3368a472M53J280M0M37J28j628o44J360O52m0Q8q41j204P02J566P1p63m84n19
3387h18j7J116R47n84j210l17L93O04Q48j7j407p18R24M93K88O04j036j618Q39
3406f86J463l29m4J81j536n87K119N97j105K22n69j385J547J787j406p91Q63j317
3424i76k97K877r6k559N76N58j316J646J744k525j132J967q53m31K796r00l283
$$ plain form
3441 -2204 -624 1120 -858 360 2104 -1177 -2083 1153 531 -743 1724 454 -2808 -27 2027
3456 2027 -756 -23 1734 -1786 -2112 2206 1055 -1409 1067 278 -2821 619 2745 -1170 -802 1537
3472 1537 -1773 -1677 3120 964 -2599 721 661 -2514 1134 2991 -1994 -1684 1867 -1146 -1251 3333
3488 3333 361 -3492 904 1539 -2313 1169 2843 -2877 -2027 2833 -342 -1482 2931 -171 -3900
3503 -3900 1456 2387 -2285 738 2435 -3357 -1649 3937 -175 -2296 2466 -252 -3779 2220 2931
3518 2931 -2797 -147 2361 -3141 -1075 4540 -639 -3299 2336 143 -3458 2703 2984 -3818 -665
3533 -665 2927 -2372 -872 4494 -1162 -3915 2676 990 -3179 2674 2545 -4687 -667 4065 -2004
3548 -2004 -1438 4176 -1473 -4239 3191 1841 -3365 1949 2128 -4782 -35 4875 -2201 -2226 3925 -1434
$$ packed form
3441b204J580J744j978J218J744l281r06L236o22j274K467j270l262K781K054
3456B027k783P33J757l520l26M318j151k464K476p89l099L440K126l915L68K339
3472A537l310R6M797k156l563L320o0l175L648J857m985L10L551l013j05M584
3488C333k972l853M396O35l852L482J674n720Q50M860l175j140M413l102l729
3503c900N356R31m672L023J697n792J708N586m112k121M762k718l527N999P11
3518B931n728K650K508n502K066N615n179k660N635k193l601O161K81o802L153
3533f65L592n299J500N366n656k753O591j686m169N853j29p232M020M732o069
3548b004N66N614n649k766P430j350n206N314J79o910M747M910p076k5O151n359
$$ plain form
3564 -1434 -4150 3871 2210 -4060 1173 2240 -4282 352 5117 -2681 -2973 3927 -861 -3695 4148
3579 4148 2030 -4815 815 2929 -3659 372 4867 -3263 -3485 4287 -141 -3605 3798 1565 -5303
3594 -5303 967 3671 -3357 -48 4431 -3440 -3556 5004 628 -4112 3012 1522 -5151 1261 4289
3609 4289 -3315 -776 4028 -3279 -3058 5609 584 -5067 2486 1956 -4649 1437 4410 -3651 -1549
3624 -1549 3900 -2573 -2489 5512 37 -5531 2480 2588 -4235 1295 4067 -4012 -1881 4180 -1782 -2259
3640 -2259 4825 -516 -5400 2869 3184 -4034 838 3665 -4034 -1715 4729 -1248 -2772 4010 -544
3655 -544 -4996 3298 3467 -4297 19 3418 -3578 -1349 4957 -1336 -3355 3533 -205 -4404 3494
3670 3494 3294 -4677 -417 3620 -2859 -1122 4636 -1609 -3613 3345 308 -3807 3304 2669 -5174
$$ packed form
3564a434k716Q021j661o270N233J067o522M634M765p798k92O900m788k834P843
3579D148k118o845N630K114o588M031M495q130k22P772m428l464P403k233o868
3594e303O270K704p028L309M479p871j16Q560m376m740P124j490o673O412L028
3609D289p604K539M804p307K21Q667n025n651P553n30o605O086K973q061K102
3624a549N449o473Q4Q001n475n568Q011J08o823N530K772q079K131O061n962m77
3640b259P084n341m884Q269L15p218M872K827p699K319O444n977j524O782m554
3655e44m452Q294J69p764M316L399o996K229O306o293k019O888l738m199P898
3670C494k00p971M260M037o479J737N758o245k004O958l037m115P111o35p843
$$ plain form
3685 -5174 -412 4147 -2344 -1295 4003 -1719 -3504 3462 852 -3411 2667 1963 -4919 207 4502
3700 4502 -2244 -1762 3401 -1633 -3166 3674 1170 -3582 1776 1678 -4104 716 4383 -2542 -2234 3272
3716 3272 -1255 -2718 3767 984 -3990 1316 2065 -3352 687 3909 -2820 -2387 3278 -718 -2359
3731 -2359 3390 560 -4178 1374 2579 -2825 443 3184 -2915 -2105 3614 -152 -2375 2640 179
3746 179 -3791 1773 2699 -2762 39 2628 -2740 -1605 3830 -179 -2702 2065 294 -3118 1880
3761 1880 2595 -2821 -453 2415 -2175 -1038 3669 -628 -3109 1958 792 -2643 1737 2242 -3032
3776 -3032 -773 2563 -1411 -871 3041 -980 -2981 2179 1171 -2341 1405 1736 -3084 -517 2900
3791 2900 -996 -1168 2253 -951 -2523 2228 1321 -2221 817 1295 -2637 -77 3063 -1061 -1607 1799
$$ packed form
3685e174M762M559o491J049N298n722j785O966k610m263O078p04o882N126M295
3700D502o746M82N163n034j533O840k504m752N358r8n782M820L667o925L08N506
3716C272m527j463O485k783m974N306P49n417M039L222o729M33N665l996j641
3731b359N749k830m738N552J205n404L268K741o099Q10N719l766k223N015k461
3746A79l970N564R26n461K801K589n368J135N435m009k523M767j771l412M998
3761A880P15n416K368K868m590J137M707m297k481N067j166l435M380N05n274
3776c032K259L336l974N40L912m021k001N160j008l512L746L31m820K567L417
3791B900l896j72L421l204j572M751r07l542L038M78l932K560L140m124n46L406
$$ plain form
3807 1799 -594 -1915 2176 1198 -2409 259 1207 -1901 242 2599 -1327 -1784 1754 -110 -1531 1889
3823 1889 854 -2552 127 1600 -1204 93 1880 -1369 -1649 1708 277 -1245 1315 356 -2232
3838 -2232 349 1911 -923 -377 1306 -1127 -1236 1713 504 -1228 633 228 -1573 612 1692 -911
3854 -911 -707 878 -695 -691 1563 384 -1404 75 384 -798 540 1157 -954 -772 699 -127 -229
3871 -229 1165 -26 -1361 67 788 -270 211 526 -742 -633 640 352 -105 319 -268 -841 272
3888 272 814 -34 -164 36 -429 -295 660 521 -251 -392 -180 -123 279 528 58 -544 -308 115 135 291 312
3909 312 -382 -731 119 524 74 27 171 -580 -489 690 485 -327 50 -135 -727 301 897 -351 -466 325
3929 325 -399 -425 1110 346 -1090 3 427 -670 328 1195 -680 -940 684 -54 -522 1100 205 -1556
$$ packed form
3807A799k393j321M091r78l607K668R48l108K143K357l926m57L538j864j421L420
3823A889j035l406K679J473k804J297J787l249k80L357j431j522K560r59k588
3838b232K581J562k834N46J683k433j09K949j209j732J861m05j801K185J080k603
3854i11K04J585j573MK254j179j788J479L09j182J338O17k111J82J471q26j02
3871b29J394j191j335J428P21j058M81L15j268J09J273k88m57M24n87n73J113
3888B72N42q48j30K00m65J34R55j39p72j41K12N7M02K49m70o02K36M23K0J56K1
3909C12o94l49Q50M05m50m7J44p51R1J179k05q12L77j85n92J028N96j248j15P91
3929C25p24k6J535p64j436J093M24j097R98Q67j875k60J624p38m68J622q95j761
$$ plain form
3947 -1556 228 991 -780 94 1230 -1017 -1102 1345 286 -972 884 194 -1761 521 1386 -1053
3963 -1053 -297 1267 -1149 -1030 1954 271 -1598 736 465 -1675 674 1698 -1404 -634 1407 -970
3979 -970 -910 2083 0 -2040 984 862 -1768 752 1791 -1841 -905 1881 -620 -1090 2013 -89
3995 -89 -2313 1265 1277 -1933 600 1820 -2134 -920 2535 -601 -1554 1941 -78 -2435 1520 1632
4011 1632 -2158 277 1814 -2125 -704 2818 -833 -2002 2048 62 -2504 1751 1758 -2577 -21 2063
4027 2063 -1941 -662 2905 -1025 -2210 2237 293 -2508 1834 1646 -3023 63 2513 -1801 -853
4042 -853 2856 -1100 -2456 2475 564 -2609 1693 1482 -3131 214 2894 -2030 -1163 2932 -1182 -2557
4058 -2557 2818 814 -3004 1391 1728 -3085 354 3188 -2160 -1401 3012 -1096 -2511 3129 845
$$ packed form
3947a556J784P63j771Q74J136k247q5K447j059j258J856o90j955K282Q65k439
3963a053P56J564k416J19K984j683j869K334k71k140K349J024l102P70K041k377
3979i70O0K993k083k040L024j22k630K520J039l632R36K786k501m70L103k102
3995h9k224L578J2l210K533J220l954J214L455l136r53L495k019k357L955J12
4011A632l790K435J537l939J421L522l651j169M050j986k566M255Pm335K556K084
4027B063m004J279L567l930j185M447j944k801M342j88m669L086K450m314R48
4042h53L709l956j356M931j911l173M302k11m613L345K680m924Q67M095m114j375
4058b557N375k004l818M395L37m813L439K834n348P59M413m108j415N640k284
$$ plain form
4073 845 -3505 1300 2040 -3035 299 3186 -2295 -1643 3170 -905 -2458 3045 608 -3677 1513 2417
4089 2417 -3010 68 3207 -2444 -1788 3409 -640 -2637 2792 591 -3727 1666 2644 -3233 -111
4104 -111 3239 -2501 -1887 3730 -592 -3073 2774 839 -3753 1748 2829 -3325 -391 3365 -2325
4119 -2325 -1784 3842 -664 -3389 2771 1193 -3832 1635 2924 -3504 -658 3608 -2059 -1927 3665
4134 3665 -618 -3434 2921 1335 -3745 1539 2906 -3622 -715 3948 -1849 -2284 3462 -526 -3379
4149 -3379 2843 1472 -3777 1290 2843 -3554 -691 4074 -1813 -2514 3420 -192 -3441 2703 1714
4164 1714 -3825 901 2945 -3191 -742 3955 -1820 -2737 3434 58 -3516 2602 1780 -3954 661
4179 661 3181 -3033 -1001 3812 -1685 -2780 3412 303 -3481 2354 1815 -3829 666 3307 -2791
$$ packed form
4073H45m350M805P40n075L334K887n481O52M813m075j553N503k437m285N190R04
4089B417n427L078L139n651O56N197m049j997N429k201m318N393R78n877L122
4104a11L350n740O14N617m322k481N847j935m592N501J081o154K934L756n690
4119b325N41N626m506k725O160j578n025N467J289o428K846M266n667J32N592
4134C665m283k816O355j586n080N284J367o528K907M663n797m35N746l988k853
4149c379O222j371n249N067J553o397K863M765n887p01N934l612l249O144r89
4164A714n539M726K044o136K449M697n775r17O171l376l574O118q22n734M615
4179F61K520o214K032M813n497j095O192l109l784N835n39n644M495K641o098
$$ plain form
4194 -2791 -1210 3624 -1490 -2708 3232 506 -3410 2028 1815 -3553 581 3208 -2730 -1351 3477
4209 3477 -1250 -2652 3157 533 -3450 1683 1926 -3131 339 3087 -2430 -1373 3255 -1029 -2564
4224 -2564 2974 600 -3447 1559 2217 -3000 49 3020 -2191 -1536 3146 -723 -2535 2600 667
4239 667 -3169 1458 2141 -2839 -81 2814 -1970 -1499 2981 -538 -2462 2237 739 -2807 1255 1990
4255 1990 -2604 -124 2578 -1767 -1366 2757 -448 -2353 1998 812 -2547 991 1884 -2343 -212
4270 -212 2376 -1451 -1250 2398 -415 -2104 1865 838 -2389 923 1748 -2088 -269 2222 -1227 -1264
4286 -1264 2142 -354 -1928 1680 745 -2147 789 1563 -1982 -284 2035 -1132 -1296 1888 -139 -1757
4302 -1757 1422 686 -1837 650 1399 -1619 -189 1789 -1017 -1017 1789 -145 -1586 1200 642 -1628
$$ packed form
4194b791J581M834n114j218N940k726l916N438k13n368M134K627n938J379M828
4209C477m727j402N809k624l983N133K43n057L470K748n517J057M628m284j535
4224b564N538k374m047N006O58n217L049K971n211O55M682l869j812N135j933
4239F67l836M627O83m980K758K895m784M71M480l519j924M699j498l546M062P35
4255A990m594K480K702m345M01M123l205j905M351j186l359L538Q93m227K131
4270b12K588l827K01L648k813j689L969j027l227L312Q25l836J819K491l449l7
4286a264L406k496j574L608r35k892K936P74l545J698K319l167j64L184k027j618
4302a757L179p36k523K487P49l018J430J978k806%K806j934j441K786n58k270
$$ plain form
4318 -1628 449 1235 -1332 -169 1478 -826 -829 1468 -189 -1393 1076 602 -1474 461 1151 -1195
4334 -1195 -354 1327 -662 -803 1169 -173 -1156 899 503 -1234 362 901 -1068 -271 1238 -566
4350 -566 -792 941 -57 -1017 729 436 -981 219 725 -844 -166 950 -521 -697 858 -9 -832
4367 -832 582 395 -841 43 599 -515 -152 653 -393 -429 650 59 -552 417 295 -703 79 592 -345
4386 -345 -182 418 -202 -377 376 74 -300 176 163 -425 131 413 -274 -180 259 -14 -225 176 63 -217 -19
4407 -19 92 -54 96 82 -113 -106 56 89 -31 57 130 -62 -230 54 265 -141 -218 128 -83 -302 152 220 -270
4430 -270 -83 196 -195 -16 434 -256 -439 373 -23 -440 381 309 -709 -83 503 -271 -203 512 -267 -578
4450 -578 562 223 -577 386 408 -862 25 836 -485 -445 760 -286 -832 779 399 -917 248 555
$$ packed form
4318a628K077P86k567J163J647k304lK297j657j204K469m74k076J935O90k346
4334a195Q41J681j989j41J972j342r83K055l96j737J596N39j969P97J509j804
4350e66k26J733r98r60J746k93j417J200N06j569O78J116j471j76J555q67q23
4367h32J414j87j236Q84N56j114L63Q05j046l6J079n91o11R69j22r98P82N13r37
4386c45J63O00o20j75P53l02l74M76j3n88N56K82o87R4M39k73k11M01j13k80J98
4407a9J11j46J50j4j95PJ62L3j20Q8P3j92j68K84K11m06p7L46k11k19M54O8m90
4430b70J87K79l91J79M50o90j83Q12l96m17Q21p2j018O26N86p74O8P15p79l11
4450e78J140l39q00R63K2j270Q87Q11j321M0J205j046n46J611l80j316J165L07
$$ plain form
4468 555 -889 -18 1120 -596 -679 934 -221 -971 999 531 -1278 168 873 -958 -122 1244 -774
4485 -774 -929 1104 -48 -1042 1045 449 -1542 317 1217 -1077 -249 1372 -784 -1068 1438 217 -1320
4502 -1320 949 564 -1668 432 1443 -1233 -497 1480 -855 -1217 1663 288 -1690 880 773 -1711
4518 -1711 431 1631 -1389 -655 1642 -760 -1144 1843 130 -1974 894 1051 -1660 318 1715 -1550
4534 -1550 -868 1802 -522 -1250 1720 83 -2075 1051 1314 -1831 222 1776 -1640 -936 2134 -425
4550 -425 -1534 1652 172 -2101 1148 1340 -1938 38 1730 -1556 -752 2356 -556 -1808 1668 345
4566 345 -2101 1225 1565 -2092 -139 1854 -1436 -663 2307 -705 -1992 1794 550 -2140 1276 1478
4582 1478 -2341 -171 2121 -1230 -875 2194 -760 -2003 1896 699 -2181 1120 1402 -2386 -112
$$ packed form
4468E55j444Q71J138j716q3J613j155p50J970m68j809J446P05j831Q36J366k018
4485g74j55K033j152r94K087n96j991J859R00k294Q28J621k156k84K506j221j537
4502a320K269l85k232K100J011k676P36J977k335l62K880j375j978K570j07k484
4518a711K142J200l020P34K297k402l84K987j713k104K868J57k711J978J397l265
4534a550O82K670k324p28K970j637k158L126K63l145K053J554l416P04L070k559
4550d25j109L186j480k273L249J92l278J976J692l286Q04L108k912j252L476j323
4566C45k446L326L40l657J953J993l290P73K970l012j287L786j244k690L416K02
4582A478l819K170K292l351L55L069k954j243L899j197k880L301K82l788K274
$$ plain form
4597 -112 2383 -1292 -1135 2100 -644 -2001 1983 844 -2280 817 1456 -2153 61 2420 -1366 -1309
4613 -1309 2120 -582 -1891 2164 835 -2537 727 1654 -2003 -21 2313 -1501 -1445 2147 -338 -1806
4629 -1806 2121 606 -2790 861 2011 -1971 -225 2260 -1592 -1459 2329 -121 -1819 1903 468
4644 468 -2731 1062 2125 -2156 -424 2210 -1544 -1387 2506 -107 -2078 1665 544 -2431 1232
4659 1232 2079 -2226 -553 2251 -1337 -1201 2550 -216 -2383 1568 835 -2300 1164 1973 -2449 -712
4675 -712 2497 -1087 -1208 2416 -450 -2447 1765 1085 -2371 980 1937 -2520 -667 2790 -942 -1545
4691 -1545 2200 -373 -2374 1923 1190 -2391 691 1837 -2438 -451 2905 -997 -1841 2058 -40
4706 -40 -2216 1855 1275 -2502 375 1817 -2057 -330 2763 -1219 -2056 2096 230 -2027 1684 1225
$$ packed form
4597a12K495l675J57L235k744j357L984j139l124L097O39l609K214K359l786N7
4613a309L429k702j309M055j329l372L264R27l657J982K334l814N6L592k485j468
4629a806L927j515l396L651J150l982J746K485l852J33L788k450j698L722j435
4644D68l199L793J063m281J732K634l754J57L893k613j971L743j121k975L663
4659A232Q47m305J673K804l588J36L751k766k167L951p33l135L464Q09m422J737
4675g12L209l584j21L624k866j997M212o80l456L351R57m457J853L457l732o03
4691a545L745k573k001M297p33l581L082J146m275J987L356l902q44L899k098
4706d0k176M071n80l777K877J442l874J727L093l982q37M152j866k257L711m59
$$ plain form
4722 1225 -2613 210 2123 -1602 -482 2432 -1293 -2036 2248 506 -2088 1404 1126 -2591 282
4737 282 2353 -1533 -869 2162 -1081 -1896 2291 646 -2231 1077 1046 -2304 432 2418 -1626 -1140
4753 -1140 2025 -792 -1658 2242 600 -2422 823 1276 -1825 361 2122 -1685 -1213 2008 -474 -1455
4769 -1455 1961 373 -2454 712 1604 -1576 123 1767 -1536 -1164 2020 -118 -1404 1532 147
4784 147 -2183 946 1730 -1566 -281 1528 -1309 -1063 2061 11 -1682 1021 319 -1718 988 1531
4800 1531 -1678 -519 1505 -981 -774 1907 -96 -1840 854 619 -1349 728 1243 -1603 -587 1434
4816 1434 -557 -623 1461 -291 -1755 907 878 -1076 384 950 -1495 -437 1429 -284 -712 999
4832 999 -305 -1300 933 906 -1051 81 657 -1126 -198 1453 -322 -1021 645 -65 -921 957 737
$$ packed form
4722A225l838K823J913l725J120K914l725p43M284j742k594L492k78l717K873
4737B82K071l886O64L031l243q15M187j645k877L308l1l350K736J986m044M86
4753a140L165k817q66L900j642l022L245M53l101K186J761l807M72L221k482r81
4769a455L416j588k827L166Q92l180J699J644l303L72L184k138j286K936j385
4784A47k330L129P84l296J285J809k837K46L124k050j693K703p02k037K706N43
4800A531l209J159K024k486K07K681k003j744K694k35j968K077N15k846J016K021
4816A434j991o6K084j752j464K662k9j954J460N66k445J058J866j713m28J711
4832I99j304r95K233k7j957J132N76j783R28J651j775o99J666p10q56J878k20
$$ plain form
4849 737 -1067 -158 604 -706 14 1194 -448 -1053 601 230 -517 717 483 -1088 -214 735 -213 -17
4867 -17 702 -546 -823 662 394 -381 393 85 -927 -50 841 -49 -222 163 -418 -454 671 411 -361
4886 -361 9 -95 -569 281 785 -250 -534 -22 -118 -119 534 264 -457 -277 -10 -15 356 334 -372 -490 68 136
4908 136 122 306 -69 -489 -187 214 282 152 -133 -389 -290 136 350 200 -143 -312 -253 14 393 374 -183 -342
4930 -342 -170 26 197 389 -36 -470 -297 207 144 149 264 -353 -421 172 314 106 147 -168 -719 -23 693 79
4952 79 -139 162 -402 -442 520 496 -240 -43 -73 -531 266 810 -320 -459 282 -250 -220 791 381 -789 -218
4973 -218 262 -307 348 705 -601 -701 497 44 -210 763 150 -1103 -12 738 -259 76 636 -761
4991 -761 -687 873 253 -446 526 -100 -1130 412 1056 -575 -209 613 -796 -535 1222 198 -870 343
$$ packed form
4849G37j804R09P62j310P20J180j642o05J654l71p47J234k34j571Q74R49r48J96
4867a7P19j248k77J485k68p75P74l08j012Q77Q91q90j73L85n81l6J125k60p72
4886c61L70j04m74Q50N04j035k84N12r6jO53k70p21J80K67nL71k2p06j18N58O8
4908A36j4J84l75m20L02M01O8j30k85k56R9M26K14j50l43j69N9K67L79j9n57j59
4930c42J72J96J71J92m25m34J73N04o3NJ15o17o8N93J42k08M1l15n51O96P16o14
4952G9k18L01n64m0R62k4p36J97l0m58P97N44j130j39P41n32L0J011m10j170N71
4973b18M80n69O55L57j306j00J198m53k54R73o13j253J091P50r97L35N60j397
4991g61P4J560o20o99R72o26j030J542O44j631L66Q22j409K61J757j024j068J213
$$ plain form
5009 343 42 -941 610 1087 -846 -471 724 -597 -390 1368 14 -1299 437 505 -855 604 1010
5026 1010 -1201 -701 1005 -284 -397 1210 -302 -1458 735 806 -940 479 920 -1499 -620 1553
5042 1553 -131 -780 875 -290 -1363 1027 1009 -1200 174 826 -1354 -329 1793 -275 -1250 857
5058 857 -2 -1194 1147 1024 -1477 -177 1057 -1049 -218 1774 -617 -1520 1008 315 -1172 1095
5074 1095 901 -1858 -188 1467 -725 -374 1550 -752 -1611 1300 698 -1226 832 654 -1925 25
5090 25 1860 -846 -832 1367 -625 -1418 1523 832 -1463 452 693 -1694 254 2006 -1015 -1165 1333
5107 1333 -369 -1294 1550 674 -1803 218 903 -1246 318 1800 -1268 -1271 1460 59 -1139 1422
5123 1422 457 -1948 360 1351 -1139 25 1516 -1349 -1270 1733 277 -1304 1043 244 -1891 640
$$ packed form
5009C43l01r83J551M77j933L75J195j321K07J758j354j313J736O8j360J459M06
5026A010k211N00J706j289j13J607j512j156K193P1j746J419M41k419Q79K173
5042A553j684o49J655j165j073K390j8k209J374O52k180J025K122k068r75K107
5058H57q59j192K341j23k501J300J234k106Q31J992k391r03K528o93j487K267
5074A095j94k759J670J655k192L51J924k302q59K911o02j924K058j78k579J950
5090B5J835k706J4K199j992p93K941o91k295J915K41k387J948J752l021j50K498
5107A333j702r25K844q76k477K021O85k149J564J482l068lK731j401j198K561
5123A422r65k405K308R91k490J164J491k865P9L003j456j581K347p99k135K531
$$ plain form
5139 640 1503 -1251 -236 1383 -1273 -1095 2012 269 -1630 687 426 -1444 820 1454 -1479 -438
5155 -438 1382 -1002 -842 2086 79 -1957 640 834 -1166 672 1192 -1599 -539 1487 -612 -715
5171 -715 1751 -257 -2041 864 1183 -1136 339 1040 -1577 -451 1726 -519 -924 1368 -334 -1743
5187 -1743 1173 1219 -1326 28 932 -1385 -186 1879 -585 -1267 1179 -147 -1467 1312 1148 -1623
5203 -1623 -239 979 -997 30 1665 -846 -1361 1240 178 -1256 1199 884 -1772 -179 1305
5218 1305 -634 -131 1214 -905 -1202 1359 326 -1220 906 551 -1791 51 1575 -622 -485 949
5234 949 -814 -899 1495 343 -1289 627 518 -1544 463 1690 -939 -848 969 -494 -759 1477 256
5251 256 -1472 501 666 -1129 482 1402 -1212 -963 1118 -196 -684 1250 21 -1575 578 936
$$ packed form
5139F40Q63k754J015J619k656J78L107j743j899K317k61j870K264O34k933J041
5155d38J820k384J60K928k007k036K597J94k000J838N20k791J060K026k099j03
5171g15K466k008j784K905L19k319J475P01k617J126K177k245m05K292j702j409
5187a743K916M6k545J354R04k317J199K065k464o82K446j326j320K779j64k771
5203a623J384J218j976J027J635k511n15K601j062j434K455l15k656J593J484
5218A305j939N03J345k119k97K561j033j546K126l55k342J842J524k197J37J434
5234I49j763q5K394j152j632J916j09k062K007J227k629R1J817j463k65K236j221
5251B56j728J973J65j795J611R20k614K49K081j314m88J934j229j596K153L58
$$ plain form
5267 936 -949 334 1047 -1240 -741 1338 69 -780 874 -137 -1467 706 1080 -955 -15 797 -1133
5284 -1133 -505 1479 36 -1004 631 -25 -1101 868 944 -1081 -312 827 -832 -256 1538 -168
5300 -168 -1277 521 336 -754 665 710 -1250 -286 915 -444 -221 1163 -450 -1342 724 654 -700
5317 -700 380 532 -1082 -258 1079 -209 -373 765 -542 -1021 930 731 -815 97 373 -971 -44
5334 -44 1202 -219 -643 432 -277 -652 928 578 -983 -136 495 -529 138 1009 -430 -864 419 68
5352 68 -348 705 287 -1043 -157 678 -229 87 572 -595 -737 624 312 -341 326 102 -874 41 826
5371 826 -101 -212 225 -469 -463 722 332 -399 -2 -9 -513 286 718 -286 -438 159 -201 -216 633 172 -617
5392 -617 -161 85 -85 364 360 -397 -488 176 101 -50 397 15 -602 -74 333 139 98 3 -431 -231 328 251
$$ packed form
5267I36j885J283P13k287M99K079j269q49J654j011j330K173L74k035R40Q12j930
5284a133O28J984j443j040J635o56j076J969P6k025P69J139j659N76J794j706
5300a68j109J798j85j090J419M5j960R64J201j359K23J384j613q92K066p0j354
5317g00J080J52j614Q24J337j288j64J138j307m79J951j99j546R12K76j344R27
5334d4J246j421m24J075p09l75J580l50j561Q47O31j024O67Q71j439m34J283l51
5352F8m16J053m18j330Q86Q35r07L16M85j167j42J361l12o53O67k24r76R15P85
5371H26r27j11M37o94OJ185l90p31L97pn04P99M32j004j52N97l60j5Q49m61p89
5392f17M56K46j70M49mp57r1O64p5j51M47l82o17N28M07j94m1r5m34K00N59p7
$$ plain form
5414 251 -8 89 -125 -502 60 497 142 -293 -250 -177 3 348 217 -63 -204 -256 -79 273 463 -74 -366
5435 -366 -190 93 151 163 66 -260 -301 10 286 188 43 -166 -393 -163 342 267 -122 -155 -246 -181 191 406 -62
5458 -62 -220 -138 -229 -36 536 158 -464 -254 81 38 252 251 -253 -301 77 65 81 436 3 -617 -121 515 34
5481 34 127 173 -393 -300 333 205 -61 111 -132 -554 175 600 -113 -237 130 -357 -263 575 244 -414 -80 -82
5503 -82 -394 418 553 -414 -363 213 -145 -126 676 37 -690 21 229 -281 355 408 -583 -378 440 -35 -109 511
5525 511 -157 -732 246 518 -298 139 246 -657 -274 684 58 -303 346 -239 -656 481 619 -432 -79
5544 -79 196 -625 -54 891 -120 -610 315 -17 -532 502 504 -575 -222 337 -414 81 841 -362 -807 437
5564 437 182 -427 467 430 -831 -136 547 -201 -31 592 -519 -758 723 329 -548 332 300 -848 -89
$$ packed form
5414B51k59R7k14l77N62M37l55m35M3P3J80L45j31k80j41n2J77L52J90n37k92
5435c66J76K83N8J2r7l26m1L11K76r8j45k09k27K30N05p5l89l3r1O5L72K15m68
5458f2j58Q2r1J93N72l78o22K10L35m3K14jn04m8L78j2J6L55m33o20M96O36m81
5481C4R3M6n66R3O33j28k66J72k43m22P29M25p13j24L67m87R4Q38l31o58L34k
5503h2l12Q12J35r67N1N76l58J9Q02o39p27P11K08n10O36N3r91K05Q18m75p4O20
5525E11o68n75R78K72q16M37J07r03L83R58o26l61O49n85m17J137J38j051L53
5544g9K75q21N71R45j011m90R25l32n15J034Kj079L53N59p51M95P60j203m45J244
5564D37k55o09Q94l7j261O95O83p48J70O23j111k39J481l94q77Q80l2j148P59
$$ plain form
5583 -89 807 -210 -255 457 -415 -587 883 394 -779 137 314 -735 113 899 -415 -490 547 -298 -480
5602 -480 891 303 -998 43 512 -519 136 754 -609 -534 623 -95 -452 828 161 -1106 100
5619 100 798 -376 -16 582 -665 -447 831 60 -512 685 103 -1099 298 954 -493 -258 530 -482
5637 -482 -412 931 5 -684 420 127 -826 473 895 -708 -417 514 -387 -315 985 -99 -883 469
5655 469 392 -727 318 782 -809 -488 704 -119 -246 746 -216 -797 579 583 -729 162 737 -752 -466
5674 -466 835 37 -380 491 -317 -776 691 537 -810 22 637 -661 -340 894 6 -628 269 -58
5692 -58 -486 669 442 -871 -49 591 -571 -189 889 -127 -749 362 82 -367 527 313 -899 -71
5710 -71 811 -357 -238 712 -223 -737 435 313 -383 329 152 -805 32 857 -354 -424 487 -195 -571 508
$$ packed form
5583h9Q96j017m5P12q72j72J470m89j173R16J77j049Q48P86j314p5J037q45j82
5602d80J371n88j301J041M69j031O55O18j363P5J157p18l57J280o67j267J206
5619A00O98j174L60N98j247K18J278p71n72J197n82j202J397O56j447K35P88j012
5637d82P0J343r26o89J104k93r53J299M22j603K91R31r01P2J300j084p84J352
5655D69p7j119J045M64j591L21J192q23j27R92r62n81J376Mj312Q91N75j489K86
5674d66J301p98m17Q71q08m59J467j54j347Q32O15j298L21J234q88o34Q97l27
5692e8m28J155k27j313Q22O40j162L82J078j016o22J111k80m49Q94k14j212Q28
5710g1Q82j168J19R50r35n14J172j22o96P12j77r57Q37Q25j211p0R11o82l76J079
$$ plain form
5730 508 366 -463 126 103 -589 219 724 -390 -491 520 -68 -449 512 331 -531 -44 254 -384 205 627
5750 627 -526 -449 576 65 -409 484 243 -675 -26 406 -159 128 346 -480 -292 629 23 -380 322 75
5770 75 -625 144 548 -219 -109 229 -320 -206 570 8 -417 210 71 -483 180 515 -314 -311 229 -142 -83
5791 -83 476 -64 -488 118 197 -267 253 365 -321 -290 257 2 -33 282 -217 -423 242 248 -263 119 186 -449
5813 -449 -140 363 28 -139 134 -180 -322 373 223 -326 39 112 -367 -94 412 -12 -246 85 -159 -112 321
5834 321 151 -348 -4 188 -192 16 411 -145 -296 132 52 -120 244 12 -404 11 211 -139 102 280
5854 280 -233 -283 186 95 -90 79 -12 -305 74 230 -80 -5 87 -228 -180 302 78 -191 -5 -38 -153 104
5876 104 281 -81 -138 61 -92 8 241 51 -242 32 43 -63 110 146 -153 -119 79 19 -41 163 -84 -210
$$ packed form
5730E08j42q29N89k3o92Q08N05j114j01J011n88l81R61j81q62M87K98o38N89M22
5750F27j153P7J025n11m74Q93k41r18O49M32n65K87K18q26J88R21o06m03P02k47
5770G5p00P69M04p67J10L38n49J14P76n62m25O27j39n54O63L35q29LN40l71N9
5791h3N59n40m24O06P9m64N20J12o86L1N47k55l5L15m99k06O65On11L82O7o35
5813d49L09N03l35j67K73l14j42O95j50n49L65P3m79K73N06m24k34L31k44M7M33
5834C21j70m99L44J92l80K08L95n56j51M28q0j72L64k32m16M15K00l50K41J78
5854B80n13n0M69r1j85J69r1k93L79J56l10P5R2l15M8M82k24k69J86l3j15K57
5876A04J77l62n7J99j53J00K33j90k93K74J1j06J73L6k99L4J98o0o0K04k47j26
$$ plain form
5898 -210 14 107 -1 22 25 -191 -73 166 92 9 35 -103 -156 106 178 -51 -71 15 -118 -41 70 67 -8 -81 -125 -76
5924 -76 194 177 -112 -60 63 -55 25 97 45 -28 -153 -40 62 146 -71 -176 -35 120 65 -33 76 -14 -38 -89
5948 -89 3 154 78 -70 -112 4 48 57 9 -25 -44 -26 -58 80 66 -33 -111 -58 61 77 42 -42 -71 -50 42 -34 56 30
5976 30 -86 -150 -10 109 22 -47 -71 -112 8 67 28 -33 4 -30 -137 71 121 -35 -47 -42 -6 60 84 -44 1 1 -41
6003 -41 -41 108 75 -156 -69 22 41 40 22 -128 -81 95 21 -10 99 0 -174 -4 113 17 -11 26 -40 -45 158 12 -69
6030 -69 84 -75 -124 30 112 -53 0 4 -62 -47 72 31 -86 -49 76 -46 74 109 -136 -79 41 -64 -9 56 -19
6055 -19 -120 21 35 -63 80 63 -104 -77 74 55 -71 60 -2 -97 79 45 -45 81 80 -173 -122 83 89 -95 24
6080 24 36 -87 5 55 -80 79 23 -97 -33 138 20 -131 -20 102 -27 -27 6 -20 -2 -26 -34 -26 152 -10 -132
$$ packed form
5898b10K24R3j08K3Lk16J18K39p4q3K6j38n3K62P2k29k0Q6j33P7J11lp5p3m4M9
5924g6K70j7k89N2J23j18Q0P2n2p3j25J13J02Q4k17j05J41J55n5r8J09r0k4n1
5948h9R2J51p6j48m2J16M4Rm8l4j9J8l2J38j4r9p8N3J19J6l5q4k9K1R2p6R0k6
5976C0j16o4J40J19q7o9k4m1J20N9l9o1L7l4j07K08N0j56j2NL6O6K4j28M5%m2
6003d1%J49l3k31Q7R1J9jj8j50M7J76p4l1J09r9j74J70J17r6k8L7o6nK03j46q1
6030f9J53j59m9J54Q2j65N3Mo6J5J19m1j17L7J25j22J20L5k45N7J20j05N5O5p5
6055a9j01J41J4r8J43j7j67K7J51j9j26J31o2r5J76l4r0J26jk53N1K05Oj84J19
6080B4J2j23R2N0j35J59n6j20O4J71j18j51J11J22j29%L3k6J8k4qQJ78j62j22
$$ plain form
6105 -132 10 71 -48 11 18 -53 22 7 -92 -31 110 -39 -103 4 44 -37 -18 12 -71 20 87 -27 -17 72 -43 -95 8
6132 8 117 -49 -46 -33 26 58 22 -37 -7 105 20 -126 -12 58 9 -60 -89 92 33 -38 -55 44 25 -58 -58 42 66 14
6160 14 -70 -23 29 35 -33 -39 -18 37 -52 -73 -25 61 -39 -59 -36 77 62 -34 -48 3 24 0 -31 -41 64 26 -91 -69 102
6189 102 37 -90 -87 29 -12 -1 -40 -69 24 -18 -125 9 153 -23 -64 -5 61 7 2 -45 23 84 12 -58 29 107 -51
6216 -51 -119 34 62 -63 -32 -15 36 60 -8 -32 83 8 -109 -113 72 64 -13 -8 -6 8 9 18 -39 70 50 -102 -81 98 25
6245 25 -125 1 63 -13 -4 14 -68 -54 44 -61 -87 163 66 -164 41 136 -58 -9 18 -79 2 47 -72 -5 144 -15
6271 -15 -147 11 123 2 -34 31 -43 -52 101 -44 -52 100 -11 -224 22 117 -93 -89 89 -45 -46 128 0 -103
6295 -103 67 -63 -174 119 142 -104 -81 49 -70 -45 79 27 -152 79 125 -132 93 135 -169 -106 125 45 -38
$$ packed form
6105a32J42O1j19N9Pp1P5j5r9O1J41j49o4J07M0q1J9L0q3R1O7j14J0Q9j15n2J03
6132HJ09j66LJ3N9L2l6n9L0J12q5j46J14P0m9o9k9J81n9p1j7R9j9q3%J00K4n2
6160A4q4M7N2Oo8oK1N5q9k1M8Q6j00k0K3J13j5r6j4N1K1k4l1j0J05l8j17K2J71
6189A02o5j27LJ16m1J1l9k9R3m2j07J34J44j76m1N9O6n4nm7O8O1p2p0Q7P8j58
6216e1o8J53K8j25L1J7N1K4o8k4J15p5j17mJ85qp7NKJ4JRn7J09k0j52K1J79p3
6245B5j50J26O2p6RJ8q2J4R8j05k6K50r7k30K05R5j94M9K7r7Q1M5j19O7J49j59
6271a5j32J58J12j21l6O5p4rJ53j45qJ52j11k13K46R5k10MJ78j34jJ74j28j03
6295a03J70j30j11K93K3k46K3J30j19K5J24n2j79K31M6k57K25M2l04O3K31q0q3
$$ plain form
6318 -38 120 30 -200 89 116 -80 -1 66 -183 -61 178 9 -80 55 1 -104 93 102 -108 -22 48 -148 -54 165
6342 165 1 -164 -2 26 -62 135 139 -123 -50 110 -117 8 145 -45 -201 77 13 -81 74 52 -163 -75 82
6365 82 -25 17 165 -96 -139 43 116 -79 13 19 -173 -75 141 1 -70 62 -64 -113 95 67 -99 -16 113 -74
6389 -74 3 198 -22 -134 27 42 -57 126 68 -112 -81 56 -27 7 119 -61 -190 49 85 -52 50 51 -159 -38
6413 -38 115 20 -6 42 -126 -140 90 96 -24 -47 -70 -117 7 112 5 -58 -20 -66 -86 119 136 -135 -117 -12 -27 116
6439 116 138 -39 -114 17 -42 -6 50 70 -98 -72 57 35 36 10 -70 -142 -7 94 -35 58 -20 -126 -66 85 103 -103
6465 -103 -73 -73 -8 1 90 2 -64 -58 -37 -33 121 19 -65 -80 19 80 -9 100 -76 -169 -6 55 15 -8 44 -129 -128 134 137
6494 137 -41 -3 -96 -159 56 120 -47 -48 10 -89 -65 173 40 -135 -6 0 -55 46 178 -145 -114 72 -25 -12 165
$$ packed form
6318c8J58r0k30K89K7j96P9O7k49J22K39j69q9J35n4j05J97Rk10Q6P0j96R4K19
6342A65j64j65J62K8q8J97Mk62P3J60k27J25J37j90j56K78o4r4J55k2k15Q8J57
6365H2j07M2J48k61m3J82P3j95R2Oj92R8K16j40p1J32j26m9K08k8j66Q3J29j87
6389g4P7J95k20j12J61J5r9J83n8j80L1J37q3L4J12j80j29K39L6j37J02Jk10J21
6413c8J53r5k6M8j68j4K30Oj20k3k3m7J24J05j07o3L8m6k0K05J7k71J8J05j5J43
6439A16K2j77p5J31n9L6N6K0j68K6J29k2Jk6q0p2J35J01j29R3p8j06O0J51J8k06
6465a03L0%O5RQ9q8o6OK1MJ54j02q4j5R9O1q9J09j76r3J63O1m0k3N2j73JK62L
6494A37j78L8r3o3K15O4j67jN8r9K4K38j33j75J29On5J01J32l23L1J86r7J3J77
$$ plain form
6519 165 30 -261 -14 82 -90 25 181 -158 -186 169 36 -62 129 -17 -285 22 184 -63 -14 112 -209
6540 -209 -112 287 43 -114 100 -34 -267 139 266 -200 -94 132 -138 -77 306 53 -259 77 49 -212 94
6561 94 229 -183 -175 143 -61 -118 292 -21 -349 106 144 -216 88 204 -307 -122 288 -41 -115 270 -80 -369
6583 -369 183 188 -200 11 203 -309 -114 405 -4 -231 241 -28 -299 308 289 -285 23 204 -316 -74 432
6604 432 -102 -348 228 28 -231 286 222 -436 -42 319 -192 -69 402 -145 -411 282 131 -263 201 153 -469
6625 -469 -59 359 -162 -165 428 -153 -409 347 226 -399 164 149 -476 -27 433 -174 -248 321 -162 -355 401
6646 401 262 -451 81 268 -448 80 500 -274 -302 398 -64 -342 438 168 -517 83 326 -364 72 432
6666 432 -354 -368 443 -22 -375 381 109 -604 188 433 -364 -46 375 -409 -248 517 -9 -468 364 122
$$ packed form
6519A65j35k91K47R6j72J15J56l39k8L55j33r8J91j46k68L07J62k47M9J26l21
6540b09R7L99k44j57K14j34k33M06J27m66J06K26k70O1L83k53l12L36k8k61L06
6561I4J35m12QL18k04n7M10l13l28M55L8l60L04J16n11J85M10l29p4L85l50k89
6583c69N52Nl88K11J92n12J95N19m09k27M72k69k71O07j9n74L08J81n20K42N06
6604D32n34k46N76k00k59N17o4o58L94L61n11J23M71n47k66O93j51l94M64m8o22
6625d69M10M18n21lN93n81k56P56j21o25N63j5o25M49M60o07p4N69m83j93P56
6646D01j39p13N32J87p16N28M20p74k8P00m62k78P80k70o85O00K43o90M36L60
6666D32p86j4Q11m65l53P56k72p13P92K45p97L18M21p84J61P65n26m59Q32k42
$$ plain form
6686 122 -487 223 462 -392 -80 413 -280 -237 567 8 -479 343 189 -505 250 417 -470 -198 495 -206
6706 -206 -237 568 -43 -561 309 283 -433 209 413 -507 -168 512 -156 -323 474 -103 -599 325 309 -451 74
6727 74 411 -503 -129 590 -168 -371 414 -23 -509 402 319 -527 19 383 -393 -149 637 -228 -486 434 21
6748 21 -439 392 315 -621 54 480 -380 -122 584 -196 -572 424 71 -403 343 228 -623 13 530 -295 -165
6769 -165 463 -309 -460 500 211 -429 189 254 -589 37 546 -271 -199 471 -201 -421 508 163 -589 152 261
6790 261 -512 92 586 -390 -334 443 -113 -370 481 173 -625 110 356 -431 72 496 -419 -328 517 -39 -400
6811 -400 421 43 -564 161 398 -430 17 424 -378 -320 511 73 -434 312 160 -554 243 427 -380 -112
6831 -112 364 -254 -243 506 -8 -479 257 160 -402 221 399 -427 -138 354 -205 -205 429 6 -464 243 217 -375
$$ packed form
6686A22o09P10K39q54L12M93o93M3Q04n59m87Q22j54o94P55J67q87K72O93p01
6706b06l1Q05o11n18Q70k6p16O42K04r20L39O80o68j67P97n77m96R24j6p60N25
6727G4L37r14L74P19p58k03P85m37m86R11q3q46N46L64p76K44P86q65k58R20m13
6748B1m60Q31p7r36O75M26q60K58P06p80l76R96l53m74P46j15q51O36N17q25J30
6769a65O28p72j51R60k89o40O18O5q43O26N09q17P2O70o72k20R29l45p52P41J09
6790B61p73O04M94r76N6P77n56k57Q51l08p98P35K46p87N03M24r15R1Q45n56l61
6811d00Q21l78o07P25K37q28M47M07q02N8Q31m38n07P46j52p14P97J84q07K68
6831a12M76o18J1P49n14m71P36r7n62O23J78q26K89M92n59%O34m23m70P07k6n92
$$ plain form
6853 -375 134 309 -395 -136 382 -127 -229 356 -2 -408 294 276 -317 43 251 -374 -56 458 -138 -242
6873 -242 400 -25 -321 194 225 -356 -15 257 -282 -6 369 -157 -227 238 2 -290 183 183 -390 -18 229
6894 229 -128 -51 279 -110 -284 163 68 -181 181 107 -352 -49 264 -153 -74 216 -129 -245 242 129 -233
6915 -233 96 52 -249 -1 184 -129 -72 172 -72 -102 236 85 -182 28 90 -165 74 151 -149 -129 138 -15
6937 -15 -102 175 50 -188 -39 105 -9 -4 126 -95 -92 40 76 -27 20 -7 -154 -15 161 20 -99 9 -60
6960 -60 -80 91 26 -35 -73 -16 -22 12 54 57 -96 -51 57 19 64 29 -25 -52 45 11 -59 57 50 -51 -42 84 5 -105 -9
6989 -9 22 -94 13 99 -1 -84 31 -45 -88 81 33 -145 38 40 -109 21 125 -68 -92 93 -7 -58 123 55
7013 55 -140 4 79 -128 -27 145 -160 -138 148 48 -58 143 75 -253 53 154 -171 -80 159 -186 -175 226
$$ packed form
6853c75N09J75p04K59N18n09j02N85l58m06P02j8n93L60K08o25L18N14n96j04
6873b42O42m25k96N15L1n81L41K72n39K76L75n26p0M65k36k92M73%n73L72K47
6894B29l57P7L30l89j74M47r5k49L62p4m59L03L13m17P9K90l45j16M87j13l62
6915b33L29m4l01K48J85l13N7K44k44l0L38j51k67K10O2k55K39P7l00K0K67j53
6937a5q7K77j25k38J49J44j14NJ30k21LJ32L6j03M7k7j47J39J76j41j19J08o9
6960f0k0J71o5o1l8N7oL4M2Lj53M5J08l8M5l5n4k7R7l4p0J16pj01RJ26p9j10R6
6989iL1j16J07Q6j00q3J15p6m3J69m8j78J83Kj49J30J04j93k4J85j00n1J81o8
7013E5j95J44P5k07J01J72l05K2K86j00j06K01o8l28L06J01l25R1K39l45J1M01
$$ plain form
7035 226 22 -215 102 48 -259 78 226 -163 -131 267 -101 -171 281 35 -337 200 130 -299 79 277 -270
7056 -270 -105 270 -98 -197 304 17 -297 147 188 -369 22 312 -302 -188 379 -39 -320 346 28 -408 205
7077 205 236 -330 24 306 -334 -150 454 -96 -411 345 116 -441 259 351 -373 -5 402 -268 -228 415 -119
7098 -119 -378 397 183 -452 257 364 -423 -46 467 -329 -264 541 -124 -483 396 159 -477 171 406 -474
7118 -474 -67 537 -316 -289 483 -133 -499 453 207 -583 151 430 -488 -45 525 -362 -379 546 -27 -517 471
7139 471 198 -625 216 415 -478 -114 571 -327 -363 572 -48 -561 438 267 -625 143 555 -526 -172 606
7159 606 -337 -429 579 65 -602 394 307 -611 166 485 -531 -192 624 -216 -422 539 -28 -641 447 331
7179 331 -665 137 589 -531 -170 643 -216 -494 614 49 -609 465 381 -678 72 612 -511 -249 675
$$ packed form
7035B26k04k37L17n4l07L37J48l89L2L98l68p0M52k46l72N37p0m29L78J98n47
7056b70J65L75l68r9N01k87l14M44M1n57L91K90o14J14N67m18k81O66l18m36O13
7077B05L1n66L54K82o40J84O04n50l15P56k29n57P00R2p24L68M07o70M0O43n34
7098a19k59P75k14o35P09J07p87L77N13p96O5Q05o65l59Q79k37o36O48K35q80
7118d74M07O04q53K7P72o16l66R52k46p90P34K79r18M43N70q87j7R25n73m90R88
7139D71k73q23Q41J99q93L64O85q98l6R35o20n13R99j71q92P68M12j081L54P78
7159F06r43r2J008n14o67R96q7r18P77L19j016L39Q16q40k06R61n67o13J088j16
7179C31r96Q02M52j120L61Q13q59k78J108n65o58J074q4j059P50N40j123K62R24
$$ plain form
7198 675 -210 -523 576 71 -581 360 343 -655 79 571 -485 -281 689 -253 -547 554 143 -602 336
7217 336 436 -625 71 606 -424 -266 678 -237 -555 569 167 -721 354 444 -685 59 642 -397
7235 -397 -340 661 -167 -501 525 118 -648 353 445 -632 11 625 -457 -322 620 -121 -513 499 113
7254 113 -699 253 443 -605 -39 564 -497 -367 613 -98 -552 512 105 -597 274 526 -568 -32 558
7273 558 -389 -307 664 -113 -562 507 142 -679 297 458 -612 -142 586 -410 -342 574 -60 -527 423 146
7293 146 -594 280 448 -609 -149 600 -343 -319 545 -83 -531 495 302 -534 187 389 -579 -73 612 -321
7313 -321 -369 555 -71 -539 445 284 -604 141 443 -537 -61 632 -344 -349 536 -64 -492 495 278 -611 94
7334 94 439 -426 -78 601 -265 -388 486 25 -408 377 234 -588 162 434 -454 -77 497 -318 -408 508 48
$$ packed form
7198F75q85l13J099n05o52R41j7r98P34M92j056K04R70r42k94J101m11p45R38
7217C36J00j061O96N35j030J58R44r15l18J124m02q88J075R0j129P44N83j039
7235c97N7J001q28l34J026m07p66J001R2j077O43O14j082J35R42p41l92J012l86
7254A13q12R52J90j048N66O03j061J30R80p11m54J064m07p02Q71K52j094N36N90
7273E58r47Q2R71p77m49J069l65q21R76J61j070M70P28r96O8R16o34m67R50k77
7293A46p40Q74J68j057M60P49r43K4Q64o28m48J026j93q36P21K02r68N06O85r33
7313c21m8R24o26m68R84j61q88P45L02r80M76O93r76nQ85o00m28R87k17q89P05
7334I4L45q65L48O79q66j23Q74m61m33P85j43q22P50K72q88L77N74q15r0R16m60
$$ plain form
7355 48 -448 302 179 -550 126 418 -376 -59 458 -260 -339 533 73 -498 242 179 -455 59 398 -344 -153
7376 -153 341 -180 -287 504 63 -521 200 208 -365 98 391 -343 -248 374 -49 -243 353 18 -492 187 264
7397 264 -307 53 345 -352 -247 388 -47 -296 240 49 -382 204 280 -243 -1 246 -236 -134 429 -48
7417 -48 -333 163 96 -280 199 219 -272 -102 261 -201 -78 294 -54 -316 100 134 -161 140 194 -280 -116 177
7439 177 -100 -65 213 -128 -267 92 135 -169 24 48 -262 -17 260 -22 -80 106 -25 -132 138 150 -121 -38
7461 -38 -47 -96 28 197 -64 -133 -12 -66 -96 162 123 -90 -200 51 47 69 15 -34 -115 3 83 33 57 -37 -136 -119 64
7488 64 103 88 -26 -86 -76 18 110 44 -147 -63 -25 -66 34 144 -36 -178 -31 -3 -4 107 52 -152 -78 134 -21
7513 -21 40 157 -114 -289 64 118 4 58 -38 -192 14 219 -43 -50 127 -78 -195 171 225 -149 -114 -6 -165
$$ packed form
7355D8m96P50j23p29O76K92p94L17N17p18p9Q72m60n71P40o3o34N14L39p42J91
7376a53M94n21j07P91m41n84P21Qn73M63K93p34R5O22m23j94N96l35n10O79P7
7397B64n71L60K92o97J05O35m35k49N36j91m31N86P6n23K42K47m82J02N63m77
7417d8k85M96o7l76M79K0m91J70L63m62J23L72l48k62M16L4k95L01N4m74J64K93
7439A77k77L5K78l41j39L59M3l04J93K4l10K45K77k82n8J86j31j07K70J2k71Q3
7461c8rm9J24J69k61o9J21n4l0K58l9k13j10K51mK2n4m9q1J18Q0n0K4r4r9J7J83
7488F4L9j5j14o0J0R4R2o6j91Q4L8m1J00J10j80j42J47K8jJ11n5k04P4K12j55
7513b1O1J17k71j75L53N4j14N4r6j54K06K05k62pJ77k05j17L66N4l74L5J08j59
$$ plain form
7536 -165 49 280 -55 -170 39 -111 -207 263 218 -295 -117 188 -177 39 337 -84 -296 159 89 -223 256
7557 256 181 -314 -26 265 -71 -66 288 -226 -328 251 193 -278 164 146 -405 28 395 -119 -149 197 -187 -286
7579 -286 359 210 -387 87 106 -389 35 463 -187 -390 236 -39 -238 438 140 -507 86 244 -274 166
7599 166 516 -329 -338 362 21 -204 380 60 -526 74 372 -255 -8 357 -441 -244 539 105 -366 297 98
7620 98 -503 219 478 -307 -83 363 -326 -259 586 26 -559 289 120 -539 297 503 -447 -165 403 -276 -203
7641 -203 658 -25 -661 270 261 -450 226 387 -575 -238 621 -198 -252 586 -110 -732 358 433 -478 146 348
7662 348 -594 -157 610 -214 -321 556 -208 -692 519 465 -543 -54 351 -570 -4 754 -213 -448 445 -50
7682 -50 -612 566 441 -765 -114 506 -341 -43 673 -258 -524 442 42 -485 527 357 -801 -64 656
$$ packed form
7536a65K14K31l35j15K09j50r6M70m5n13J78L05l65K16K98m21k12M55p0l12M79
7557B56p5m95K88K91l36NL54n14j02N79n8m71M42j8n51M33L67n14l0L46l84r9
7579b86O45j49n97M74J9m95M24M28o50k03O26k75j99O76k98o47N93J58n18M40
7599A66L50q45rP00l41k25N84l20n86O00K98o27K47L65p98J97P83m34m71O63j99
7620I8o01P22K59p85K24M46o89O7Q45n60n85Q48j69o59Q36K06r50K82N68o79P3
7641b03Q61o83o36R31rp11O76J61r62L37Q59q19n4Q38o96o22J090P5r11O24K02
7662C48r42M37P67q24j07Q77p64m84J211n4j008M89M05r21N66P58r67k35Q93m95
7682e0n62J178j25j206O51O20q47K98P16r31k66R66m00n27J012j70j158P37P20
$$ plain form
7701 656 -320 -168 586 -375 -609 616 258 -542 372 298 -818 12 793 -332 -237 425 -365 -460 706 226
7721 226 -657 306 332 -732 125 805 -399 -479 446 -179 -354 710 40 -795 181 373 -564 156 741 -513
7741 -513 -536 545 16 -308 557 14 -846 282 519 -479 77 571 -600 -470 747 55 -453 418 -31
7760 -31 -731 399 572 -526 -151 481 -540 -411 755 26 -598 281 121 -537 453 576 -659 -178 552
7779 552 -343 -250 776 -80 -754 304 200 -385 407 446 -697 -230 680 -172 -275 635 -139 -697 366
7798 366 381 -413 204 322 -712 -55 800 -169 -370 484 -132 -665 455 417 -453 3 213 -522 41 786
7818 786 -313 -429 390 -111 -484 564 361 -591 -94 347 -341 71 561 -395 -495 402 68 -389 415
7837 415 177 -698 -60 491 -205 -16 412 -415 -492 509 190 -319 320 142 -554 86 532 -200 -119 297
$$ packed form
7701F56r76J52P54r61k34J225l58q00R14p4j116Q30P81j125R5O62p90r5J166m80
7721B26q83R63K6j064Q57O80j204q0R25o25j75J064o70q35R76J92r37P20N85j254
7741e13k3J081n29l24Q65n43q60J128K37r98N56M94j171J30J217o92n08Q71m49
7760c1p00J130J73j098L75O32j021J29J166p29o24Q79j60o58R90J23j235M81P30
7779E52q95R3J026q56o74J058j04n85P92L9j143M67R10q52j03R10p74n58J063
7798C66J5p94O17J18j034O57Q55r69k01Q54o16n33J120l8q70M56K10p35N63P45
7818G86j099j16Q19n01l73J048k03r52M97M41o88M12M90r56j00Q97l34m57Q04
7837D15k38q75O38N51o96J89M28q27p7J001l19n09O39j78o96O40M46p32Q1M16
$$ plain form
7857 297 -412 -286 617 167 -499 104 92 -431 243 522 -332 -276 281 -194 -154 637 27 -550 60 228 -276
7878 -276 215 443 -442 -361 330 -15 -129 387 -115 -566 133 338 -211 122 232 -455 -270 489 84 -178
7898 -178 257 -176 -411 286 378 -199 -12 98 -400 -11 585 36 -350 75 -60 -225 330 364 -274 -174 51
7919 51 -191 72 451 -164 -396 117 109 -117 290 131 -449 -168 181 47 89 215 -340 -311 273 232 -73 145
7941 145 14 -457 -71 376 72 -7 50 -303 -182 398 225 -173 -74 -43 -279 106 355 -8 -205 -84 -155 36
7963 36 373 108 -369 -243 57 34 125 185 -118 -243 -38 69 137 291 -114 -403 -48 187 104 15 3 -152 -174
7986 -174 76 168 132 4 -244 -264 158 323 22 -133 -159 -112 -24 107 163 31 -179 -190 -21 214 262 -60 -224
8009 -224 -191 56 151 99 77 -85 -209 -95 219 183 47 -165 -227 -111 225 237 -65 -140 -52 -157 54 317 123
$$ packed form
7857B97p09J26R03m50o66O03j2n23O74K79q54N6N57m75M0P91o10n77O10J68n04
7878b76M91K28q85Q1O91l45j14N16n02m51O99K05n49L33J10o87J85P59m05k62
7898a78M35m33k35O97R2n77J87J10m98L89N96n49l86M25j35j65N55L4o38J00K25
7919E1k42K63L79o15k32N13qk26M07j59n80K81L49j34M2J26n55K9N84m1l05K18
7941A45j31m71L86M47l04p9N7l53J21N80j73l98R9L1k36L85K49l63j97J21p1J91
7963C6L37k65m77J26L00k3R1O0l03j25K05J07O8J54m05k89L55K35q3q9j2j55k2
7986a74K50R2l6j28k48k0M22J65l01j55k6M7Q8J31N6j32k10j1J69K35M8l22j64
8009b24L3K47R5n2k2j62j24J14L14l6j36k12o2J16L36J2l02p5Q8j05K11K63j94
$$ plain form
8032 123 -194 -170 -99 36 387 130 -336 -180 96 -37 81 290 -39 -375 -91 67 123 238 -71 -437 -93
8053 -93 251 3 -1 129 -168 -363 212 291 5 0 -94 -395 79 506 -10 -132 70 -165 -237 362 292 -250 -128
8076 -128 25 -241 107 474 -139 -420 57 -39 -64 454 94 -449 -89 170 -129 189 415 -308 -455 267 137
8097 137 -90 287 10 -580 23 365 -116 47 215 -395 -302 470 188 -220 167 -9 -471 172 560 -149
8117 -149 -206 171 -314 -143 570 76 -468 87 23 -368 263 547 -345 -346 261 -121 -88 515 -59 -621 167 167
8139 167 -312 294 389 -539 -409 492 79 -113 347 -211 -545 258 411 -265 167 284 -601 -216 681 97
8159 97 -297 267 -159 -470 446 440 -420 -84 166 -455 -54 729 -78 -491 130 -23 -288 484 325 -670 -118
8180 -118 344 -312 16 610 -190 -544 212 183 -167 437 79
$$ packed form
8032A23l17K4P1J35L51k57m66J56K76j33J18K09l29l36K84J58N6J15l09l66L44
8053i3L44k48mJ30k97j95N75P9k86nr4l01M74M27n16j22K02k35p2N99p0n42J22
8076a28J53k66L48L67o13k81M77r6k5N18l60n43L60K59k99L18K26p23j47P22j30
8097A37k27L77k77n90O03L42m81J63J68o10R3P72k82m08L87j76m62O43L88p09
8117a49n7L77m85J71P13m94n44N55o4l91O31K84q92jO07l82L3O03n74n62P88%
8139A67m79O06R5r28J30R01m13j92M60n58l34Q03J53o76M32J17q85L85Q97n84
8159I7l94N64m26l11R16oq60L36K50o21M01P83q07m13O21j53k65P72j59r95N52
8180a18M62o56L28N94q00l54P56k9l50O04l58
8191G9
$$ Imaginary data points
##PAGE= N=2
##DATA TABLE= (X++(I..I)), XYDATA
$$ plain form
0 0 0 0 0 0 0 0 0 8 -8 8 -8 14 -17 24 -26 33 -42 53 -65 76 -90 109 -131 154 -178 207 -242 280 -325 369
30 369 -423 481 -549 621 -700 786 -882 990 -1106 1234 -1371 1523 -1689 1872 -2068 2284
46 2284 -2519 2778 -3062 3373 -3713 4091 -4510 4978 -5502 6093 -6765 7540 -8443 9510
60 9510 -10789 12365 -14356 16964 -20534 25736 -34030 49313 -86469 357311 164501 -687115
72 -687115 257005 289458 -423101 99783 427989 -454224 -149648 489864 -230319 -317442
82 -317442 589027 17819 -645859 230243 393880 -387055 45250 358968 -391165 -163237
92 -163237 495834 -155806 -319211 444813 11768 -563040 262061 407934 -374840 -50511
102 -50511 318567 -318310 -131334 475208 -120021 -351524 352633 42054 -459981 260548
$$ packed form
0@%%%%%%%Qj6J6j6K2l1M1n0N9p5R5j18J41j66J99k40K85l32L85m49N22o05O94
30C69p92R04j030J170j321J486j668J872k096K340k605K894l212L561l940M352
46B284m803N297n840O435p086P804q601R488j0480J1595j2858J4305j5983J7953
60I510k0299K3154k6721L1320l7498M6270n9766Q3343j35782M43780j92810q51616
72f87115R44120L2453p12559N22884L28206q82213L04576O39512p20183q7123
82c17442R06469n71208o63678Q76102J63637p80935M32305L13718p50133K27928
92a63237O59071o51640j63405P64024m33045n74808Q25101J45873p82774L24329
102e0511L69078o36877J86976O06542n95229k31503P04157l10579n02035P20529
$$ plain form
112 260548 374982 -396141 -106950 320970 -219007 -108866 417936 -130009 -362759 310503
122 310503 89782 -379713 227916 307673 -404198 -109407 351945 -143449 -127357 326879
132 326879 -130284 -327314 296843 125693 -324254 168068 233745 -372895 -68398 368619
142 368619 -114981 -167975 248093 -100955 -264737 282521 131407 -301220 100992 184064
152 184064 -304625 -15004 349979 -130320 -200447 211102 -53469 -205928 258366 107878
162 107878 -301881 60549 182900 -227023 7115 294740 -158250 -206061 210481 -4899
172 -4899 -170135 213414 68525 -293640 59448 203662 -173906 -9527 227628 -163218
182 -163218 -178034 222105 28204 -159348 151169 35509 -252834 81189 207579 -153668
$$ packed form
112B60548J14434p71123K89191M27920n39977J10141N26802n47945k32750O73262
122C10503k20721m69495O07629P9757p11871K94791M61352m95394J6092M54236
132C26879m57163j97030O24157j71150m49947M92322O5677o06640L04497M37017
142C68619m83600n2994M16068l49048j63782N47258j51114m32627M02212Q3072
152A84064m88689K89621L64983m80299p0127M11549k64571j52459M64294j50488
162A07878m09759L62430J22351m09923K34138K87625m52990m7811M16542k15380
172d899j65236L83549j44889l62165L53088J44214l77568J64379K37155l90846
182a63218j4816M00139j93901j87552L10517j15660k88343L34023J26390l61247
$$ plain form
192 -153668 -41139 170783 -140502 -129941 223327 32043 -170009 93495 32771 -184908
202 -184908 96753 180201 -154652 -64660 139944 -96538 -81479 201457 5941 -183491
212 -183491 69747 58838 -127100 84485 133322 -159240 -67023 137371 -51840 -55525 156532
223 156532 -28246 -174431 80777 86081 -99193 53494 89708 -150846 -48492 147948
233 147948 -23600 -60309 101029 -43466 -136396 99489 91464 -95721 16939 58016 -120734
244 -120734 -15231 148619 -23422 -81846 60778 -26526 -84768 101306 71474 -102189 -10029
255 -10029 48011 -72538 11879 120376 -44088 -93399 49379 5409 -46284 80049 38888
266 38888 -104561 -16213 58770 -27139 14678 72121 -59529 -79003 57195 30742 -29079
$$ packed form
192a53668J12529K11922l11285J0561L53268j91284k02052K63504o0724k17679
202a84908K81661Q3448l34853Q9992K04604k36482J5059K82936j95516j89432
212a83491K53238j0909j85938K11585M8837k92562R2217K04394j89211l685K12057
223A56532j84778j46185K55208N304j85274J52687L6214k40554J02354J96440
233A47948j71548l6709J61338j44495r2930K35885q025j87185J12660M1077j78750
244a20734J05503J63850j72041n8424J42624q7304n8242J86074k9832j73663R2160
255a0029N8040j20549Q4417J08497j64464m9311J42778m3970n1693J26333m1161
266C8888j43449Q8348P4983q5909M1817N7443j31650j9474J36198k6453n9821
$$ plain form
277 -29079 44713 6760 -92170 -587 74147 -6114 -8028 25281 -52382 -44607 64378 37403
289 37403 -30466 5042 -10326 -54642 24331 69752 -11724 -34014 -63 -23034 -7091 54849
301 54849 23141 -38904 -22738 -5016 -4931 33160 36456 -24513 -40949 -4674 10747 19499 27985
314 27985 -2514 -38663 -25870 14249 32923 18393 -7752 -25079 -25864 -182 35071 28316 -12546
327 -12546 -26312 -17498 -8938 25485 43505 -9702 -42316 -6609 3324 1505 40735 20498 -51494
340 -51494 -29237 24973 5687 12447 36098 -30901 -57705 24302 31663 -12033 26444 9530
352 9530 -71433 -12017 67346 721 -18878 30019 -34501 -57715 56508 49657 -41788 2960
364 2960 13081 -65983 8436 90259 -20972 -52845 34327 -20865 -49625 77019 47115 -81220
$$ packed form
277b9079P3792l7953r8930R1583P4734q0261j914L3309p7663P775J08985k6975
289C7403o7869L5508j5368m4316P8973M5421q1476k2290L3951k2971J5943O1940
301E4849l1708o2045J6166J7722Q5L8091L296o0969j6436L6275J5421Q752Q486
314B7985l0499l6149J2793M0119J8674j4530k6145j7327p85K5682L5253o755m0862
327a2546j3766Q814Q560L4423J8020n3207l2614L5707R933j819L9230k0237p1992
340e1494K2257N4210j9286O760K3651o6999k6804Q2007P361m3696L8477j6914
352I530q0963N9416P9363o6625j9599M8897o4520k3214J14223o851r1445M4748
364B960J0121p9064P4419Q1823j11231l1873Q7172n5192k8760J26644k9904j28335
$$ plain form
376 -81220 -10283 39517 -49224 13465 91125 -46447 -75422 54582 4260 -47272 76534
387 76534 30872 -111092 -650 77227 -44262 -2083 83386 -63905 -83237 85302 26862
398 26862 -63426 59252 20771 -118934 21615 107306 -55914 -27763 79177 -65947 -76389
409 -76389 115205 33715 -95801 41018 29828 -108377 38267 118143 -78327 -53650 84397
420 84397 -49677 -63491 126056 20713 -126916 38364 56088 -93945 38147 112540 -99683
431 -99683 -68745 104247 -23964 -62668 113379 3100 -140380 52150 82435 -91510 24199
442 24199 100749 -113383 -66687 133698 -8814 -82101 94037 -1634 -135879 71959 98694
453 98694 -103266 4271 93693 -112238 -50940 157487 -15041 -113566 83986 12108 -122977
$$ packed form
376h1220P0937M9800q8741O2689P7660j37572k8975J30004n0322n1532J23806
387G6534m5662j41964J10442P7877j21489M2179Q5469j47291j9332J68539n8440
398B6862r0288J22678l8481j39705J40549Q5691j63220K8151J06940j45124j0442
409g6389J91594q1490j29516J36819j1190j38205J46644P9876j96470K4677J38047
420H4397j34074j3814J89547j05343j47629J65280J7724j50033J32092P4393k12223
431i9683L0938J72992j28211l8704J76047j10279j43480J92530L0285j73945J15709
442B4199P6550k14132M6696K00385j42512p3287J76138r5671j34245K07838K6735
453I8694k01960J07537Q9422k05931O1298K08427j72528r8525J97552p1878j35085
$$ plain form
464 -122977 83236 99623 -123866 -13094 100354 -94836 -36499 159533 -34663 -135828
474 -135828 90124 36234 -111791 78664 87510 -140247 -17031 118550 -76422 -37840 143884
485 143884 -51197 -140307 105700 57265 -110458 61252 71823 -142953 -3893 137954
495 137954 -72948 -52762 129697 -56080 -132632 125920 68089 -125959 38933 67574 -129617
506 -129617 14487 144399 -87765 -70038 128209 -49604 -121446 141487 64770 -152451
516 -152451 25823 83850 -108517 20019 134051 -104396 -77300 136568 -37041 -113112
526 -113112 142375 49900 -173160 28779 109961 -94985 6857 116490 -109572 -73517
536 -73517 147362 -23336 -112767 127151 36067 -174327 43908 130798 -96066 -17086 103522
$$ packed form
464a22977K06213J6387k23489J10772J13448j95190N8337J96032j94196j01165
474a35828K25952n3890j48025J90455Q846k27757J23216J35581j94972L8582J81724
485A43884j95081q9110K46007m8435j67723J71710J0571k14776J39060J41847
495A37954k10902K0186J82459j85777p6552K58552n7831j94048J64892K8641j97191
506a29617J44104J29912k32164J7727J98247j77813p1842K62933p6717k17221
516a52451J78274N8027j92367J28536J14032k38447K7096K13868j73609p6071
526a13112K55487r2475k23060K01939Q1182k04946J01842J09633k26062L6055
536g3517K20879j70698q9431K39918r1084k10394K18235Q6890k26864P8980J20608
$$ plain form
547 103522 -100884 -61878 156149 -19837 -125169 109573 35164 -161006 58785 136495
557 136495 -110920 -38428 104705 -82454 -49635 156800 -30134 -140606 106804 47578
567 47578 -149076 63563 131562 -129056 -50996 118829 -60479 -48123 142375 -43535 -144507
578 -144507 115726 61650 -144293 57263 121313 -139512 -50978 139385 -42471 -62160 117492
589 117492 -44125 -131033 123784 67449 -145796 42807 110795 -135683 -39948 153776 -39912
600 -39912 -86081 98908 -27433 -111072 122080 63390 -150349 29590 109138 -120123 -28404
611 -28404 154189 -50507 -105293 97106 -3974 -98653 110948 53611 -155722 24220 118378
622 118378 -103650 -28106 142492 -61338 -110915 107205 16885 -96551 91925 43143 -152295
$$ packed form
547A03522k04406L9006K18027j75986j05332K34742p4409j96170K19791P7710
557A36495k47415P2492J43133j87159L2819K06435j86934j10472K47410n9226
567D7578j96654K12639O7999k60618P8060J69825j79308J2356J90498j85910j00972
578a44507K60233n4076k05943K01556O4050k60825Q8534J90363j81856j9689J79652
589A17492j61617q6908K54817n6335k13245J88603O7988k46478R5735J93724j93688
600c9912m6169J84989j26341q3639K33152n8690k13739J79939P9548k29261R1719
611b8404J82593k04696n4786K02399j01080r4679K09601n7337k09333J79942R4158
622A18378k22028P5544J70598k03830m9577K18120r0320j13436J88476m8782j95438
$$ plain form
633 -152295 29699 129976 -94907 -41099 125829 -59627 -103662 115193 29006 -103082
643 -103082 66353 39675 -132550 37320 129410 -94357 -55712 113726 -45290 -90227 114038
654 114038 30793 -112472 45223 48232 -104841 36203 114213 -96086 -61722 108872 -28094
665 -28094 -78534 103584 22442 -118877 38574 64963 -84069 23401 94175 -93160 -57266
676 -57266 110479 -14073 -74533 85021 12242 -113424 45074 77218 -78066 3818 78273
687 78273 -81600 -46401 110656 -8168 -78626 64666 11073 -94201 51103 75165 -79212
698 -79212 -11297 69259 -62674 -33558 102528 -11252 -83764 50706 20167 -72018 46378
709 46378 61708 -79035 -18424 66441 -40877 -24831 83655 -19560 -81020 49124 32180
$$ packed form
633a52295J81994J00277k24883N3808J66928j85456m4035K18855q6187j32088
643a03082J69435k6678j72225J69870R2090k23767L8645J69438j59016m4937K04265
654A14038q3245j43265J57695L009j53073J41044P8010k10299L4364J70594j36966
665b8094n0440J82118q1142j41319J57451K6389j49032J07470P0774j87335L5894
676e7266J67745j24552o0460J59554p2779j25666J58498L2144j55284Q1884P4455
687G8273j59873L5199J57057j18824p0458J43292n3593j05274J45304K4062j54377
698g9212O7915Q0556j31933K9116J36086j13780p2512J34470l0539r2185J18396
709D6378J5330j40743O0611Q4865j07318J6046J08486j03215o1460J30144j6944
$$ plain form
720 32180 -57696 33310 45853 -74459 -15565 69050 -25400 -26385 59808 -23834 -66917 53624
732 53624 35848 -54561 18598 34228 -63944 -5933 70645 -21362 -34985 42197 -17336 -47762
744 -47762 53482 30684 -54985 6973 28788 -46879 3812 62560 -26561 -41549 34607 -4213
756 -4213 -31819 44435 20115 -53816 997 30608 -26592 5751 43465 -30950 -37136 34970
768 34970 7214 -23245 29277 8334 -47608 3675 35055 -14392 -2396 23164 -27247 -24328
780 -24328 35220 11036 -21194 13735 750 -34119 11922 34520 -13516 -12327 11404 -16530
792 -16530 -10606 31178 7964 -22775 1313 666 -15595 16228 23521 -17856 -16235 8429 -3457
805 -3457 -342 21388 270 -22823 -2639 7921 714 10488 6733 -17394 -11730 8889 6502
$$ packed form
720C2180q9876R1006J2543j20312N8894Q4615r4450r85Q6193q3642m3083J20541
732E3624j7776r0409P3159J5630r8172N8011P6578r2007j3623P7182n9533l0426
744d7762J01244k2798q5669O1958K1815p5667N0691N8748q9121j4988P6156l8820
756d213k7606P6254k4320p3931N4813K9611n7200L2343L7714p4415o186P2106
768C4970k7756l0459N2522k0943n5942N1283L1380m9447J1996K5560n0411K919
780b4328N9548k4184l2230L4929j2985l4869M6041K2598m8036J189K3731k7934
792a6530N924M1784k3214l0739K4088o47j6261L1823P293m1377J621K4664j1886
805c457L115K1730k1118k3093K0184J0560p207R774l755k4127N664K0619k387
$$ plain form
818 6502 3684 6179 -7942 -15881 1053 13276 7250 -902 -6497 -9307 -2916 8074 11399 2424
832 2424 -9507 -9830 -895 5675 10264 6308 -10199 -13128 2498 5870 3359 9495 -2048 -19927
846 -19927 -3087 15603 2943 -262 5466 -13279 -13974 15979 11804 -7834 3655 -1941 -21308
859 -21308 6748 25718 -7798 -11664 9712 -11442 -13220 26500 11453 -23793 500 7085 -18367
872 -18367 10730 28615 -19312 -19282 18603 -6031 -13138 30925 5898 -37575 4832 20911 -18829
885 -18829 6741 28211 -27760 -22993 30959 405 -18741 28258 910 -43375 15017 32710
897 32710 -25684 -892 29553 -31580 -22323 44743 2149 -31832 24793 3183 -43434 23393
909 23393 38291 -36907 -8238 34303 -31004 -19789 54462 -2497 -46700 26982 12988 -43091
$$ packed form
818F502k818K495j4121p939J6934J2223o026q152n595k810O391J0990L325q975
832B424j1931l23Q935O570M589l956j6507k929J5626L372k511O136j1543j7879
846a9927J6840J8690j2660l205N728j8745o95K9953m175j9638J1489n596j9367
859b1308K8056J8970l3516l866K1376k1154j778L9720j5047l5246K4293O585k5452
872a8367K9097J7885m7927L0L7885k4634p107M4063k5027m3473M2407J6079l9740
885a8829K5570K1470n5971M767N3952l0554j9146M6999k7348m4285N8392J7693
897C2710n8394K4792L0445o1133R257O7066m2594l3981N6625k1610m6617O6827
909B3393J4898p5198K8669M2541o5307J1215P4251n6959m4203P3682j3994n6079
$$ plain form
921 -43091 25724 40260 -47338 -13841 43418 -25517 -20288 55461 -9306 -56012 33803 24066
933 24066 -45744 21636 39856 -54311 -15425 55754 -20344 -27904 51032 -11050 -57480 41595
945 41595 31982 -51574 14667 39948 -55847 -12352 66391 -22023 -40240 49618 -6500 -56908
957 -56908 46682 35680 -60234 7851 43994 -52096 -8694 70760 -28902 -50020 54489 822
969 822 -57785 48657 36025 -69964 4242 53212 -46446 -10737 67673 -34510 -53594 61190
981 61190 7710 -60192 45478 34331 -75015 5526 63980 -43329 -19176 62727 -33241
992 -33241 -52077 65649 12479 -64468 38267 33940 -73030 8832 69685 -45342 -28595
1003 -28595 60983 -27704 -49504 67861 13763 -70911 32652 38653 -67144 9936 69696
$$ packed form
921d3091O8815J4536q7598L3497N7259o8935N229P5749o4767m6706Q9815r737
933B4066o9810O7380J8220r4167L8886P1179p6098p560P8936o2082m6430R9075
945D1595r613q3556O6241K5281r5795M3495P8743q8414j8217Q9858n6118n0408
957e6908J03590j1002r5914O8085L6143r6090M3402P9454r9662k1118J04509n3667
969H22n8607J06442j2632j05989P4206M8970r9658L5709P8410j02183j9084J14784
981F1190n3480o7902J05670j1147j09346Q0541N8454j07309K4153Q1903r5968
992c3241j8836J17726n3170p6947J02735m327j06970Q1862O0853j15027J6747
1003b8595Q9578q8687k1800J17365n4098q4674J03563O001j05797P7080N9760
$$ plain form
1014 69696 -49579 -34769 63282 -21094 -47584 67015 10025 -77324 33291 46613 -64225
1025 -64225 6279 67171 -51995 -37061 67616 -14092 -47982 61045 5840 -76994 38328
1036 38328 52081 -65488 408 65089 -50660 -36781 70826 -8984 -51898 51622 6151
1047 6151 -69786 41155 51121 -67774 -3587 64143 -46924 -34003 72158 -8534 -57271
1058 -57271 46060 11351 -61651 39916 46117 -69862 -4738 65028 -42815 -31560 70100
1069 70100 -12793 -60336 47335 16948 -58022 36810 40897 -71019 -2125 68444 -40456
1080 -40456 -32358 65910 -15747 -58763 50950 19479 -58213 32561 36478 -69737 2312 71127
1092 71127 -41057 -36637 62408 -13492 -55130 51702 20452 -58941 27011 34813 -63381 6188
$$ packed form
1014F9696j19275J4810R8051q4376k6490J14599n6990q7349J10615J3322j10838
1025f4225P0504O0892j19166J4934J04677q1708l3890J09027n5205q2834J15322
1036C8328J3753j17569O5896O4681j15749J3879J07607p9810m2914J03520m5471
1047F151p5937J10941R966j18895O4187O7730j11067J2921J06161q0692m8737
1058e7271J03331l4709p3002J01567O201j15979O5124O9766j07843J1255J01660
1069G0100q2893m7543J07671l0387p4970R4832M087j11916O8894P0569j08900
1080d0456Q098R8268q1657m3016J09713l1471p7692R0774L917j06215P2049O8815
1092G1127j12184M420R9045p5900m1638J06832l1250p9393Q5952P802r8194O9569
$$ plain form
1104 6188 69104 -43778 -40046 61514 -8495 -52533 49261 20025 -60392 22022 36996 -55184
1116 -55184 6158 62672 -45774 -38724 63086 -5268 -51545 46648 18376 -61774 21503 41798
1128 41798 -50928 2032 56578 -45114 -34893 64480 -5243 -52080 43911 16293 -60773 24366
1140 24366 44667 -51210 -3088 53662 -41099 -31064 63966 -5823 -53539 40408 16888 -56051
1152 -56051 25189 43115 -52082 -6746 52341 -35461 -28522 60429 -7212 -54356 38167 20657
1164 20657 -50843 21898 39438 -50279 -7751 51396 -29755 -26823 54486 -9068 -52552 38620
1176 38620 23542 -49212 16997 36822 -47251 -7725 51012 -25593 -27491 47932 -9210 -47501
1188 -47501 39930 23349 -49752 13655 36125 -43894 -6890 50658 -24069 -30360 43000 -5678
$$ packed form
1104F188O2916j12882L732J01560p0009m4038J01794k9236q0417Q2414J4974r2180
1116e5184O1342N6514j08446P050J01810o8354m6277R8193k8272q0150Q3277K0295
1128D1798r2726N2960N4546j01692J0221R9373o9723m6837R5991k7618p7066Q5139
1140B4366K0301r5877M8122N6750r4761J0035R5030o9789m7716R3947k3520p2939
1152e6051Q1240J7926r5197M5336N9087q7802O939Q8951o7641m7144R2523j7510
1164B0657p1500P2741J7540q9717M2528N9147q1151K932Q1309o3554m3484R1172
1176C8620j5078p2754O6209J9825q4073L9526N8737p6605j898P5423n7142l8291
1188d7501Q7431j6581p3101O3407K2470q0019L7004N7548p4727o291P3360m8678
$$ plain form
1200 -5678 -41990 37479 20847 -48974 11073 35626 -38801 -6376 47529 -23508 -31879 40507
1212 40507 -107 -38231 31564 19253 -45401 8037 35231 -31984 -8031 40996 -21362 -30179
1224 -30179 38326 3719 -36285 24886 18306 -40660 6225 35070 -26603 -11360 34459 -16856
1236 -16856 -25966 34966 4748 -34324 19810 17047 -35207 6486 32894 -24985 -13917 30656
1248 30656 -11829 -22408 30202 4301 -31631 15608 16337 -28415 6142 27872 -23519 -13292
1260 -13292 28236 -8002 -19830 24728 3771 -28271 12062 16590 -21726 2983 21173 -19436
1272 -19436 -10813 24420 -5088 -16996 18804 2880 -23176 10611 15989 -17419 -784 16172
1284 16172 -13701 -8330 19499 -2965 -14449 12680 2258 -16685 9416 12632 -15013 -2344
$$ packed form
1200e678l6312P9469j6632o9821O0047K4553p4427L2425N3905p1037q371P2386
1212D0507m0614l8124O9795j2311o4654N3438K7194o7215K3953M9027o2358q817
1224c0179O8505l4607m0004O1171o580n8966M6885K8845o1673J5243M5819n1315
1236a6856r110O0932l0218l9072N4134k763n2254M1693K6408n7879J1068M4573
1248C0656m2485j0579N2610k5901l5932M7239P29m4752L4557K1730n1391J0227
1260a3292M1528l6238j1828M4558k0957l2042M0333M528l8316K4709J8190m0609
1272a9436Q623L5233k9508j1908L5800j5924k6056L3787N378l3408J6635J6956
1284A6172k9873N371K7829k2464j1484K7129j0422j8943K6101L216k7645J2669
$$ plain form
1296 -2344 13171 -8963 -6281 15028 -1838 -12415 8182 3331 -10351 6712 8001 -11785 -1847
1309 -1847 10093 -5551 -4183 10248 -2038 -9992 5717 4533 -6200 2667 4411 -7079 -1311
1322 -1311 6666 -1962 -2459 4610 -1891 -5371 4024 3916 -3607 -660 2058 -2553 -1207 3395 920
1337 920 -2034 -762 -198 -189 1082 1610 -341 -2097 -239 1549 -326 26 2365 -1474 -3936 2354 3398
1354 3398 -3040 -512 3343 -3478 -2828 5531 326 -4532 3201 840 -5950 3599 5582 -6595 -1345
1369 -1345 7005 -4818 -4485 9521 -182 -9387 5345 4025 -8913 3358 7900 -9243 -2528 10204
1383 10204 -5517 -6153 11833 -1215 -12502 8554 6653 -12515 3277 11081 -11604 -4011 13973
1396 13973 -5563 -8870 13045 -935 -14308 10639 7759 -15731 3536 13501 -14158 -4734 17913
$$ packed form
1296b344J5515k2134K682K1309j6866j0577K0597m851j3682J7063J289j9786R938
1309a847J1940j5644J368J4431j2286p954J5709j184j0733Q867J744j1490N768
1322a311P977q628m97P069o501l480R395j08p523K947K718m611J346M602k475
1337I20k954J272N64RJ271N28j951j756J858J788j875L52K339l839k462O290J044
1354C398o438K528L855o821O50Q359n205m858P733k361o790R549J983j2177N250
1369a345Q350j1823L33J4006r703r205J4732j320j2938J2271M542j7143O715J2732
1383A0204j5721o36J7986j3048j1287K1056j901j9168J5792P804k2685P593J7984
1396A3973j9536l307K1915j3980j3373K4947k880k3490J9267R965k7659R424K2647
$$ plain form
1409 17913 -6835 -12406 15557 571 -16630 11970 9134 -18404 3862 15532 -16075 -4667
1421 -4667 20735 -9238 -14994 19122 1085 -20088 13544 11120 -21391 3790 18402 -17234
1433 -17234 -5726 22500 -10232 -16311 21800 1278 -22926 15146 12862 -24589 3720 21750
1445 21750 -18723 -8098 24575 -9874 -18264 22958 2214 -24852 15844 14082 -26601 4252
1457 4252 24396 -20792 -9779 27748 -9759 -20976 24724 3489 -27314 16083 15900 -28188
1469 -28188 4006 26043 -22825 -10518 30707 -10956 -23458 27465 4484 -30461 17119 18412
1481 18412 -30213 3032 28322 -23360 -11769 32281 -11289 -25252 29099 5094 -33032 17916
1493 17916 20448 -32511 1881 31139 -23423 -14432 33561 -9640 -27016 29045 6998 -34002
$$ packed form
1409A7913k4748n571K7963j4986j7201K8600k836k7538K2266J1670l1607J1408
1421d667K5402k9973n756L4116j8037k1173L3632k424l2511K5181J4612l5636
1433a7234J1508K8226l2732o079L8111k0522k4204L8072k284l7451K8309J8030
1445B1750m0473J0625L2673l4449q390M1222k0744k7066M0696j762m0683L0853
1457D252K0144m5188J1013L7527l7507j1217M5700k1235l0803M3397j83m4088
1469b8188L2194K2037m8868J2307M1225m1663j2502N0923k2981l4945M7580J293
1481A8412m8625L3245K5290n1682J1591M4050m3570j3963N4351k4005l8126N0948
1493A7916K532n2959L4392K9258n4562Q991M7993m3201j7376N6061k2047m1000
$$ plain form
1505 -34002 17143 22087 -33253 970 33251 -23712 -16947 34983 -7929 -29414 28745 9337
1517 9337 -35353 15422 23982 -32974 -100 34239 -23950 -18227 36594 -7230 -31229 29550
1529 29550 10814 -37378 14761 26373 -33094 -2134 34899 -23529 -19343 37065 -6500 -32231
1541 -32231 29536 11412 -38436 14890 28424 -33594 -4335 36035 -21782 -20837 36906 -4383
1553 -4383 -33105 27663 12663 -37587 13806 28916 -33338 -6174 36363 -20018 -22082 36217
1565 36217 -2620 -34149 25846 14959 -36229 11718 29010 -32081 -7395 36106 -18086 -22268
1577 -22268 34852 -2323 -34376 25359 16391 -36116 9833 29132 -30952 -8434 36021 -16215
1589 -16215 -22534 32757 -2138 -32861 25546 16289 -36094 8926 29311 -30010 -8994 35933
$$ packed form
1505c4002N1145M944n5340L4223L2281n6963O765N1930m2912k1485N8159j9408
1517I337m4690N0775Q560n6956L2874L4339n8189N723N4821m3824k3999O0779
1529B9550j8736m8192N2139J1612n9467L0960L7033n8428M186N6408m3565k5731
1541c2231O1767j8124m9848N3326J3534o2018K9259M0370n7817R45N7743m1289
1553d383k8722O0768j5000n0250N1393J5110o2254K7164M2537n6381k064N8299
1565C6217l8837l1529N9995j0887n1188M7947J7292o1091K4686M3501n4192m182
1577b2268N7120l7175l2053N9735q968n2507M5949J9299o0084K2518M4455n2236
1589a6215o319N5291l4895l0723N8407r257n2383M5020K0385n9321K1016M4927
$$ plain form
1601 35933 -14757 -23673 30365 -392 -30773 23675 15624 -34717 7591 28516 -27703 -9076
1613 -9076 34681 -13547 -24519 28668 2302 -29200 20672 15485 -32734 5694 27888 -24593
1625 -24593 -9618 31795 -12806 -23697 27709 3538 -28332 18495 15028 -31111 5404 27792
1637 27792 -22805 -10153 29310 -11867 -21561 26901 3113 -27470 17240 13779 -29443 6428
1649 6428 26772 -23062 -10558 28028 -10751 -19841 25755 2532 -26446 15808 13210 -26501
1661 -26501 6829 24255 -22964 -9941 27442 -9569 -18887 23984 2090 -25902 14408 13994
1673 13994 -23592 5104 21330 -21275 -8685 26266 -8569 -17884 22034 1565 -24591 14507
1685 14507 14632 -22448 3112 19415 -19065 -7402 24725 -8173 -17268 19838 1000 -22234
$$ packed form
1601C5933n0690q916N4038l0757l0381N4448q051n0341M2308K0925n6219J8627
1613i076M3757m8228j0972N3187k6366l1502M9872n187m8219L8428K2194n2481
1625b4593J4975M1413m4601j0891N1406k4171l1870M6827l467m6139L6515K2388
1637B7792n0597J2652L9463m1177r694M8462k3788l0583M4710l461m3222L5871
1649F428K0344m9834J2504L8586l8779r090M5596k3223k8978M2254k598l9711
1661b6501L3330J7426m7219J3023L7383l7011r318M2871k1894k7992M0310m14
1673A3994l7586K8696J6226m2605J2590L4951l4835r315L9918k0469k6156L9098
1685A4507J25l7080K5560J6303l8480J1663L2127l2898r095L7106j8838k3234
$$ plain form
1697 -22234 14963 13494 -22557 2307 18705 -17229 -6154 23382 -8301 -17149 18365 1879
1709 1879 -19546 14017 11389 -22044 2261 18154 -15491 -5560 21264 -8858 -16667 17847 3505
1722 3505 -17966 11479 10059 -19908 2146 17540 -13095 -5765 18183 -8419 -14707 17575 3923
1735 3923 -17506 9021 9299 -17709 2076 16929 -11663 -6926 15329 -6781 -11909 16448 2932
1748 2932 -16928 7888 8775 -15340 2854 15517 -11844 -7709 14219 -4589 -10072 14174 1612
1761 1612 -15779 7108 8560 -12847 2890 12883 -11951 -6783 14170 -2833 -9420 11526 1170
1774 1170 -14118 6513 8981 -10488 1138 9871 -10297 -5065 13276 -2105 -9171 8673 1056
1787 1056 -11746 6219 8939 -9339 -1342 7938 -6942 -3555 11175 -1767 -8753 6164 1636
$$ packed form
1697b2234L7197j469l6051K4864J6398l5934J1075K9536l1683q848L5514j6486
1709A879k1425L3563k628l3433K4305J5893l3645R931K6824l0122p809L4514j4342
1722C505k1471K9445j420k9967K2054J5394l0635P330K3948k6602o288L2282j3652
1735C923k1429K6527K78k7008J9785J4853k8592M737K2255k2110n128K8357j3516
1748B932j9860K4816Q87k4115J8194J2663k7361M135K1928j8808n483K4246j2562
1761A612j7391K2887J452k1407J5737R993k4834N168K0953j7003o587K0946j0356
1774A170j5288K0631K468j9469J1626Q733k0168N232J8341j5381p066J7844p617
1787A056j2802J7965K720j8278P997R280j4880L387J4730j2942o986J4917m528
$$ plain form
1800 1636 -8291 5649 7105 -9098 -2470 7386 -3907 -2872 8375 -1769 -7970 4459 2821
1813 2821 -5035 3805 4115 -7647 -1602 6784 -1926 -2512 5311 -1909 -6313 3889 3916 -3397 784
1828 784 1776 -4785 -473 5335 -618 -2496 1940 -1430 -3205 3591 3373 -2896 -1491 947 -1398 289
1844 289 3263 68 -2649 -806 160 390 1931 1061 -2039 -2147 469 1480 753 542 -91 -2126 -1818
1861 -1818 2147 2801 -975 -1252 7 -1763 -168 3621 637 -2897 -196 -211 -1741 2898 3232 -3763
1877 -3763 -2442 2739 -1027 -955 4956 -294 -5958 1217 3045 -2336 1889 3344 -5419 -2774 5417
1892 5417 -375 -2532 4727 -1250 -7343 3661 5492 -4516 72 4214 -5887 -2653 8046 -164
1906 -164 -5096 4091 -524 -6997 5440 6246 -7204 -1219 5568 -5689 -2273 9797 -1477 -8233
$$ packed form
1800A636r927J3940J456j6203O628R856j1293J035J1247j0144o201J2429j638
1813B821p856Q840L10j1762O045Q386q710n86P823p220m404J0202K7p313M181
1828G84R92o561M312N808n953j878M436l370j775O796k18o269J405K438k345J687
1844B89K974l195k717J843R66K30J541q70l100j08K616J011p27k11o33k035L08
1861a818L965O54l776k77J259j770J595L789k984l534K701j5j530M639L34o995
1877c763J321N181l766P2N911n250n664P175J828n381M225J455q763K645Q191
1892E417n792k157P259n977o093J1004J831j0008M588M142j0101L234J0699q210
1906a64m932R187m615o473J2437Q06j3450N985O787j1257L416J2070j1274o756
$$ plain form
1920 -8233 4647 1684 -6666 5753 5985 -9488 -1607 7742 -4956 -2164 10171 -3615 -10072 7262
1934 7262 3758 -7772 5029 5592 -11004 -1135 10275 -4672 -3629 9305 -4545 -9820 9717
1947 9717 4660 -9779 4125 5858 -11502 108 12590 -5506 -6303 9036 -3490 -9141 10988
1960 10988 4580 -12081 3197 6730 -10768 1155 13293 -7776 -8365 10571 -1770 -8966 11209
1973 11209 4007 -14073 3164 8847 -9697 1226 12348 -9936 -8493 12931 -912 -9945 10898
1986 10898 2878 -15506 4646 11231 -10067 -430 11401 -10417 -7346 15121 -993 -11471 10354
1999 10354 2414 -15506 6783 12718 -12001 -2655 11643 -9387 -6550 16095 -1686 -13619 9751
2012 9751 3595 -14337 7864 12524 -14296 -3780 13277 -7855 -6235 16141 -2904 -15508 10551
$$ packed form
1920h233J2880k963q350J2419K32j5473P881R349j2698K792J2335j3786o457J7334
1934G262l504j1530J2801N63j6596R869J1410j4947J043J2934j3850n275J9537
1947I717n057j4439J3904J733j7360J1610J2482j8096p97J5339j2526n651K0129
1960A0988o408j6661J5278L533j7498J1923J2138k1069n89J8936j2341p196K0175
1973A1209p202j8080J7237N683j8544J0923J1122k2284J443K1424j3843r033K0843
1986A0898q020j8384K0152O585k1298R637J1831k1818L071K2467j6114j0478K1825
1999A0354p940j7920K2289N935k4719R346J4298k1030K837K2645j7781j1933K3370
2012I751o156j7932K2201M660k6820J0516J7057k1132J620K2376j9045j2604K6059
$$ plain form
2025 10551 5905 -13961 6911 11498 -15605 -3628 15209 -7008 -6792 15120 -4506 -15804 13091
2038 13091 7553 -15356 5618 11251 -15939 -2719 17100 -6894 -8455 13750 -4921 -14430 15263
2051 15263 7370 -17757 4631 12063 -15559 -2051 18373 -7683 -10964 13272 -2967 -12768 15446
2064 15446 6260 -19560 4395 13845 -14371 -2296 18247 -8720 -12894 14218 -67 -12591
2076 -12591 13658 5195 -20150 4663 15888 -13428 -3704 17073 -9177 -12907 15938 1684
2088 1684 -13686 11633 4751 -19646 5951 17416 -13968 -5924 16115 -8325 -11725 16880 1763
2101 1763 -15222 10004 5078 -17891 7287 17303 -15662 -7544 16887 -6274 -11124 16319 1447
2114 1447 -16457 8681 6789 -15438 6789 15429 -16869 -7828 18392 -4399 -11888 14839 1365
$$ packed form
2025A0551m646j9866K0872M587k7103J1977J8837k2217K16K1912j9626j1298K8895
2038A3091n538k2909K0974N633k7190J3220J9819k3994j561K2205j8671r509K9693
2051A5263p893k5127K2388P432k7622J3508K0424k6056l281K4236j6239r801K8214
2064A5446r186k5820K3955R450k8216J2075K0543k6967m174K7112j4285j2524
2076a2591K6249q463k5345K4813J1225k9316R724K0777k6250l730K8845j4254
2088A684j5370K5319o882k4397K5597J1465l1384Q044K2039k4440l400K8605j5117
2101A763j6985K5226m926k2969K5178J0016l2965Q118K4431k3161m850K7443j4872
2114A447j7904K5138j892k2227K2227Q640l2298R041K6220k2791p489K6727j3474
$$ plain form
2127 1365 -17086 8310 9300 -13571 4383 13113 -16086 -6554 19399 -3646 -13013 13041 1345
2140 1345 -16415 9033 10825 -13745 1447 11702 -13898 -4762 19155 -4158 -14158 11712
2152 11712 2215 -14536 9598 10379 -14814 -200 11845 -11350 -3662 17661 -5402 -14828 11465
2165 11465 3982 -12785 8290 8741 -15010 -570 12667 -8914 -3701 15176 -6288 -14260 12266
2178 12266 5850 -12340 5680 7518 -13752 -262 13285 -7155 -5025 12007 -5891 -11985 12963
2191 12963 6092 -13018 3431 7385 -11455 474 13198 -6782 -6759 9905 -3962 -9087 12363
2204 12363 4409 -13590 2749 7637 -9422 1035 11737 -7805 -7590 9686 -1472 -7179 10276
2217 10276 2226 -13120 3240 8399 -7600 829 9220 -8526 -6592 10610 -30 -7126 7539
$$ packed form
2127A365j8451K5396R90k2871J7954Q730k9199R532K5953k3045r367K6054j1696
2140A345j7760K5448J792k4570J5192J0255k5600R136K3917k3313j0000K5870
2152A1712r497j6751K4134P81k5193J4614J2045k3195P688K1323k3063r426K6293
2165A1465p483j6767K1075M51k3751J4440J3237k1581N213J8877k1464p972K6526
2178A2266o416j8190J8020J838k1270J3490J3547k0440K130J7032j7898o094K4948
2191A2963o871j9110J6449L954j8840J1929J2724j9980K3J6664j3867n125K1450
2204A2363p954j7999J6339M888j7059J0457J0702j9542K15J7276j1158n707J7455
2217A0276q050j5346J6360N159j5999Q429Q391j7746J934J7202j0640p096J4665
$$ plain form
2230 7539 1048 -11548 4104 8899 -6790 -870 6853 -7426 -4397 10853 -14 -7761 5472
2243 5472 1058 -9104 5035 8369 -7432 -2603 6040 -5036 -2737 9681 -1071 -8356 4295
2256 4295 1802 -6466 5214 6293 -8490 -2806 6755 -2858 -1972 7739 -2348 -8092 4555 3216
2270 3216 -4648 3840 3486 -8369 -1361 7435 -2051 -2452 5412 -3052 -6692 5629 4096 -4592 1508
2285 1508 2021 -6426 458 7290 -2144 -3381 3475 -2429 -4315 6097 3385 -5699 -226 2214 -4015
2300 -4015 1259 6077 -2858 -4315 2657 -600 -1941 5234 1415 -6157 -263 3209 -1845 1138 3986
2315 3986 -3711 -4165 3108 1309 -1004 2767 -597 -5156 827 3769 -946 287 1651 -3736 -2320
2330 -2320 4125 1838 -1703 521 -1040 -3078 1872 3568 -935 -1290 -133 -2249 -45 3912 869
$$ packed form
2230G539o491j2596J5652M795j5689N920P723j4279L029J5250j0867p747J3233
2243E472m414j0162J4139L334j5801M829Q643j1076K299J2418j0752p285J2651
2256D295k493q268J1680J079j4783N684R561r613Q86R711j0087n744J2647j339
2270C216p864Q488l54j1855P008Q796r486m01P864q464l640J2321j533q688O100
2285A508N13q447O884O832r434j237O856n904j886J0412k712r084N473K440o229
2300d015N274M818q935j457O972l257j341P175l819p572N894L472n054K983K848
2315C986p697m54P273j799k313L771l364m559N983K942m715J233J364n387J416
2330b320O445k287l541K224j561k038M950J696m503l55J157k116K204L957l043
$$ plain form
2345 869 -2714 -822 -371 -704 2264 2401 -1696 -2466 -403 433 1569 2043 -675 -2660 -957 839 1350
2362 1350 1596 144 -2194 -1937 547 2199 1405 -578 -1526 -1326 -389 1651 2344 -218 -2143 -1221 -45
2379 -45 1122 2425 470 -2706 -1351 740 307 1583 1997 -2302 -3238 1272 1732 182 1538 -292
2395 -292 -3794 -249 3164 294 58 1180 -3096 -2695 3866 2336 -2108 534 -120 -4003 1096 4926
2411 4926 -1206 -2414 1365 -2077 -1833 5027 1805 -4443 114 1247 -3277 2078 5296 -3449 -3996
2426 -3996 2969 -416 -1890 4965 826 -6349 595 3324 -2673 1714 4427 -5276 -4085 5378 698
2441 698 -2905 4353 -53 -7196 2079 5594 -3207 -202 3677 -5377 -3084 7296 667 -4845 3387
2456 3387 -14 -6778 3842 6616 -5077 -2209 4269 -4151 -2355 8081 -108 -6866 3072 1431
$$ packed form
2345H69l583J892M51l33K968J37m097p70K063Q36J136M74k718j985J703J796N11
2362A350K46j452k338K57K484J652p94j983r48K00R37K040O93k562j925R22J176
2379d5J167J303j955l176J355K091m33J276M14m299r36M510M60j550J356j830
2395b92l502L545L413k870k36J122m276M01O561j530m444K642o54l883N099L830
2411D926o132j208L779l442K44O860l222o248M557J133m524N355L218q745n47
2426c996O965l385j474O855m139p175O944K729n997M387K713r703J191R463m680
2441F98l603P258m406p143R275L515q801L005L879r054K293J0380o629n512Q232
2456C387l401o764J0620K774j1693K868O478q420J796J0436q189o758R938j641
$$ plain form
2470 1431 -5593 4392 6005 -7166 -3009 5862 -2805 -2338 7760 -1345 -8436 3919 3660 -5162 3488
2485 3488 4831 -8240 -2454 7827 -1997 -3072 6633 -2477 -8330 5955 5016 -6299 1800 4299
2499 4299 -8011 -1186 9135 -2314 -4648 5605 -2432 -6902 7579 4691 -8167 835 4919
2512 4919 -6951 -283 9607 -3505 -6427 5460 -967 -5511 7649 3397 -9821 792 6411
2525 6411 -5899 -175 8993 -4952 -7395 6803 1080 -5364 6525 2129 -10423 1746 8059
2538 8059 -5459 -1252 7642 -5660 -6593 8497 1630 -6436 5191 1445 -9980 3519 9169 -6421
2552 -6421 -2800 6971 -5053 -5088 9439 993 -7788 4437 1559 -8648 5089 8911 -8559 -4082
2566 -4082 7880 -3603 -4372 9154 -84 -8904 4321 2783 -7160 5241 7333 -10281 -3816 9869
$$ packed form
2470A431p024R985J613j3171M157Q871q667M67J0098r105p091J2355k59q822Q650
2485C488J343j3071N786J0281r824j075R705r110n853J4285r39j1315Q099K499
2499D299j2310O825J0321j1449k334J0253q037m470J4481k888j2858R002M084
2512D919j1870O668R890j3112k922J1887o427m544J3160m252j3218J0613N619
2525F411j2310N724R168j3945k443J4198n723o444J1889m396j2552J2169O313
2538H059j3518M207Q894j3302r33J5090o867q066J1627l746j1425J3499N650j5590
2552f421L621R771j2024l5J4527q446q781J2225k878j0207J3737L822j7470M477
2566d082J1962j1483p69J3526r238q820J3225j538r943J2401K092j7614O465J3685
$$ plain form
2580 9869 -2366 -5079 8094 -792 -9290 5004 4449 -6671 3784 5675 -10495 -2437 11453
2593 11453 -2554 -6579 7095 -878 -8667 6352 5249 -7609 2126 5043 -9480 -646 12077
2606 12077 -3705 -8016 6781 -118 -7460 7156 4631 -9180 1317 5665 -8023 327 11544
2619 11544 -5503 -9073 7719 1686 -6818 6289 3514 -9857 1497 6979 -6911 46 10131
2632 10131 -6744 -9003 9482 3115 -7775 4485 3127 -9429 2032 8151 -6347 -1304 8543
2645 8543 -6706 -7606 11040 3270 -9475 3191 3804 -8226 2591 8425 -6783 -2923 7655
2658 7655 -5323 -5911 11205 1866 -10967 3129 5040 -7107 2662 7797 -7745 -3832 8240
2671 8240 -3405 -5026 9805 291 -11244 3937 6378 -6526 1636 6524 -8152 -3554 9357
$$ packed form
2580I869j2235k713J3173q886q498J4294n55j1120J0455J891j6170Q058J3890
2593A1453j4007m025J3674p973p789J5019j103j2858R735K917j4523Q834J2723
2606A2077j5782m311J4797o899p342J4616k525j3811J0497M348j3688Q350J1217
2619A1544j7047l570J6792o033q504J3107k775j3371J1354N482j3890O957J0085
2632A0131j6875k259J8485o367j0890J2260j358j2556J1461O119j4498N043R847
2645H543j5249r00J8646p770j2745J2666O13j2030J0817N834j5208L860J0578
2658G655j2978n88J7116r339j2833J4096J911j2147R769N135j5542L913J2072
2671H240j1645j621J4831r514j1535J5181K441j2904Q162M888j4676M598J2911
$$ plain form
2684 9357 -2070 -5550 7864 -286 -10420 4961 7448 -6644 -271 5638 -7004 -2571 9822
2697 9822 -1775 -6712 6177 81 -8716 5669 7403 -7796 -1867 5915 -5031 -1845 9096
2710 9096 -2306 -7498 5479 1302 -6888 5584 5841 -8740 -1937 6969 -3423 -2056 7525 -2945
2724 -2945 -7528 5658 2695 -5744 4059 3844 -8583 -925 7945 -2779 -2941 5886 -2915 -6548 6207
2739 6207 3691 -5834 1909 2953 -6917 313 7939 -2894 -4162 4488 -1942 -4930 6356 3300
2753 3300 -6626 485 3486 -4763 694 6842 -3515 -4890 4170 -269 -3350 5314 1758 -7008 412
2768 412 4356 -3127 389 5047 -4115 -4632 4711 1199 -2831 3375 499 -6020 1298 4893 -2381
2783 -2381 -491 3154 -3906 -3049 5385 1442 -3474 1638 186 -4341 2074 4591 -2614 -1747 2009
$$ packed form
2684I357j1427l480J3414q150j0134J5381K487j4092O373N909j2642M433J2393
2697I822j1597m937J2889o096q797J4385J734j5199N929P782j0946L186J0941
2710I096j1402n192J2977m177q190J2472K57j4581O803Q906j0392J367R581j0470
2724b945m583J3186k963q439R803k15j2427P658Q870j0724j62Q827q801l633J2755
2739F207k516r525P743J044r870P230P626j0833j268Q650o430k988J1286l056
2753C300r926P111L001q249N457O148j0357j375R060m439l081Q664l556q766P420
2768D12L944p483L516M658r162n17R343l512m030O206k876o519P318L595p274
2783b381J890L645p060Q57Q434l943m916N112j452m527O415K517p205Q67L756
$$ plain form
2798 2009 -2471 -1286 5076 559 -4191 798 912 -2555 2307 3553 -3303 -2504 2075 -562 -294 3557
2814 3557 -671 -4210 860 1863 -1159 1739 1769 -3704 -1878 2961 723 -520 1637 -1373 -3177
2829 -3177 1548 2462 -632 275 92 -3032 -341 3352 528 -1414 196 -1203 -1592 2183 2240 -1197
2845 -1197 -1134 -384 -1141 1046 2719 -358 -2008 -407 -178 115 2069 939 -2025 -1589 267 693 1188
2862 1188 1039 -1128 -1938 -180 1040 1168 901 -589 -1958 -791 1217 1549 534 -687 -1366 -1009 429
2879 429 1761 1080 -950 -1633 -668 458 1284 1331 -444 -1932 -682 623 907 1422 253 -2176 -1299
2896 -1299 1258 1013 403 751 -1195 -2366 696 2084 231 80 -365 -2301 -437 2749 732 -1059
2912 -1059 211 -1218 -1860 2249 2575 -1477 -1210 248 -1487 303 3303 -256 -2656 337 -64 -1164
$$ packed form
2798B009m480J185O362m517m750M989J14l467M862J246o856P99M579k637K68L851
2814C557m228l539N070J003l022K898L0n473J826M839k238j243K157l010j804
2829c177M725R14l094R07j83l124K691L693k824j942J610j399l89L775N7l437
2845a197O3P50p57K187J673l077j650J601K29K93J954j130k964M36J856M26M95
2862A188j49k167q10J758J220J28k67j490j369J167K008L32j015j221o79L57J438
2879D29J332o81k030o83R65J126Q26M7j775j488J250J305K84N15j169k429Q77
2896a299K557k45o10L48j946j171L062J388j853j51m45j936J864L186k017j791
2912a059J270j429o42M109L26m052K67J458j735J790L000l559k400K993m01j100
$$ plain form
2928 -1164 2661 1869 -3254 -1406 1806 -756 247 3124 -1364 -3563 1479 1424 -1165 2058 1054 -4138
2944 -4138 -725 3340 -596 -536 2520 -2233 -3601 3081 2418 -2278 889 829 -4015 379 4525 -1165
2960 -1165 -1938 2097 -1923 -2752 4350 2136 -4083 256 1653 -3430 951 4900 -2436 -3413 2633 -623
2976 -623 -2228 4453 1238 -5398 480 3113 -2837 809 4600 -3563 -3968 4095 669 -2686 3653
2991 3653 630 -5975 1187 4525 -2790 -199 3853 -4008 -3451 5601 1087 -3955 2763 619 -5646
3006 -5646 2310 5333 -3677 -1601 3582 -3345 -2551 6285 467 -5361 2368 1326 -4870 2874 5305
3021 5305 -5158 -2634 4584 -2068 -2350 5936 -272 -6250 2593 2714 -4198 2515 4491 -6119 -2713
3036 -2713 6098 -1096 -3167 5056 -650 -6493 3340 3953 -4286 1298 3708 -6076 -1782 7281 -1152
$$ packed form
2928a164L825p92n123J848L212k562J003K877m488k199N042n5k589L223j004n192
2944d138L413M065l936O0L056m753j368O682o63m696L167o0m844M394M146n690
2960a165p73M035m020q29P102k214o219M339J397n083M381L949p336r77O046l256
2976f23j605O681l215o636N878K633n950L646L791q163m05Q063l426l355O339
2991C653l023o605P162L338p315K591M052p861N57R052m514n042O718k144o265
3006e646P956L023r010K076N183o927P94Q836n818n828P729j042o196P744K431
3021E305j0463K524P218o652k82Q286o208n978Q843J21o912O713J976j0610L406
3036b713Q811p194k071Q223n706n843R833O13q239N584K410r784M294R063q433
$$ plain form
3051 -1152 -4486 4257 -504 -5841 4189 4285 -5287 92 3628 -5205 -864 7545 -2028 -5599 4091
3066 4091 443 -4836 4450 3577 -6264 -160 4400 -4115 -448 7092 -2994 -6285 4641 1815 -4457
3081 -4457 3626 2641 -6679 172 5360 -3622 -877 6026 -3705 -6061 5922 2883 -5053 2158 2359
3096 2359 -5990 878 5928 -3658 -1863 5201 -3590 -5119 6936 2704 -6450 1258 2889 -4908 1398
3111 1398 5764 -4277 -2670 4977 -2616 -3895 7007 1607 -7449 1337 3805 -3966 1280 4937
3125 4937 -4994 -2890 5545 -1668 -3456 6136 477 -7675 2146 4898 -3736 460 3923 -5199 -2209
3140 -2209 6452 -1186 -4016 4976 39 -7055 3133 5563 -4345 -912 3502 -4251 -1317 6701 -1527
3155 -1527 -4939 4348 395 -6100 3859 5401 -5551 -1770 4073 -2981 -898 6061 -2292 -5310 4280
$$ packed form
3051a152l334Q743m761n337J0030R6r572N379L536q833M341Q409r573l571R690
3066D091l648n279R286q73r841O104M560q515L667P540j0086l291J0926k826o272
3081d457Q083r85r320O851N188q982K745O903r731k356J1983l039p936P211K01
3096B359q349O868N050r586J795P064q791j529J2055m232r154P708J631p797O306
3111A398M366j0041J607P647p593j279J0902n400r056Q786K468p771N246L657
3125D937r931K104Q435p213j788R592n659q152R821K752q634M196L463r122K990
3140b209Q661p638k830Q992m937p094J0188K430r908L433M414p753K934Q018q228
3155a527l412R287l953o495R959J542j0952L781N843p054K083O959q353l018R590
$$ plain form
3170 4280 975 -5073 3945 4181 -6525 -1566 5218 -2051 -1296 5030 -2702 -5042 4854 1731 -4706
3185 -4706 3142 2926 -6604 -480 6150 -2152 -2333 4143 -2505 -4378 5426 2110 -5206 2070 2582 -5722
3201 -5722 558 6456 -2768 -3389 3861 -1630 -3516 5560 1755 -6065 1362 3177 -4564 792 5794
3216 5794 -3649 -4036 4188 -373 -2977 4812 763 -6358 1646 4049 -3833 399 4816 -4119 -3696
3231 -3696 5041 559 -3280 3489 193 -5640 2289 4452 -3643 -387 3809 -3865 -2758 5705 488
3246 488 -4135 2434 583 -4523 2688 4321 -3917 -1432 3338 -2783 -1771 5512 -172 -4967 2068
3261 2068 1462 -3528 2368 3638 -4359 -1910 3784 -1388 -1438 4324 -930 -4850 2409 2414 -2975 1597
3277 1597 2679 -4426 -1443 4446 -587 -1964 2911 -1070 -4096 2828 2777 -2860 448 1840 -3637
$$ packed form
3170D280l305o048R018K36j0706M959O784p269P55O326p732k340R896l123o437
3185d706P848k16r530O124O630q302j81O476o648j873R804l316p316P276N12q304
3201e722O280N898r224o21P250n491j886R076l805p820P427J815p741N356N002
3216E794r443l87Q224m561k604P789m049p121Q004K403p882M232M417q935M23
3231c696Q737m482l839O769l296n833P929K163q095L256M196p674J107Q463n217
3246D88m623O569j851n106P211J633q238K485M770o121J012P283n684m795P035
3261B068o06m990N896J270p997K449N694n172n0N762n254l920P259Nn389M572
3277A597J082p105K983N889n033j377M875l981l026O924n1n637L308J392n477
$$ plain form
3292 -3637 -484 4601 -734 -2676 2031 -604 -2820 3016 2480 -3302 -532 1764 -2140 89 3815
3307 3815 -1348 -3049 1716 318 -1789 2565 1554 -3604 -681 2373 -998 -94 2532 -1608 -2786
3322 -2786 1902 1221 -1317 1488 619 -3242 -105 2825 -454 -718 1329 -1512 -2031 2245 1557 -1343
3338 -1343 125 41 -2050 719 2578 -630 -1249 585 -836 -849 2236 1087 -1932 -629 358 -588 875
3355 875 1651 -1066 -1549 380 129 122 1559 101 -1974 -443 1020 293 440 547 -1179 -1236 652 977
3373 977 333 195 -710 -1350 149 1351 573 -224 -482 -820 -380 944 1214 -138 -1049 -682 -131 575 959
3392 959 377 -968 -1042 37 631 658 570 -634 -1416 -112 1050 492 248 69 -1213 -905 1232 1142 -276
3411 -276 -193 -420 -1203 526 1769 -114 -826 -32 -916 -425 1873 863 -1516 -509 308 -759 763
$$ packed form
3292c637L153N085n335j942M707k635k216N836n36n782K770K296l904K229L726
3307C815n163j701M765j398k107M354j011n158K923L054l371R04K626m140j178
3322b786M688o81k538K805q69l861L137K930l279k64K047k841n19M276o88k900
3338a343J468q4k091K769J859l208o19J834j421j3L085j149l019J303R87r46J463
3355H75P76k717m83J929k51pJ437j458k075J531J463p27J47J07j726n7J888L25
3373I77o44j38r05o40J499J202p78p97k58l38M40J324K70j352r11L67N51P06L84
3392I59n82j345p4J079N94K7q8j204p82J304J162n58k44j79j282L08K137r0j418
3411b76Q3k27p83J729J243j883p12P94q84M91K298j010k379J007Q17j067J522
$$ plain form
3428 763 1843 -967 -1663 494 78 -187 1788 179 -2376 -114 1272 -577 494 1519 -1781 -1835
3444 -1835 1704 758 -779 1177 -164 -2528 573 2158 -820 -161 1141 -2009 -1295 2614 724 -1742
3460 -1742 806 41 -2340 1288 2581 -1601 -1002 1260 -1505 -740 3188 122 -2754 846 682 -2047
3476 -2047 1592 2486 -2656 -1498 2111 -809 -827 2906 -416 -3376 1436 1547 -1919 1272 2006 -3392
3492 -3392 -1282 3364 -467 -1480 2614 -749 -3484 2175 2332 -2405 491 1733 -3334 -614 4098
3507 4098 -762 -2412 2368 -587 -3199 2862 2481 -3376 -189 2154 -2717 -267 4257 -1423 -3184
3522 -3184 2577 63 -2851 3076 2065 -4350 -162 3114 -2379 -424 4023 -2018 -3614 3222 1003
3537 1003 -2962 2537 1660 -4632 353 3992 -2372 -1060 3795 -2348 -3649 4087 1585 -3692 1814
$$ packed form
3428G63J080k810o96K157m16k65J975j609k555K262J386j849J071J025l300n4
3444a835L539r46j537J956j341k364L101J585k978O59J302l150P14L909j890k466
3460a742K548p65k381L628J293m182N99K262k765P65L928l066k876L600j64k729
3476b047L639Q94n142J158L609k920j8L733l322k960M812J11l466L191P34n398
3492c392K110M646l831j013M094l363k735N659J57m737K896J242n067K720M712
3507D098m860j650M780k955k612O061l81n857L187K343m871K450M524n680j761
3522c184N761k514k914N927j011o415M188L276n493J955M447o041j596O836k219
3537A003l965N499q77o292M985L639o364J312M855o143j301P736k502n277N506
$$ plain form
3552 1814 1667 -4390 772 4475 -2701 -1824 3689 -2059 -3203 4634 1458 -4758 1323 2366 -3842
3567 -3842 865 4508 -3238 -2454 3891 -1331 -2933 4636 821 -5406 1533 3201 -3523 607 4139
3582 4139 -3707 -2564 4574 -596 -3138 4048 602 -5500 1919 4008 -3501 -139 3670 -3689 -2293
3597 -2293 5230 -439 -3946 3467 793 -5278 2261 4419 -3933 -1131 3587 -2992 -1885 5409 -738
3612 -738 -4664 3357 1421 -4832 2376 4292 -4565 -1649 4166 -2056 -1770 4811 -1199 -4786 3489
3627 3489 1862 -4455 2231 3836 -4993 -1594 4911 -1466 -2256 3995 -1251 -4462 3787 2204 -4433
3642 -4433 1575 3289 -4832 -1076 5357 -1506 -3056 3526 -933 -3973 4013 2296 -4781 903 3375
3657 3375 -4063 -668 5256 -1833 -3560 3407 -151 -3433 3817 1949 -5206 698 3791 -3434 -728
$$ packed form
3552A814j47o057N162L703p176Q77N513n748j144P837l176o216O081J043o208
3567c842M707L643p746P84O345n222j602P569l815o227O939J668o724M130L532
3582D139p846J143P138n170k542P186l446o102P419K089p509L362L809p359J396
3597b293P523n669l507P413k674o071P539K158q352K802M718o579J107P294o147
3612g38l926Q021j936o253P208J916q857K916N815o222K86O581o010l587Q275
3627C489j627o317O686J605q829L399O505o377p90O251n246l211Q249j583o637
3642d433O008J714q121L756O433o863j550O582m459l040P986j717p077N684K472
3657C375p438L395N924p089j727O967l558l282P250j868p155N904L093p225K706
$$ plain form
3672 -728 4863 -2135 -3771 3601 557 -3115 3094 1359 -5079 1051 4129 -3180 -980 4232 -2310
3687 -2310 -3502 3924 994 -3331 2171 1043 -4399 1432 4129 -3195 -1398 3731 -2104 -2927 4275
3702 4275 919 -3907 1669 1458 -3527 1501 3722 -3382 -1752 3611 -1481 -2356 4077 381 -4296
3717 -4296 1704 2049 -3096 1162 3278 -3487 -1757 3861 -951 -2222 3380 -40 -4075 1990 2444
3732 2444 -2965 615 2726 -3352 -1391 4116 -728 -2562 2723 -134 -3478 2305 2490 -3041 118
3747 118 2374 -2817 -744 3998 -1037 -2864 2367 245 -2893 2322 2197 -3361 -295 2439 -2029
3762 -2029 -464 3517 -1265 -2942 2455 651 -2538 2082 1666 -3508 -180 2874 -1528 -820 2727
3777 2727 -1450 -2629 2580 999 -2359 1498 1213 -3299 272 3145 -1510 -1305 2221 -1129 -2154
$$ packed form
3672g28N591o998j636P372l044l672O209j735o438O130L078p309K200N212o542
3687b310j192P426k930m325N502j128n442N831K697p324J797N129n835q23P202
3702D275l356m826N576k11m985N028K221p104J630N363n092q75O433l696m677
3717d296O000L45n145M258K116o765J730N618m812j271N602l420m035O065M54
3732B444n409L580K111o078J961N507m844j834N285k857l344N783J85n531L159
3747A18K256n191K073M742n035j827N231k122l138N215j25n558L066K734m468
3762b029J565L981m782j677N397j804l189M620m16n174L328L054m402P08L547
3777B727m177j179N209j581l358L857k85m512L571K873m655K05L526l350j025
$$ plain form
3792 -2154 2644 1028 -2518 817 1066 -2491 611 2872 -1789 -1586 2064 -753 -1626 2523 761 -2727
3808 -2727 503 1370 -1711 522 2233 -1871 -1589 2058 -231 -1328 2034 215 -2720 664 1787
3823 1787 -1378 62 1632 -1705 -1327 2142 178 -1309 1287 52 -2147 1006 1841 -1332 -385 1276
3839 1276 -1331 -838 2174 249 -1616 685 237 -1416 929 1451 -1359 -656 1023 -687 -373 1702
3855 1702 -112 -1707 449 632 -799 583 996 -1243 -693 986 -38 -187 897 -407 -1324 565
3871 565 859 -466 171 464 -959 -424 1094 303 -398 191 -323 -664 578 755 -280 -297 36 -529 0
3890 0 890 201 -701 -297 86 -8 375 418 -251 -619 -102 234 277 264 -28 -522 -364 327 412 -19 -28 -88 -616
3913 -616 -73 814 283 -513 -46 -75 -398 508 737 -508 -488 241 -245 5 979 -53 -1075 146 447
$$ packed form
3792b154M798j616l546L335K49l557L102K261m661K03L650k817q73M149j762l488
3808b727L230Q67l081K233J711m104K82L647k289j097L362j819k935L384J123
3823A787l165J440J570l337L78L469j964j487K596j235k199L153Q35l173R47J661
3839A276k607M93L012j925j865K301m48j653K345N22k810P03J679j710L14K075
3855A702j814j595K156J83j431J382M13k239N50J679j024j49J084j304r17J889
3871E65K94j325O37K93j423N35J518p91p01N89n14l41J242J77j035j7L33n65N29
3890@Q90o89r02M04L83r4L83M3o69l68N17L36M3j3k92m94J58O91Q5m31ro0n28
3913f16N43Q87n31p96M67k9l23R06K29j245K0P29m86K50R74j032j022J221L01
$$ plain form
3932 447 -502 374 765 -975 -783 918 51 -398 840 -159 -1311 507 938 -737 166 812 -1267 -689
3950 -689 1585 53 -1048 822 -12 -1425 764 1297 -1153 -242 1009 -1182 -480 1872 -134 -1566
3966 -1566 993 367 -1500 991 1465 -1654 -547 1443 -844 -569 1900 -325 -1930 1165 678 -1574
3982 -1574 991 1383 -2101 -539 2069 -758 -981 1866 -476 -2045 1538 1054 -1765 691 1387 -2154
3998 -2154 -291 2575 -1002 -1481 1951 -371 -2239 1855 1319 -2344 350 1674 -2044 -235 2680
4013 2680 -1187 -1763 2136 -207 -2150 2074 1153 -2820 372 2040 -1936 -393 2675 -1350 -2001 2349
$$ packed form
3932D47r49Q76L91j740J92J701q67m49J238r99j152J818M31j675R03O46k079N78
3950f89K274j532j101J870q34j413K189N33k450R11J251k191P02K352k006j432
3966a566K559o26j867K491M74l119J107J990k287K75K469k225j605L095m87k252
3982a574K565L92l484J562K608k827k23K847k342j569L583m84k819K456O96l541
3998b154J863K866l577m79L432k322j868M094n36l663K694J324l718J809K915
4013B680l867n76L899k343j943M224r21l973L192J668l976J543L068m025o51M350
$$ [...]
8191b26
##END NTUPLES=NMR FID
##END=
