##TITLE=1H_IBA1203-2
 CDCl3
 8 sc, 
 13.3.2024
##JCAMPDX= 6.0         $$ Bruker NMR JCAMP-DX V2.0
##DATA TYPE= NMR FID
##DATA CLASS= NTUPLES
##ORIGIN= UXNMR, Bruker Analytische Messtechnik GmbH
##OWNER= root
$$ XWIN-NMR		Version 3.5
$$ Wed Mar 13 14:12:36 2024 Russian Standard Time (UT+4h)  she@DPX200
##.OBSERVE FREQUENCY= 200.1313
##.OBSERVE NUCLEUS= ^1H
##.DELAY= (6, 6)
##.ACQUISITION MODE= SIMULTANEOUS
##.ACQUISITION SCHEME= undefined
##.AVERAGES= 8
##.DIGITISER RES= 18
##SPECTROMETER/DATA SYSTEM= spect
##.PULSE SEQUENCE= zg30
##.SOLVENT NAME= CDCl3
##.SHIFT REFERENCE= (INTERNAL, CDCl3, 0, 15.7039)
##AUDIT TRAIL= $$ (NUMBER, WHEN, WHO, WHERE, WHAT)
$$ ##TITLE= Audit trail, XWIN-NMR		Version 3.5
$$ ##JCAMPDX= 5.01
$$ ##ORIGIN= Bruker BioSpin GmbH
$$ ##OWNER= she
$$ F:/spectra/data/she/nmr/H-F/1/audita.txt
$$ ##AUDIT TRAIL=  $$ (NUMBER, WHEN, WHO, WHERE, WHAT)
(   1,<2024-03-13 14:11:37.85 +0400>,<she>,<DPX200>,
      <created by zg, POWCHK disabled, PULCHK disabled
       configuration hash MD5:
       00 E9 B6 7A A2 85 ED C7 34 08 36 98 17 FE 4E 26
       data hash MD5: 16K
       9A B7 FF 3D DD 5C 80 45 08 54 A1 71 88 AF 25 FE>)
$$ ##END=
$$ 
$$ hash MD5
$$ D4 5E B3 47 83 CD 4A 00 74 47 B2 E4 00 43 74 A5
##$RELAX= 
##$RELAX= 
##$RELAX= 
##$RELAX= 
##$RELAX= 
##$RELAX= 
$$ Bruker specific parameters
$$ --------------------------
##$DU= <F:/spectra>
##$EXPNO= 1
##$NAME= <H-F>
##$PROCNO= 1
##$TYPE= <nmr>
##$USER= <she>
##$AMP= (0..31)
100 100 100 100 100 100 100 100 100 100 100 100 100 100 100 100 100 100 
100 100 100 100 100 100 100 100 100 100 100 100 100 100 
##$AQSEQ= 0
##$AQ_mod= 1
##$AUNM= <au_zg>
##$AUTOPOS= <>
##$BF1= 200.13
##$BF2= 200.13
##$BF3= 200.13
##$BF4= 200.13
##$BF5= 200.13
##$BF6= 200.13
##$BF7= 200.13
##$BF8= 200.13
##$BYTORDA= 1
##$CFDGTYP= 0
##$CFRGTYP= 5
##$CHEMSTR= <none>
##$CNST= (0..31)
1 1 145 1 1 1 1 1 1 1 1 1 1 1 1 1 1 1 1 1 1 1 1 1 1 1 1 1 1 1 1 1 
##$CPDPRG= <>
##$CPDPRG1= <>
##$CPDPRG2= <>
##$CPDPRG3= <>
##$CPDPRG4= <mlev>
##$CPDPRG5= <mlev>
##$CPDPRG6= <mlev>
##$CPDPRG7= <mlev>
##$CPDPRG8= <mlev>
##$CPDPRGB= <>
##$CPDPRGT= <>
##$D= (0..31)
0 1.2 0 0 0 0 0 0 0 0.06 0 0.03 0 0 0 0 0.0002 0 0 0 0 0 0 0 0 0 0 0 0 
0 0 0 
##$DATE= 1710324697
##$DBL= (0..7)
120 120 120 120 120 120 120 120 
##$DBP= (0..7)
150 150 150 150 150 150 150 150 
##$DBP07= 0
##$DBPNAM0= <>
##$DBPNAM1= <>
##$DBPNAM2= <>
##$DBPNAM3= <>
##$DBPNAM4= <>
##$DBPNAM5= <>
##$DBPNAM6= <>
##$DBPNAM7= <>
##$DBPOAL= (0..7)
0.5 0.5 0.5 0.5 0.5 0.5 0.5 0.5 
##$DBPOFFS= (0..7)
0 0 0 0 0 0 0 0 
##$DE= 6
##$DECBNUC= <off>
##$DECIM= 32
##$DECNUC= <off>
##$DECSTAT= 4
##$DIGMOD= 1
##$DIGTYP= 9
##$DL= (0..7)
0 120 120 120 120 120 120 120 
##$DP= (0..7)
150 150 150 150 150 150 150 150 
##$DP07= 0
##$DPNAME0= <>
##$DPNAME1= <>
##$DPNAME2= <>
##$DPNAME3= <>
##$DPNAME4= <>
##$DPNAME5= <>
##$DPNAME6= <>
##$DPNAME7= <>
##$DPOAL= (0..7)
0.5 0.5 0.5 0.5 0.5 0.5 0.5 0.5 
##$DPOFFS= (0..7)
0 0 0 0 0 0 0 0 
##$DQDMODE= 0
##$DR= 18
##$DS= 0
##$DSLIST= <SSSSSSSSSSSSSSS>
$$ [...]
##$SUBNAM2= <"">
##$SUBNAM3= <"">
##$SUBNAM4= <"">
##$SUBNAM5= <"">
##$SUBNAM6= <"">
##$SUBNAM7= <"">
##$SUBNAM8= <"">
##$SUBNAM9= <"">
##$SW= 18.0517328524113
##$SWIBOX= (0..15)
0 0 2 0 0 0 0 0 0 0 0 0 0 0 0 0 
##$SW_h= 3612.71676300578
##$TD= 16384
##$TD0= 1
##$TE= 0
##$TE2= 300
##$TE3= 300
##$TEG= 300
##$TL= (0..7)
0 120 120 120 120 120 120 120 
##$TP= (0..7)
150 150 150 150 150 150 150 150 
##$TP07= 0
##$TPNAME0= <>
##$TPNAME1= <>
##$TPNAME2= <>
##$TPNAME3= <>
##$TPNAME4= <>
##$TPNAME5= <>
##$TPNAME6= <>
##$TPNAME7= <>
##$TPOAL= (0..7)
0.5 0.5 0.5 0.5 0.5 0.5 0.5 0.5 
##$TPOFFS= (0..7)
0 0 0 0 0 0 0 0 
##$TUNHIN= 0
##$TUNHOUT= 0
##$TUNXOUT= 0
##$USERA1= <user>
##$USERA2= <user>
##$USERA3= <user>
##$USERA4= <user>
##$USERA5= <user>
##$V9= 5
##$VALIST= <valist>
##$VCLIST= <CCCCCCCCCCCCCCC>
##$VD= 0
##$VDLIST= <DDDDDDDDDDDDDDD>
##$VPLIST= <PPPPPPPPPPPPPPP>
##$VTLIST= <TTTTTTTTTTTTTTT>
##$WBST= 1024
##$WBSW= 4
##$XGAIN= (0..3)
0 0 0 0 
##$XL= 0
##$YL= 0
##$YMAX_a= 411923
##$YMIN_a= -492458
##$ZGOPTNS= <>
##$ZL1= 120
##$ZL2= 120
##$ZL3= 120
##$ZL4= 120
##$ABSF1= 10
##$ABSF2= 0
##$ABSG= 5
##$ABSL= 3
##$ALPHA= 0
##$AQORDER= 0
##$ASSFAC= 0
##$ASSFACI= 0
##$ASSFACX= 0
##$ASSWID= 0
##$AUNMP= <proc_1d>
##$AZFE= 0.1
##$AZFW= 0.1
##$BCFW= 1
##$BC_mod= 2
##$BYTORDP= 1
##$COROFFS= 0
##$CY= 11.3945322036743
##$DATMOD= 1
##$DC= 2
##$DFILT= <>
##$DTYPP= 0
##$F1P= 15.7292609196834
##$F2P= 12.9074282941183
##$FCOR= 0.5
##$FTSIZE= 0
##$FT_mod= 4
##$GAMMA= 1
##$GB= 0.15
##$INTBC= 1
##$INTSCL= 1
##$ISEN= 128
##$LB= 0.24
##$LEV0= 0
##$LPBIN= 0
##$MAXI= 10000
##$MC2= 0
##$MEAN= 0
##$ME_mod= 0
##$MI= 1.114404
##$NCOEF= 0
##$NC_proc= 0
##$NLEV= 6
##$NOISF1= 3.799351
##$NOISF2= 2.8
##$NSP= 1
##$NTH_PI= 0
##$NZP= 0
##$OFFSET= 15.70392
##$PC= 1
##$PHC0= -25459.52
##$PHC1= 9.987313
##$PH_mod= 1
##$PKNL= yes
##$PPARMOD= 0
##$PSCAL= 0
##$PSIGN= 0
##$REVERSE= no
##$SF= 200.130013532006
##$SI= 16384
##$SIGF1= 3
##$SIGF2= 2
##$SINO= 400
##$SIOLD= 16384
##$SREGLST= <1H.CDCl3>
##$SSB= 0
##$STSI= 0
##$STSR= 0
##$SW_p= 3612.71676300578
##$SYMM= 0
##$S_DEV= 0
##$TDeff= 0
##$TDoff= 0
##$TI= <>
##$TILT= no
##$TM1= 0
##$TM2= 0
##$TOPLEV= 0
##$USERP1= <user>
##$USERP2= <user>
##$USERP3= <user>
##$USERP4= <user>
##$USERP5= <user>
##$WDW= 1
##$XDIM= 8192
##$YMAX_p= 0
##$YMIN_p= 0
$$ End of Bruker specific parameters
$$ ---------------------------------
##NTUPLES= NMR FID
##VAR_NAME=  TIME,          FID/REAL,        FID/IMAG
##SYMBOL=    X,             R,               I
##VAR_TYPE=  INDEPENDENT,   DEPENDENT,       DEPENDENT
##VAR_FORM=  AFFN,          ASDF,            ASDF
##VAR_DIM=   8192,          8192,            8192
##UNITS=     SECONDS,       ARBITRARY UNITS, ARBITRARY UNITS
##FACTOR=    0.0002768,     1,               1
##FIRST=     0,             0,               0
##LAST=      2.2672688,     0,               0
##MIN=       0,             -492458,         0
##MAX=       2.2672688,     411923,          0
$$ Real data points
##PAGE= N=1
##DATA TABLE= (X++(R..R)), XYDATA
0 0 0 0 0 0 0 0 0 0 0 0 0 0 0 -7 8 -8 8 -8 15 -16 17 -22 26 -33 39 -45 52 -61 72 -81 93 -105 121 -141 158
35 158 -179 200 -226 255 -285 317 -353 392 -437 484 -536 592 -652 721 -796 873 -964 1059
53 1059 -1168 1289 -1422 1570 -1739 1932 -2153 2411 -2713 3075 -3521 4074 -4772 5654 -6699
68 -6699 7168 -328 362336 -72929 -355771 325479 176546 -350902 52584 214944 -300338
79 -300338 20284 411923 -224259 -345095 347624 114871 -341167 154812 236839 -331933
89 -331933 -58180 315798 -145188 -139761 313845 -93882 -360393 270855 254353 -332806 -35217
100 -35217 265729 -196436 -119596 322367 -51076 -267417 205723 71836 -300713 152795
110 152795 289311 -295496 -161405 302578 -37981 -186564 222931 15783 -297168 138011
120 138011 208852 -239012 -7390 265770 -195266 -204729 297519 69177 -257548 96876
130 96876 108372 -225548 67830 250020 -192556 -141321 237116 -48215 -205760 214979
140 214979 112893 -274623 11634 199399 -131316 -34951 204377 -128079 -189576 214972
150 214972 75896 -208430 88654 134443 -215934 -28256 237692 -73943 -139726 146657
160 146657 -25322 -170742 166432 126902 -217332 -17642 170622 -115406 -67696 202281
170 202281 -41052 -191619 117806 82692 -145929 71024 127743 -185040 -65645 201789
180 201789 -29627 -125188 125284 7507 -172879 91584 138967 -136497 -31674 123434
190 123434 -99889 -75150 182221 10428 -169301 60179 76399 -115931 40020 131003
200 131003 -119062 -86931 131397 -6835 -88179 108438 24050 -160569 33456 129371 -75830
211 -75830 -34272 96707 -70071 -87680 127673 42286 -115227 31857 53259 -103257 17419
222 17419 131353 -63769 -91273 79600 1324 -72608 86799 47776 -124538 -7715 94051
233 94051 -43546 -21021 88230 -48007 -98209 79109 56516 -71187 20745 43355 -89404
244 -89404 -11662 109748 -16588 -69303 43569 -3962 -64516 63199 63082 -79070 -28735
255 -28735 54075 -28987 -14721 78007 -15405 -86294 29632 46248 -34943 18386 38528 -65700
267 -65700 -34240 69599 12195 -35345 25984 -7440 -59490 31943 63013 -32718 -29424 21533
279 21533 -23888 -15278 60553 13934 -56645 -5170 20282 -15379 20185 37748 -37631 -42249
291 -42249 27579 18996 -6990 20091 -3270 -47285 -1073 41960 5949 -10698 245 -22115
303 -22115 -16384 32249 26775 -16272 -17441 -6647 -7679 15108 29844 -2977 -29582 -13582 7869
316 7869 15478 15451 354 -21070 -20542 5071 25225 15051 -9369 -18167 -13020 -505 22177 23418
330 23418 -12686 -27838 -2415 8287 7923 21776 2086 -37646 -14547 26963 11194 -750
342 -750 9955 -20806 -32644 24363 34520 -14367 -8723 4610 -29139 -3258 51732 5203 -41570
355 -41570 2713 7081 -22071 27350 39260 -40872 -34522 31187 2114 -12157 39981 -2856
367 -2856 -63681 10489 48757 -19189 -4381 32064 -40006 -38675 59145 25702 -45627 10073
379 10073 14170 -51243 14782 69729 -30721 -47602 36684 -5061 -37677 56278 30121 -76523
391 -76523 -8557 55535 -27395 -9846 62111 -32420 -70486 53427 39005 -51577 20831 36429
403 36429 -74619 -13949 89765 -14649 -57356 45965 -2684 -68439 54693 63397 -74496
414 -74496 -22523 60182 -39351 -27056 88145 -9054 -92958 39788 48776 -60149 21181 65505
426 65505 -76473 -46138 89661 -214 -61223 56662 11182 -94072 34707 86264 -61897
437 -61897 -31407 67400 -43299 -53575 96244 21198 -98810 26193 54230 -72623 10416
448 10416 94425 -61372 -71730 80090 7604 -67267 67310 33305 -112273 9926 100325
459 100325 -53541 -39462 84378 -35290 -85531 86123 47897 -91816 20119 58186 -87835
470 -87835 -6131 118067 -42829 -90354 75852 17832 -85103 60087 64955 -103447 -16774
481 -16774 92648 -47465 -40171 100846 -23370 -112725 70676 71122 -87282 7555 73800
492 73800 -82218 -35728 113087 -17987 -85588 72524 17730 -107083 52449 99823 -92754
503 -92754 -45685 90785 -34438 -54392 100323 199 -115781 54843 71940 -94607 7753
514 7753 105993 -79260 -78065 107840 14453 -85086 60451 26903 -111373 38287 108543
525 108543 -87071 -50126 106448 -34247 -92663 99243 47841 -111206 17489 68098 -80064
536 -80064 5027 111594 -72034 -91625 107419 24775 -104024 56505 68040 -109257 -12633
547 -12633 104013 -47449 -45131 92684 -35601 -102772 98821 68198 -118001 1816 92035
558 92035 -74732 -37095 111650 -24942 -89744 75521 18618 -99692 65027 87989 -119496
569 -119496 -40907 119791 -27790 -71893 87578 2057 -105767 60746 68370 -95867 10268
580 10268 96965 -89828 -65663 129086 11129 -109513 48971 44048 -90382 33085 89794
591 89794 -88380 -41345 104477 -35859 -83210 103290 36950 -125033 17896 89143 -63869
602 -63869 -13612 85065 -62596 -68253 105784 14475 -102777 55104 62106 -107673 -6038
613 -6038 112745 -44345 -63777 74409 -16117 -75606 86962 44999 -115333 10320 93020
624 93020 -69567 -36315 105263 -24801 -93899 67001 35789 -79189 42491 60841 -102537
635 -102537 -19854 114262 -31958 -75263 76409 9146 -92802 51181 68537 -80684 -8609
646 -8609 73962 -60871 -40215 105305 -5043 -101197 47627 51586 -74322 16470 73791
657 73791 -69067 -42202 83411 -13492 -60698 69921 17314 -98336 27189 82153 -57681
668 -57681 -27398 67411 -37437 -53615 79152 17739 -79624 30588 44005 -72128 5622
679 5622 85268 -46340 -59676 63844 4382 -57201 52814 31733 -81968 5021 69668
690 69668 -42127 -24870 67293 -25924 -66642 58409 35682 -62022 14497 41342 -59986
701 -59986 -9600 76002 -22188 -53823 45855 6333 -55395 39735 45123 -61464 -14479 52819
713 52819 -26108 -23209 58492 -9587 -63538 33596 36615 -44172 8179 40711 -46869 -24612
725 -24612 58905 -2103 -41098 31788 6794 -51292 24758 48225 -40518 -20132 39068 -19515
737 -19515 -25632 49314 6742 -52455 13842 28347 -32080 7099 40341 -34329 -32037 41020
749 41020 6281 -29802 25436 10736 -45798 7040 42420 -19410 -16562 26627 -15787 -26733
761 -26733 36363 17176 -35802 2347 18807 -24593 1810 36892 -15865 -30755 20021 7648
773 7648 -18373 18945 13889 -33174 -6054 28080 -5700 -8957 19253 -10222 -26319 19479 20175
786 20175 -17293 -2002 9843 -18467 -3868 27670 -327 -20303 5098 2060 -11610 14162
798 14162 15845 -18706 -12023 12246 -25 -2065 14292 -3238 -20285 2906 13690 -1637 705
811 705 2995 -12802 -6891 14033 7587 -5924 -2095 -3409 -6967 6274 12593 -1680 -9561 -3740
825 -3740 395 4045 7639 1835 -7722 -7698 928 7501 5554 -991 -5316 -6616 -2020 8620 8753 -4481
841 -4481 -7863 -852 -864 2406 11343 689 -14353 -3058 7901 284 3290 6969 -11216 -12080 11435
856 11435 8321 -6394 3745 900 -16838 1775 20724 -3501 -11947 7096 -3951 -11714 16961
869 16961 12928 -19411 -5273 12195 -9281 -1222 22467 -7531 -24535 12204 11877 -14402 8507
882 8507 14348 -24569 -9946 26976 -1081 -15618 16122 -1525 -26815 15745 24908 -21596 -7809
895 -7809 20310 -15850 -13504 32715 2723 -32829 10716 15976 -23827 7616 29339 -25747 -21375
908 -21375 30815 63 -23267 25200 8480 -40026 8125 35093 -22269 -11700 30645 -17104
920 -17104 -28679 36264 14017 -37381 10166 22034 -33955 381 43652 -20683 -32082 32635
932 32635 3555 -33614 27571 23440 -44710 -3272 39986 -20979 -17109 39829 -11442 -42544
944 -42544 32799 24593 -40058 7187 32249 -37735 -13883 50375 -10091 -38420 32052 8497
956 8497 -43634 24153 37989 -43882 -13726 44090 -19832 -26799 46856 492 -52592 25144
968 25144 32476 -42157 3473 44286 -37243 -29256 52455 355 -43606 31726 16828 -51885
980 -51885 15071 48935 -39207 -21748 48167 -16861 -39720 47787 16683 -55930 13546 37749
992 37749 -40465 -3894 51614 -29847 -40053 49341 8459 -48828 29416 30747 -54551 -2157
1004 -2157 54155 -26817 -27865 46420 -10745 -47713 43393 27911 -56057 6497 45067 -40865
1016 -40865 -17619 57832 -14779 -47491 40152 13813 -49574 27200 39609 -55398 -12453 58475
1028 58475 -21828 -36479 48952 1144 -55045 31600 35020 -49720 3133 47496 -41929 -27401
1040 -27401 61993 -3486 -54227 33634 23394 -50667 15430 46114 -44340 -19096 53086 -19377
1052 -19377 -40249 51845 12765 -62101 18197 44611 -41513 -7873 47721 -30725 -33475 53388
1064 53388 2270 -51966 33325 29325 -57159 3378 56981 -32255 -30966 46799 -9071 -41650
1076 -41650 44442 18547 -58747 14278 46373 -44367 -15203 57627 -19968 -46677 43760 14162
1088 14162 -47718 25729 31823 -54198 -2624 58166 -28527 -35958 50005 -338 -51922 33663
1100 33663 31945 -49695 2883 43082 -38270 -18878 57562 -12547 -51516 38752 22820 -49976
1112 -49976 14620 41766 -43070 -15962 50424 -17905 -34661 46210 4655 -55821 26164 41016
1124 41016 -45717 -8132 46703 -27741 -29422 49322 -206 -47162 31026 23180 -50414 10541
1136 10541 49589 -38244 -27027 49113 -7524 -39526 38620 14677 -51146 15635 39375 -40138
1148 -40138 -9624 48963 -23812 -38347 45236 11409 -46441 20742 28372 -43952 238 47299
1160 47299 -27392 -28617 43406 -2900 -42350 32456 24895 -46371 2592 39170 -29740 -15672
1172 -15672 44251 -13176 -39614 35142 16745 -42373 13921 33138 -37807 -11244 43996 -14793
1184 -14793 -29800 35210 2954 -41095 23997 29357 -39650 -4412 38316 -23275 -22277 40197
1196 40197 -1803 -38731 24118 19414 -36485 8280 34202 -31082 -17492 39496 -6943 -30786
1208 -30786 28957 10549 -38452 12248 30614 -28842 -9128 33317 -16081 -24839 33016 6470
1220 6470 -34740 14635 21435 -30040 -216 32995 -19113 -21241 29573 306 -27602 20676
1232 20676 15195 -31838 2661 27981 -19344 -12094 28142 -8226 -25622 23314 11880 -27664
1244 -27664 7180 20614 -23064 -6061 28396 -9601 -20369 20968 3671 -23753 13836 17043
1256 17043 -24006 -3343 23024 -12065 -12832 22312 -1376 -22720 13452 12891 -19345 2396 17476
1269 17476 -15648 -9106 21065 -2541 -16605 13340 5668 -18563 6346 15953 -14132 -6551 15437
1282 15437 -5685 -11121 14538 3024 -16246 5602 10345 -11770 -371 13428 -8485 -9547
1294 -9547 12697 1672 -11053 6915 5656 -12031 1023 11223 -6379 -5235 8779 -2780
1306 -2780 -8063 8497 4307 -9617 1238 6509 -6226 -1442 8447 -2709 -6646 4992 2030
1319 2030 -4933 3092 3409 -6010 -1149 5467 -1419 -2692 3501 -541 -4350 2129 3397 -2253 -1166
1334 -1166 1481 -1129 -700 2328 756 -1854 -632 618 90 198 940 9 -1867 -838 2134 922
1350 922 -1910 353 1185 -2450 -282 3918 -822 -3498 2219 1110 -3391 2240 3491 -4618 -1533
1365 -1533 5250 -1864 -3598 5544 318 -7328 3254 5541 -6216 -931 6943 -4616 -5053 8319
1379 8319 542 -8308 5088 4566 -9244 1561 9776 -7148 -5538 10318 -1578 -9518 8537
1392 8537 4643 -12113 2361 10141 -9226 -3636 12528 -4932 -10527 11630 3485 -13710 5887
1405 5887 10159 -13184 -2082 15129 -7222 -10262 14019 583 -15060 9734 9381 -16155 781
1418 781 15591 -11527 -8303 17765 -2961 -16403 13408 7837 -18357 4746 15854 -15375 -6013
1431 -6013 19713 -6691 -15323 17168 4091 -20640 9195 15097 -19085 -2930 20971 -11051
1443 -11051 -14179 20541 1089 -21287 12894 12872 -21628 1355 21358 -15334 -11608 23261 -3428
1456 -3428 -21347 17445 10242 -24410 5449 20905 -19293 -8362 24984 -8120 -19954 21478
1468 21478 5961 -25747 11051 19174 -23729 -3866 26561 -13387 -17872 25411 1451 -26594
1480 -26594 15899 16163 -26664 1416 25918 -18859 -14195 28329 -4062 -25729 21092 12163 -29351
1493 -29351 6854 25319 -22791 -10253 29323 -9235 -23370 24980 7463 -30030 11857 22113
1505 22113 -26583 -4784 30205 -14739 -21188 27899 2867 -29321 16938 18400 -29377 513
1517 513 29325 -19285 -16283 30269 -3802 -28456 22371 14395 -31249 6183 26797 -24468 -10993
1530 -10993 32285 -9583 -26243 26086 8593 -31695 12755 23798 -28433 -5596 31756 -15203
1542 -15203 -21242 30116 1861 -32174 18214 20526 -30439 -63 29814 -20304 -16807 31519
1554 31519 -3429 -28943 22424 13735 -32328 7173 28835 -24656 -12982 31594 -8271 -25248
1566 -25248 25905 8524 -31956 11818 23812 -27338 -5325 31647 -15422 -22766 29128 4106
1578 4106 -30225 16431 18429 -29848 991 30168 -19745 -16830 30403 -3790 -28264 22714
1590 22714 14480 -31315 5572 26006 -23375 -9654 31168 -10551 -25471 25853 8398 -30284
1602 -30284 12275 22369 -27287 -5310 29979 -13678 -19291 27006 504 -28936 18218 18556
1614 18556 -28759 -109 27335 -18488 -15001 28677 -3061 -26148 19272 11729 -27484 7691
1626 7691 24198 -23480 -10639 29080 -7682 -22248 22897 6668 -28011 10945 20398 -23426
1638 -23426 -3429 25892 -15323 -17636 27075 1850 -26923 14796 15180 -25393 2396 24991
1650 24991 -18000 -13131 25472 -4851 -22099 20885 9942 -27698 6142 22090 -19541 -7080
1662 -7080 24850 -10474 -19579 22508 5437 -24681 11287 16626 -23507 -2307 25358 -12135
1674 -12135 -15784 21413 -482 -21614 16204 12979 -24246 1543 21559 -15889 -10151 23691
1686 23691 -4625 -21281 16627 9124 -21201 7138 17124 -20030 -5908 23599 -7873 -16625
1698 -16625 18807 3011 -22109 11029 15794 -19450 -2380 19218 -12394 -11383 21533 -917
1710 -917 -20742 12578 10656 -19307 3669 18306 -15486 -9678 19919 -3284 -15623 15233 5488
1723 5488 -20338 6101 16240 -14707 -4899 17431 -8318 -13331 17234 3963 -18047 7331
1735 7331 11108 -15769 -158 17661 -9675 -11556 14985 184 -14147 11270 8042 -17099 1093
1748 1093 14843 -9931 -6144 14942 -4532 -13893 12147 6697 -14040 3727 10142 -12567 -2761
1761 -2761 15443 -4999 -10852 10948 1510 -12612 7958 9582 -12903 -2370 11798 -6166 -6062
1774 -6062 12066 -1210 -12518 7090 6881 -9898 1852 9194 -9213 -5324 11867 -606 -8831
1787 -8831 6678 2545 -10142 3664 9249 -7337 -3933 7680 -3463 -5633 8834 1867 -9786
1800 -9786 2272 5849 -5957 112 7707 -4973 -6181 6697 1817 -5311 3773 2557 -7396 460
1814 460 7069 -2764 -3203 4332 -1874 -4834 5148 3540 -5301 -639 3021 -2962 -285 5227 -1348
1829 -1348 -4582 1912 1653 -1960 2200 2069 -4124 -1883 3433 714 -1173 1207 -812 -2961 1065
1844 1065 2985 -265 -1262 -345 -1089 -105 2337 1290 -1617 -1688 129 897 811 1006 -29 -2207 -1411 2001
1862 2001 1966 -828 -699 -279 -1838 350 3387 -62 -2768 239 272 -1358 2455 2680 -3658 -2489 2960
1879 2960 213 -1246 3231 -271 -5300 1186 4288 -1948 -628 2760 -3612 -3103 5636 1824 -4742
1894 -4742 1345 1795 -4921 1313 6721 -3204 -4843 4000 2 -3843 5194 2769 -7578 -403 5894
1909 5894 -3228 -1434 6429 -3246 -7240 5912 4112 -6018 1797 4185 -7341 -1367 9260 -2016
1923 -2016 -6204 5310 -144 -7359 5970 6471 -8700 -2012 7338 -4415 -3341 9560 -1342 -10108
1937 -10108 5199 5277 -7421 2493 7438 -8919 -4499 10813 -942 -7488 7166 1389 -11097
1950 -11097 4605 9880 -8334 -3487 8750 -5125 -6419 11367 1689 -11949 4140 6618 -9416
1963 -9416 1468 11482 -8267 -8368 10980 781 -9184 8085 4318 -13413 1812 11993 -7561
1976 -7561 -4583 10979 -5022 -10519 11852 5488 -12838 3034 8324 -11150 -917 14521 -6187
1989 -6187 -10763 10810 1483 -11572 8740 8232 -14499 -1386 13157 -6993 -5971 13401 -3287
2002 -3287 -14312 10440 8462 -13058 1962 10926 -11837 -4928 16002 -2874 -12168 10148 2675
2015 2675 -14293 7661 12730 -14015 -5151 14185 -5524 -8941 14154 868 -16050 7218 9865
2028 9865 -12784 1441 13933 -11878 -9725 16583 880 -13801 9230 5578 -15703 4127
2040 4127 14885 -11600 -6413 14432 -5832 -12264 15390 5532 -17720 3645 11817 -12029 -1095
2053 -1095 15820 -9255 -12244 15125 2317 -14816 9559 9548 -17415 -1180 16997 -7490 -8597
2066 -8597 13470 -3584 -14336 13502 8699 -17228 1683 13970 -12337 -6149 17806 -3049
2078 -3049 -14868 10427 4525 -13727 8067 11696 -16920 -4510 17984 -5526 -11777 14123 1701
2091 1701 -16897 7586 11338 -12836 201 12911 -12335 -7939 19076 -230 -17052 9005
2103 9005 8007 -14712 3367 14347 -11706 -6919 14101 -4817 -10886 15253 3826 -19190 4431
2116 4431 14408 -11096 -3581 13769 -7784 -10754 14481 2451 -14129 8329 8240 -16513 117
2129 117 17688 -7617 -10874 11770 -778 -11599 11341 6597 -15949 1728 12938 -10768 -4813
2142 -4813 16225 -4213 -14937 10241 6673 -11510 4872 8440 -13874 -2003 15936 -5687
2154 -5687 -10440 12232 642 -14722 8039 11020 -12078 -2193 10425 -8205 -4817 14908 -2296
2167 -2296 -14298 8544 6912 -12180 3252 11808 -10884 -6767 12470 -1622 -8392 10031 1139
2180 1139 -14325 5636 11787 -9876 -3445 10868 -6205 -8164 12343 2609 -11858 4529 5866
2193 5866 -10684 2059 12642 -8209 -8700 10320 305 -8680 8336 4296 -12599 1293 10165
2206 10165 -6798 -2795 10334 -5310 -9922 10096 5031 -9868 2724 5839 -9550 -319 11699
2219 11699 -4647 -7675 7852 -392 -8705 7872 6563 -10889 -1604 8596 -4790 -2874 9569
2232 9569 -2882 -9872 6565 5023 -7517 2779 6290 -9043 -3193 10554 -1163 -6761 5718
2245 5718 293 -8570 5158 7623 -7496 -2563 6514 -4350 -3555 9214 99 -9269 3301 4486
2259 4486 -5821 2057 6823 -6878 -5049 7643 399 -4916 5060 884 -8473 2482 7501 -4479
2273 -4479 -2321 5111 -3863 -4497 7718 2520 -7094 1149 3218 -5028 1277 7115 -4096 -5468 4489
2288 4489 632 -3745 4672 2215 -7417 -493 5920 -1886 -1642 4294 -2664 -5293 4696 3761 -3964
2303 -3964 257 2006 -4579 -253 6394 -936 -4617 1892 243 -3022 3579 3452 -4775 -2236 3141
2318 3141 -591 -424 3801 -1330 -4986 1754 3184 -1446 661 1535 -3784 -1813 4180 1264 -2159
2333 -2159 423 -689 -2599 2062 3457 -1709 -2158 463 -800 0 3208 450 -3373 -941 1374
2348 1374 368 1167 1235 -2071 -2324 1103 1866 584 91 -1170 -2106 259 2390 1146 -870 -1401 -1044
2365 -1044 93 1614 1659 -429 -2113 -1208 996 1624 812 -234 -1549 -1724 857 2334 367 -1018
2381 -1018 -811 -1444 -177 2821 1397 -2276 -1347 381 -362 1260 2554 -1462 -3189 782 1417 -119
2397 -119 1627 459 -3787 -931 3463 483 -1025 1264 -1639 -3250 2695 3455 -2210 -1254 1084 -2310
2413 -2310 -333 4733 88 -4246 646 1208 -2159 2273 3454 -4208 -3078 3570 443 -1690 3242
2428 3242 -206 -5561 1377 4586 -2069 -751 2807 -3577 -3070 5753 1950 -4664 866 1556 -4269
2443 -4269 1543 5999 -3152 -4358 3415 -224 -2970 4901 2029 -6873 -260 5028 -2435 -773 5094
2458 5094 -3167 -5788 5001 3348 -4531 1488 2685 -6085 -572 7507 -1654 -4765 3726 -394 -5302
2473 -5302 4998 4888 -6640 -1819 5157 -2952 -1819 7050 -1357 -7572 3555 3882 -4647 2124 4670
2488 4670 -6960 -3196 7927 -307 -5083 4486 276 -7542 3725 6769 -5476 -2106 5220 -4126
2502 -4126 -3429 8509 717 -8328 2562 4009 -5811 1877 7060 -6070 -5120 6938 -54 -5053
2516 -5053 5949 1645 -9381 1716 8014 -4513 -2390 6104 -4071 -5876 8138 2941 -7881
2529 -7881 2223 4414 -7318 328 9587 -4025 -6951 5824 504 -5816 6257 3858 -9680
2542 -9680 -197 8226 -4504 -3058 8315 -2589 -8782 6210 4914 -6701 1955 4669 -8272
2555 -8272 -1239 10558 -2730 -7541 6321 1118 -8301 5042 7108 -8013 -2392 6899 -4271
2568 -4271 -3011 9701 -1475 -10555 5210 6351 -7331 934 7366 -7095 -4700 9031 -355
2581 -355 -6366 6307 1143 -10319 4077 9794 -7110 -4517 7520 -2919 -5602 8625 1805
2594 1805 -9384 3307 5306 -8000 1142 10161 -6472 -8175 8378 2169 -6819 4942 2968
2607 2968 -9611 1644 8928 -5939 -3423 8894 -3583 -8968 8386 5752 -8766 296 5333
2620 5333 -6625 -137 9662 -4719 -7738 7751 1427 -8731 5555 7101 -9479 -3020 8469
2633 8469 -2617 -3574 7536 -2520 -9194 7003 6171 -8640 397 7630 -6891 -4552 9784 156
2647 156 -7474 4520 1405 -7894 4943 8021 -8754 -4142 8770 -2129 -5710 7708 1567 -9347
2661 -9347 2782 5849 -6024 941 7438 -7077 -6185 9663 1874 -7945 3723 3355 -7953 1508
2675 1508 8123 -5093 -3767 6642 -2896 -6132 8339 3710 -9585 396 6512 -4765 -970 7474
2689 7474 -3881 -6624 6412 1942 -6276 4362 4287 -8785 -1230 8872 -2253 -4723 5268 -1131
2703 -1131 -6553 5753 4828 -7027 -236 5290 -5152 -2163 8450 -1126 -7506 3794 2657 -5244
2717 -5244 3088 4951 -6873 -2704 6877 -1400 -3857 5574 -136 -7363 3235 5629 -4563 -716
2731 -716 4394 -4597 -3045 7357 646 -6124 2445 2157 -5268 2131 6058 -4555 -3821 4646 -705
2746 -705 -3197 5251 1081 -7013 996 4973 -3053 -681 4567 -3434 -4474 5158 2144 -4219 1635
2761 1635 1772 -5174 689 6090 -2324 -3738 3191 -667 -3394 4375 2723 -5274 -760 3471 -2215
2776 -2215 -232 4543 -2155 -4771 3067 2222 -2779 1745 1937 -4794 -995 4940 -409 -2477 2194
2791 2194 -962 -3610 3170 3360 -3216 -1123 1985 -2261 -588 4539 -397 -4228 1030 1536 -1848
2806 -1848 1705 2502 -3522 -2147 3057 396 -1153 2147 -583 -3736 1324 3364 -1263 -771 1209
2821 1209 -2117 -1319 3513 1181 -2566 -140 383 -1646 1436 2854 -1868 -2448 1087 315 -374 2153
2837 2153 270 -3169 -428 2079 165 186 886 -1803 -1844 1861 1657 -703 -199 -452 -1745 557 2545
2854 2545 52 -1572 -472 -304 -65 1771 1059 -1595 -1343 307 511 955 1018 -947 -1867 11 1315
2871 1315 915 188 -709 -1363 -471 1149 1370 55 -1187 -1095 -20 952 1249 344 -1218 -1415 221 1209
2889 1209 745 179 -807 -1676 -83 1895 796 -726 -517 -883 -672 1540 1779 -970 -1371 0 -270
2906 -270 560 2081 -187 -2562 -193 1241 -75 871 1114 -2156 -1809 1976 1217 -689 642 -438
2922 -438 -2589 752 2961 -607 -1347 743 -1204 -1203 2944 1598 -2782 -722 1241 -1212 522 2963
2938 2963 -1554 -3112 1550 1190 -1245 1736 1057 -3747 -711 3528 -245 -1360 1913 -1127 -3193
2953 -3193 2698 2853 -2552 -598 1565 -2452 -478 4302 -450 -3760 1310 1037 -2454 2035 2953 -3734
2969 -3734 -2180 3284 -218 -1556 3170 -288 -4655 1598 3625 -2303 -436 2602 -3030 -2442 4662
2984 4662 1099 -3827 1246 1258 -3754 1425 4656 -2865 -3044 3176 -529 -2500 4034 1385 -5343 303
3000 303 3854 -2320 -437 4071 -2720 -4206 4103 2081 -3556 1530 1879 -4799 98 5512 -1866
3015 -1866 -3269 3342 -724 -3980 4007 3247 -5021 -847 3623 -2593 -881 5186 -1672 -5242 3327
3030 3327 2391 -3926 1890 3497 -5068 -1982 5560 -543 -3191 3555 -338 -5307 3290 4610 -4467
3045 -4467 -1295 4004 -3076 -2490 5814 334 -5482 2073 2232 -4230 1903 4936 -4838 -3481 5316
3060 5316 43 -3571 3905 972 -5918 1651 4757 -3512 -836 4476 -3570 -4086 6009 1998 -5464
3075 -5464 1256 2663 -4433 848 5572 -3444 -3636 4546 -621 -4315 4888 2878 -6703 -457 5185
3090 5185 -2392 -1382 4591 -2597 -4863 4865 2298 -5158 1958 3617 -5779 -1361 6771 -1174 -4316
3105 -4316 3408 -155 -4438 4333 3646 -6174 -736 5243 -3149 -2500 6016 -468 -6053 2825 2846 -4019
3121 -4019 2021 3802 -5885 -2180 6806 -764 -4745 4014 1062 -5762 2328 4918 -4052 -1150 4024
3136 4024 -3588 -2765 6833 491 -6845 2043 3819 -4311 537 5147 -3878 -3426 4892 -397 -3808
3151 -3808 4709 1501 -7148 1093 6307 -3192 -2530 4454 -2068 -4136 5113 1983 -5274 1801 3094
3166 3094 -5349 6 6800 -2563 -5120 3965 951 -3987 3506 2635 -5858 -177 5182 -2924 -1985
3181 -1985 5456 -1573 -5911 3801 3549 -4240 666 3113 -4621 -1036 6157 -1338 -4515 3711 857
3196 857 -5032 2843 4632 -4635 -2019 4185 -1829 -2091 5101 -400 -5943 2505 3693 -4005 308
3211 308 4310 -3812 -3240 5044 639 -3764 2738 945 -5146 1808 5174 -3423 -2512 3896 -1475 -3252
3227 -3252 4512 1674 -5047 720 2983 -3176 330 4550 -2948 -3874 3997 1198 -3400 2412 1893
3242 1893 -4761 -140 4633 -1675 -2083 3206 -1310 -3650 3647 2637 -3954 -50 2608 -2932 -594
3257 -594 4549 -1119 -3944 2292 1167 -2897 2097 2614 -3970 -1457 3683 -673 -1758 2938 -535
3272 -535 -4007 2048 3026 -2536 -356 2304 -2546 -1466 3929 321 -3190 1208 852 -2579 1420 3113
3288 3113 -2518 -2018 2413 -349 -1420 2776 370 -3617 462 2478 -1336 -146 2053 -2001 -2130
3303 -2130 2707 1159 -1974 757 588 -2557 499 3074 -1054 -1890 1332 -373 -1425 2139 1261 -2577
3319 -2577 -524 1465 -794 154 2051 -1168 -2341 1377 1233 -997 726 719 -2197 -478 2271 139
3335 139 -989 645 -627 -1434 1484 1541 -1306 -714 557 -780 -38 1893 -120 -1847 17 624 -220
3352 -220 880 734 -1485 -977 1094 522 -69 533 -533 -1451 413 1472 3 -457 -145 -747 -221 1279
3370 1279 635 -760 -560 -208 -129 761 941 -463 -1078 -146 392 512 490 -276 -978 -547 508 830 260
3389 260 -446 -687 -367 296 848 412 -626 -744 -72 355 633 565 -475 -1183 -108 845 343 105 -52
3408 -52 -908 -633 1034 842 -391 -246 -295 -793 529 1437 -336 -1119 75 -59 -295 1154 607 -1575
3426 -1575 -726 870 67 144 953 -754 -1660 807 1180 -588 186 482 -1624 -371 2047 292 -1246
3443 -1246 430 -173 -1323 1226 1701 -1410 -1023 1034 -586 -407 2041 -73 -2341 382 1319 -930
3459 -930 444 1438 -1790 -1460 2049 579 -1289 1072 141 -2413 682 2505 -1191 -1113 1385 -962
3475 -962 -1477 2449 1007 -2628 49 1465 -1589 155 2519 -1432 -2356 1900 737 -1691 1465 1250
3491 1250 -2996 -356 2911 -800 -1351 2003 -752 -2584 2200 1922 -2450 -48 1835 -2163 -676
3506 -676 3497 -516 -2990 1581 901 -2354 1540 2379 -2944 -1312 2870 -662 -1547 2664 -182 -3525
3522 -3525 1490 2549 -2275 -205 2388 -2394 -1781 3628 416 -3008 1452 1188 -2972 1037 3328
3537 3328 -2413 -1913 2764 -674 -2202 3142 977 -3987 567 2972 -2187 -502 3130 -1894 -2802
3552 -2802 3233 1096 -3015 1515 1711 -3640 -20 4078 -1595 -2519 2635 -298 -2913 2837 1971 -3748
3568 -3748 -41 2913 -2292 -995 3886 -1024 -3668 2459 1660 -2822 1293 2296 -3462 -964 3899
3583 3899 -985 -2563 2861 115 -3772 1981 2989 -3050 -680 2770 -2183 -1538 4061 -161 -3939
3598 -3939 1942 1967 -3195 733 3393 -2734 -2073 3395 -332 -2392 2890 540 -4274 1358 3620 -2715
3614 -2715 -1218 3219 -1593 -2641 3437 928 -3421 1397 1790 -3425 489 4083 -2310 -2805 3175
3629 3175 187 -2834 2481 1513 -3783 333 3066 -2297 -902 3591 -1548 -3496 3051 1851 -3178
3644 -3178 827 2166 -3142 -344 3801 -1453 -2570 2902 99 -3417 2332 2671 -3528 -802 3043
3659 3043 -1660 -1292 3460 -781 -3557 2463 1919 -3261 751 2979 -2992 -1682 3653 -298 -2503
3674 -2503 2319 275 -3432 1824 3027 -3136 -1069 3154 -1568 -2182 3407 508 -3497 1250 1831
3689 1831 -2715 606 3133 -2603 -2151 3388 67 -2781 2230 1169 -3526 529 3099 -2033 -1081
3704 -1081 2745 -1452 -2535 3177 1235 -3340 778 2150 -2581 -220 3455 -1508 -2525 2526 337
3719 337 -2593 2100 1830 -3402 -365 3143 -1424 -1444 2802 -704 -3038 2224 1711 -2757 511 2176
3735 2176 -2557 -1002 3424 -553 -2598 1941 603 -2564 1469 2280 -2767 -853 2660 -1128 -1574
3750 -1574 2750 -18 -3136 1279 1982 -2153 83 2220 -2050 -1524 2842 147 -2329 1551 790 -2755
3766 -2755 672 2637 -1844 -1378 2158 -695 -1802 2330 832 -2777 465 1816 -1740 -199 2401
3781 2401 -1307 -1999 2149 694 -1988 1151 1143 -2407 -127 2406 -995 -1290 1706 -397 -1931 1761
3797 1761 1335 -2109 -73 1602 -1417 -553 2260 -502 -1980 1199 702 -1515 773 1273 -1911 -715
3813 -715 1863 -386 -1090 1395 -43 -1921 902 1506 -1283 -227 1201 -997 -754 1808 207 -1595
3829 -1595 620 623 -1226 467 1452 -1149 -963 1209 -30 -818 1030 327 -1548 201 1176 -563 -230
3846 -230 881 -704 -948 1144 521 -1007 226 483 -943 0 1276 -347 -843 435 36 -509 732
3863 732 454 -957 -202 663 -170 -43 707 -306 -818 339 612 -250 21 237 -556 -194 621 169 -379
3882 -379 25 -75 -295 306 511 -298 -450 27 62 2 352 61 -427 -204 205 252 71 34 -234 -284 85 418
3904 418 118 -186 -132 -96 -83 227 379 -200 -491 121 235 3 215 123 -510 -215 440 201 -199 222 -137
3925 -137 -533 338 586 -341 -292 276 -317 -258 734 193 -764 58 310 -421 238 710 -563 -660 663 118
3945 118 -554 568 268 -1091 51 1021 -355 -398 706 -402 -800 920 483 -942 108 657 -875
3962 -875 -108 1256 -413 -1043 779 279 -910 628 843 -1202 -288 1168 -424 -632 1113 -178 -1378
3979 -1378 875 953 -1126 72 1100 -1103 -638 1584 -94 -1263 815 455 -1409 619 1364 -1291
3995 -1291 -660 1481 -448 -1070 1473 324 -1791 610 1285 -1249 -152 1597 -1048 -1194 1756 264
4011 264 -1649 922 835 -1835 196 1910 -1165 -1001 1696 -326 -1563 1534 861 -1976 299 1581
4027 1581 -1439 -403 2039 -834 -1717 1736 613 -1867 901 1400 -1986 -328 2239 -841 -1410 1857
4043 1857 -11 -2082 1407 1389 -2157 -21 1962 -1451 -1011 2280 -294 -2165 1494 1001 -2194 595
4059 595 1995 -1966 -990 2374 -633 -1791 1990 499 -2531 1002 1931 -2028 -457 2297 -1184 -1639
4075 -1639 2357 295 -2325 1231 1400 -2285 179 2396 -1694 -1435 2394 -172 -2195 1803 1132 -2581
4091 -2581 372 2168 -1780 -794 2455 -914 -2106 2193 852 -2583 871 1864 -2287 -406 2617
4106 2617 -1144 -1796 2225 153 -2501 1517 1661 -2578 -131 2382 -1501 -1341 2541 -342 -2497 1821
4122 1821 1308 -2498 437 2290 -2071 -1053 2730 -634 -2103 2026 654 -2612 1071 2027 -2289
4137 -2289 -598 2540 -1181 -1728 2418 353 -2559 1226 1616 -2333 -3 2365 -1673 -1371 2547 -153
4153 -153 -2312 1740 1211 -2546 403 2285 -1801 -940 2405 -722 -2027 2110 822 -2587 815 1941
4169 1941 -2104 -528 2484 -1085 -1802 2221 312 -2309 1299 1544 -2375 -119 2329 -1415 -1343 2302
4185 2302 -231 -2254 1679 1191 -2326 383 1994 -1841 -883 2414 -625 -1950 1838 710 -2178
4200 -2178 876 1714 -1921 -446 2226 -1048 -1499 2118 224 -2232 1239 1450 -2000 52 2039 -1385
4216 -1385 -1113 2170 -291 -1981 1541 964 -2144 441 1866 -1650 -802 2106 -634 -1665 1735 548
4232 548 -2174 844 1488 -1781 -313 2045 -1049 -1395 1926 122 -1928 1122 1196 -1974 116 1819
4248 1819 -1265 -985 1955 -287 -1779 1452 795 -1958 446 1586 -1511 -625 1853 -656 -1461 1505
4264 1505 405 -1784 738 1287 -1585 -240 1796 -929 -1164 1632 49 -1691 993 1054 -1666 38
4280 38 1546 -1159 -846 1570 -252 -1419 1220 721 -1619 404 1381 -1247 -477 1604 -527 -1265 1282
4297 1282 419 -1522 623 1093 -1301 -200 1450 -781 -980 1321 11 -1336 846 855 -1361 4
4313 4 1281 -853 -690 1283 -146 -1149 891 548 -1248 328 1029 -1011 -485 1198 -338 -951 966
4330 966 312 -1152 422 875 -891 -219 1022 -488 -712 1031 95 -1026 494 620 -917 58 955
4347 955 -632 -601 910 -43 -754 597 351 -900 90 770 -529 -349 736 -243 -746 597 324 -715
4365 -715 127 539 -626 -156 685 -253 -471 455 74 -525 309 376 -514 -96 579 -198 -264 439 3 -449
4385 -449 220 355 -254 10 252 -322 -190 402 60 -356 127 132 -320 -1 338 -76 -231 113 -23 -86 143
4406 143 131 -225 -68 173 4 -37 79 81 -166 2 257 62 -137 -6 -5 -24 56 226 -78 -233 100 80 -125
4429 -125 116 192 -263 -179 242 -49 -187 239 -3 -322 177 378 -229 -184 240 -227 -279 411 203 -432 94
4450 94 297 -346 72 524 -311 -472 463 197 -437 326 321 -626 -91 625 -227 -311 527 -122 -603 550 481
4471 481 -619 -34 551 -535 -274 880 -98 -743 457 246 -650 377 617 -735 -327 852 -238
4488 -238 -557 743 87 -970 458 722 -719 -114 826 -559 -621 1053 150 -971 480 510 -944 211
4506 211 1068 -720 -648 1008 -131 -841 947 406 -1222 123 926 -719 -287 1066 -556 -942 1039
4523 1039 410 -1120 504 680 -1174 -97 1404 -524 -903 1020 5 -1102 875 781 -1343 -36
4539 -36 1173 -801 -482 1397 -277 -1361 891 650 -1174 337 1058 -1282 -469 1535 -326 -1040 1130
4556 1130 160 -1461 761 1211 -1280 -376 1345 -775 -885 1536 29 -1550 734 861 -1312 195
4572 195 1420 -1164 -962 1548 -86 -1313 1184 536 -1790 371 1535 -1094 -616 1482 -637 -1235
4588 -1235 1540 519 -1725 531 1085 -1480 -79 1776 -850 -1276 1451 137 -1451 1142 937 -1891
4604 -1891 -117 1674 -1009 -817 1677 -362 -1656 1346 920 -1730 321 1276 -1540 -561 2008 -474
4620 -474 -1573 1314 397 -1703 881 1442 -1731 -439 1791 -796 -1089 1781 116 -1996 930 1391
4636 1391 -1567 9 1606 -1302 -984 1962 -32 -1623 1228 712 -1957 444 1861 -1293 -914 1616
4652 1616 -472 -1304 1637 479 -2035 557 1459 -1497 -288 1869 -965 -1529 1607 430 -1572 911
4668 911 906 -1904 52 1953 -1001 -1152 1646 -199 -1724 1415 1082 -1805 73 1453 -1276 -463 1983
4685 1983 -527 -1763 1367 717 -1654 621 1329 -1656 -541 1847 -574 -1109 1512 -6 -1927 1018
4701 1018 1419 -1541 -324 1491 -1028 -872 1773 5 -1678 947 728 -1605 506 1660 -1395 -1022
4717 -1022 1613 -101 -1187 1294 419 -1814 501 1395 -1216 -327 1477 -892 -1305 1601 532 -1610
4733 -1610 543 903 -1489 48 1722 -886 -1077 1343 -83 -1333 1192 834 -1761 -38 1398 -927
4749 -927 -449 1546 -521 -1458 1165 704 -1286 456 989 -1392 -340 1691 -375 -1093 983 88 -1354
4766 -1354 905 1133 -1325 -349 1144 -680 -597 1438 -121 -1465 634 738 -970 319 1019 -1156
4782 -1156 -670 1326 -60 -969 887 132 -1411 499 1216 -881 -441 945 -575 -681 1320 223
4798 223 -1298 409 628 -935 199 1183 -783 -885 987 99 -763 766 329 -1239 149 1126 -531
4815 -531 -356 848 -508 -935 959 538 -968 95 495 -817 -35 1139 -459 -826 556 128 -713
4832 -713 685 614 -1043 -255 840 -264 -245 791 -256 -969 616 612 -578 45 504 -767 -309 1001
4850 1001 -38 -711 319 91 -660 468 728 -708 -493 497 -212 -231 767 -13 -951 175 582 -351
4868 -351 140 469 -610 -507 631 277 -388 200 49 -589 209 704 -169 -390 157 -195 -245 646 257 -554
4888 -554 -211 251 -171 118 462 -335 -579 170 317 -66 173 20 -497 -45 468 92 -184 0 -169 -343
4908 -343 273 441 -173 -322 -59 -37 139 281 56 -412 -179 164 41 203 189 -268 -367 88 359 189 -62
4929 -62 -213 -231 -53 304 286 -175 -233 -106 -30 176 320 -9 -455 -152 207 179 115 72 -310 -374 271 351 -69
4952 -69 -33 -47 -367 26 598 83 -361 -40 -65 -202 403 409 -414 -385 244 84 -32 487 -10 -681 2 532
4974 532 -89 -15 303 -525 -441 652 297 -445 82 86 -646 158 837 -246 -560 197 -33 -329 726 359
4994 359 -885 -202 569 -275 -73 750 -368 -917 502 606 -433 187 421 -838 -246 1029 -26 -591
5012 -591 439 -117 -825 615 857 -780 -419 603 -354 -301 1013 10 -1108 340 603 -562 255
5029 255 707 -827 -715 1018 164 -669 625 61 -1177 399 1123 -631 -455 680 -489 -629 1159
5046 1159 447 -1182 138 605 -777 187 1260 -654 -1051 900 327 -758 664 463 -1332 -49
5062 -49 1169 -416 -466 938 -430 -1211 1050 847 -1103 1 745 -976 -229 1493 -339 -1196 728
5079 728 213 -1016 808 1021 -1360 -535 1203 -337 -559 1145 -154 -1523 699 1029 -1015 -20 988
5096 988 -1042 -630 1512 96 -1193 662 280 -1364 646 1427 -1080 -855 1158 -310 -793 1330
5112 1330 274 -1653 356 1083 -993 12 1340 -1048 -1234 1423 562 -1136 604 526 -1496 194
5128 194 1593 -798 -854 1175 -364 -1225 1338 901 -1613 -105 1059 -945 -118 1665 -753 -1511 1210
5145 1210 632 -1218 679 1006 -1602 -450 1616 -406 -829 1148 -296 -1628 1249 1306 -1547 -261
5161 -261 1278 -957 -643 1643 -102 -1513 738 572 -1273 770 1434 -1578 -953 1599 -95 -1039
5177 -1039 1173 192 -1726 543 1443 -1166 -194 1423 -1135 -1082 1853 544 -1671 445 845 -1318
5193 -1318 251 1676 -1123 -1122 1268 -152 -1207 1414 736 -1976 -52 1559 -742 -421 1411 -775
5209 -775 -1473 1427 738 -1428 440 962 -1545 -262 1954 -306 -1296 969 65 -1225 1140 1101 -1683
5226 -1683 -349 1437 -719 -598 1650 -133 -1748 778 1029 -1051 332 1031 -1441 -655 1766 -53
5242 -53 -1295 905 246 -1560 637 1507 -1097 -680 1089 -636 -714 1634 182 -1759 455 1021 -1088
5259 -1088 167 1435 -1049 -1212 1276 357 -965 885 386 -1586 175 1597 -686 -699 1077 -446
5275 -446 -1131 1303 868 -1368 -20 800 -998 17 1542 -628 -1348 910 367 -944 718 808 -1417
5292 -1417 -445 1342 -230 -566 971 -320 -1311 915 1033 -967 -155 769 -890 -377 1484 35 -1203
5309 -1203 487 247 -920 634 1140 -1113 -716 1006 -21 -555 988 31 -1357 288 947 -537
5325 -537 -30 731 -869 -753 1214 479 -856 208 243 -906 286 1137 -498 -681 559 -177 -459 1019
5343 1019 382 -1199 -172 761 -258 4 842 -456 -947 590 546 -473 257 209 -1017 -91 1080 -52
5361 -52 -580 270 -171 -574 740 703 -731 -364 356 -301 11 887 -156 -953 152 381 -207 362 346 -774
5381 -774 -446 708 265 -185 302 -235 -678 391 808 -161 -315 144 -350 -142 754 207 -593 -236 143
5400 143 -86 339 533 -500 -621 225 320 48 316 -48 -616 -142 486 185 4 -7 -405 -328 510 565 -250
5421 -250 -297 -186 -131 190 459 53 -419 -202 -37 186 379 156 -468 -511 160 480 158 -69 -199 -364 -7
5442 -7 372 275 -75 -300 -305 -70 339 471 -157 -515 -161 209 207 258 12 -453 -382 199 343 130 40 -317 -517
5465 -517 152 661 50 -406 -140 -200 -78 526 390 -493 -328 117 -78 230 580 -301 -737 89 462 -16
5485 -16 190 123 -730 -379 738 233 -277 90 -216 -672 415 781 -353 -511 149 -278 -159 853 148
5504 148 -947 -111 359 -216 283 749 -688 -861 605 382 -263 418 143 -1025 50 973 -144 -383
5522 -383 362 -435 -722 939 726 -923 -250 351 -511 80 1136 -299 -1035 436 260 -522 629 616
5540 616 -1223 -488 1106 10 -426 663 -284 -1202 631 1012 -633 -133 586 -844 -390 1385 229
5557 229 -1172 200 302 -789 576 1115 -952 -807 929 2 -579 997 245 -1502 171 1153 -495
5574 -495 -124 816 -895 -1024 1319 609 -1155 206 474 -1096 79 1499 -503 -1013 724 -143 -845
5591 -845 1283 721 -1643 -286 1200 -447 -282 1188 -513 -1461 957 745 -925 471 736 -1436
5607 -1436 -399 1756 -73 -1109 701 -46 -1229 950 1172 -1303 -515 1025 -663 -526 1616 2
5623 2 -1655 515 810 -871 432 1110 -1374 -914 1557 152 -1113 906 247 -1667 457 1558 -848
5640 -848 -565 951 -803 -883 1806 516 -1805 202 934 -1017 159 1589 -924 -1238 1178 138
5656 138 -973 1102 601 -1997 -107 1810 -514 -698 1050 -573 -1284 1375 827 -1409 205 883
5672 883 -1393 -251 2043 -352 -1589 792 365 -1049 1014 977 -1692 -428 1519 -572 -712 1488
5688 1488 -159 -1876 766 1342 -999 89 874 -1412 -554 1937 -16 -1524 838 449 -1532 551
5704 551 1623 -1160 -875 1043 -464 -561 1708 117 -2048 477 1386 -1053 -112 1417 -1056 -1309 1470
5721 1470 487 -1040 817 310 -1772 385 1898 -878 -1057 1167 -248 -1141 1354 880 -1580 -70
5737 -70 984 -1020 -28 1739 -812 -1694 1152 785 -1165 645 824 -1602 -342 1662 -315 -799 1112
5754 1112 -338 -1612 1224 1438 -1381 -387 1035 -866 -468 1713 -157 -1541 667 557 -1179 779
5770 779 1403 -1519 -953 1505 16 -858 1025 72 -1676 562 1350 -941 -237 1039 -1018 -1016 1663
5787 1663 552 -1480 215 636 -1061 326 1470 -929 -1035 1056 -35 -874 1240 634 -1762 -189
5803 -189 1363 -408 -332 1024 -656 -1235 1193 744 -1019 277 609 -1253 -157 1658 -249 -1180 557
5820 557 83 -896 936 930 -1292 -434 927 -433 -326 1231 -221 -1489 517 857 -595 178 611 -1074
5838 -1074 -542 1314 233 -780 433 9 -1015 554 1220 -678 -622 526 -322 -337 1156 201 -1255
5855 -1255 15 678 -463 126 853 -771 -899 747 403 -468 426 82 -1111 121 1109 -238 -513
5872 -513 392 -363 -625 826 661 -776 -252 303 -413 109 948 -354 -921 284 324 -219 491 371 -909
5891 -909 -415 736 222 -180 275 -281 -714 440 727 -287 -191 123 -506 -122 846 285 -726 -185 64
5910 64 -176 310 457 -521 -520 289 130 -5 363 -42 -743 -128 576 243 -67 -89 -476 -294 549 487 -214 -270
5932 -270 -67 -246 163 640 93 -524 -266 33 168 394 137 -528 -397 264 307 97 14 -208 -434 -92 485
5953 485 336 -122 -372 -319 28 420 418 -249 -538 -56 136 140 276 70 -476 -395 179 391 176 -11 -406 -420
5975 -420 319 628 3 -261 -57 -235 -102 614 345 -415 -333 -13 -125 371 524 -402 -670 154 279 -82
5995 -82 286 51 -675 -217 623 152 -125 135 -368 -553 530 692 -347 -342 64 -350 -45 827 43 -799
6015 -799 36 179 -243 463 583 -684 -642 590 191 -174 516 -129 -951 239 844 -202 -159 364 -619
6034 -619 -478 950 430 -752 -44 233 -633 297 978 -431 -798 434 10 -342 812 352 -1278 -222
6052 -222 949 -196 -199 705 -495 -997 717 706 -634 144 419 -985 -113 1429 -102 -949 397 107
6070 107 -727 747 894 -986 -470 749 -338 -313 1179 -123 -1454 392 970 -662 62 738 -971
6087 -971 -651 1285 152 -859 557 196 -1277 437 1390 -686 -719 807 -406 -634 1346 300 -1498
6104 -1498 200 955 -757 5 1311 -782 -1183 990 580 -793 647 341 -1589 57 1562 -494
6120 -494 -886 992 -296 -1175 1049 976 -1218 -153 790 -943 -137 1657 -430 -1564 828 666 -968
6137 -968 624 945 -1359 -545 1370 -251 -705 1113 -100 -1657 741 1371 -1027 -300 965 -868
6153 -868 -579 1645 76 -1478 644 638 -1290 448 1531 -1121 -1104 1188 -42 -747 1170 153 -1758
6170 -1758 425 1474 -937 -414 1277 -801 -1252 1333 690 -1170 383 543 -1317 219 1777 -813
6186 -813 -1273 1153 81 -1142 1052 925 -1480 -196 1207 -639 -225 1485 -685 -1568 1172 950
6202 950 -1250 255 959 -1306 -376 1556 -290 -1035 957 -97 -1470 1100 1291 -1432 -586 1195
6218 1195 -604 -508 1432 -124 -1517 697 773 -1128 462 1294 -1328 -1081 1537 251 -1050 749
6234 749 168 -1482 640 1349 -1082 -444 1199 -751 -994 1551 616 -1547 81 787 -931 258 1368
6251 1368 -989 -1106 1234 140 -1065 998 667 -1717 -83 1483 -478 -538 1008 -584 -1139 1339
6267 1339 709 -1363 202 851 -1159 -203 1696 -355 -1236 763 210 -971 919 864 -1515 -369 1304
6284 1304 -440 -624 1290 -182 -1483 697 917 -865 133 791 -1194 -480 1560 2 -1203 694
6300 694 309 -1159 521 1230 -976 -612 878 -422 -615 1365 153 -1491 353 1018 -752 36 1077
6317 1077 -801 -880 1117 248 -849 658 263 -1350 255 1372 -635 -810 813 -212 -774 1029
6333 1029 585 -1163 55 680 -741 31 1203 -566 -1191 816 506 -802 425 554 -1177 -236 1124
6350 1124 -183 -570 681 -230 -1021 773 880 -882 -256 625 -652 -303 1172 -27 -1032 324 323
6367 323 -646 428 760 -867 -576 834 -1 -436 650 -12 -1038 290 831 -459 -140 538 -523
6384 -523 -537 936 337 -817 59 276 -599 190 931 -386 -666 453 125 -311 595 264 -908 -138 655
6403 655 -117 -169 460 -339 -633 526 505 -350 15 117 -572 -30 854 53 -598 163 147 -293 310 398 -481
6424 -481 -302 254 -50 14 504 -155 -704 92 505 -49 -71 144 -394 -204 405 249 -173 16 -124 -369 250
6445 250 597 -128 -403 -8 32 70 288 130 -316 -206 134 6 147 218 -211 -443 24 381 121 -116 -70
6466 -70 -217 -58 271 201 -193 -145 -33 -60 128 366 18 -398 -168 227 199 219 72 -308 -211 239 255 -101 36
6489 36 -9 -334 -46 510 172 -286 -146 -45 -152 312 289 -447 -317 221 -38 -36 376 46 -579 -59 445 -86
6511 -86 -34 197 -474 -326 518 274 -395 6 137 -479 52 668 -117 -475 167 1 -320 506 341 -643 -201
6532 -201 468 -115 -121 547 -224 -698 341 493 -394 70 393 -583 -305 842 73 -609 274 72 -619 409
6552 409 729 -541 -417 439 -180 -353 790 189 -915 203 627 -469 64 694 -549 -628 732 265
6570 265 -600 315 197 -877 131 984 -427 -514 645 -188 -745 727 531 -884 2 556 -576 -105
6588 -105 973 -449 -878 667 389 -785 382 579 -981 -201 996 -176 -518 759 -182 -976 740
6605 740 784 -931 -144 820 -602 -433 1146 -50 -968 558 395 -860 363 1010 -949 -626 1112
6622 1112 -119 -742 766 163 -1194 403 941 -872 -235 991 -600 -834 1169 326 -1079 364
6638 364 582 -947 166 1176 -789 -786 1024 -66 -986 893 597 -1235 -62 1124 -572 -383 1118
6655 1118 -534 -1100 1093 584 -1158 343 896 -1092 -317 1360 -405 -938 866 68 -1153 784
6671 784 934 -1272 -347 1231 -588 -595 1231 -85 -1307 742 736 -1081 250 1057 -1106 -639 1376 -30
6689 -30 -1082 751 356 -1233 485 1069 -1046 -407 1200 -500 -917 1247 392 -1411 309 907 -941
6706 -941 4 1211 -827 -879 1240 68 -1123 812 683 -1369 36 1333 -633 -562 1060 -298 -1027
6723 -1027 1133 540 -1315 235 1033 -977 -323 1374 -367 -1056 923 279 -1019 683 830 -1247
6739 -1247 -177 1357 -528 -804 1093 13 -1252 655 800 -1063 26 1008 -886 -553 1342 -139
6755 -139 -1146 674 482 -1125 397 975 -946 -435 1067 -318 -767 1100 250 -1394 427 1011 -895
6772 -895 -167 974 -588 -734 1147 127 -1025 679 514 -1167 196 1212 -754 -701 992 -128
6788 -128 -844 863 437 -1122 201 789 -827 -208 1087 -428 -985 874 370 -986 379 694 -983
6805 -983 -110 1112 -467 -681 842 -61 -1027 671 714 -1014 -59 818 -648 -427 1054 -155 -955 728
6823 728 434 -875 379 828 -846 -335 948 -219 -665 799 131 -1003 392 721 -827 -182 837
6840 837 -540 -552 902 92 -835 405 421 -803 175 808 -656 -527 793 -69 -679 627 269 -859
6858 -859 210 715 -523 -243 708 -368 -625 740 248 -720 273 482 -645 -88 774 -311 -580 599
6876 599 56 -617 426 421 -692 -39 593 -407 -291 660 -111 -636 429 364 -554 123 476 -543 -232
6895 -232 667 -185 -516 462 86 -583 277 554 -512 -152 533 -169 -316 565 21 -590 188 445 -457 -1
6915 -1 517 -308 -281 484 90 -408 226 212 -459 30 478 -270 -249 373 -80 -383 318 188 -467 72 303 -256
6937 -256 -121 426 -162 -378 276 153 -320 79 235 -297 -93 347 -39 -190 213 25 -264 150 211 -254
6957 -254 -101 251 -74 -139 181 94 -215 28 145 -120 23 193 -86 -209 97 116 -192 8 134 -141 -101
6978 -101 189 20 -127 44 74 -109 43 142 -110 -90 121 18 -92 69 115 -179 -92 228 -27 -114 163 57
7000 57 -146 68 218 -145 -124 149 -77 -190 147 86 -286 29 206 -134 -77 297 -63 -250 169 159 -192 75
7022 75 207 -248 -67 331 -48 -247 240 37 -262 144 331 -254 -120 376 -95 -257 282 81 -300 135
7042 135 238 -318 -77 349 -202 -268 412 9 -396 192 331 -422 -3 355 -253 -255 410 -13 -383 344 225
7063 225 -508 24 492 -319 -260 498 -116 -396 406 190 -517 156 439 -457 -107 583 -202 -407 541 107
7083 107 -512 289 424 -529 -45 607 -299 -416 534 -25 -542 389 313 -612 60 609 -424 -273 717 -66
7103 -66 -648 456 332 -651 85 545 -555 -229 667 -244 -576 575 136 -684 293 570 -581 -126 721
7122 721 -356 -509 688 48 -783 313 481 -704 67 724 -509 -437 707 -104 -660 559 338 -863
7140 -863 51 677 -530 -308 723 -221 -647 679 226 -788 272 584 -716 -166 884 -341 -577
7157 -577 653 102 -766 399 537 -846 -40 750 -445 -460 852 -115 -835 557 476 -847 132 738
7175 738 -662 -288 901 -208 -757 654 259 -832 259 691 -733 -194 821 -361 -595 853 116
7192 116 -957 432 672 -704 -66 819 -548 -531 848 0 -785 603 401 -949 168 908 -562
7209 -562 -440 829 -160 -763 728 308 -907 256 726 -717 -206 952 -396 -753 763 279 -890
7226 -890 389 585 -868 -117 961 -427 -558 850 -85 -878 540 597 -884 -57 689 -571 -386 970
7244 970 -201 -883 594 378 -874 243 784 -771 -327 876 -210 -642 752 95 -940 435 717
7261 717 -790 -227 851 -479 -629 789 131 -818 401 393 -830 176 867 -615 -601 857 -6 -688
7279 -688 624 324 -825 123 698 -546 -172 774 -383 -695 734 339 -801 199 568 -652 -172
7296 -172 838 -360 -600 609 36 -717 540 560 -805 -137 739 -356 -392 670 -120 -764 477 382
7314 382 -692 142 614 -614 -359 835 -57 -607 453 117 -700 317 639 -624 -253 665 -320 -481
7332 -481 677 140 -766 202 433 -502 55 522 -490 -435 585 -6 -522 432 238 -714 57 633 -300
7351 -300 -332 445 -269 -470 598 208 -683 160 391 -477 -83 631 -277 -516 379 132 -369 284 285 -590 -84
7372 -84 530 -212 -238 478 -117 -539 356 374 -454 -10 359 -327 -178 507 -31 -475 201 64 -377 217 425
7393 425 -484 -254 422 -64 -253 389 -20 -517 181 396 -306 23 299 -346 -291 448 102 -311 186 123 -253
7414 -253 97 426 -218 -218 244 -48 -247 309 102 -430 -54 305 -141 -52 273 -217 -382 326 183 -282 113
7435 113 173 -349 -91 392 -11 -234 98 -64 -170 285 223 -321 -115 253 -88 -128 234 19 -286 -15 179
7456 179 -13 63 72 -280 -127 320 15 -220 75 52 -187 7 296 -46 -148 -20 -94 -67 238 71 -289 -111
7478 -111 174 19 0 144 -65 -249 32 109 17 90 -28 -272 -88 284 162 -165 -35 21 -28 89 150 -21
7500 -21 -140 24 -90 -38 211 116 -304 -204 139 120 -14 9 -43 -123 98 109 0 -19 14 -177 -133 284 199 -254
7524 -254 -142 48 3 15 166 -124 -237 47 35 -49 127 102 -318 -210 216 99 -105 100 -71 -236 165 295
7546 295 -110 -122 101 -172 -94 232 157 -306 -71 90 -147 75 212 -227 -291 249 89 -92 140 55 -349 -52
7568 -52 309 -49 -134 203 -117 -286 353 332 -252 -92 165 -195 -41 406 30 -382 112 70 -209 138 258
7589 258 -354 -175 311 51 -144 252 -20 -483 94 380 -163 -119 163 -211 -252 425 111 -347 103 144 -318
7610 -318 73 499 -233 -371 249 71 -228 313 110 -509 -35 389 -139 -109 322 -167 -488 310 351 -276 7
7631 7 157 -395 -5 529 -130 -416 208 56 -396 221 360 -427 -172 279 -121 -102 476 -79 -539 202 398
7652 398 -295 49 327 -326 -215 455 9 -300 288 28 -500 222 590 -337 -321 308 -58 -198 415 48
7672 48 -503 120 243 -341 84 553 -350 -538 387 240 -305 145 87 -493 48 459 -277 -178 384 -183 -553
7693 -553 429 424 -439 -135 319 -251 34 485 -185 -477 381 170 -447 249 346 -504 -264 432 40 -179 320
7714 320 -231 -534 438 443 -471 -109 426 -266 -277 490 136 -429 191 64 -366 345 531 -571 -371 553 90
7735 90 -384 312 99 -537 33 320 -219 25 356 -481 -441 631 258 -534 -10 176 -318 48 478 -270
7755 -270 -286 297 -132 -341 550 255 -601 -154 443 -129 -121 382 -210 -430 335 227 -392 189 295 -526 -217
7776 -217 677 25 -443 198 -31 -341 355 291 -467 -134 449 -175 -304 523 32 -547 108 286 -196 189
7796 189 255 -530 -207 597 20 -463 279 90 -534 53 547 -130 -272 201 -251 -256 568 55 -596 87 363
7817 363 -322 -6 476 -193 -416 289 112 -201 299 36 -574 31 555 -139 -281 323 -72 -437 300 307 -319
7838 -319 -100 200 -314 -34 567 -80 -493 170 197 -245 144 248 -343 -208 325 -88 -121 404 -96 -478 165
7859 165 484 -125 -106 162 -223 -174 387 71 -342 123 43 -302 199 406 -246 -348 194 41 -151 267 57
7880 57 -382 19 366 -161 -27 272 -236 -281 323 210 -236 33 40 -289 17 352 -45 -246 28 -10 -122 273
7902 273 178 -354 -93 282 -97 -19 329 -34 -333 119 193 -77 99 21 -342 -80 358 71 -216 73 -7 -245
7924 -245 108 287 -77 -230 52 -86 14 329 28 -388 -30 209 -48 -9 132 -95 -172 158 116 -67 133
7945 133 -59 -290 79 375 0 -226 32 16 -80 178 156 -136 -70 22 -158 65 298 -9 -317 1 229 36
7967 36 35 4 -171 -67 128 -7 -75 101 -46 -330 24 296 16 -221 -54 51 48 133 -25 -155 47 19 -119
7990 -119 105 241 -32 -304 -4 187 129 54 -112 -184 45 199 -22 -98 118 -30 -129 59 275 37 -126 -104
8012 -104 -37 102 172 -109 -277 -31 108 -32 -23 65 -57 -110 13 111 1 101 -91 -246 26 267 -8 -184
8034 -184 15 -24 -70 62 122 -36 -92 -25 -52 101 231 -70 -275 72 184 -22 31 29 -96 -59 123 35 12 12 -67
8059 -67 -177 61 230 -51 -161 -29 -8 -68 113 83 -136 -53 -17 -65 55 129 -122 -226 54 206 19 69 15
8082 15 -210 -50 194 65 -116 -7 -94 -149 106 197 -87 -83 -8 -57 -6 223 -13 -197 -29 35 -6 39 173 -195
8106 -195 -133 97 80 -11 58 -11 -250 26 163 -4 -85 39 -60 -114 246 105 -175 -67 84 -84 38 229 -62
8129 -62 -186 -21 -12 -91 131 60 -270 -136 193 58 -86 4 -11 -136 36 91 -114 45 9 -192 -19 248 131
8152 131 -196 -39 103 -20 68 130 -159 -107 114 -31 -87 162 20 -249 -33 232 50 -20 4 -167 -111 224
8174 224 90 -177 47 57 -149 -87 238 27 -105 -9 -46 -23 188 115 -271 -36 223
8191B23
$$ Imaginary data points
##PAGE= N=2
##DATA TABLE= (X++(I..I)), XYDATA
0 0 0 0 0 0 0 0 0 2 -1 3 -8 8 -12 16 -17 24 -28 35 -43 52 -61 76 -89 104 -123 141 -166 192 -222 254 -289 329
32 329 -376 425 -479 539 -607 679 -757 844 -939 1043 -1158 1280 -1416 1563 -1725 1903
48 1903 -2096 2310 -2541 2803 -3090 3410 -3767 4172 -4634 5166 -5785 6514 -7392 8475
62 8475 -9840 11631 -14081 17656 -23372 33921 -59674 248579 127566 -492458 141494 239902
74 239902 -269494 17478 325242 -276317 -188960 360605 -40078 -315289 311229 154731
84 154731 -444244 17911 388406 -181718 -153596 260529 -122311 -237572 328572 99067
94 99067 -364060 106432 252022 -306321 -65725 383342 -103442 -287778 211116 53748
104 53748 -229593 197801 158337 -351553 -16848 336494 -151607 -179381 288069 -20792
114 -20792 -311917 170156 188731 -226883 32573 188187 -244896 -79550 345764 -56789
124 -56789 -285085 181072 102190 -255021 93977 230154 -212408 -96122 219948 -95058
134 -95058 -133097 257006 4908 -306347 112031 212814 -186792 -26548 203336 -148426
144 -148426 -146190 227232 19914 -189740 130904 71883 -240204 58738 247421 -147434
154 -147434 -137563 174657 -36962 -145607 182051 69958 -222211 40168 151029 -148546
164 -148546 -16990 208137 -107758 -183070 166889 68657 -152756 84439 89430 -193842 -3350
175 -3350 200428 -84215 -107036 148532 -31024 -164849 139641 118001 -167111 -11580 118323
186 118323 -110372 -32973 182398 -49732 -162533 106011 59539 -128203 68290 112293
196 112293 -151500 -57931 149869 -26989 -77317 112566 -15060 -151651 83331 115730
206 115730 -108947 -18097 97095 -89305 -60701 146963 9343 -124501 49789 41046 -100959
217 -100959 48817 114187 -100890 -71830 101340 -12364 -64195 97549 16555 -133215 26120
228 26120 96855 -59923 -11116 81058 -71028 -76723 105668 36145 -84612 30374 31045 -92036
240 -92036 19386 109798 -48276 -67779 57141 -11347 -54424 79703 40964 -97477 -9731
251 -9731 62821 -34675 -3922 72882 -42376 -79613 55862 41305 -44868 23390 27198 -75117
263 -75117 -11810 81771 -5478 -42597 28190 -14045 -49246 52081 52127 -52637 -23472 28427
275 28427 -25279 -3512 63649 -8451 -65021 10985 27257 -16501 22550 26604 -51363 -30638
287 -30638 43548 14935 -12521 18013 -13367 -46014 18979 46946 -9553 -17592 2472 -21103
299 -21103 -6906 41584 16421 -30685 -15417 703 -3148 20592 25000 -19033 -31651 1482
311 1482 15559 12337 12048 -6920 -27726 -11515 19380 23297 3754 -14714 -18544 -7468 11535
324 11535 24018 9318 -21277 -23087 2596 13329 13287 13254 -12929 -33985 331 30227 7869
337 7869 -3813 639 -23653 -18149 33240 26303 -20811 -11288 -205 -20787 11933 44820 -11499
350 -11499 -40077 8604 7148 -13098 31395 21980 -49800 -21623 37842 1738 -7490 31787 -17893
363 -17893 -53500 27596 43260 -25403 -2646 20875 -44095 -17932 65576 8549 -49455 13697
375 13697 8333 -42181 30126 56420 -46541 -38193 40850 -8144 -23957 57371 6136 -77234
387 -77234 11887 53870 -32317 -1566 50748 -47704 -52991 67065 25597 -53651 24205 20944
399 20944 -70847 12412 84035 -35789 -49811 49893 -13299 -53858 68622 40964 -85390
410 -85390 -5916 59272 -42521 -9967 80434 -35518 -81708 59339 36869 -61493 32130
421 32130 47105 -86291 -19591 95151 -18590 -55357 59032 -7339 -82096 59421 69477
432 69477 -78832 -17773 64958 -50960 -31992 97992 -7491 -95079 44779 42184 -71822
443 -71822 30614 77307 -84004 -50758 93318 -5507 -60947 69224 9882 -103959 38521
454 38521 86123 -70077 -20997 79260 -57518 -64634 105771 24872 -100524 31456 49097
465 49097 -82660 17951 100049 -69621 -66847 89690 -5374 -77545 80774 42518 -117308
476 -117308 5698 95107 -54645 -27496 87404 -48272 -85616 95489 40776 -99045 31274
487 31274 65395 -96249 -14041 117063 -35816 -77984 72289 -984 -84643 78580 64543
498 64543 -116227 -12206 100827 -54644 -46768 104385 -17246 -106688 65463 52513 -86072
509 -86072 33114 75770 -106509 -37506 130193 -18688 -94387 74563 22144 -103649 49929
520 49929 85582 -91044 -20146 91184 -65209 -58056 126530 6486 -131227 46715 76466
531 76466 -85034 7853 91552 -79100 -56730 106441 -12616 -85289 88778 34039 -132394
542 -132394 23862 118129 -67813 -50094 85337 -38316 -70857 101989 23980 -113131 42794
553 42794 72954 -103583 -7286 127002 -52374 -95264 83793 18471 -79662 67987 45011
564 45011 -119816 10359 113088 -69972 -55223 111338 -20735 -113034 76803 65605 -92015
575 -92015 15056 66048 -93007 -14458 128547 -43058 -102985 89127 31809 -107697 46632
586 46632 88237 -93127 -31052 89800 -44997 -45053 106956 -16524 -123418 68927 83023
597 83023 -96707 -6316 92433 -67094 -56221 100633 -3114 -80397 67562 22199 -110167
608 -110167 42963 108324 -86430 -57690 95205 -19469 -70957 83910 22856 -102849 34204
619 34204 67325 -83693 885 105788 -65488 -86732 97339 29119 -87055 43599 45155
630 45155 -95082 10086 98031 -60050 -50331 90578 -22144 -91671 80879 58811 -98641
641 -98641 -761 71454 -60352 -17480 95213 -37973 -83652 75455 29777 -85669 39716
652 39716 68720 -87670 -28905 90889 -22665 -51339 67853 -7804 -85901 57512 63792
663 63792 -80216 -8864 72539 -53035 -42833 88668 1557 -79213 40127 31584 -68374
674 -68374 28400 70873 -70434 -41364 78575 -11055 -55835 61997 16641 -84386 22916
685 22916 64158 -51989 -12170 62662 -44163 -51079 75888 18163 -70056 26820 35704 -63652
697 -63652 7547 72559 -40511 -45572 54506 -5419 -49727 53050 29356 -72732 1290
708 1290 55847 -34492 -15451 56962 -25717 -55529 49107 26662 -49619 18215 33481 -55195
720 -55195 -9035 64380 -15982 -40826 36559 -1016 -46102 37374 37158 -51608 -9645 41205
732 41205 -26559 -16801 52825 -8501 -53260 26520 26165 -34890 13558 33151 -43262 -19986 48480
745 48480 -3150 -29815 29377 1312 -45433 21151 39739 -30694 -13259 28251 -20744 -19133
757 -19133 42638 6196 -40330 10098 18004 -25516 9813 33344 -27362 -25812 28860 3860
769 3860 -19001 22055 6466 -36718 3746 30723 -11964 -8857 18267 -15497 -20595 27840 14413
782 14413 -23371 1420 9743 -19418 3280 28882 -9456 -22121 10312 2777 -10201 16750
794 16750 10005 -24326 -6830 16578 -2205 -1835 13549 -9323 -19761 11133 14819 -6384 -338
807 -338 2507 -13577 -2133 18063 3419 -10195 -1272 -2695 -5146 10358 10740 -8580 -10124 1149
821 1149 2013 3687 7613 -1740 -11138 -4158 5991 7040 2913 -2879 -7057 -4661 3485 9209 3919
836 3919 -6566 -7116 -733 1719 5728 7513 -5212 -12892 1043 8601 834 2556 2189 -12093 -6623
851 -6623 13538 6429 -6560 1607 -2563 -12347 7965 17158 -8353 -10559 6771 -4677 -6420 18145
865 18145 5752 -21324 -1463 12040 -7730 2540 17362 -13519 -19010 16718 8649 -13206
877 -13206 10034 7448 -25332 -1129 27328 -6469 -14285 14968 -5830 -20945 21184 17722 -24981
890 -24981 -3277 17601 -16904 -4991 31545 -7150 -30120 16878 12470 -22302 12568 21864
902 21864 -30645 -12638 32601 -5339 -19422 25024 -893 -35996 18271 29186 -27634 -5784
914 -5784 27502 -22480 -19028 40232 3540 -37473 16115 16908 -32556 9953 36922 -29943 -23490
927 -23490 35947 -4171 -28380 32575 11572 -46671 8563 37722 -26790 -10576 37042 -20426
939 -20426 -33342 40236 14088 -40820 15054 24908 -40626 -831 48774 -21878 -33153 36218
951 36218 548 -38360 32192 26007 -49093 -1739 42472 -26826 -17764 47002 -12332 -46949
963 -46949 35257 23932 -43409 12678 35556 -44461 -14713 55294 -12871 -40098 37812 7351
975 7351 -49449 26244 39930 -46240 -10843 45799 -26336 -27640 53484 36 -56134 27427
987 27427 32815 -45044 4990 46288 -38393 -28314 52346 -4041 -42758 37861 16011 -57486
999 -57486 15033 51519 -39082 -21654 47985 -18149 -38883 48405 13952 -54631 19226 35722
1011 35722 -47427 -2076 57507 -30374 -42342 48437 6780 -46855 32400 26749 -56471 3929
1023 3929 53125 -34876 -24944 54130 -13452 -52356 43833 28240 -53163 9908 39695 -44747
1035 -44747 -10443 59525 -22388 -46212 46951 11410 -54768 27336 41701 -51655 -11633 50802
1047 50802 -24799 -27283 51992 -6908 -56364 37512 35051 -53185 2806 49260 -38440 -27069
1059 -27069 54538 -5779 -43980 37337 12965 -54676 23356 48737 -49230 -20830 54666 -17310
1071 -17310 -39214 47369 9615 -54120 23406 34293 -47400 2471 53254 -38044 -37026 56443
1083 56443 4391 -50806 31080 24996 -52778 9051 49226 -38426 -21484 52454 -17333 -46402
1095 -46402 48435 22284 -57281 11507 41266 -40586 -8593 52253 -25558 -39479 48004 7287
1107 7287 -51230 29380 35002 -53276 -6362 52761 -24488 -28711 45235 -7047 -46631 38396
1119 38396 26878 -52479 6840 45354 -39182 -21236 54613 -9534 -44974 35350 14657 -46540
1131 -46540 21829 37862 -47894 -12126 52440 -20971 -35229 46482 5338 -51830 24637 33686
1143 33686 -42795 391 43118 -34157 -25583 52080 -3058 -46733 31506 21916 -47808 9990
1155 9990 43545 -35370 -19911 44334 -13505 -35150 41226 12332 -50162 15277 36922 -36677
1167 -36677 -8230 43721 -22112 -32298 40893 6149 -41352 23733 24865 -43965 497 44635
1179 44635 -24735 -25499 38574 -4596 -36893 31289 19860 -42534 6578 35143 -31228 -13191
1191 -13191 43310 -12593 -36406 31739 13251 -37505 15442 27953 -36445 -7372 40144 -16661
1203 -16661 -26025 34449 1462 -38233 21992 25818 -34623 -1861 32639 -22656 -17889 36770
1215 36770 -3051 -33831 22286 15794 -32875 8024 30088 -26876 -14939 32958 -6944 -25193
1227 -25193 26087 8238 -33482 10870 25821 -24616 -6559 28416 -14698 -20875 28436 4895
1239 4895 -28778 13475 16857 -26617 715 28089 -16763 -17331 24625 -1286 -22543 18856 11961
1252 11961 -26839 3203 22442 -16856 -8403 23976 -7782 -21024 19269 9025 -21796 6856
1264 6856 15657 -19373 -4378 22354 -7916 -15212 16451 1613 -18581 11451 13327 -18206 -2438
1277 -2438 16842 -9332 -8944 16991 -1158 -16773 9541 8907 -13642 2467 12341 -11973 -6591
1290 -6591 15014 -1837 -11236 9560 3321 -13313 4650 11291 -9342 -4011 10022 -4548 -6879
1303 -6879 10436 1756 -10662 3774 6008 -7866 582 8769 -5798 -6191 7518 972 -6010 4413
1317 4413 2768 -7121 552 6241 -2921 -2343 4292 -1903 -4172 4396 2687 -4272 -284 2432 -2271
1332 -2271 -618 3403 -390 -2927 441 1034 -549 754 908 -1262 -1404 855 1550 -89 -866 383
1348 383 -255 -1549 1209 2699 -1899 -2350 2284 305 -2468 2445 1891 -4414 -367 4308 -2153 -1949
1364 -1949 4711 -1406 -5390 4591 3521 -6089 857 5533 -5601 -2762 8043 -1446 -7074 5618
1378 5618 2430 -8161 3415 7221 -8218 -2740 9641 -3836 -7083 9591 1514 -11436 5085
1391 5085 8280 -9917 -954 11122 -6970 -7553 12054 178 -12110 7926 6640 -13531 1734
1404 1734 13342 -9922 -7102 14360 -2694 -12880 11817 5920 -15885 4221 13014 -13120 -4076
1417 -4076 16770 -6956 -13181 15424 3316 -17687 8495 12342 -17209 -1656 18533 -10273
1429 -10273 -11669 18199 -549 -18466 12992 10676 -19996 2372 18761 -14834 -9375 21417
1441 21417 -4287 -18978 16427 8104 -21950 6332 17978 -18393 -6322 22768 -8692 -17305
1453 -17305 20413 4355 -23577 11013 16890 -21961 -2558 23955 -13070 -15567 23416 139
1465 139 -23838 15624 13731 -25179 2492 23822 -18375 -12075 26616 -5145 -23652 20556 10454
1478 10454 -27314 7689 22546 -22695 -7783 28140 -10505 -21349 24646 5059 -28617 13522
1490 13522 20338 -26736 -3231 28562 -15611 -18469 27883 467 -28290 17800 16413 -28535
1502 -28535 2673 27472 -20784 -14633 30175 -4712 -26799 22369 12069 -30761 7581 25860
1514 25860 -24128 -9719 30448 -10920 -23921 26933 7090 -31219 13202 22257 -28042 -3588
1526 -3588 31177 -16442 -20681 29599 1067 -30200 19262 18070 -31435 1688 29730 -20955
1538 -20955 -15193 31305 -6014 -28456 24501 13180 -32530 8117 26988 -26076 -10233 32889
1550 32889 -10382 -25300 26364 6740 -31339 14675 22824 -29736 -4554 31929 -16031 -20969
1562 -20969 29993 1654 -31201 17855 18793 -29374 1966 28617 -21791 -15631 32211 -4163
1574 -4163 -28674 22487 13025 -31552 7634 26884 -24543 -10448 30545 -10971 -23660 27656
1586 27656 6804 -32265 12946 22766 -27201 -3437 30207 -16640 -20041 29177 908 -28860
1598 -28860 19025 16479 -30936 2318 29250 -19913 -15008 28812 -5560 -25697 23124 11631
1610 11631 -30118 7830 24090 -24263 -8116 30742 -10325 -23969 24055 6941 -27444 12765
1622 12765 19164 -26537 -3088 28173 -14856 -17598 26853 -264 -27948 17267 17100 -26148 1273
1635 1273 23950 -18964 -11527 28013 -5601 -24238 20589 9646 -27322 8786 22745 -22724
1647 -22724 -8611 26089 -9486 -18336 23524 3020 -27100 13238 18443 -23825 -1596 24814
1659 24814 -15480 -15675 25139 121 -23302 15737 11382 -25188 4787 23637 -18426 -11779 23979
1672 23979 -5324 -19884 19644 7937 -24703 7142 18525 -19427 -4262 24023 -11234 -18441
1684 -18441 21384 4907 -22119 10873 13963 -21767 -601 22372 -12764 -12719 20933 -2652 -20696
1697 -20696 16425 11933 -22350 2109 18593 -15336 -7288 22023 -6232 -18523 16581 6425
1709 6425 -20053 8450 15489 -19312 -4953 21045 -7826 -13617 17494 914 -19852 11171
1721 11171 13516 -17721 -943 16981 -12016 -9704 19433 -929 -17755 11164 8341 -17112
1733 -17112 4263 16139 -13935 -8352 16978 -3313 -13018 13714 4273 -17767 5387 13633 -12557
1746 -12557 -3134 14992 -8186 -11459 15309 3226 -15036 6708 8528 -14016 685 15080
1758 15080 -8684 -9172 12531 -1207 -11580 10717 6279 -14822 1283 11914 -8612 -4044 12836
1771 12836 -4515 -11542 10075 5057 -10957 3939 7622 -11029 -2077 12620 -3944 -8287 8504
1784 8504 469 -10139 6563 7852 -9762 -2039 8521 -4836 -4112 9732 -881 -9737 4871
1797 4871 5083 -6934 1760 6938 -7259 -4509 8601 39 -5901 4682 1257 -7705 2631 7028
1811 7028 -4636 -2690 4830 -2886 -3644 6662 1737 -6576 902 3404 -3750 651 5323 -3245 -4558
1826 -4558 3464 1389 -2418 2519 1091 -4891 -254 4390 -508 -1515 1659 -1409 -2742 2699 2910
1841 2910 -1942 -1482 316 -906 362 2616 78 -2542 -899 715 590 1118 818 -1398 -2144 215
1857 215 2356 934 -952 -605 -608 -1070 1494 2661 -1045 -2592 329 417 -373 2347 967 -3794 -1158
1874 -1158 3002 -107 -601 2488 -1646 -4225 2686 3715 -2487 -453 1916 -3461 -1305 5617 300
1889 300 -4562 1608 943 -3993 2886 5009 -4871 -3560 4546 -657 -2808 5326 784 -7391 1393
1904 1393 5473 -3494 -423 5124 -4643 -5031 7189 2260 -6198 2627 2790 -7257 1010 8603 -4040
1919 -4040 -5367 5604 -1015 -5620 7019 3837 -9307 139 6940 -5056 -1353 8859 -3963
1932 -3963 -8727 7205 3884 -7472 3523 5282 -9638 -1550 10777 -3173 -6442 7474 -883
1945 -883 -9494 7380 7486 -9989 -1316 8371 -6371 -3919 11694 -1443 -11256 6140 5067 -9064
1959 -9064 3674 8965 -10453 -5184 11996 -1809 -8156 9053 1436 -12880 5134 10678 -9238
1972 -9238 -2638 10027 -6909 -7314 13280 1775 -12969 5447 6638 -11430 2161 12842 -9264
1985 -9264 -8386 11968 -872 -9936 10486 4556 -15281 2451 12546 -8853 -3822 12539 -6369
1998 -6369 -11365 13011 4877 -13563 4900 8628 -13401 -1037 15978 -6468 -10953 11329 429
2011 429 -12237 10211 8527 -15657 -658 13808 -8532 -6200 15278 -3083 -15362 10190 8132
2024 8132 -12963 3391 10766 -13584 -4575 17185 -3975 -12697 11940 2753 -15847 7607 13191
2037 13191 -13524 -3997 13466 -7781 -7961 16521 -290 -17498 8573 10177 -14176 1510 14723
2050 14723 -11839 -9310 15746 -850 -12487 11675 4305 -18079 5126 16396 -12031 -6954
2062 -6954 14712 -5464 -12017 14660 4598 -16337 5466 10345 -14459 -259 18139 -9215
2074 -9215 -14066 14280 3400 -13799 8779 8368 -16306 444 15669 -9675 -7335 16202 -3931
2087 -3931 -16874 12702 10497 -15395 745 11502 -11788 -3477 17053 -5823 -13707 13124 3429
2100 3429 -16310 8236 13764 -15424 -5668 15090 -5155 -8007 14080 -1772 -16499 10344 10688
2113 10688 -15075 466 14686 -11386 -9432 16295 653 -13128 8672 4049 -14885 6293
2125 6293 14783 -13369 -7489 15196 -3584 -11709 13064 4740 -15764 3790 10352 -11029 -51
2138 -51 14334 -10030 -11890 15295 3753 -14080 6493 7803 -13876 434 14258 -7750 -6940
2151 -6940 12280 -3934 -12391 13049 7838 -15826 383 11596 -9047 -3373 13715 -5066 -11743
2164 -11743 10568 3314 -11886 7230 9178 -14554 -3304 14881 -3946 -8422 10131 -820
2176 -820 -12310 8567 8644 -11825 -195 10266 -9236 -5460 14467 -642 -12744 6355 5010
2189 5010 -10088 4450 9973 -10896 -5307 11872 -2480 -7880 10177 1760 -13342 4094 9881
2202 9881 -7943 -1457 8986 -7484 -6822 12208 1654 -10919 4996 4974 -10280 2081 11282
2215 11282 -6987 -6544 8497 -1724 -6881 9416 3182 -12174 1648 8867 -6515 -1638 9423
2228 9423 -5265 -8618 8665 3520 -7825 3919 4253 -9825 76 10917 -3974 -6301 6769
2241 6769 -1064 -7643 7271 5751 -9141 -932 6557 -5041 -1812 9142 -2716 -8909 5449
2254 5449 3837 -6230 3306 5327 -8395 -2752 8856 -1184 -4862 5542 -728 -7922 4854
2267 4854 6621 -6092 -1588 4927 -4699 -2677 8539 24 -7753 2667 2922 -5091 2772 6097
2281 6097 -6037 -4316 5919 -14 -3327 5020 352 -7600 1865 6062 -3266 -1200 4112 -3851
2295 -3851 -4074 6268 2425 -5114 829 1767 -4437 1359 6086 -2868 -4370 3007 51 -2530 4337
2310 4337 2011 -5954 -913 4069 -1012 -403 3382 -2563 -4431 3249 2934 -2148 619 883 -4022 -176
2326 -176 5022 25 -2883 844 -611 -2078 2999 2869 -2973 -2007 1227 -521 472 3059 -951 -3738
2342 -3738 290 1874 52 963 622 -2835 -1607 2413 1802 -369 -362 -1307 -1631 1262 2542 95 -1542
2359 -1542 -1181 -706 639 2168 869 -1717 -1951 -134 1387 1395 381 -936 -1787 -728 1624 2078 -170
2376 -170 -1475 -1048 -652 948 2485 115 -2540 -908 683 204 1542 1429 -2422 -2496 1593 1609 -85
2393 -85 1039 -641 -3330 426 3500 -50 -1233 655 -1897 -1837 3580 2355 -3035 -1014 1067 -1845
2409 -1845 708 4106 -1417 -4046 1295 1173 -1446 2606 1887 -4747 -1527 4185 -53 -1355 2832
2424 2832 -1445 -4729 2860 4069 -2813 -692 2010 -3636 -1260 5882 227 -4756 1471 1155 -3669
2439 -3669 2857 4801 -4696 -3379 4100 -392 -2131 4760 50 -6668 1553 4814 -2978 -144 4013
2454 4013 -4376 -4092 6267 1980 -4904 1954 1698 -5758 1492 6984 -3373 -4211 4115 -1029 -3897
2469 -3897 5858 2717 -7386 -174 5063 -3478 -659 6414 -3410 -6652 5217 3195 -4859 2551
2483 2551 3118 -7123 -817 8005 -2078 -4400 4844 -1159 -6443 5678 5424 -6945 -1295 4987
2497 4987 -4288 -1632 8116 -1811 -7711 4286 3036 -5729 3267 5607 -7597 -3306 7828 -998
2511 -998 -4336 5808 -503 -8419 4381 6823 -6180 -1302 5860 -5122 -4118 8907 885 -7913
2525 -7913 3155 3017 -6827 2898 8124 -6733 -5376 7431 -435 -5428 6629 1973 -9400 1768
2539 1768 7128 -5209 -1059 7384 -5424 -7035 8938 3352 -8066 2448 4186 -7661 673
2552 673 9139 -4646 -5492 6934 -1375 -7181 7818 5020 -10307 -834 7751 -4327 -2091 8107
2566 8107 -3648 -8136 7243 3606 -7815 3583 6136 -9403 -2707 10656 -1562 -6545 5653
2579 5653 -282 -7891 6446 6535 -9249 -1437 8162 -5339 -4610 10149 174 -9908 3848 4619
2593 4619 -6548 2991 7014 -8939 -4395 10533 -910 -7602 6736 2320 -9957 2732 8311
2606 8311 -5853 -1986 6720 -5738 -5211 10932 1656 -10847 3193 6133 -7578 339 9027 -5339
2620 -5339 -5985 7258 -709 -6142 7937 3068 -11686 1023 10134 -4947 -4183 7544 -2888 -7365
2634 -7365 7356 3514 -7941 2935 5222 -9097 -906 11518 -3139 -8658 6041 1867 -6856
2647 -6856 5217 5233 -8919 -985 7954 -4770 -3693 9495 -1401 -10439 5076 6379 -6409 771
2661 771 5454 -7260 -2587 9746 -1650 -7281 6174 1770 -9006 3691 8347 -6550 -3691
2674 -3691 6181 -3027 -3623 8427 -28 -9494 3777 5797 -6630 345 7796 -5497 -5968 7385
2688 7385 1242 -5499 4584 1723 -8615 2236 8461 -5066 -3984 6382 -2261 -6014 6905
2701 6905 3423 -7597 811 4488 -5361 217 7996 -4008 -6727 5885 2006 -5488 3867 3780 -7588
2716 -7588 -901 7107 -2585 -3018 5539 -2106 -6728 5498 4667 -6020 -60 4187 -4973 -1368 7486
2731 7486 -1392 -5984 3682 1361 -4990 3672 4894 -6225 -2678 5552 -1318 -2604 5169 -640 -6686
2746 -6686 2905 4569 -3935 130 4024 -4612 -3056 6442 902 -4734 2154 1209 -4847 2239 5454
2761 5454 -3824 -3063 3733 -1300 -2631 5078 1145 -6038 588 3718 -2577 238 4070 -3407 -3879
2776 -3879 4282 1684 -3083 2046 1014 -4917 675 5219 -1720 -2566 2494 -1360 -2889 4121 2352
2791 2352 -4215 -536 2207 -2226 336 4229 -1893 -4011 2248 1474 -1901 2043 1621 -4198 -1102
2806 -1102 3799 -115 -1370 1839 -1298 -3216 2573 2880 -2181 -672 1103 -2274 -396 3902 31
2821 31 -3151 369 613 -1235 1934 2170 -2768 -1974 1856 322 -278 1989 -708 -3195 646 2463
2837 2463 -364 -95 525 -2102 -1132 2636 1285 -1370 -275 -431 -1303 1335 2356 -973 -1821 65
2853 65 -42 239 1854 316 -2211 -899 1038 670 730 534 -1501 -1583 850 1483 478 -217 -861 -1281
2871 -1281 250 1712 918 -761 -1255 -664 344 1242 980 -515 -1468 -888 722 1309 494 -385 -1196 -1057
2889 -1057 719 1828 306 -950 -635 -707 45 1869 992 -1620 -1223 321 233 873 1418 -1007 -2246
2906 -2246 409 1315 98 787 231 -2346 -869 2439 865 -933 296 -719 -1844 1592 2520 -1308
2922 -1308 -1392 629 -966 -362 2978 291 -3104 -41 1380 -954 1014 2161 -2397 -2501 2276 1053
2938 1053 -1172 1540 148 -3521 488 3423 -892 -1257 1533 -1648 -2182 3431 1916 -3148 -293
2953 -293 1431 -2189 470 3912 -1615 -3354 1908 771 -1928 2474 1707 -4327 -988 3684 -668
2968 -668 -1309 2792 -1283 -3942 2727 3014 -2770 -59 2064 -3302 -1009 4996 -281 -3883 1793 788
2984 788 -3257 2379 3658 -3930 -2236 3537 -879 -1794 4048 -82 -5218 1630 3535 -2705 125
2999 125 3292 -3606 -2854 5019 1032 -3835 1911 1108 -4513 1491 5026 -2991 -2753 3373 -1352 -2874
3015 -2874 4756 1567 -5674 442 3747 -2966 -232 4576 -2867 -4282 4181 1534 -3571 2489 2090
3030 2090 -5676 -195 5911 -1908 -3134 3606 -1041 -4370 4239 3250 -4977 -156 3538 -3611 -989
3045 -989 6135 -1423 -5548 3113 2139 -3839 2447 3408 -5475 -1637 5540 -1438 -3026 4520 -329 -5988
3061 -5988 2990 4527 -3996 -538 3503 -3888 -1975 6409 -267 -5585 2902 2156 -4936 1792 5241
3076 5241 -4262 -3136 4399 -955 -2715 5045 314 -6794 2109 5166 -3966 -1062 4858 -3128 -4108
3091 -4108 5257 1452 -4464 2450 1741 -5853 1388 6687 -3643 -4295 4600 -257 -4237 4356 2457
3106 2457 -5889 479 4127 -3833 -458 6171 -2992 -5887 4792 2927 -4611 1732 2894 -5414 -295
3121 -295 5934 -2464 -3358 4783 -953 -5846 4355 4657 -5503 -1218 4089 -2998 -1208 5855 -1677
3136 -1677 -5618 4019 2296 -5197 2224 4961 -5377 -3059 5655 -348 -3304 3960 -364 -5877 3368
3151 3368 4853 -5062 -1057 5075 -3362 -3686 6035 1279 -5457 1817 2195 -4492 1933 5350 -4794
3166 -4794 -3641 5498 -246 -4317 4252 1996 -6229 663 4817 -3082 -737 4590 -3389 -4363 5676
3181 5676 2147 -5420 1430 3081 -4765 -124 5818 -2384 -3685 3862 -474 -4169 4439 3106 -6181
3196 -6181 -725 4889 -2379 -1745 4869 -1472 -5039 3635 2578 -4209 1576 3407 -5102 -1758 6095
3211 6095 -601 -4157 2999 510 -4510 2894 4007 -4386 -1366 3975 -2442 -2262 5312 139 -5539
3226 -5539 1878 3026 -3251 910 3766 -3893 -2673 4638 66 -3347 2988 844 -4981 1369 4560
3241 4560 -2713 -1731 3217 -1906 -2776 4414 1392 -4465 812 2393 -3158 408 4368 -2485 -3492
3256 -3492 3151 738 -2697 2635 1629 -4559 -231 3976 -1392 -1576 2888 -1375 -3414 3082 2351
3271 2351 -3162 112 2045 -2859 -497 4181 -778 -3317 1813 694 -2453 2004 2395 -3392 -1351
3286 -1351 2854 -724 -1128 2822 -582 -3527 1572 2444 -1858 121 1770 -2465 -1326 3267 441
3301 441 -2313 969 293 -2335 1338 2733 -1972 -1580 1672 -582 -958 2528 440 -2997 135 1753
3317 1753 -910 234 1662 -1749 -1879 2002 887 -1230 748 282 -2253 307 2509 -463 -1240 759
3333 759 -602 -1042 1959 1067 -1848 -506 762 -698 359 1842 -856 -1936 676 790 -332 753
3349 753 386 -1750 -487 1483 364 -340 338 -742 -1130 1078 1356 -578 -608 -7 -668 190 1485 170
3367 170 -1224 -426 120 124 846 488 -959 -962 341 622 407 348 -470 -998 -36 964 608 -122 -627 -620 -86
3388 -86 657 745 -24 -850 -583 174 601 602 71 -768 -838 368 903 273 -80 -319 -827 -91 1183 540 -642
3409 -642 -390 -230 -250 818 1061 -649 -1013 205 109 49 1143 56 -1585 -226 1086 76 129 686
3427 686 -1074 -1153 1227 915 -655 117 27 -1404 226 1970 -290 -1310 502 -173 -886 1468 1191
3444 1191 -1768 -672 1102 -446 -35 1708 -766 -2133 1020 1210 -943 579 930 -2080 -822 2369
3460 2369 162 -1370 962 -247 -1969 1348 2093 -1624 -917 1353 -1083 -779 2594 142 -2699 573
3476 573 1303 -1449 626 2044 -2035 -1793 2269 393 -1559 1574 366 -2956 641 2719 -1395 -1074
3492 -1074 1872 -1204 -1992 2734 1302 -2735 316 1516 -2096 151 3176 -1491 -2539 2065 498
3507 498 -2088 1964 1524 -3337 -410 2962 -1138 -1158 2525 -979 -2986 2349 2013 -2647 260 1977
3523 1977 -2594 -743 3675 -580 -2906 1918 622 -2767 1756 2658 -3103 -1279 2944 -1079 -1587
3538 -1587 3157 -126 -3810 1607 2575 -2586 104 2813 -2583 -2130 3709 465 -2942 1774 1038 -3422
3554 -3422 1125 3577 -2622 -1853 3032 -841 -2501 3297 1203 -3901 660 2576 -2446 -127 3413
3569 3413 -2229 -3050 3367 998 -3119 1711 1782 -3750 -25 3831 -1724 -1916 2934 -793 -3202 3122
3585 3122 2256 -3805 -85 2811 -2344 -855 3773 -1148 -3352 2572 1085 -3160 1803 2706 -3788
3600 -3788 -1265 3907 -853 -2251 2807 -124 -3635 2273 2652 -3307 -130 3175 -2588 -1980 4145
3615 4145 217 -3766 1657 1505 -2965 1277 3137 -3249 -1645 3623 -851 -2669 3226 872 -4127
3630 -4127 908 3048 -2286 -427 2947 -2341 -2277 3816 599 -3572 1655 1924 -3452 252 3690 -1961
3646 -1961 -2055 2807 -630 -2559 3171 1451 -4161 389 3235 -2306 -1044 3379 -1314 -3016 2846
3661 2846 1118 -2943 1524 2043 -3709 -486 4155 -1266 -2600 2712 77 -3037 2250 2180 -3373 -76
3677 -76 2832 -2344 -1266 3846 -583 -3699 2027 1747 -2798 919 2465 -2959 -1174 3495 -768 -2300
3693 -2300 2804 322 -3686 1567 2963 -2561 -795 2602 -1696 -1709 3465 116 -3276 1527 1663 -2968
3709 -2968 609 3186 -2335 -2075 2934 -102 -2346 2436 898 -3581 703 2972 -2174 -948 2865
3724 2865 -1417 -2496 2865 1179 -2885 948 1752 -2801 -25 3347 -1523 -2357 2498 119 -2511
3739 -2511 2051 1662 -3142 -200 2582 -1564 -1025 2769 -852 -2775 2123 1559 -2523 561 1989 -2478
3755 -2478 -844 3059 -602 -2126 1907 299 -2523 1513 2157 -2512 -811 2314 -1120 -1342 2625
3770 2625 68 -2805 1065 1609 -1944 375 2135 -1957 -1505 2536 84 -1976 1498 718 -2544 612
3786 612 2398 -1553 -1051 1863 -737 -1565 2115 739 -2319 452 1432 -1621 -43 2167 -1180 -1733
3802 -1733 1692 446 -1508 1103 978 -2162 -159 1970 -768 -866 1512 -451 -1682 1479 1153 -1655
3818 -1655 15 1123 -1262 -376 1878 -372 -1625 903 500 -1194 811 1135 -1523 -604 1433 -337
3834 -337 -748 1159 -54 -1593 657 1189 -914 -123 918 -915 -659 1388 279 -1075 421 264
3850 264 -958 483 1176 -787 -795 745 -48 -550 809 257 -1139 27 743 -329 2 582 -622 -693
3868 -693 727 484 -492 109 187 -621 -7 851 -44 -518 152 -63 -224 457 394 -537 -321 214 -57 41 385
3889 385 -105 -585 36 361 117 11 -12 -305 -168 271 376 -46 -259 -118 -112 121 326 83 -388 -333 212
3910 212 153 25 147 -63 -544 -9 465 75 -206 94 -249 -280 501 335 -411 -225 227 -330 3 719 -83
3931 -83 -758 164 319 -367 214 461 -647 -430 744 41 -445 578 -26 -914 372 876 -605 -302 641
3950 641 -455 -558 1008 281 -975 194 514 -829 182 1047 -695 -849 919 52 -857 866 529
3967 529 -1319 37 1126 -545 -422 1000 -473 -1160 1108 611 -1174 238 878 -1170 -200 1545
3983 1545 -459 -1200 1053 215 -1256 892 1016 -1482 -354 1370 -695 -778 1500 -142 -1682 991
3999 991 1015 -1411 192 1370 -1292 -782 1818 -119 -1494 1149 492 -1716 696 1572 -1494 -623 1724
4016 1724 -673 -1313 1730 371 -2109 703 1332 -1525 -60 1859 -1232 -1241 1918 137 -1763 1250
4032 1250 935 -2194 316 2034 -1286 -978 1919 -513 -1758 1760 873 -2232 503 1677 -1750 -429
4048 -429 2347 -894 -1813 1916 540 -2134 1084 1520 -2205 -315 2355 -1108 -1410 2117 -83 -2376
4064 -2376 1500 1421 -2266 83 2088 -1699 -1089 2556 -327 -2275 1639 979 -2321 752 2021 -2057
4080 -2057 -793 2489 -781 -1794 2198 499 -2679 1009 1959 -2105 -408 2357 -1347 -1593 2440
4095 2440 172 -2464 1449 1358 -2471 185 2479 -1669 -1408 2424 -382 -2213 1976 1008 -2680 561
4111 561 2241 -1964 -811 2613 -914 -2132 2212 791 -2575 1045 1824 -2393 -336 2710 -1214
4126 -1214 -1777 2242 163 -2505 1532 1570 -2540 30 2369 -1689 -1235 2637 -402 -2377 1746 1220
4142 1220 -2498 583 2126 -2036 -962 2594 -716 -1927 2137 504 -2647 1104 1993 -2249 -512
4157 -512 2412 -1182 -1641 2330 162 -2440 1355 1443 -2382 204 2386 -1643 -1394 2501 -246 -2200
4173 -2200 1758 1084 -2500 512 2139 -1861 -849 2400 -789 -1942 2063 711 -2424 924 1790
4188 1790 -2174 -324 2375 -1156 -1573 2201 136 -2206 1369 1309 -2212 55 2107 -1462 -1046 2329
4204 2329 -426 -2090 1697 956 -2200 514 1867 -1692 -760 2209 -697 -1684 1802 379 -2185 992
4220 992 1565 -1944 -307 2118 -1088 -1393 2030 20 -2058 1277 1185 -1987 182 1889 -1432 -966
4236 -966 2074 -398 -1863 1484 698 -2096 538 1645 -1574 -616 1973 -715 -1527 1743 389 -1861
4252 -1861 841 1314 -1687 -155 1842 -1000 -1181 1797 46 -1798 1172 1045 -1751 169 1662 -1186
4268 -1186 -770 1763 -396 -1544 1358 652 -1749 405 1455 -1425 -528 1683 -589 -1266 1431 327
4284 327 -1668 735 1165 -1473 -182 1578 -881 -1017 1533 83 -1514 956 840 -1498 160 1375
4300 1375 -944 -643 1414 -304 -1205 1089 578 -1428 365 1134 -1084 -395 1436 -495 -1040 1115
4316 1115 257 -1208 596 816 -1238 -161 1212 -682 -740 1117 -30 -1194 731 676 -1117 -20
4332 -20 1012 -800 -488 1129 -155 -960 706 448 -1039 325 843 -847 -365 1008 -208 -763 781
4349 781 216 -988 339 690 -745 -155 850 -453 -503 782 152 -733 365 435 -703 94 717 -376
4367 -376 -455 600 20 -544 447 328 -624 -13 543 -352 -159 533 -150 -542 364 237 -410 89 333 -371
4387 -371 -133 488 -93 -293 208 85 -301 149 291 -281 -209 255 -16 -204 214 42 -341 30 188 -62
4407 -62 -40 127 -67 -187 140 181 -58 -123 48 3 -101 116 132 -152 -179 107 97 -15 125 -4 -290 3 251
4430 251 3 -122 171 -104 -293 216 241 -235 -48 226 -215 -112 448 -19 -432 150 231 -278 107 383 -394
4451 -394 -267 483 -2 -420 357 74 -603 99 604 -365 -244 500 -235 -495 613 331 -656 135 416 -578
4471 -578 -15 785 -335 -638 600 232 -603 447 422 -833 -130 819 -359 -365 710 -196 -903 597 552
4490 552 -825 21 715 -689 -332 1057 -89 -829 620 271 -875 429 829 -930 -370 1002 -282
4507 -282 -670 988 80 -1230 487 834 -888 -68 1002 -718 -699 1183 101 -1086 596 514 -1144
4524 -1144 274 1258 -842 -654 1082 -253 -989 1038 419 -1354 205 980 -942 -190 1276 -612
4540 -612 -1072 1209 401 -1215 591 832 -1293 -169 1458 -604 -833 1156 -155 -1265 1057 811
4556 811 -1456 -24 1173 -942 -461 1515 -322 -1472 1061 636 -1392 539 1163 -1375 -566 1593
4572 1593 -455 -1137 1252 129 -1704 812 1258 -1459 -270 1458 -903 -908 1660 46 -1617 915
4588 915 869 -1527 402 1588 -1292 -992 1656 -88 -1331 1198 513 -1852 399 1546 -1248 -465
4604 -465 1598 -762 -1387 1616 521 -1764 608 1092 -1627 -88 1919 -941 -1339 1551 107 -1600
4620 -1600 1185 1054 -1872 -92 1701 -1030 -705 1764 -480 -1788 1395 972 -1787 365 1434 -1571
4636 -1571 -656 1983 -492 -1457 1350 297 -1824 994 1486 -1841 -474 1806 -800 -1083 1794 10
4652 10 -1888 943 1110 -1480 253 1628 -1443 -1062 1956 4 -1689 1159 675 -1901 480 1661
4668 1661 -1363 -684 1685 -723 -1388 1809 539 -2041 396 1383 -1463 -110 1796 -1044 -1380 1643
4684 1643 315 -1670 1085 989 -2011 -77 1909 -858 -966 1516 -412 -1579 1468 997 -1820 206
4700 206 1434 -1354 -508 2006 -427 -1634 1164 471 -1479 884 1234 -1743 -456 1779 -585 -1098
4716 -1098 1500 1 -1865 878 1274 -1338 -116 1299 -1195 -813 1903 -23 -1612 891 708 -1545
4732 -1545 471 1575 -1203 -922 1453 -351 -1049 1425 391 -1844 441 1332 -1125 -220 1425 -927
4748 -927 -1130 1480 415 -1390 609 697 -1512 84 1617 -775 -998 1137 -176 -1145 1201 711 -1519
4765 -1519 12 1130 -829 -310 1449 -528 -1320 1090 618 -1087 534 855 -1328 -332 1431 -371
4781 -371 -903 958 -123 -1211 853 991 -1178 -225 997 -728 -442 1363 -73 -1303 571 515 -953
4798 -953 457 952 -1163 -616 1258 -47 -802 844 110 -1269 394 1035 -712 -255 771 -705 -593
4815 -593 1270 235 -1091 282 490 -861 248 1068 -725 -730 751 -29 -546 797 273 -1185 55
4832 55 919 -440 -210 763 -501 -828 871 499 -706 156 362 -843 0 1111 -261 -699 442 7
4850 7 -578 641 544 -883 -246 583 -247 -156 711 -210 -918 378 518 -369 136 320 -690 -317 844 97
4870 97 -505 251 -63 -543 399 676 -456 -320 322 -179 -162 604 62 -723 15 307 -131 199 349 -485
4890 -485 -471 411 295 -187 120 0 -472 94 528 -16 -201 -37 -267 -191 457 327 -419 -273 76 -35 142
4911 142 400 -98 -414 -75 195 124 175 38 -405 -258 314 290 -21 -152 -199 -196 90 340 172 -226 -265 -97
4933 -97 98 277 140 -274 -383 14 278 135 51 -33 -352 -160 384 296 -111 -151 -148 -287 214 524 -74 -452
4955 -452 -10 0 -30 349 216 -533 -228 309 -9 15 354 -251 -679 275 524 -165 -31 160 -480 -190 702
4976 702 131 -459 87 -20 -468 373 690 -449 -528 382 11 -175 601 131 -823 38 547 -283 93 538
4996 538 -595 -639 736 445 -528 158 206 -795 96 996 -176 -583 417 -144 -573 832 557 -942
5014 -942 -220 674 -358 -62 964 -322 -965 485 520 -531 383 479 -1070 -319 1142 -46 -663 588
5032 588 -103 -996 660 935 -783 -272 706 -560 -423 1236 36 -1238 308 535 -708 340 913
5049 913 -937 -703 1058 34 -740 834 162 -1300 275 1172 -562 -373 822 -637 -773 1305 444
5066 444 -1212 230 727 -949 113 1398 -640 -1032 850 117 -772 988 575 -1551 -115 1320
5082 1320 -499 -442 1146 -529 -1245 1060 849 -1091 186 742 -1207 -262 1643 -257 -1217 757 139
5099 139 -1133 934 1039 -1400 -444 1243 -475 -614 1376 -144 -1645 631 1009 -942 245 1013
5115 1013 -1260 -723 1668 104 -1248 767 321 -1491 533 1498 -996 -630 1131 -599 -809 1638
5131 1638 304 -1806 382 1142 -1014 45 1374 -1030 -1109 1395 199 -1141 940 540 -1828 93
5147 93 1750 -736 -890 1160 -463 -1182 1459 767 -1652 165 1018 -1174 -231 1837 -617 -1620 1020
5164 1020 528 -1075 821 793 -1733 -267 1742 -584 -875 1401 -199 -1763 896 1317 -1226 -136
5180 -136 1041 -1144 -497 1930 -228 -1714 944 603 -1478 615 1559 -1373 -947 1354 -267 -775
5196 -775 1415 16 -1977 622 1510 -1124 -264 1320 -1008 -1188 1600 449 -1428 609 551 -1577
5212 -1577 390 1849 -994 -1198 1270 -115 -1157 1308 712 -1754 14 1269 -896 -230 1601 -792
5228 -792 -1626 1303 875 -1258 380 852 -1536 -253 1805 -412 -1094 1043 -81 -1402 1206 1236 -1530
5245 -1530 -450 1240 -661 -493 1523 -219 -1647 751 748 -1056 542 1118 -1478 -812 1678 92
5261 92 -1066 875 143 -1518 655 1361 -1013 -493 1034 -748 -820 1583 358 -1682 216 815 -926
5278 -926 263 1307 -957 -1059 1129 151 -822 964 406 -1658 108 1456 -503 -519 921 -534 -1085
5295 -1085 1215 735 -1209 89 625 -1007 -33 1549 -466 -1153 673 265 -771 786 694 -1318 -345
5312 -345 1142 -319 -424 1043 -305 -1356 683 992 -702 -32 555 -931 -331 1361 73 -946
5328 -946 423 111 -885 592 1100 -802 -721 637 -161 -305 979 30 -1243 160 820 -479 54 679
5346 679 -769 -750 912 483 -550 241 46 -872 253 1067 -315 -586 414 -285 -414 860 458 -942
5364 -942 -272 520 -220 119 728 -479 -857 457 441 -255 333 142 -898 -211 899 118 -410 201 -283
5383 -283 -602 548 627 -487 -363 73 -324 116 824 -25 -770 -74 259 -69 357 316 -659 -420 458 240
5403 240 3 232 -192 -673 107 678 57 -194 -77 -372 -100 654 314 -395 -283 -30 -147 249 474 -207
5423 -207 -535 -122 171 263 264 -96 -565 -227 369 305 65 -43 -240 -310 152 531 212 -297 -389 -147 209 455
5445 455 213 -297 -430 17 239 187 204 -87 -498 -146 436 370 5 -203 -347 -244 407 534 -153 -358 -55
5466 -55 -115 64 610 152 -628 -244 220 52 316 341 -468 -605 358 397 -130 128 -55 -690 -36 757 104
5487 104 -364 45 -355 -396 675 625 -576 -437 227 -207 54 715 -101 -918 129 408 -134 371 343 -821
5507 -821 -539 735 279 -358 330 -171 -896 314 987 -274 -378 307 -464 -320 1054 310 -1001 -29
5525 -29 403 -460 203 949 -608 -994 556 306 -393 595 179 -1231 -15 1111 -197 -382 654 -477
5543 -477 -933 913 833 -837 -142 374 -848 -17 1371 -269 -1154 446 313 -706 698 790 -1179 -575
5561 -575 944 -191 -379 982 -274 -1429 560 1059 -691 -184 661 -928 -545 1430 181 -1085
5577 -1085 457 294 -1149 571 1412 -955 -943 851 -134 -582 1191 190 -1566 215 1166 -789 -117
5594 -117 1155 -849 -1214 1216 699 -974 436 385 -1360 156 1639 -640 -1018 948 -196 -1027 1160
5611 1160 892 -1471 -305 1000 -755 -99 1537 -601 -1605 969 823 -1008 457 817 -1388 -454
5627 -454 1605 -223 -929 961 -204 -1583 1008 1457 -1251 -516 999 -734 -456 1599 -140 -1638
5643 -1638 665 725 -1205 479 1471 -1371 -1074 1418 165 -836 1006 8 -1783 583 1548 -1048
5659 -1048 -458 1260 -830 -1152 1637 630 -1485 287 602 -1271 394 1781 -1077 -1357 1241 244
5675 244 -1051 1093 703 -1740 -140 1384 -642 -327 1391 -797 -1598 1468 1066 -1435 113 896
5691 896 -1257 -248 1756 -440 -1298 906 -47 -1371 1267 1320 -1765 -717 1409 -433 -593 1418
5707 1418 -311 -1652 863 934 -1207 374 1219 -1598 -931 1947 297 -1288 641 175 -1437 873
5723 873 1480 -1294 -637 1173 -646 -875 1819 449 -1908 191 1143 -847 178 1337 -1165 -1173 1509
5740 1509 260 -1172 924 559 -1775 133 1830 -653 -786 965 -567 -1115 1581 786 -1685 52
5756 52 1055 -1055 -154 1801 -570 -1609 933 491 -1026 852 791 -1791 -327 1734 -430 -799 1202
5773 1202 -228 -1591 939 1246 -1111 -192 850 -1083 -373 1825 -104 -1568 638 566 -1111 561
5789 561 1346 -1202 -873 1114 -88 -616 1231 49 -1741 464 1412 -805 -284 1056 -809 -1030 1384
5806 1384 556 -1112 297 282 -1206 404 1579 -797 -1071 908 1 -814 1132 604 -1508 -129 937
5823 937 -508 -104 1100 -687 -1269 984 720 -871 232 532 -1115 -136 1376 -129 -858 531 -159
5840 -159 -919 860 978 -1041 -555 696 -312 -170 1141 -198 -1292 315 655 -501 336 664 -1045
5857 -1045 -620 1077 290 -563 355 -63 -965 439 1027 -512 -439 401 -404 -397 1084 305 -1022 -85 390
5876 390 -370 204 763 -649 -839 506 341 -180 505 62 -1015 -79 928 -14 -398 271 -351 -582 695
5895 695 637 -454 -255 123 -388 214 884 -137 -880 82 278 -158 338 350 -637 -459 401 264 51 266
5915 266 -326 -695 310 717 -65 -262 -37 -363 -139 603 289 -315 -202 -116 -118 343 566 -279 -651 -10 237
5936 237 220 277 -37 -503 -274 298 312 104 -17 -370 -441 228 643 108 -357 -266 -32 148 400 189 -309 -316
5958 -316 -45 136 258 311 -234 -590 -109 497 329 -114 -213 -365 -186 425 420 -79 -203 -150 -244 189 685 33
5980 33 -682 -244 129 116 306 207 -529 -408 335 222 40 251 -131 -655 -11 726 116 -221 42 -372 -248
6001 -248 727 401 -510 -243 140 -281 170 729 -266 -753 74 240 -141 467 312 -856 -356 695 146
6020 146 -170 375 -291 -776 460 843 -411 -185 189 -611 -131 1009 72 -837 67 147 -532 443 821
6039 821 -767 -755 586 23 -284 701 -14 -1126 174 969 -341 -110 568 -696 -754 976 516 -753
6057 -753 77 213 -833 254 1219 -499 -826 521 -72 -640 970 619 -1243 -326 892 -245 -162 896
6075 896 -529 -1127 843 740 -817 169 571 -1121 -348 1375 -49 -865 552 -86 -1017 902 1018
6092 1018 -1173 -566 895 -471 -424 1237 -36 -1424 442 733 -792 341 1000 -1281 -909 1425
6108 1425 282 -943 631 160 -1386 386 1316 -815 -570 950 -581 -860 1423 582 -1532 6
6124 6 850 -792 131 1295 -865 -1134 1109 300 -1040 829 647 -1667 -215 1490 -340 -617 932
6141 932 -504 -1256 1246 947 -1387 -111 987 -1017 -353 1662 -265 -1428 733 318 -1064 836
6157 836 1116 -1603 -672 1502 -196 -827 1141 -62 -1581 691 1132 -1076 4 1012 -1241 -799
6173 -799 1799 254 -1501 454 556 -1177 455 1343 -1135 -792 1278 -333 -958 1440 409 -1891
6189 -1891 176 1315 -738 -199 1115 -935 -1059 1439 447 -1325 655 695 -1624 -8 1795 -541
6205 -541 -1098 848 -271 -1017 1330 686 -1688 -38 1209 -939 -405 1553 -398 -1512 892 669
6221 669 -975 619 773 -1585 -277 1798 -310 -1098 1006 27 -1424 805 1176 -1091 -312 920
6237 920 -962 -446 1727 -168 -1700 651 861 -1088 332 1161 -1135 -846 1278 -73 -746 1078
6253 1078 56 -1791 565 1534 -948 -467 1086 -696 -911 1392 392 -1338 383 513 -1214 322
6269 322 1594 -949 -1209 1153 140 -902 1009 538 -1518 62 1262 -707 -307 1199 -623 -1360
6285 -1360 1212 797 -1093 183 674 -1086 -119 1487 -438 -1053 890 75 -1145 947 983 -1284 -519
6302 -519 1098 -431 -392 1162 -265 -1355 744 780 -942 242 934 -1116 -636 1381 101 -939 577
6319 577 60 -1101 685 1103 -991 -487 916 -489 -697 1281 284 -1347 235 768 -630 161 932
6336 932 -951 -818 1084 189 -847 645 293 -1235 132 1249 -421 -525 702 -384 -715 1060
6352 1060 553 -1089 21 654 -696 -35 1169 -399 -999 554 322 -600 544 564 -1166 -245 1001
6369 1001 -146 -450 651 -210 -959 632 773 -621 -240 435 -671 -266 1003 29 -922 250 291 -596
6387 -596 353 758 -711 -578 612 5 -286 572 9 -916 178 738 -291 -144 424 -458 -485 676 444
6406 444 -510 38 120 -450 235 738 -345 -619 296 -27 -316 561 330 -638 -262 361 42 59 264 -361
6426 -361 -558 398 449 -240 19 177 -433 -212 556 217 -329 -89 -15 -177 347 402 -372 -318 186 -20 -34 338
6448 338 64 -449 -128 292 124 83 62 -356 -278 343 331 -112 -144 -24 -174 35 380 134 -289 -172 -43 20
6470 20 313 211 -263 -393 134 296 52 26 3 -296 -131 295 184 -53 -84 -186 -317 261 442 -147 -384
6491 -384 61 33 -97 305 201 -361 -275 201 16 102 335 -193 -528 239 483 -200 -54 132 -324 -157 525
6512 525 181 -391 13 23 -359 310 620 -377 -435 249 -8 -197 420 135 -670 -18 437 -163 8 449 -364
6533 -364 -577 540 412 -379 57 221 -628 5 825 -133 -530 331 -7 -469 544 511 -676 -277 536
6552 536 -217 -106 769 -101 -828 398 492 -463 187 517 -704 -385 889 128 -577 413 120 -791 355
6571 355 823 -621 -300 639 -393 -436 906 196 -1072 118 660 -543 26 788 -572 -675 823 243
6589 243 -675 599 342 -1071 20 1144 -434 -576 706 -225 -768 859 544 -999 78 710 -771
6606 -771 -169 1218 -358 -1026 684 334 -747 564 658 -1123 -218 1130 -362 -641 945 -28 -1088
6623 -1088 601 801 -897 -12 791 -838 -440 1317 -41 -1204 634 483 -1007 334 1034 -925
6639 -925 -496 1054 -270 -699 1074 240 -1441 409 1105 -819 -256 1092 -696 -817 1157 259 -1073
6656 -1073 579 583 -1234 91 1384 -696 -877 1008 -92 -921 943 605 -1334 139 1089 -855 -370
6673 -370 1348 -437 -1232 966 552 -1122 423 779 -1227 -220 1457 -431 -935 1004 134 -1267
6689 -1267 700 972 -1149 -183 1048 -693 -530 1383 -140 -1434 707 790 -1117 195 1084 -986
6705 -986 -632 1247 -155 -888 975 272 -1444 522 1302 -1035 -497 1148 -434 -827 1184 210 -1257
6722 -1257 503 778 -1135 79 1321 -852 -972 1153 98 -1095 796 576 -1265 91 1145 -779
6738 -779 -473 1137 -400 -1121 1057 633 -1203 193 872 -962 -187 1321 -501 -1001 976 273 -1100
6755 -1100 618 890 -1161 -229 1173 -496 -590 1059 -164 -1172 837 733 -1094 67 1010 -889
6771 -889 -549 1221 -98 -1021 715 294 -1059 455 1010 -995 -390 1169 -414 -746 1064 224 -1171
6788 -1171 396 770 -832 22 968 -785 -668 1157 76 -1015 617 549 -1095 145 1080 -697 -494
6805 -494 865 -305 -819 906 405 -1138 201 816 -774 -194 978 -452 -828 816 222 -873 494
6822 494 625 -966 -123 986 -434 -598 812 -101 -858 664 564 -915 70 722 -696 -370 954
6839 954 -177 -887 599 390 -781 309 685 -760 -300 895 -252 -533 769 60 -952 384 630
6856 630 -661 -91 679 -457 -460 806 -5 -741 421 349 -747 133 740 -545 -452 738 -61 -583 574
6875 574 263 -768 122 631 -476 -143 676 -251 -562 663 240 -642 279 428 -496 -65 689 -249 -413
6894 -413 498 6 -495 363 351 -642 -59 548 -309 -208 573 -56 -574 382 288 -462 156 354 -428 -171 527
6915 527 -64 -385 384 158 -466 173 452 -350 -131 434 -192 -365 409 100 -427 85 316 -328 -30 387
6935 387 -283 -253 414 49 -333 215 160 -404 -43 427 -170 -223 249 -42 -281 246 202 -268 4 241 -195
6956 -195 -119 248 -7 -285 105 185 -149 43 197 -151 -120 219 25 -106 117 80 -247 6 221 -93 -188 126
6978 126 21 -138 116 136 -88 -43 207 21 -146 130 30 -189 13 153 -102 -91 136 3 -200 151 167
6999 167 -177 -63 249 -73 -146 199 -9 -190 118 132 -203 -12 242 -129 -173 294 81 -251 155 124 -258
7020 -258 -12 264 -133 -129 230 44 -245 211 201 -353 -16 309 -154 -168 331 10 -343 193 243 -355 64 316
7042 316 -310 -166 397 -112 -357 259 175 -405 101 366 -341 -86 423 -169 -335 373 130 -458 219 312 -395
7063 -395 -11 467 -226 -328 477 72 -517 212 356 -501 9 522 -317 -343 498 4 -430 382 313 -605 105
7084 105 536 -409 -259 639 -123 -506 494 189 -604 139 427 -508 -107 666 -280 -463 571 130 -660
7103 -660 274 461 -669 -4 658 -346 -405 690 -35 -659 468 384 -701 25 621 -508 -344 720
7121 720 -170 -641 533 281 -674 284 603 -616 -232 785 -224 -587 626 145 -806 340 626 -655
7139 -655 -168 750 -350 -554 717 91 -738 412 464 -742 72 727 -577 -451 833 -52 -650 578
7157 578 357 -824 86 698 -607 -217 801 -294 -714 744 274 -847 253 583 -712 -140 880
7174 880 -404 -666 746 67 -854 511 567 -861 -50 831 -499 -424 891 -146 -875 666 437 -847
7192 -847 114 787 -691 -389 890 -128 -725 634 246 -849 383 708 -854 -264 883 -339 -630
7209 -630 831 133 -912 465 543 -741 26 855 -641 -559 891 -21 -901 615 449 -895 141 833
7227 833 -603 -361 814 -262 -709 793 381 -995 274 693 -704 -184 909 -350 -729 744 180
7244 180 -782 468 586 -886 -133 975 -384 -525 777 -48 -831 603 514 -830 23 770 -588 -427
7262 -427 946 -87 -822 463 310 -737 231 667 -797 -296 856 -284 -597 793 178 -953 266
7279 266 684 -646 -105 730 -426 -448 788 22 -815 493 420 -791 80 828 -532 -463 675 -50 -609
7298 -609 603 257 -854 192 669 -552 -219 729 -306 -710 631 320 -680 207 437 -801 -101
7315 -101 849 -262 -566 606 -7 -664 464 462 -665 -76 610 -489 -277 708 -84 -745 438 402 -606
7334 -606 135 517 -563 -299 635 -112 -460 501 63 -725 302 606 -481 -223 540 -287 -333 595 101
7353 101 -640 267 325 -489 107 578 -484 -476 532 117 -435 390 153 -620 69 569 -307 -210 485 -228 -408
7374 -408 462 194 -544 115 326 -371 -30 529 -212 -472 341 47 -345 363 287 -503 -63 413 -223 -161 417
7395 417 -143 -433 336 287 -362 -10 211 -370 -140 561 -46 -358 245 58 -363 204 386 -331 -274 292 -70
7416 -70 -144 400 18 -468 111 303 -204 -21 239 -238 -258 363 101 -262 69 -4 -337 54 417 -108 -292
7437 -292 181 17 -150 264 137 -315 -37 167 -143 18 300 -171 -367 204 206 -146 -40 69 -190 -92 291
7458 291 22 -91 143 -29 -250 140 257 -200 -213 82 39 7 231 -64 -273 42 80 -87 50 205 -187
7479 -187 -235 157 208 -13 -53 -23 -184 55 287 -19 -180 3 -3 -83 162 276 -64 -183 -37 4 50 170 -114
7502 -114 -233 -2 180 -12 -21 101 -74 -257 67 210 -32 -100 -108 -134 34 270 -14 -245 32 95 -93 106
7524 106 173 -149 -266 54 97 -12 135 -76 -319 45 313 11 -75 74 -52 -236 182 236 -138 -115 43 -134
7546 -134 68 301 -30 -361 22 193 -100 150 161 -245 -177 244 57 -109 152 -33 -411 64 356 -115 -139
7567 -139 148 -149 -145 331 164 -314 -36 165 -178 -1 394 -130 -389 203 109 -135 195 148 -387 -65 368
7588 368 -56 -185 248 -106 -374 231 339 -295 -100 206 -264 -114 445 74 -376 101 79 -233 185 311
7608 311 -400 -325 347 -4 -215 312 64 -469 113 369 -139 -54 246 -273 -299 491 189 -413 31 184 -341
7629 -341 102 508 -131 -291 286 -10 -246 399 228 -524 -94 387 -88 -122 326 -211 -353 320 213 -366
7649 -366 95 228 -458 -110 601 33 -402 175 -17 -286 406 282 -441 -134 434 -175 -239 495 12 -533
7669 -533 159 307 -239 139 264 -495 -203 591 36 -430 278 114 -505 123 462 -291 -182 225 -269 -204
7689 -204 581 118 -687 90 359 -302 -29 474 -229 -402 322 109 -235 367 178 -683 -41 653 -160 -272
7709 -272 286 -119 -347 448 255 -459 98 309 -465 -69 684 -44 -588 152 204 -223 257 215 -584 -118 486
7730 486 -180 -281 457 -61 -619 227 449 -241 -111 191 -375 -107 617 -30 -528 301 198 -502 162 588
7750 588 -322 -324 273 -64 -169 452 -44 -612 95 385 -320 -109 439 -252 -470 405 213 -291 158 84 -493
7771 -493 130 664 -269 -448 319 57 -329 372 272 -480 -76 269 -251 -5 557 -227 -591 393 364 -281
7791 -281 29 232 -413 -134 475 -139 -237 343 -161 -509 292 545 -443 -267 351 -136 -141 415 -40 -452 159
7812 159 179 -374 209 515 -409 -351 436 141 -264 139 39 -396 153 432 -212 -121 375 -217 -344 456 250
7833 250 -494 -42 202 -226 72 435 -280 -351 328 56 -257 258 209 -517 -116 364 -18 -107 245 -217 -361
7854 -361 310 306 -369 -29 233 -304 -114 428 -5 -350 142 30 -250 206 352 -387 -228 361 62 -181 264
7875 264 8 -460 23 315 -143 4 169 -352 -216 427 121 -282 47 48 -289 102 436 -175 -292 128 -26
7896 -26 -170 285 60 -330 -57 203 -93 56 308 -190 -341 206 265 -142 43 84 -255 -5 301 -51 -191
7917 -191 105 -30 -194 242 296 -252 -209 149 -27 -26 249 -73 -288 24 136 -80 143 117 -291 -274 249 175
7939 175 -80 26 -46 -112 155 238 -203 -127 175 -109 -143 244 153 -224 -115 75 46 125 155 -209 -171 190 153 -132
7963 -132 55 131 -208 -54 134 142 -37 -13 -204 -83 301 179 -240 -179 86 -24 -36 177 20 -128 -62 -49 84
7986 84 223 85 -289 -159 254 134 -73 -27 -3 -136 -21 113 24 23 23 -202 -111 281 165 -281 -202 51 50 -20
8010 -20 104 -65 -75 46 32 -31 129 48 -241 -176 160 148 -63 -145 -61 -95 123 124 -69 -70 31 -79 -78 217 130 -161
8036 -161 -118 35 26 92 54 -171 -95 98 79 -35 102 47 -211 -153 150 149 -43 -57 -112 -115 159 191 -135 -77 81 -44
8062 -44 10 123 50 -177 -103 33 48 71 81 -185 -133 172 127 -2 -44 -31 -194 -37 184 -26 -45 -1 -37 -120 208
8087 208 144 -147 -101 27 -31 31 198 -53 -210 56 94 -2 86 18 -218 -112 111 89 -56 -37 -33 -130 108 215
8111 215 -41 -131 20 -95 -17 229 44 -201 -61 78 -38 78 189 -118 -178 97 78 -18 116 -39 -224 44
$$ [...]
8191a11
##END NTUPLES=NMR FID
##END=
