##TITLE=1H_IBA1203-1
 CDCl3
 8 sc, 
 13.3.2024
##JCAMPDX= 6.0         $$ Bruker NMR JCAMP-DX V2.0
##DATA TYPE= NMR FID
##DATA CLASS= NTUPLES
##ORIGIN= UXNMR, Bruker Analytische Messtechnik GmbH
##OWNER= root
$$ XWIN-NMR		Version 3.5
$$ Wed Mar 13 14:06:40 2024 Russian Standard Time (UT+4h)  she@DPX200
##.OBSERVE FREQUENCY= 200.1313
##.OBSERVE NUCLEUS= ^1H
##.DELAY= (6, 6)
##.ACQUISITION MODE= SIMULTANEOUS
##.ACQUISITION SCHEME= undefined
##.AVERAGES= 8
##.DIGITISER RES= 18
##SPECTROMETER/DATA SYSTEM= spect
##.PULSE SEQUENCE= zg30
##.SOLVENT NAME= CDCl3
##.SHIFT REFERENCE= (INTERNAL, CDCl3, 0, 15.7039)
##AUDIT TRAIL= $$ (NUMBER, WHEN, WHO, WHERE, WHAT)
$$ ##TITLE= Audit trail, XWIN-NMR		Version 3.5
$$ ##JCAMPDX= 5.01
$$ ##ORIGIN= Bruker BioSpin GmbH
$$ ##OWNER= she
$$ F:/spectra/data/she/nmr/H-F/1/audita.txt
$$ ##AUDIT TRAIL=  $$ (NUMBER, WHEN, WHO, WHERE, WHAT)
(   1,<2024-03-13 14:05:26.46 +0400>,<she>,<DPX200>,
      <created by zg, POWCHK disabled, PULCHK disabled
       configuration hash MD5:
       00 E9 B6 7A A2 85 ED C7 34 08 36 98 17 FE 4E 26
       data hash MD5: 16K
       37 A7 72 51 F1 09 FA A0 EF 06 53 80 2E 65 CD C4>)
$$ ##END=
$$ 
$$ hash MD5
$$ 9F 05 58 DF E6 7A 78 BC 94 CE AB A2 93 75 C0 EC
##$RELAX= 
##$RELAX= 
##$RELAX= 
##$RELAX= 
##$RELAX= 
##$RELAX= 
$$ Bruker specific parameters
$$ --------------------------
##$DU= <F:/spectra>
##$EXPNO= 1
##$NAME= <H-F>
##$PROCNO= 1
##$TYPE= <nmr>
##$USER= <she>
##$AMP= (0..31)
100 100 100 100 100 100 100 100 100 100 100 100 100 100 100 100 100 100 
100 100 100 100 100 100 100 100 100 100 100 100 100 100 
##$AQSEQ= 0
##$AQ_mod= 1
##$AUNM= <au_zg>
##$AUTOPOS= <>
##$BF1= 200.13
##$BF2= 200.13
##$BF3= 200.13
##$BF4= 200.13
##$BF5= 200.13
##$BF6= 200.13
##$BF7= 200.13
##$BF8= 200.13
##$BYTORDA= 1
##$CFDGTYP= 0
##$CFRGTYP= 5
##$CHEMSTR= <none>
##$CNST= (0..31)
1 1 145 1 1 1 1 1 1 1 1 1 1 1 1 1 1 1 1 1 1 1 1 1 1 1 1 1 1 1 1 1 
##$CPDPRG= <>
##$CPDPRG1= <>
##$CPDPRG2= <>
##$CPDPRG3= <>
##$CPDPRG4= <mlev>
##$CPDPRG5= <mlev>
##$CPDPRG6= <mlev>
##$CPDPRG7= <mlev>
##$CPDPRG8= <mlev>
##$CPDPRGB= <>
##$CPDPRGT= <>
##$D= (0..31)
0 1.2 0 0 0 0 0 0 0 0.06 0 0.03 0 0 0 0 0.0002 0 0 0 0 0 0 0 0 0 0 0 0 
0 0 0 
##$DATE= 1710324326
##$DBL= (0..7)
120 120 120 120 120 120 120 120 
##$DBP= (0..7)
150 150 150 150 150 150 150 150 
##$DBP07= 0
##$DBPNAM0= <>
##$DBPNAM1= <>
##$DBPNAM2= <>
##$DBPNAM3= <>
##$DBPNAM4= <>
##$DBPNAM5= <>
##$DBPNAM6= <>
##$DBPNAM7= <>
##$DBPOAL= (0..7)
0.5 0.5 0.5 0.5 0.5 0.5 0.5 0.5 
##$DBPOFFS= (0..7)
0 0 0 0 0 0 0 0 
##$DE= 6
##$DECBNUC= <off>
##$DECIM= 32
##$DECNUC= <off>
##$DECSTAT= 4
##$DIGMOD= 1
##$DIGTYP= 9
##$DL= (0..7)
0 120 120 120 120 120 120 120 
##$DP= (0..7)
150 150 150 150 150 150 150 150 
##$DP07= 0
##$DPNAME0= <>
##$DPNAME1= <>
##$DPNAME2= <>
##$DPNAME3= <>
##$DPNAME4= <>
##$DPNAME5= <>
##$DPNAME6= <>
##$DPNAME7= <>
##$DPOAL= (0..7)
0.5 0.5 0.5 0.5 0.5 0.5 0.5 0.5 
##$DPOFFS= (0..7)
0 0 0 0 0 0 0 0 
##$DQDMODE= 0
##$DR= 18
##$DS= 0
##$DSLIST= <SSSSSSSSSSSSSSS>
$$ [...]
##$SUBNAM2= <"">
##$SUBNAM3= <"">
##$SUBNAM4= <"">
##$SUBNAM5= <"">
##$SUBNAM6= <"">
##$SUBNAM7= <"">
##$SUBNAM8= <"">
##$SUBNAM9= <"">
##$SW= 18.0517328524113
##$SWIBOX= (0..15)
0 0 2 0 0 0 0 0 0 0 0 0 0 0 0 0 
##$SW_h= 3612.71676300578
##$TD= 16384
##$TD0= 1
##$TE= 0
##$TE2= 300
##$TE3= 300
##$TEG= 300
##$TL= (0..7)
0 120 120 120 120 120 120 120 
##$TP= (0..7)
150 150 150 150 150 150 150 150 
##$TP07= 0
##$TPNAME0= <>
##$TPNAME1= <>
##$TPNAME2= <>
##$TPNAME3= <>
##$TPNAME4= <>
##$TPNAME5= <>
##$TPNAME6= <>
##$TPNAME7= <>
##$TPOAL= (0..7)
0.5 0.5 0.5 0.5 0.5 0.5 0.5 0.5 
##$TPOFFS= (0..7)
0 0 0 0 0 0 0 0 
##$TUNHIN= 0
##$TUNHOUT= 0
##$TUNXOUT= 0
##$USERA1= <user>
##$USERA2= <user>
##$USERA3= <user>
##$USERA4= <user>
##$USERA5= <user>
##$V9= 5
##$VALIST= <valist>
##$VCLIST= <CCCCCCCCCCCCCCC>
##$VD= 0
##$VDLIST= <DDDDDDDDDDDDDDD>
##$VPLIST= <PPPPPPPPPPPPPPP>
##$VTLIST= <TTTTTTTTTTTTTTT>
##$WBST= 1024
##$WBSW= 4
##$XGAIN= (0..3)
0 0 0 0 
##$XL= 0
##$YL= 0
##$YMAX_a= 291949
##$YMIN_a= -341160
##$ZGOPTNS= <>
##$ZL1= 120
##$ZL2= 120
##$ZL3= 120
##$ZL4= 120
##$ABSF1= 10
##$ABSF2= 0
##$ABSG= 5
##$ABSL= 3
##$ALPHA= 0
##$AQORDER= 0
##$ASSFAC= 0
##$ASSFACI= 0
##$ASSFACX= 0
##$ASSWID= 0
##$AUNMP= <proc_1d>
##$AZFE= 0.1
##$AZFW= 0.1
##$BCFW= 1
##$BC_mod= 2
##$BYTORDP= 1
##$COROFFS= 0
##$CY= 11.3945322036743
##$DATMOD= 1
##$DC= 2
##$DFILT= <>
##$DTYPP= 0
##$F1P= 15.7292609196834
##$F2P= 12.9074282941183
##$FCOR= 0.5
##$FTSIZE= 0
##$FT_mod= 4
##$GAMMA= 1
##$GB= 0.15
##$INTBC= 1
##$INTSCL= 1
##$ISEN= 128
##$LB= 0.24
##$LEV0= 0
##$LPBIN= 0
##$MAXI= 10000
##$MC2= 0
##$MEAN= 0
##$ME_mod= 0
##$MI= 1.114404
##$NCOEF= 0
##$NC_proc= 0
##$NLEV= 6
##$NOISF1= 3.799351
##$NOISF2= 2.8
##$NSP= 1
##$NTH_PI= 0
##$NZP= 0
##$OFFSET= 15.70392
##$PC= 1
##$PHC0= -25459.61
##$PHC1= 8.787313
##$PH_mod= 1
##$PKNL= yes
##$PPARMOD= 0
##$PSCAL= 0
##$PSIGN= 0
##$REVERSE= no
##$SF= 200.130013532006
##$SI= 16384
##$SIGF1= 3
##$SIGF2= 2
##$SINO= 400
##$SIOLD= 16384
##$SREGLST= <1H.CDCl3>
##$SSB= 0
##$STSI= 0
##$STSR= 0
##$SW_p= 3612.71676300578
##$SYMM= 0
##$S_DEV= 0
##$TDeff= 0
##$TDoff= 0
##$TI= <>
##$TILT= no
##$TM1= 0
##$TM2= 0
##$TOPLEV= 0
##$USERP1= <user>
##$USERP2= <user>
##$USERP3= <user>
##$USERP4= <user>
##$USERP5= <user>
##$WDW= 1
##$XDIM= 8192
##$YMAX_p= 0
##$YMIN_p= 0
$$ End of Bruker specific parameters
$$ ---------------------------------
##NTUPLES= NMR FID
##VAR_NAME=  TIME,          FID/REAL,        FID/IMAG
##SYMBOL=    X,             R,               I
##VAR_TYPE=  INDEPENDENT,   DEPENDENT,       DEPENDENT
##VAR_FORM=  AFFN,          ASDF,            ASDF
##VAR_DIM=   8192,          8192,            8192
##UNITS=     SECONDS,       ARBITRARY UNITS, ARBITRARY UNITS
##FACTOR=    0.0002768,     1,               1
##FIRST=     0,             0,               0
##LAST=      2.2672688,     0,               0
##MIN=       0,             -341160,         0
##MAX=       2.2672688,     291949,          0
$$ Real data points
##PAGE= N=1
##DATA TABLE= (X++(R..R)), XYDATA
$$ plain form
0 0 0 0 0 0 0 0 0 0 0 0 0 0 0 0 1 -2 7 -8 8 -9 10 -16 17 -23 25 -30 33 -41 47 -55 62 -71 81 -93 105 -118 132
37 132 -150 168 -189 209 -233 260 -290 319 -355 391 -433 478 -527 578 -637 701 -775 852 -940
56 -940 1039 -1151 1277 -1422 1590 -1788 2026 -2314 2669 -3110 3650 -4237 4183 3425 264466
71 264466 -48170 -255906 222061 126037 -254506 34943 180936 -205668 -26236 291949
81 291949 -123186 -264673 228322 121511 -250656 62443 198477 -206015 -78924 241122
91 241122 -68474 -165196 201681 19197 -266343 122787 231482 -209218 -102992 213623
101 213623 -64383 -146753 196053 33670 -229905 91359 156432 -192429 -16268 233805
111 233805 -120022 -192557 195336 75688 -186650 73183 109221 -189533 1265 217118
$$ packed form
0@%%%%%%%%%%%%%%JlRj5J6j7J9k6L3m0M8n5O3p4Q8j02J17j33J52j74J98k23K50
37A32k82L18l57L98m42M93n50O09o74P46q24R11j005J105j215J338j476J627j792
56i40J979k190K428k699L012l378L814m340M983n779O760p887Q420p58K61041
71B64466l12636k07736M77967r6024l80543K89449J45993l86604J79432L18185
81B91949m15135j41487M92995j06811l72167L13099J36034m04492J27091L20046
91B41122l09596r6722L66877j82484k85540L89130J08695m40700J06226L16615
101B13623k78006q2370L42806j62383k63575L21264O5073l48861J76161K50073
111B33805l53827p2535L87893j19648k62338K59833L6038k98754J90798K15853
$$ plain form
121 217118 -108891 -145285 181842 11514 -198372 117722 148993 -183534 -43239 165551
131 165551 -82275 -81860 176319 -25702 -194580 116403 126342 -164324 -3823 159165 -113525
142 -113525 -104321 170081 13166 -145877 86180 60153 -156838 42016 165789 -117762
152 -117762 -102472 145713 -6237 -124076 109655 65478 -158031 12518 130332 -89134
162 -89134 -45989 138049 -51209 -136725 117806 78582 -132452 15943 98589 -104983 -35635
173 -35635 145394 -33657 -116773 91106 35978 -119443 55976 107759 -115166 -54552 119676
184 119676 -24779 -77045 97087 11854 -128286 48489 100067 -87395 -25649 97701 -57200
195 -57200 -78004 107935 31761 -105494 29904 58707 -84138 4958 105885 -56568 -80327
$$ packed form
121B17118l26009l6394L27127j70328k09886L16094L1271l32527J40295K08790
131A65551k47826M15K58179k02021j68878L10983R939k90666J60501J62988k72690
142a13525R204K74402j56915j59043K32057k6027k16991J98854J23773k83551
152a17762J5290K48185j51950j17839K33731m4177k23509J70549J17814k19466
162h9134M3145J84038j89258q5516K54531l9224k11034J48395Q2646k03572O9348
173c5635J81029j79051q3116K07879n5128j55421J75419N1783k22925O0614J74228
184A19676j44455n2266J74132q5233j40140J76775N1578j87462O1746J23350j54901
195e7200k0804J85939p6174j37255J35398K8803j42845Q9096J00927j62453k3759
$$ plain form
206 -80327 80849 16304 -77418 54693 51575 -97876 -11711 92580 -33580 -45793 71115
217 71115 -14871 -83668 60804 61082 -75683 -8153 61723 -51429 -30971 87601 -4355 -81261
229 -81261 36448 36508 -59020 20791 63449 -61960 -43882 69863 2186 -48515 45401 14618
241 14618 -74419 16619 68448 -37136 -28998 46358 -22248 -44006 57675 27764 -61752 1556
253 1556 37731 -35417 -3372 57256 -23812 -53487 35551 22808 -34650 19241 27118 -49379
265 -49379 -14352 52574 -3304 -29511 24331 -3014 -40132 26449 39439 -32486 -18577 24850
277 24850 -13942 -13539 39694 4333 -43499 3784 24128 -13764 4926 23959 -25225 -26392 27967
290 27967 15422 -16568 6545 3454 -26987 2929 32453 -3598 -19695 3980 -2623 -8591 19258
$$ packed form
206h0327J61176o4545r3722J32111l118j49451Q6165J04291j26160j2213J16908
217G1115q5986o8797J44472K78j36765O7530O9876j13152K0458J18572r1956p6906
229h1261J17709O0r5528P9811M2658j25409J8078J13745o7677n0701R3916l0783
241A4618q9037R1038N1829j05584Q138P5356o8606k1758J01681k9911q9516O3308
253A556L6175p3148L2045O0628q1068k9675Q9038j2743n7458N3891P877p6497
265d9379L5027O6926n5878k6207N3842k7345l7118O6581J2990p1925J3909M3427
277B4850l8792M03N3233l5361m7832M7283K0344l7892J8690J9033m9184j167N4359
290B7967j2545l1990K3113l091l0441K9916K9524l6051j6097K3675o603n968K7849
$$ plain form
303 19258 14055 -20414 -13010 9109 2725 3593 11940 -7045 -20078 1498 15669 5365 -1681
316 -1681 -4750 -10507 -3952 11637 12324 -2584 -12664 -7472 3312 8015 7927 1995 -12271 -13235 7861
331 7861 15161 -225 -4012 -2067 -12286 -2351 21896 7367 -18039 -4842 4328 -7044 9005
344 9005 19835 -14919 -22425 12774 9140 -8433 13260 6452 -30234 -4572 31000 -1502 -14939
357 -14939 13733 -7160 -25901 22521 27023 -25418 -11376 18596 -15219 -8988 37406 -303
369 -303 -40992 9962 22723 -21277 6397 30090 -30071 -27980 37706 10466 -28531 18075 11076
382 11076 -42541 6431 47396 -20606 -27884 30053 -6722 -33568 37688 26381 -49511 -5994
394 -5994 38405 -23126 -12917 47596 -13684 -51954 32382 30329 -39684 8987 36377 -45613
$$ packed form
303A9258n203l4469P404K2119o384Q68Q347j8985j3033K1576J4171j0304p046
316a681l069n757O555J5589O87j4908j0080N192J0784M703q8n932j4266r64K1096
331G861P300j5386l787J945j0219R935K4247j4529k5406J3197R170j1372J6049
344I005J0830l4754p506L5199l634j7573K1693o808l6686K5662L5572l2502j3437
357a4939K8672k0893j8741M8422M502n2441J4042K9972l3815O231M6394l7709
369c03m0689N0954J2761m4000K7674K3693o0161K091O5686k7240l8997M6606o999
382A1076n3617M8972M0965o8002p278N7937l6775k6846P1256j1307p5892M3517
394e994M4399o1531J0209O0513o1280l8270Q4336k053p0013M8671K7390q1990
$$ plain form
406 -45613 -22667 60133 -1242 -46636 29608 13552 -51649 21330 53599 -43828 -29703 48603
418 48603 -11749 -37713 50773 16498 -66705 10328 51476 -36424 -13272 53530 -28013 -51504
430 -51504 53882 26080 -56328 14931 38169 -53768 -9378 69768 -20489 -52988 44308 11298
442 11298 -55288 35093 48104 -63746 -20655 63587 -19936 -38311 56963 1431 -71146 32508
454 32508 52056 -54084 -6956 57980 -42987 -43440 72998 12425 -69693 27043 37551 -59639
466 -59639 7504 69512 -45391 -47694 64090 1309 -60151 48737 37096 -77889 -2408
477 -2408 71643 -34510 -33994 60934 -16485 -65268 56751 41296 -72063 4242 60466 -51880
489 -51880 -29566 78778 -8549 -69718 42756 28281 -63146 25616 61307 -67452 -34797
$$ packed form
406d5613K2946Q2800o1375m5394P6244j6056o5201P2979L2269r7427J4125P8306
418D8603o0352k5964Q8486l4275q3203P7033M1148q7900K3152O6802q1543k3491
430e1504J05386k7802q2408P1259K3238r1937M4390P9146r0257l2499R7296l3010
442A1298o6586R0381J3011j11850M3091Q4242q3523j8375R5274n5532p2577J03654
454C2508J9548j06140M7128O4936j00967m53J16438o0573q2118R6736J0508r7190
466e9639O7143O2008j14903k303J11784o2781o1460J08888j1641j14985P5481
477b408P4051j06153N16R4928p7419m8783J22019j5455j13359P6305N6224j12346
489e1880K2314J08344q7327o1169J12474j4475r1427Q8762L5691j28759L2655
$$ plain form
500 -34797 79674 -9662 -60804 54368 21625 -77846 21484 66058 -54514 -22001 68311
511 68311 -34337 -58618 76937 27581 -86224 16458 60340 -56996 -13094 75474 -35410
522 -35410 -60571 66927 15077 -73556 41404 55544 -82285 -19533 88073 -23148 -56522
533 -56522 58395 3487 -71390 47499 53716 -76510 -9057 76260 -44610 -50651 82163
544 82163 10425 -85078 30675 50323 -60192 5713 67330 -57628 -46542 84645 3368
555 3368 -78155 46419 45106 -79919 129 79600 -41078 -42793 65133 -14819 -65226 67170
567 67170 40197 -91614 2627 78988 -48286 -38259 76721 -11905 -72516 52546 34425
578 34425 -70848 23028 63512 -73403 -34155 93780 -7992 -75957 48331 29761 -70769
$$ packed form
500c4797J14471q9336n1142J15172l2743r9471R9330M4574j20572L2513R0312
511F8311j02648k4281J35555m9356j13805J02682M3882j17336M3902Q8568j10884
522c5410k5161J27498n1850q8633J14960J4140j37829O2752J07606j11221l3374
533e6522J14917n4908p4877J18889O217j30226O7453Q5317j20870o041J32814
544H2163p1738r5503J15753J9648j10515O5905O1617j24958J1086J31187q1277
555C368q1523J24574j313j25025Q0048P9471j20678j715J07926p9952n0407J32396
567F7170k6973j31811R4241P6361j27274J0027J14980q8626o0611J25062j8121
578C4425j05273R3876M0484j36915L9248J27935j01772o7965J24288j8570j00530
$$ plain form
589 -70769 23440 63486 -62508 -26133 75102 -27407 -60799 73099 27171 -89469 13872
600 13872 68764 -48516 -20268 65094 -33431 -54997 70191 19272 -77738 29038 56684
611 56684 -69929 -18755 82921 -21898 -60349 52048 11461 -62465 41790 48898 -76025
622 -76025 -14125 78491 -30210 -51379 66185 9114 -75835 31607 52278 -57430 -4623
633 -4623 61098 -46418 -42993 77289 8556 -75567 31106 44610 -60632 281 66749 -39701
645 -39701 -43922 60245 46 -57664 45974 35609 -72917 -2369 68587 -31604 -36470 54479
657 54479 -7975 -57234 44355 35775 -59947 3061 52226 -43288 -27163 66485 -4510 -60938
669 -60938 33065 29308 -49873 13047 48607 -46918 -27940 58759 -6235 -46677 40716 18831
$$ packed form
589g0769R4209M0046j25994L6375J01235j02509l3392J33898m5928j16640J03341
600A3872N4892j17280K8248Q5362r8525k1566J25188n0919r7010J06776K7646
611E6684j26613N1174J01676j04819l8451J12397m0587p3926J04255P108j24923
622g6025O1900R2616j08701k1169J17564n7071q4949J07442K0671j09708N2807
633d623O5721j07516L425J20282o8733q4123J06673J3504j05242O0913O6468j06450
645c9701m221J04167o0199n7710J03638j0365j08526P0548P0956j00191m866R0949
657E4479o2454m9259J01589q580r5722O3008M9165r5514J6125R3648p0995n6428
669f0938R4003l757p9181O2920L5560r5525J8978Q6699o4994m0442Q7393k1885
$$ plain form
681 18831 -59880 12170 53193 -36051 -23199 46326 -16410 -40273 47229 19832 -55649 9588
693 9588 40551 -37471 -11347 51610 -18410 -44503 37357 17259 -41513 17874 31599 -44477
705 -44477 -11914 50145 -12057 -33699 32900 4943 -42311 22182 35197 -36797 -11870 36138
717 36138 -17672 -23471 39772 4555 -43832 14472 27675 -28913 -647 33828 -24015 -26144
729 -26144 35759 6873 -31696 17134 16609 -34973 1940 37507 -17262 -22546 26007 -2279 -26508
742 -26508 24433 18074 -33718 -2464 27085 -16070 -10747 29534 -6918 -30706 18824 17784 -22561
755 -22561 3598 19507 -22382 -11083 29533 -735 -22279 13527 6320 -22543 9578 23005
767 23005 -18540 -13288 18791 -3362 -13316 18447 5299 -24198 2989 17968 -10335 -3708 15544
$$ packed form
681A8831p8711P2050M1023q9244J2852O9525o2736k3863Q7502k7397p5481O5237
693I588L0963p8022K6124O2957p0020k6093Q1860k0098n8772N9387J3725p6076
705d4477L2563O2059o2202k1642O6599k7957m7254O4493J3015p1994K4927M8008
717C6138n3810n799O3243l5217m8387N8304J3203n6588K8266L4475n7843k129
729b6144O1903k8886l8569M8830n25n1582L6913L5567n4769n284M8553k8286k4229
742b6508N0941o359n1792L1254K9549m3155N323M0281l6452k3788M9530j040m0345
755b2561K6159J5909m1889J1299M0616l0268k1544L5806p207k8863L2121J3427
767B3005m1545N252L2079k2153r954L1763j3148k9497K7187J4979k8303O627J9252
$$ plain form
780 15544 -10088 -15775 16951 9273 -15205 2497 8252 -14053 -967 18925 -4293 -14144 7454
793 7454 2381 -9362 9113 9380 -14296 -5905 11595 -1057 -4343 9040 -1962 -13126 4707
806 4707 10590 -4526 -2415 3818 -6304 -3776 10170 3377 -7804 -1121 1708 -3141 3131 6844
820 6844 -3836 -7146 1483 3392 968 2235 -403 -5337 -2126 4018 3911 -149 -2755 -2857 -1056
835 -1056 1907 4157 1797 -4643 -4527 2344 3239 189 1857 -726 -6858 -293 8137 725 -4343 1383
851 1383 -1799 -5078 6549 7022 -7665 -4452 5358 -2612 -2315 10057 -445 -12909 2894 8743
865 8743 -5804 285 8626 -8944 -8873 12952 4406 -10719 4441 4805 -13353 1759 16766 -7152
879 -7152 -11822 10587 212 -12020 11659 9797 -17812 -3248 15752 -6763 -7041 16321 -3405
$$ packed form
780A5544k5632n687L2726p678k4478J7702N755k2305J3086J9892k3218r851K1598
793G454n073j1743J8475K67k3676Q391J7500j2652l286J3383j1002j1164J7833
806D707N883j5116K111O233j0122K528J3946o793j1181O683K829m849O272L713
820F844j0680l310Q629J909k424J267k638m934L211O144j07m060k606j02J801
835a056K963K250k360o440J16O871Q95l050J668k583o132O565Q430p412n068N726
851A383l182l279J1627M73j4687L213R810p970K97J2372j0502j2464J5803N849
865H743j4547O089Q341j7570P1K1825q546j5125J5160L64j8158J5112J5007k3918
879g152m670K2409j0375j2232K3679j862k7609J4564J9000k2515k78K3362j9726
$$ plain form
892 -3405 -19525 11828 13640 -15841 -147 15180 -14462 -9955 22682 701 -20512 10322 9155
905 9155 -19548 5366 21737 -16866 -14148 21357 -1245 -18129 17841 9267 -27121 2840 24237
918 24237 -14850 -10328 22851 -7639 -23060 21472 13416 -26007 3447 20368 -20811 -7800
930 -7800 30211 -6882 -26343 19305 10658 -25433 9829 23094 -25334 -11412 29561 -6227
942 -6227 -21620 23242 5837 -31862 11251 26851 -23690 -9600 27798 -12440 -22288 29006
954 29006 8373 -32741 10106 22535 -26184 -3424 33220 -15915 -26354 28414 7351 -30057
966 -30057 15870 20874 -32866 -4173 35418 -14868 -22743 29494 858 -33639 20330 24442 -32263
979 -32263 -4083 31309 -19227 -18559 35456 -444 -36713 19359 22238 -31547 1236 32650 -23372
$$ packed form
892c405j6120L1353J812k9481J5694J5327k9642M507L2637k1981k1213L0834j167
905I155k8703K4914J6371l8603K718L5505k2602j6884L5970q574l6388K9961K1397
918B4237l9087M522L3179l0490j5421M4532q056l9423K9454J6921m1179J3011
930g800L8011l7093j9461M5648q647l6091L5262J3265m8428J3922M0973l5788
942f227j5393M4862j7405l7699M3113J5600n0541J4090L7398m0238r848N1294
954B9006k0633m1114M2847J2429m8719K2760L6644m9135j0439N4768k1063l7408
966c0057M5927N004n3740K8693L9591n0286p875N2237k8636l4497N3969M112n6705
979c2263K8180L5392n0536O68N4015l5900l6269N6072K879n3785L2783L1414n6022
$$ plain form
992 -23372 -21280 34620 380 -31380 22086 16037 -36791 4814 36626 -23173 -20810 33052 -3629
1005 -3629 -30952 26115 17156 -36648 4180 31293 -25495 -13394 37951 -9134 -35621 27166
1017 27166 18052 -34537 7331 28718 -29611 -12010 38926 -9867 -31127 29334 10642 -38502
1029 -38502 13464 32926 -30919 -13617 35236 -12025 -25711 32990 6386 -40125 15380 30056
1041 30056 -32059 -7683 37366 -16868 -28543 33097 8261 -34656 16325 22387 -35168 -1531
1053 -1531 39916 -19519 -27972 33325 4644 -35033 19767 23552 -34713 -2556 34306 -20585
1065 -20585 -19468 36749 -2822 -38658 23565 24997 -34827 -770 32937 -23289 -18549 36826
1077 36826 -3317 -34141 24865 16776 -38008 6979 36753 -27406 -20955 36250 -3656 -30828
$$ packed form
992b3372K092N5900l4240l1760N3466o049n2828M1605L1812n9799K363N3862l6681
1005c629k7323N7067q959n3804M0828K7113n6788J2101N1345m7085k6487O2787
1017B7166r114n2589M1868K1387n8329J7601N0936m8793k1260O0461j8692m9144
1029c8502N1966J9462o3845J7302M8853m7261j3686N8701k6604m6511N5505J4676
1041C0056o2115K4376M5049n4234j1675O1640k4836m2917N0981O062n7555L3637
1053a531M1447n9435q453O1297k8681l9677N4800L785n8265L2157L6862n4891
1065b0585J117N6217l9571l5836O2223J432n9824L4057L3707n6226M740N5375
1077C6826m0143l0824N9006q089n4784M4987K9774o4159O451N7205l9906k7172
$$ plain form
1089 -30828 26817 13798 -38236 8635 33289 -28238 -14136 37856 -10352 -33603 29605 16335
1101 16335 -36198 7627 28147 -28828 -9389 38194 -12708 -31608 30042 11881 -36476 12352
1113 12352 29636 -30560 -11522 35374 -11381 -25418 30363 5461 -37572 16258 29375 -31611
1125 -31611 -9165 34902 -14812 -25391 31710 6288 -34657 15655 22841 -32063 -1714 36423
1137 36423 -19502 -26243 32738 5512 -33095 17398 21059 -32569 -1386 33589 -18916 -20434
1149 -20434 32264 -970 -33710 21168 22242 -32241 -2004 30437 -18885 -17086 31999 -2173
1161 -2173 -31559 20328 17971 -30722 2672 29743 -21527 -17704 30838 -1312 -27560 19818
1173 19818 13589 -30575 4952 28876 -20955 -15192 28853 -4552 -25813 21983 13262 -29605
$$ packed form
1089c0828N7645j3019n2034M6871K4654o1527J4102N1992m8208k3251O3208j3270
1101A6335n2533M3825K0520n6975J9439M7583n0902j8900O1650j8161m8357M8828
1113A2352J7284o0196J9038M6896m6755j4037N5781k4902m3033N3830J3117o0986
1125c1611K2446M4067m9714j0579N7101k5422m0945N0312P186n4904L0349L8137
1137C6423n5925o741N8981k7226l8607N0493L661n3628L1183L4975n2505j518
1149b0434N2698l3234l2740N4878J074n4483L0237L2441m9322J799M9085l4172
1161b173k9386N1887k357m8693L3394K7071n1270L823M8542l2150k6248M7378
1173A9818o229m4164L5527K3924m9831N763M4045l3405k1261M7796q721m2867
$$ plain form
1185 -29605 4553 24885 -20776 -10316 29043 -7705 -25712 21908 11838 -27280 6761 22241
1197 22241 -22246 -9057 28065 -7334 -22018 20883 7301 -26436 9758 21755 -21888 -8435
1209 -8435 25089 -8226 -18699 21207 5666 -25327 8694 18744 -19541 -4850 22967 -10361
1221 -10361 -17612 20593 5599 -22136 8733 15334 -19306 -3112 22045 -9360 -15560 17815
1233 17815 2831 -19411 10495 13689 -19041 -2927 19269 -9103 -12066 17437 745 -18801
1245 -18801 10091 12441 -16260 -1027 16092 -10317 -10050 16975 494 -16204 9154 8961 -15136
1258 -15136 1171 15191 -10033 -9306 14223 -313 -12845 9453 6936 -14182 1066 12885
1270 12885 -8180 -6241 12138 -2251 -11511 9111 6412 -11684 1042 9619 -7983 -4345 11118
$$ packed form
1185b9605L4158K0332m5661J0460L9359l6748j8007M7620j0070l9118L4041J5480
1197B2241m4487J3189L7122l5399j4684M2901j3582l3737L6194J1997m3643J3453
1209h435L3524l3315j0473L9906j5541l0993L4021J0050l8285J4691K7817l3328
1221a0361p251L8205j4994k7735L0869O601l4640J6194K5157l1405o200L3375
1233A7815j4984k2242K9906L194l2730J6114K2196k8372k963K9503j6692j9546
1245a8801K8892K350k8701J5233J7119k6409K67K7025j6481j6698K5358j93k4097
1258a5136J6307J4020k5224P27K3529j4536j2532K2298k517k1118J5248J1819
1270A2885k1065J939J8379j4389r260K0622k699j8096J2726Q577j7602L638J5463
$$ plain form
1283 11118 -1995 -9679 6951 4059 -9185 2635 7912 -7724 -3858 9183 -1624 -6754 6274
1296 6274 2290 -8257 2438 6695 -5616 -2516 6423 -2576 -4937 6069 1811 -6637 1743 4372
1310 4372 -4600 -782 5605 -2352 -4324 4070 1359 -3928 1921 2599 -3936 -639 3984 -1217 -2437
1325 -2437 2454 86 -2935 1522 2315 -2229 -981 1678 -543 -922 1527 276 -1605 74 994 -204
1341 -204 -187 410 -222 -819 69 1059 248 -1100 -195 872 -611 -562 1584 -44 -2151 799 1703 -1604
1359 -1604 -287 2236 -1519 -1924 3046 649 -3232 1523 2262 -3543 -239 4329 -2114 -3358 3915
1374 3915 613 -4511 2668 3334 -5079 -710 5495 -2828 -3566 5649 108 -6433 3660 4516 -6296
1389 -6296 -471 6652 -4147 -4467 7287 320 -7580 4416 4651 -7759 319 8144 -5444 -5233
$$ packed form
1283A1118j3113p684J6630k892j3244J1820N277j5636L866J3041j0807n130J3028
1296F274l984j0547J0695M257j2311L100Q939q999k361J1006m258q448Q380K629
1310D372q972L818O387p957j972Q394k711n287N849O78o535L297M623n201j220
1325b437M891k368l021M457P93m544J248K659k221l79K449j251j881J679R20j198
1341b04J7N97o32n97Q88R90q11j348R05J067j483M9K146j628k107K950R04l307
1359a604J317K523l755m05M970k397l881M755P39n805L304M568o443j244P273
1374C915l302n124P179O66q413M369O205q323p38R215n541o541J0093Q56j0812
1389f296N825P123j0799l20J1754o967p900J1996K35j2410Q078P825j3588K11
$$ plain form
1403 -5233 8712 -119 -8622 5912 5211 -9484 503 9374 -6358 -5276 9931 -1216 -9731 7491
1417 7491 5362 -11049 1465 10212 -8138 -5304 11852 -1950 -10809 8702 5368 -12179 2534
1430 2534 10958 -9633 -5248 13078 -3007 -11328 10264 5017 -13761 3457 11798 -10863 -5034
1443 -5034 14120 -3844 -11870 11499 4755 -14578 4439 12007 -12166 -4488 15250 -5047 -12281
1456 -12281 12770 4283 -15719 5558 12320 -13491 -3999 16009 -6322 -12236 14157 3386 -16532
1469 -16532 7119 12290 -14947 -2864 17073 -7829 -12366 15696 2587 -17260 8509 11979
1481 11979 -16290 -1864 17588 -9194 -11813 16831 1145 -17813 10039 11763 -17420 -932
1493 -932 17955 -10408 -11317 17726 422 -17967 10854 11046 -17917 376 17966 -11821 -10903
$$ packed form
1403e233J3945q831q503J4534p01j4695R987Q871j5732J082J5207j1147q515J7222
1417G491k129j6411J2514Q747j8350K834J7156j3802q859J9511l334j7547J4713
1430B534Q424k0591M385J8326j6085q321K1592n247j8778J7218Q341k2661N829
1443e034J9154j7964q026K3369o744j9333J9017P568k4173P678J9738k0297p234
1456a2281K5051q487k0002K1277O762k5811R492K0008k2331n914K6393j0771j9918
1469a6532K3651N171k7237J2083J9937k4902m537K8062j3109j9847K5769L470
1481A1979k8269J4426J9452k6782k619K8644j5686j8958K7852J724k9183J6488
1493i32J8887k8363r09K9043j7304j8389K8821J92k8963J8293J7590k9787R18
$$ plain form
1506 -10903 18542 -640 -18026 11903 10436 -18639 1255 17950 -12394 -10001 18793 -2156
1518 -2156 -17611 13511 9495 -19444 2545 17619 -13743 -8728 19503 -3646 -17503 14442
1530 14442 8246 -19602 4373 16919 -15464 -7534 20154 -4881 -16702 15493 6608 -19943
1542 -19943 6180 16463 -16362 -6206 19965 -6564 -15827 16629 5389 -20172 6864 15295
1554 15295 -16488 -4468 19594 -8171 -14873 17431 4307 -19672 8187 14333 -17346 -3507
1566 -3507 19637 -8481 -13868 17023 2464 -18829 9917 13109 -18343 -2143 19181 -9898
1578 -9898 -12671 18023 1185 -18839 10462 11949 -17702 27 17996 -11992 -10956 19164 -374
1591 -374 -18452 11604 10424 -18280 1437 17608 -12594 -9683 18367 -2429 -16869 13644 8860
$$ packed form
1506a0903K9445j9182j7386K9929j467k9075J9894J6695l0344K393K8794k0949
1518b156j5455L1122m016k8939K1989J5074l1362N015K8231k3149j3857L1945
1530A4442o196k7848K3975J2546l2383P930K7688k5035j1821L2195q885k6551
1542a9943K6123J0283l2825J0156K6171k6529r263L2456j1240k5561K7036Q431
1554A5295l1783J2020K4062k7765o702L2304j3124k3979K7859O146l1679J3839
1566c507K3144k8118n387L0891j4559k1293K8746L192l1452J6200K1324k9079
1578i898k773L0694j6838k0024K9301J487k9651J7729J7969k9988J036L0120j9538
1591c74j8078L0056j180k8704J9717J6171l0202K911K8050k0796j4440L0513m784
$$ plain form
1604 8860 -19279 2583 17169 -12745 -8136 17973 -3855 -15840 14097 7384 -18488 4206
1616 4206 15547 -14351 -6894 18633 -4260 -15325 13384 5787 -17110 6071 14135 -15196 -5269
1629 -5269 18257 -5754 -14023 14720 4552 -17677 6279 13352 -14334 -3348 16605 -8075
1641 -8075 -12253 16198 3007 -17692 7523 12141 -15160 -1956 16746 -8461 -11363 15304 1226
1654 1226 -15836 9575 10358 -16468 -841 16600 -8836 -10129 15116 -241 -15457 10064 9611
1667 9611 -15543 286 14826 -10140 -8488 16005 -894 -15228 9707 8313 -14557 1844
1679 1844 14010 -10967 -7834 15366 -1530 -13592 10438 6609 -15149 2464 13695 -10278
1691 -10278 -6550 14068 -3247 -12349 11615 5892 -14922 3000 12200 -10753 -4803 14270 -4095
$$ packed form
1604H860k8139K1862J4586k9914M609K6109k1828j1985K9937o713k5872K2694
1616D206J1341k9898P457K5527k2893j1065K8709p597k2897K3181Q064k9331R927
1629e269K3526k4011q269K8743j0168k2229K3956P073k7686J0986J9953k4680
1641h075m178K8451j3191k0699K5215M618k7301J3204J8702k5207k902K6667j4078
1654A226j7062K5411P83k6826J5627J7441k5436j293K5245j5357j5216K5521m53
1667I611k5154J5829J4540k4966J652K4493j6899j4334K4935j394k2870J6401
1679A844J2166k4977L133K3200j6896j2062K4030l829k1758J7613J1231k3973
1691a0278L728K0618j7315r102K3964n723k0814J7922R200k2953N950J9073j8365
$$ plain form
1704 -4095 -12120 10868 4858 -13307 4419 10572 -11810 -3887 14127 -4166 -10644 10686 3187
1717 3187 -13039 5181 10390 -10853 -3455 12129 -4784 -8764 11100 2313 -12768 4701 9089
1730 9089 -9918 -1935 11405 -5543 -8576 10358 2398 -10695 4830 7143 -10005 -1056 11078
1743 11078 -4973 -7425 8988 814 -9642 5766 6697 -9700 -1212 9439 -4785 -5580 8925
1756 8925 -138 -9416 5297 5926 -8076 -10 7790 -5788 -4813 8868 190 -8014 4585 4149
1770 4149 -7597 985 7721 -5226 -4567 6940 -396 -6104 5201 3260 -7516 598 6620 -4014
1784 -4014 -2948 6130 -1418 -5911 4709 3378 -5745 493 4496 -4226 -1951 6016 -1042 -5208 3288
1799 3288 2123 -4578 1634 4246 -4131 -2365 4645 -398 -3240 3225 928 -4529 1311 3894 -2641
$$ packed form
1704d095q025K2988o010j8165J7726O153k2382P923J8014j8293o478K1330p499
1717C187j6226J8220N209k1243P398J5584j6913l980J9864q787j5081J7469M388
1730I089j9007P983J3340j6948l033J8934p960j3093J5525K313j7148Q949J2134
1743A1078j6051k452J6413q174j0456J5408R31j6397Q488J0651j4224p95J4505
1756H925r063r278J4713O29j4002Q066P800j3578R75J3681q678q204J2599m36
1770D149j1746Q582O736j2947O59J1507p336n708J1305j941j0776Q114O022j0634
1784d014J066R078p548m493J0620j331r123O238M003q722K275P967p058m166Q496
1799C288j165o701O212K612q377J766P010n043k842O465k297n457N840K583o535
$$ plain form
1814 -2641 -1416 3099 -1464 -2672 3440 1400 -3554 231 2172 -2083 -204 3020 -1202 -2662 1803
1829 1803 1035 -1644 970 1262 -2340 -769 2365 106 -1263 729 -101 -1520 856 1614 -865 -1030
1845 -1030 340 -124 -93 1094 331 -1225 -583 675 552 109 103 -243 -744 -154 1148 678 -911 -675 263
1864 263 -187 91 1157 -232 -1716 212 1155 -488 95 1092 -1426 -1365 2031 1025 -1677 306 781
1881 781 -1911 111 2741 -968 -2235 1467 315 -1837 1819 1833 -3135 -962 2989 -760 -1519 2705
1897 2705 -241 -3659 1699 2916 -2536 -553 2715 -2323 -2070 4040 575 -4012 1423 2046 -3441
1912 -3441 539 4293 -2742 -3306 3817 499 -3453 2897 2028 -5061 83 4885 -2373 -2380 4212 -1203
1928 -1203 -4706 4071 3229 -5122 43 4151 -3778 -1838 6007 -1069 -5578 3623 2475 -5058 1868
$$ packed form
1814b641J225M515m563j208O112k040m954L785J941m255J879L224m222j460M465
1829A803p68k679K614K92l602J571L134k259j369J992q30j419K376P58k479j65
1845a030J370m64L1J187p63j556O42J258j23m43ol46n01N90J302m70j589K36R38
1864B63m50K78J066j389j484J928R43j643N83R97k518O1L396j006k702J983M75
1881G81k692K022K630l709j267L702j152k152L656J4m968K173L951l749p59M224
1897B705k946l418N358J217n452J983L268n038K53O110l465m587N435O23n487
1912c441L980L754p035n64P123l318l952O350q69p089N144M802p258pO592n415
1928a203l503Q777q42q351N165M108p929J940P845p076m509R201j148p533O926
$$ plain form
1943 1868 4929 -5319 -2740 6396 -799 -4784 4666 1498 -6796 2094 6031 -4746 -2401 5844
1957 5844 -2504 -4986 6307 2169 -7396 1810 5288 -5450 -1080 7387 -3182 -6352 6118 2304
1971 2304 -6626 3139 4845 -7252 -1401 8237 -2827 -5592 6410 613 -7790 4461 6201 -7385
1985 -7385 -1656 7438 -3927 -4625 8155 360 -8803 4206 5612 -7305 17 7986 -5602 -5685
1999 -5685 8528 829 -7913 4755 4234 -8769 739 9182 -5316 -5524 7982 -551 -7852 6351
2013 6351 4919 -9337 121 8260 -5547 -3908 9197 -1711 -9318 6342 5400 -8501 995 7514
2027 7514 -7040 -3911 9940 -1353 -8429 6598 3493 -9626 2682 9078 -7349 -4778 8882
2040 8882 -1866 -7111 7762 2628 -10463 2812 8447 -7498 -2990 9717 -3526 -8353 8190
$$ packed form
1943A868L061j0248K579R136p195l985R450l168q294Q890L937j0777K345Q245
1957E844q348k482J1293m138r565R206L478j0738M370Q467j0569l170J2470l814
1971B304q930R765J706j2097N851R638j1064k765J2002n797q403J2251J740j3586
1985g385N729R094j1365o98J2780p795r163J3009J406j2917P322P969j3588q3
1999e685J4213p699q742J2668n21j3003R508Q443j4498k08J3506q533p301J4203
2013F351j432j4256R458Q139j3807J639J3105j0908p607J5660r42j3901R496O519
2027G514j4554L129J3851j1293p076J5027l105j3119J2308O396j6427K571J3660
2040H882j0748n245J4873n134j3091J3275N635j5945M508J2707j3243m827J6543
$$ plain form
2053 8190 3768 -9155 2709 6490 -8401 -1410 10702 -4015 -8491 8047 2601 -9312 4100
2066 4100 7319 -8693 -2574 9340 -3585 -6079 8812 602 -10674 4877 8149 -8290 -2218
2079 -2218 8862 -4555 -6153 9046 1136 -9381 4613 5638 -9133 197 10262 -5599 -7407
2092 -7407 8539 1392 -8095 5228 4633 -9370 544 9279 -5706 -5049 9205 -1074 -9494 6423
2106 6423 6186 -8614 -309 7256 -5856 -3222 9532 -1993 -8988 6544 4591 -8997 1712
2119 1712 8438 -6742 -4877 8569 -714 -6625 6254 2126 -9387 2988 8524 -6954 -4053
2132 -4053 8403 -2123 -7089 6992 3255 -8477 1955 6037 -6685 -1208 9094 -3879 -7776
2145 -7776 7274 3272 -7766 2741 5580 -7277 -1458 8383 -3213 -5550 7072 357 -8482
$$ packed form
2053H190m422j2923J1864L781j4891O991J2112j4717m476J6538n446j1913J3412
2066D100L219j6012O119J1914j2925k494J4891q210j1276J5551L272j6439O072
2079b218J1080j3417j598J5199p910j0517J3994J025j4771R330J0065j5861j808
2092g407J5946p147r487J3323n95j4003R914Q735j4985O57J4254j0279q420J5917
2106F423k37j4800Q305P565j3112K634J2754j1525o995J5532j953j3588J0709
2119A712O726j5180J865J3446r283n911J2879m128j1513J2375N536j5478K901
2132d053J2456j0526m966J4081l737j1732J0432M082j2722N477J0302j2973l897
2145g776J5050m002j1038J0507K839j2857N819R841j1596k337J2622o715q839
$$ plain form
2158 -8482 4642 6742 -7404 -2142 7059 -3371 -4135 7494 -80 -8077 4304 4995 -7073 309
2172 309 7541 -5085 -5438 7439 1073 -6538 3889 3092 -7325 1263 7599 -4884 -4483 6775
2186 6775 -712 -6431 5346 4024 -7370 4 6064 -4189 -2301 7001 -2100 -6906 5288 3756
2200 3756 -6411 1186 5330 -5588 -2553 7228 -1128 -5579 4522 1622 -6452 2793 5900 -5625
2214 -5625 -2753 6059 -1748 -4286 5544 1165 -7001 2051 5041 -4641 -993 5783 -3275 -4899 5814
2229 5814 1995 -5673 2006 3474 -5269 -198 6415 -2678 -4539 4549 661 -4954 3417 3759 -5702
2244 -5702 -1234 5350 -2094 -2851 4785 -416 -5561 3075 3890 -4373 -300 4203 -3408 -2682 5452 394
2260 394 -4934 2155 2325 -4255 1033 4635 -3440 -3137 4195 5 -3394 3278 1687 -5075 374 4466
$$ packed form
2158h482J3124K100j4146N262R201j0430p64J1629p574p997J2381O91j2068P382
2172C09P232j2626l53J2877o366p611J0427p97j0417Q588O336j2483M01J1258
2186F775p487n719J1777j322j1394P374O060j0253J888R302r101m806J2194j532
2200C756j0167P597M144j0918L035R781q356m451J0101k900q074R245L107j1525
2214e625K872Q812p807k538R830m379q166R052K990r682L648O776r058j624J0713
2229E814l819p668P679J468q743N071O613r093j861R088l888n615Q371L42r461
2244e702M468O584p444p57P636n201n145Q636Q15q263M073M503p611P26Q134n058
2260C94n328P089J70o580N288L602q075L03P332m190l399O672j591o762N449M092
$$ plain form
2276 4466 -2229 -1834 3556 -1329 -3701 3435 2422 -3781 114 2688 -2819 -880 4357 -902 -3855
2291 -3855 2141 1528 -2858 1351 2784 -3229 -1761 3451 -68 -2202 2166 342 -3466 1148 3132
2306 3132 -1947 -1278 2132 -1217 -1852 2889 1144 -2992 42 1651 -1411 34 2541 -1314 -2396
2321 -2396 1672 1115 -1396 850 935 -2361 -463 2481 -64 -1356 810 -236 -1512 1226 1679 -1401
2337 -1401 -963 792 -402 -249 1588 1 -1850 -1 1026 -141 231 621 -1050 -1004 967 920 -350
2354 -350 -180 -316 -793 252 1241 77 -863 -450 7 266 632 446 -559 -827 -31 738 520 -73 -428
2373 -428 -501 -317 647 863 -377 -860 -110 -22 89 873 219 -1313 -572 917 187 -74 561 -617 -1286
2392 -1286 830 1319 -571 -386 323 -938 -276 1842 266 -1638 81 603 -857 607 1640 -1334
$$ packed form
2276D466o695L95N390m885k372P136j013o203L895K574n507J939N237n259k953
2291c855N996o13m386M209J433o013J468N212l519k134M368j824l808M614J984
2306C132n079O69L410l349o35M741j745m136L034J609l062J445K507l855j082
2321b396M068n57k511K246Q5l296J898K944k545j292K166j046j276K738M53l080
2337a401M38J755j194J53J837j587j851J849J027j167L72L90j671M6J971m7j270
2354c50J70j36m77J045R89j164r40M13M57K59L66j86j005k68P96P69k18n93l55
2373d28p3J84R64K16j240m83P50Q8J11P84o54j532P41J489p30k61O35j178o69
2392a286K116M89j890J85P09j261O62K118j576j904J719N22j460J464J033k974
$$ plain form
2408 -1334 -1570 1322 536 -858 1117 402 -2209 41 2260 -560 -1039 1299 -690 -1825 1892 1649
2424 1649 -2112 -517 1354 -1355 -450 2667 -420 -2686 1186 1342 -1710 829 1893 -2516 -1443
2439 -1443 2921 157 -1926 1611 336 -2976 1096 2993 -1890 -1418 2156 -1008 -1863 3054 1049
2454 1049 -3497 403 2339 -2020 -250 3174 -1659 -3049 2650 1319 -2634 1243 1858 -3469 -600
2469 -600 4043 -976 -2636 2432 101 -3290 2291 2925 -3443 -1115 3216 -1566 -1808 3806 5 -4302
2485 -4302 1676 2760 -2933 175 3353 -2973 -2581 4172 678 -3608 1940 1669 -4119 664 4411
2500 4411 -2536 -2578 3492 -613 -3300 3556 2083 -4805 5 4013 -2493 -1541 4194 -1360 -4334 3349
2516 3349 2391 -4021 956 3310 -3969 -1635 5373 -590 -4275 2901 1357 -4302 1965 4137 -4205
$$ packed form
2408a334k36K892p86j394J975p15k611K250K219k820m79K338j989j135L717k43
2424A649l761J595J871k709R05L117l087k266L872J56l052K539J064m409J073
2439a443M364k764k083L537j275l312M072J897m883M72L574l164q55M917k005
2454A049m546L900J936m359J770L424m833j390N699j331l953L877O15n327K869
2469f00M643n019j660N068k331l391N581O34o368K328M331m782k42N614l801m307
2485d302N978J084n693L108L178o326L92O753l494m286N548k71n788M783L747
2500D411o947m2O070m105k687O856j473o888M810M008o506R52N735n554k974P683
2516C349r58o412M977K354p279K334P008n963l685P176j544n659O267K172q342
$$ plain form
2531 -4205 -2112 4551 -1266 -3347 4331 1157 -5615 1261 4281 -3339 -1031 4308 -2583 -3778 4980
2546 4980 1609 -5108 1674 3388 -4532 -594 5557 -2112 -4080 3856 511 -4409 3324 3325 -5716 -978
2562 -978 5588 -2027 -3266 4478 -45 -5308 2943 3612 -4465 14 4452 -3872 -2956 6160 519 -5779
2578 -5779 2317 3084 -4425 565 4866 -3697 -3144 5048 -341 -4599 4049 2637 -6168 37 5740
2593 5740 -2611 -2700 4340 -1253 -4491 4477 2583 -5700 735 4646 -4078 -2179 5977 -781 -5235
2608 -5235 3069 2140 -4294 1996 3947 -5133 -1987 6080 -958 -4506 3982 1532 -5561 1555 4633
2623 4633 -3671 -1523 4381 -2523 -3540 5453 1475 -6153 1248 4357 -3792 -1087 4926 -2186 -3962
2638 -3962 4165 1030 -4458 2664 3121 -5474 -947 5970 -1580 -3972 3583 384 -4371 2908 3308
$$ packed form
2531d205K093O663n817k081P678l174o772O876L020p620K308N339o891j195Q758
2546D980l371o717O782J714p920L938O151p669j968P936l345m920P733Jr041M738
2562i78O566p615j239P744m523n263Q251O69q077M479M438q324R16R116n641o298
2578e779Q096P67p509M990M301q563N53Q192n389m258Q648j412q805O205N703
2593E740q351q9P040n593l238Q968j894q283O435L911q724J899Q156o758m454
2608e235Q304r29o434O290J951r080L146Q067p038l548Q488k450p093P116L078
2623D633q304K148N904o904j017Q993l978p628P401L109q149K705O013p112j776
2638c962Q127l135n488P122M57q595M527O917p550k392P555l199m755P279M00
$$ plain form
2653 3308 -4625 -615 4447 -2837 -2664 5306 256 -5535 2055 3381 -3584 257 3782 -3467 -2508
2668 -2508 4965 -1 -4330 2869 2075 -4869 484 4808 -2609 -2627 3569 -877 -3267 3811 1797 -5068
2684 -5068 438 4108 -2787 -1587 4313 -1150 -4121 3022 2087 -3520 1069 2830 -3915 -1164 4977
2699 4977 -804 -3797 2678 1151 -3762 1667 3372 -3372 -1447 3568 -1347 -2416 3734 520 -4615
2714 -4615 1271 3287 -2766 -663 3261 -2198 -2620 3660 865 -3498 1525 1900 -3543 138 4086
2729 4086 -1871 -2794 2756 133 -2759 2483 1945 -3836 -403 3296 -1617 -1511 3134 -648 -3486 2237
2745 2237 2275 -2792 105 2359 -2478 -1306 3727 -91 -3064 1655 1159 -2721 1041 2884 -2510 -1810
2761 -1810 2688 -321 -1992 2394 726 -3369 615 2778 -1620 -857 2277 -1268 -2266 2601 1263
$$ packed form
2653C308p933M010N062p284J73P970n050n791P590J326o965L841L525p249R59
2668b508P473m966m329P199p94o944N353M324p417j8O196m446k390P078k014o865
2684e068N506L670o895J200N900n463k971P143r35n607M589J761o745K751O141
2699D977n781k993O475j527m913N429J705o744J925N015m915j069O150l214n135
2714d615N886K016o053K103L924n459m22O280k795m363N023L75n443L681L948
2729D086n957r23N550k623k892N242n38n781L433L699m913J06M645l782k838N723
2745B237L8n067K897K254m837J172N033l818k973M719m96l880L762J843n394P00
2761a810M498l009j671M386j668m095L984K163m398P63L134l545r98M867j338
$$ plain form
2776 1263 -2622 445 1572 -2158 -114 2971 -962 -2447 1670 655 -1886 1439 1602 -2608 -796
2791 -796 2529 -495 -1222 1798 -260 -2519 1317 2036 -1639 -552 1537 -1316 -1141 2377 388 -2316
2807 -2316 484 1075 -1409 442 1880 -1412 -1546 1604 445 -1182 1087 574 -2097 -31 2040 -464
2823 -464 -933 996 -507 -1323 1505 1171 -1507 -382 825 -734 -148 1702 -327 -1726 506 822
2839 822 -556 482 727 -1322 -770 1237 353 -619 408 -172 -1162 484 1294 -436 -695 264 -255 -274
2857 -274 987 411 -1003 -439 462 23 279 553 -511 -929 308 694 87 -66 -147 -603 -182 724 432
2876 432 -303 -506 -254 30 421 455 -98 -697 -337 413 426 99 -96 -422 -540 220 826 26 -624 -122 -89
2897 -89 -128 658 505 -848 -614 433 196 97 667 -231 -1202 239 1070 -142 -174 384 -779 -718 1226 646
$$ packed form
2776A263l885L067J127l730K044L085l933j485M117j015k541L325J63m210J812
2791g96L325l024p27L020k058k259L836P19l675J087K089k853J75L518j989k704
2807b316K800N91k484J851J438l292j34L150j159j627K269n13k671K066K071k504
2823d64m69J929j503q16K828l34k678J125J207j559N86J850k029j399K232L16
2839H22j378J038K45k049N52K007q84r72J027n80r90J646Q10j730k59R59n19j9
2857b74J261n76j414N64R01m39K56K74j064m18J237L86o07j53q1m56M21R06k92
2876D32p35k03K52K84L91L4n53n99L60P50J3l27j95l26j18P60O06q00o50N02L3
2897h9l9P86j53j353K34J047k37r9N70q98r71J441Q31j212l2N58j163O1J944n80
$$ plain form
2917 646 -1026 -136 354 -729 197 1386 -542 -1319 613 474 -714 780 778 -1572 -572 1501 29
2934 29 -695 872 -238 -1629 924 1546 -1102 -505 944 -906 -740 1960 383 -1954 323 1047 -1166
2951 -1166 360 1669 -1289 -1547 1606 451 -1284 1043 649 -2206 9 2288 -697 -1187 1427 -468
2967 -468 -1762 1728 1431 -2069 -376 1597 -1286 -598 2347 -417 -2422 1160 1327 -1683 540 1799
2983 1799 -2062 -1270 2548 151 -1873 1424 490 -2442 885 2539 -1742 -1242 2020 -757 -1696 2442
2999 2442 929 -2968 369 2045 -1650 -297 2587 -1356 -2436 2310 1117 -2306 942 1491 -2675
3014 -2675 -344 3190 -896 -2134 2071 163 -2591 1772 2298 -2841 -883 2587 -1191 -1450 2906
3029 2906 -123 -3323 1484 2167 -2413 -7 2745 -2152 -2053 3238 571 -2754 1458 1295 -3059 640
$$ packed form
2917F46j672Q90M90j083R26J189j928p77J932j39j188J494kk350J000K073j472
2934B9p24J567j110j391K553O22k648N97J449j850J66K700j577k337K277P24k213
2951a166J526J309k958k58L153j155j735K327l94k855K215K279k985m90K614j895
2967d68j294L490k97l500J693J973k883O88K945k764k005L582J67l010K223J259
2983A799l861P92L818k397k024L297r34k932L327J654m281N00L262k777r39M138
2999B442j513l897L337J676l695J353K884l943j080M746j193l423L248N49m166
3014b675K331L534m086j238M205j908k754M363N26n139J958L470l778k59M356
3029B906l029l200M807O83m580K406K752m897R9N291k667l325M212j63m354L699
$$ plain form
3045 640 3389 -2123 -2167 2843 -192 -2703 2478 1646 -3525 -47 2945 -1864 -1041 3172 -1186 -3316
3061 -3316 2710 1968 -3208 426 2531 -2682 -1165 3742 -606 -2939 2298 793 -3355 1557 3178
3076 3178 -3186 -1722 3381 -552 -2369 2905 619 -3827 1281 3010 -2786 -779 3433 -1849 -3049
3091 -3049 3464 1399 -3597 872 2139 -2962 -107 3842 -1958 -3008 3198 757 -3581 1980 2747
3106 2747 -3663 -952 3593 -1262 -1948 3214 -441 -3838 2615 2871 -3636 -563 3494 -2116 -2230 3755
3122 3755 287 -3615 1754 1783 -3374 952 3750 -2982 -2654 3842 349 -3299 2233 1611 -3767 389
3138 389 3548 -2316 -1675 3592 -1076 -3629 3203 2331 -3892 -105 3033 -2284 -1174 3769 -1053 -3492
3154 -3492 2765 1620 -3556 1147 3270 -3296 -1905 3882 -233 -2753 2411 603 -3668 1523 3314
$$ packed form
3045F40K749n512m4N010l035k511N181q32n171L478K992m809Q23M213m358k130
3061c316O026p42n176L634K105n213J517M907m348k333N237j505m148M912J621
3076C178o364J464N103l933j817N274k286m446N108J729n796K007M212n282j200
3091c049O513k065m996M469J267n101K855L949n800j050O206k441m338N561P67
3106B747o410K711M545m855o86N162l655l397O453K56o507L073M057n610j14N985
3122C755l468l902N369K9n157M326K798o732L28O496l493l648N532o22n378M156
3138C89L159n864O41N267m668k553O832q72o223L787L138n317J110M943m822k439
3154c492O257j145n176M703K123o566J391N787m115k520N164j808m271N191J791
$$ plain form
3169 3314 -3072 -1401 3536 -1261 -2826 3339 1287 -3774 657 2514 -2577 -284 3452 -1900 -2944
3184 -2944 3240 1141 -3321 1293 2266 -3242 -669 3638 -1128 -2315 2616 33 -3189 2232 2601
3199 2601 -3324 -841 3160 -1378 -1857 3097 132 -3450 1514 2164 -2595 97 2765 -2268 -2004 3312
3215 3312 551 -2915 1411 1413 -2912 486 3087 -1847 -1873 2533 -272 -2434 2321 1526 -3169 -96
3231 -96 2612 -1504 -1001 2598 -904 -2679 2106 1559 -2484 455 1959 -2271 -938 3057 -337 -2321
3247 -2321 1566 676 -2276 1162 2228 -2246 -1120 2315 -549 -1579 2127 513 -2716 710 2063
3262 2063 -1553 -462 1946 -1249 -1695 2299 827 -2263 589 1243 -1905 -74 2421 -971 -1903 1600
3278 1600 363 -1669 1357 1241 -2184 -443 2053 -651 -980 1644 -278 -2044 1300 1544 -1517 -201
$$ packed form
3169C314o386J671M937m797j565O165k052n061M431J857n091K293L736n352j044
3184b944O184k099m462M614R73n508K573M307m766j187M931k583l222N421L69
3199B601n925K483M001m538m79M954k965l582M964O50m759K692K668n033K64N316
3215C312k761l466M326Km325L398K601m934k6M406k805k162M755p95m695L073
3231i6K708m116N03L599l502j775M785n47m043K939J504m230J333L995l394j984
3247b321L887q90k952L438J066m474J126L435k864j030L706j614l229L426J353
3262B063l616J091K408l195m46L994j472l090K852O54l148J831K495l392r32L503
3278A600j237k032L026j16l425J741K496k704l29K624j922j766L344K44l061J316
$$ plain form
3294 -201 1362 -1184 -813 2039 88 -1815 654 777 -1403 501 1603 -1364 -1181 1518 169 -1067
3310 -1067 1020 397 -1770 249 1621 -708 -663 1055 -511 -1177 1337 804 -1427 -52 881 -835
3326 -835 -114 1470 -405 -1340 716 574 -821 527 793 -1235 -583 1222 52 -653 648 -53 -1107
3343 -1107 581 1075 -659 -461 558 -380 -390 1057 252 -1021 -51 525 -377 173 677 -597 -830 533
3361 533 467 -294 205 75 -735 -89 857 91 -459 53 -152 -325 488 464 -512 -450 215 86 116 348 -66
3382 -66 -594 -127 385 279 34 -107 -381 -227 293 436 24 -319 -211 13 135 353 197 -364 -462 115 397
3403 397 38 -27 -73 -460 -118 583 272 -398 -102 -69 -377 362 684 -423 -571 302 156 -160 551 253 -886
3424 -886 -182 781 -39 -244 430 -293 -863 629 789 -668 -269 451 -571 -262 1131 83 -1088 301
$$ packed form
3294b01J563k546L71K852j951j903K469J23k180J904J102k967J83K699j349j236
3310a067K087o23k167K019J372k329M5J718j566o66K514n33k231J375R33j716
3326h35P21J584j875r35K056j42j395J348K66k028O52J805j170p05J301p01j054
3343a107J688M94j734J98J019r38j0J447q05j273R70N76r02N50N04j274k33J363
3361E33o6p61M99j30q10O46R46p66n50N12k05j73Q13k4r76O2O65j29L0K32m14
3382f6n28M67N12j06k45j41k74J54N20J43m12l43J08K24J22K18j56n61r8N77K82
3403C97l59o5m6l87L42P01l11o70K96L3l08P39L22j107j48Q73j46l16P11k98j139
3424h86P04R63q20k05O74p23n70J492J60j457L99P20j022L09J393j048j171J389
$$ plain form
3442 301 516 -742 318 920 -926 -846 1080 190 -762 748 306 -1383 186 1378 -585 -713 942
3459 942 -268 -1049 1170 874 -1395 -105 1035 -870 -248 1512 -373 -1579 892 793 -1231 356
3475 356 1129 -1422 -740 1710 -77 -1268 953 314 -1659 644 1660 -1275 -881 1440 -473 -1198
3491 -1198 1621 567 -2008 253 1508 -1188 -286 1796 -930 -1688 1647 777 -1686 600 1178 -1820
3507 -1820 -345 2263 -599 -1635 1391 317 -1863 1141 1570 -1939 -631 1861 -786 -1093 2002
3522 2002 37 -2339 943 1613 -1712 -126 1850 -1395 -1366 2253 383 -2113 991 1149 -2121 288
3538 288 2344 -1384 -1533 1973 0 -1880 1612 1179 -2515 -38 2277 -1249 -1063 2218 -482 -2341
3554 -2341 1725 1406 -2213 234 1864 -1866 -945 2779 -330 -2387 1519 987 -2205 724 2101 -2106
$$ packed form
3442C01K15j258J060O02j846Q0J926q90r52J510m42j689J569J192j963j28J655
3459I42j210p81K219k96k269J290J140j905O22J760j885j206K471r9k024J587
3475C56P73k551O82K450j787j191K221o39j973K303J016k935L94K321j913p25
3491a198K819j054k575K261J255k696R02K082k726p58L335q70k463K286N78k998
3507a820J475K608k862j036L026j074k180L004M29l509J308K492k647l07L095
3522B002j965k376L282O70l325J586J976l245K9L619j870k496L104J58l270K409
3538B88K056l728j49L506j973j880L492m33l694K477K315l526J86L281k700j859
3554b341M066l19l619K447J630l730R21L724l109k057L906n32l192K929J377m207
$$ plain form
3570 -2106 -1087 2475 -497 -1810 2102 625 -2829 742 2352 -1748 -823 2241 -978 -1871 2409
3585 2409 692 -2589 865 1870 -2229 -349 2862 -1130 -2260 2073 622 -2231 1337 1661 -2661
3600 -2661 -455 2870 -1067 -1840 2350 176 -2810 1400 2034 -2347 -382 2346 -1605 -1483 2911 134
3616 134 -2994 1415 1854 -2417 86 2613 -1762 -1758 2583 7 -2404 1824 1263 -3043 321 3021
3632 3021 -1650 -1623 2402 -374 -2414 2038 1359 -2853 341 2367 -2030 -1024 3065 -585 -2890 1877
3648 1877 1412 -2491 678 2135 -2364 -1013 2998 -606 -2439 2151 930 -3061 853 2675 -2116
3663 -2116 -1190 2523 -840 -2015 2529 760 -3126 847 2408 -2269 -755 2833 -1069 -2404 2377
3678 2377 915 -2605 1018 1818 -2661 -429 3075 -1098 -2282 2237 498 -2664 1343 2021 -2525
$$ packed form
3570b106J019L562k972j313L912j477l454L571J610m100R25L064l219q93M280
3585B409j717l281L454J005m099J880L211l992j130M333j451k853L568L24m322
3600b661K206L325l937p73M190k174k986M210O34m381J965K728l951J22M394k777
3616A34l128M409M39m271K503K527m375MM341k576k411M228n61m306L364K700
3632C021m671K7M025k776k040M452o79m212L194K026m397J006M089l650k305M767
3648A877m65l903L169J457m499J351M011l604j833M590j221l991L914J822m791
3663b116R26L713l363j175M544j769l886L973J561m677J514L588l902j335M781
3678B377j462l520L623Q00m479K232L504m173j184M519j739l162M007O78m546
$$ plain form
3693 -2525 -533 2573 -1220 -1656 2616 139 -2998 1296 2026 -2197 -274 2372 -1553 -1742 2629 260
3709 260 -2577 1327 1514 -2535 89 2745 -1480 -1841 2239 107 -2247 1618 1390 -2725 -110 2448
3725 2448 -1348 -1342 2357 -265 -2497 1696 1577 -2327 -13 2052 -1624 -1063 2508 -244 -2278 1440
3741 1440 1060 -2181 506 2156 -1777 -1200 2189 -177 -1786 1564 794 -2336 451 2064 -1435 -887
3757 -887 1956 -643 -1799 1755 898 -2129 360 1572 -1579 -530 2120 -653 -1809 1477 727 -1786
3773 -1786 656 1381 -1761 -597 1983 -441 -1360 1388 295 -1876 761 1513 -1481 -583 1528 -668
3789 -668 -1112 1626 295 -1795 581 1157 -1288 -69 1493 -866 -1197 1393 330 -1318 740 788
3805 788 -1368 -52 1505 -620 -903 1116 -58 -1270 931 865 -1382 -164 1130 -693 -567 1236
$$ packed form
3693b525J992L106l793m36M272k477l137M294P30m223J923K646l925j89M371k369
3709B60k837L904J87m049K624K656m225l61M080k132k354L865k28m115K615K558
3725B448l796OL699k622k232M193j19l904K314K065l676N61L571k752k034L718
3741A440l80l241K687J650l933N77L389k366j609L350p70l130K787J613l499N48
3757h87K843k599j156L554q57l027K489J212l151J049K650k773j156L286p50k513
3773a786K442P25l142J164K580k424r19K748j093k171K637P52k994Q98K111k196
3789f68m44K738j331k090K376N76k445J219J562k359l31K590j063j648K058M8
3805G88k156J316J557k125k83K019j174j212K201o6k247J218J294j823J26J803
$$ plain form
3821 1236 -102 -1254 649 738 -921 141 968 -848 -659 1186 19 -913 584 396 -1041 267
3837 267 1048 -633 -516 827 -119 -638 803 343 -983 10 809 -529 -287 729 -330 -762 622
3854 622 406 -636 137 403 -664 -162 776 -124 -589 294 57 -504 275 484 -523 -350 422 -43 -233
3873 -233 417 27 -569 115 415 -156 -151 248 -286 -331 359 191 -291 -37 64 -221 55 373 -79 -323 31
3894 31 109 -69 87 59 -232 -168 121 153 -48 -81 -40 -78 -47 212 75 -193 -193 116 75 -36 139 72 -277 -36
3918 -36 273 -75 -97 181 -131 -289 311 293 -420 -130 260 -181 -191 465 50 -572 143 278 -341 54 498
3939 498 -374 -460 554 97 -530 268 265 -703 -26 801 -338 -470 586 -59 -619 561 505 -825 -96 760
3959 760 -421 -419 921 -119 -952 559 582 -794 -1 831 -737 -495 1043 -45 -929 593 413 -968
$$ packed form
3821A236j338j152J903Q9j659J062Q27j816J89J845j167r32J497j88j437J308
3837B67P81j681J17J343r46n19J441m60j326R93P99j338K42J016j059m32J384
3854F22k16j042P73K66j067N02R38r00m65Q83k37n61P79K09j007J73P72m65j90
3873b33O50l90n96O84L00n71NL99n34m5O90j68m82K54J01k85K76L18m52k44L54
3894C1P8j78J56k8k91O4K89L2k01l3M1l8L1K59j37k68%L09m1j11J75o7l49K41
3918c6L09l48k2K78l12j58O00j8p13K90L90m41j0O56m15o22P15J35o19L95M44
3939D98q72q6J014m57o27P98lr68O77Q27j139j32J056o45n60J180n6j330P29Q56
3959G60j181KJ340j040q33J511K3j376P93Q32j568K42J538j088q84J522j80j381
$$ plain form
3977 -968 278 1038 -808 -636 990 -132 -987 924 492 -1291 147 1077 -801 -465 1191 -325 -1175
3994 -1175 1019 638 -1308 217 1076 -996 -489 1505 -256 -1207 979 444 -1380 522 1161 -1245
4010 -1245 -553 1489 -342 -1156 1256 372 -1594 465 1276 -1262 -437 1462 -661 -1185 1459 421
4026 421 -1698 585 1147 -1440 -324 1669 -736 -1299 1426 362 -1589 739 1183 -1584 -235 1700
4042 1700 -731 -1147 1554 151 -1715 968 1242 -1688 -171 1745 -957 -1143 1717 136 -1817 973
4058 973 1171 -1630 24 1746 -1171 -1162 1799 -16 -1748 1173 1057 -1898 75 1802 -1151 -1022 1836
4075 1836 -187 -1720 1324 963 -1901 192 1742 -1319 -911 1932 -324 -1810 1444 855 -1912 393
4091 393 1648 -1477 -739 2003 -387 -1651 1531 608 -1986 592 1688 -1544 -751 1965 -563 -1579
$$ packed form
3977i68J246P60j846J72J626j122q55J911m32j783J438R30j878L36J656j516q50
3994a175K194l81j946J525Q59k072N07J994j761r51K186n35j824J902O39k406
4010a245O92K042j831q14K412q84j966K059Q11k538Q25J899k123n24K644j038
4026D21k119K283N62k587J116J993k405n63K725j064j951K328M44k767J349J935
4042A700k431m16K701j403j866K683K74k930J517J916k702j86K860j581j953K790
4058I73J98k801J654J722k917RK961j815j732K921j16k955J973J727k953J29K858
4075A836k023j533L044l61k864K093J550l061M08K843k256j486L254n89k767K305
4091C93J255l125P38K742k390j264L182r23k594K578J096l232P93K716k528j016
$$ plain form
4107 -1579 1640 599 -2024 615 1545 -1610 -482 2028 -794 -1600 1750 608 -2060 803 1537 -1844
4123 -1844 -403 2089 -892 -1495 1828 287 -2016 1034 1486 -1933 -235 2035 -1032 -1274 1915 129
4139 129 -2032 1125 1323 -1875 -81 1975 -1178 -1237 1966 18 -1972 1209 1149 -1958 169 1953
4155 1953 -1314 -1191 1986 -131 -1834 1389 1048 -2032 225 1948 -1372 -941 2057 -333 -1923 1517
4171 1517 995 -2094 339 1767 -1504 -827 2103 -374 -1759 1594 816 -2049 519 1793 -1662 -785
4187 -785 2074 -536 -1725 1593 662 -2054 611 1628 -1634 -619 2046 -700 -1620 1651 554 -2022
4203 -2022 672 1575 -1603 -460 1965 -764 -1472 1716 405 -1933 831 1379 -1718 -310 1983 -855
4219 -855 -1403 1745 317 -1951 915 1356 -1763 -208 1874 -959 -1238 1781 131 -1840 1028 1246
$$ packed form
4107a579L219j041k623K639R30l155J128K510k822q06L350j142k668K863P34l381
4123a844J441K492k981o03L323j541k303L050M52l419J698K270l067k42L189j786
4139A29k161L157J98l198J794K056l153n9L203j948j990L181o0l107K127J784
4155A953l267J23L177k117j703L223l41l080K257J723l320M31K998k390j590L440
4171A517n22l089K433J428l271O77K930k477j385L353p78k865K568J274l455Q77
4187g85K859k610j189L318r31k716K665J017l262J015K665k746r20L271j097k576
4203b022K694R03l178J143K425k729p08L188j311k338K764N48l097J408K293k838
4219h55n48L148j428k268K866M41l119J555K082k833k79L019j650j971K868K18
$$ plain form
4235 1246 -1794 -106 1851 -1056 -1193 1725 42 -1738 1058 1115 -1752 -58 1670 -1032 -1029 1755
4251 1755 -72 -1643 1066 961 -1666 136 1657 -1061 -892 1682 -133 -1522 1094 882 -1571 195
4267 195 1541 -1093 -759 1585 -198 -1486 1117 773 -1561 238 1420 -1062 -678 1518 -268 -1371
4283 -1371 1084 633 -1466 324 1277 -1104 -631 1504 -257 -1186 1085 518 -1361 298 1262 -1088
4299 -1088 -465 1307 -400 -1022 1019 440 -1330 372 982 -1007 -314 1176 -387 -935 937 366 -1090
4316 -1090 364 826 -945 -263 1073 -417 -847 888 180 -1011 411 822 -812 -257 903 -365
4332 -365 -672 881 134 -907 349 612 -698 -128 845 -443 -601 739 155 -774 347 499 -734
4349 -734 -68 796 -375 -545 582 80 -617 387 364 -625 -70 581 -305 -364 539 -71 -554 289 388 -483
$$ packed form
4235A246l040J688J957k907j37K918j683j780K796N7k867J694J728k702LK784
4251A755j827j571K709j05k627J802J521k718J69K574j815j389K616k12k453J766
4267A95J346k634L34K344j783j288K603l44k334J799J182k482L84K196j786j103
4283a371K455m51k099J790R53k381M73K135j761r29K271n67j879J659R64k350
4299a088O23J772j707o22K041n79j770J702O10j989O93J490j563n48J872n71j456
4316a090J454M62j771O82J336j490m30J735p08j191J422M11j634N55J160j268
4332c65l07J553p47j041J256K63j310N70R73j288j58J340n84r29J121J52j233
4349g34O66Q64j171j70J127n02o97J004k3r89N55O51q86n9R03o10m83Q43R9q71
$$ plain form
4369 -483 -38 407 -375 -257 493 68 -425 186 193 -352 68 344 -230 -263 311 17 -304 223 137 -337 4
4390 4 264 -117 -212 183 -54 -257 168 142 -202 -107 147 -43 -87 175 99 -201 -25 75 -9 -43 53 -56 -96 43
4414 43 138 -16 -74 71 -49 -96 82 147 -119 -121 90 33 -84 146 77 -239 -48 247 -53 -127 103 -9 -235
4437 -235 127 258 -239 -163 257 -125 -184 325 59 -392 103 309 -264 -32 373 -188 -397 366 153 -381 203
4458 203 292 -478 -48 592 -195 -451 377 56 -498 357 436 -562 -232 621 -216 -370 592 6 -735 297
4478 297 464 -513 -41 585 -494 -458 745 100 -728 319 401 -713 50 828 -477 -562 665 20 -717
4497 -717 519 497 -887 -23 813 -451 -460 864 -84 -911 642 612 -858 2 882 -643 -452 1089 -9
4516 -9 -1015 569 509 -960 202 1032 -810 -653 1038 -23 -871 741 412 -1130 181 1115 -721
$$ packed form
4369d83M45M45p82J18P50m25m93O11Pn45M20K76n74l3N74k94l21N27q6m74L41
4390DK60l81r5L95k37k03M25k6l44R5K54j90m4K62p6l00J76J00q4l4R6j09m0J39
4414D3R5j54n8J45j20m7J78O5k66kK11n7j17K30o9l16J91K95l00p4K30j12k26
4437b35L62J31m97P6M20l82n9N09k66m51M95K06n73K32M05n61k09P63k13n34N84
4458B03Q9p70M30O40p87k56Q28l21n54Q55P9r98L30Q53q37j54R62n86p41J032
4478B97J67r77M72O26j079L6J203o45q28J047Q2j114P63P78j305q5J227o45p37
4497g17J236k2j384Q64Q36j264rJ324r48q27J553l0j470Q60Q80j525J91J541j098
4516ij006J584o0j469J162Q30j842J57J691j061q48J612l29j542J311R34j836
$$ plain form
4533 -721 -536 1038 -275 -1007 940 586 -1212 163 920 -874 -419 1335 -237 -1147 905 523 -1154
4550 -1154 333 1025 -1056 -529 1380 -334 -991 1000 352 -1335 487 1188 -1078 -473 1239 -442
4566 -442 -958 1244 333 -1457 377 1035 -1082 -251 1363 -622 -1148 1207 389 -1286 623 984 -1277
4583 -1277 -213 1493 -591 -1052 1166 177 -1410 800 1076 -1341 -221 1416 -647 -892 1356 78
4599 78 -1534 734 992 -1269 -8 1276 -926 -918 1527 110 -1460 782 826 -1475 59 1560 -912
4616 -912 -932 1347 -65 -1313 1061 806 -1613 71 1529 -904 -773 1474 -163 -1475 1002 857
4632 857 -1402 235 1197 -1154 -659 1685 -212 -1490 1039 683 -1420 387 1328 -1157 -670 1478
4648 1478 -351 -1166 1249 456 -1664 344 1413 -1059 -475 1306 -517 -1166 1277 479 -1533 483
$$ packed form
4533g21J85J574j313p32J947l54j798J375P57j794M55J754j572r10K052l82j677
4550a154J487O92k081N27J909j714o57J991o48j687J822P01k266O05J712j681
4566d42n16K202r11j790J834O58k117Q31J614j985n26K355q18j675J909L61k261
4583a277J064J706k084m61K218r89j587K210K76k417J120J637k063k45K248j278
4599G8j612K268K58k261J261J284k202QK445j417j570K242M4k301J534J501k472
4616i12k0K279j412j248K374k55k419J684J458k433J31K247j637j312K477j45
4632H57k259J637R62k351M95K344j897j278K529l56k103J807R41k485M87K148
4648A478j829q15K415p93k120K008J069k472N84J781j823o49K443p98k012K016
$$ plain form
4664 483 1138 -1285 -345 1619 -498 -1275 1107 353 -1266 747 991 -1437 -291 1598 -604 -1027 1299
4681 1299 207 -1492 660 1095 -1212 -213 1216 -821 -824 1520 115 -1551 669 904 -1253 -42
4697 -42 1433 -853 -979 1273 -7 -1243 890 655 -1517 101 1503 -842 -813 1250 -151 -1239
4713 -1239 981 753 -1356 68 1204 -896 -511 1446 -281 -1395 927 723 -1203 335 1077 -1101
4729 -1101 -644 1434 -192 -1167 959 415 -1459 406 1291 -937 -572 1214 -395 -995 1193 380 -1458
4746 -1458 319 1091 -964 -258 1346 -554 -1166 1063 500 -1128 475 841 -1107 -207 1389 -412
4762 -412 -1006 975 169 -1192 666 981 -1163 -364 1132 -455 -683 1071 42 -1256 579 878 -919
4779 -919 -93 977 -721 -842 1181 293 -1047 450 580 -1002 70 1141 -612 -742 971 96 -892
$$ packed form
4664D83O55k423R40J964k117p77K382p54j619K013K44k428J146J889k202m23K326
4681A299j092j699K152M35k307R99J429k037lK344j405j666K220K35k157J211
4697d2J475k286j26K252j280j236K133k35k172J618J402k345K9K063j401j088
4713a239K220k28k109J424J136k100L85J957j727j114K322k04j926J538P42k178
4729a101M57K078j626r75K126n44j874J865Q85k228L65J786j609o00K188q13j838
4746a458J777P72k055P06J604j900o12K229n63j628J603L66j948R00J596j801
4762d12n94J981q06j361J858L15k144P99J496j587k28J754j029j298J835K99j797
4779i19Q26J070j698j21K023q88j340J497J30j582J072J071j753j30J713q75r88
$$ plain form
4796 -892 615 634 -1128 -91 1012 -485 -506 949 -197 -1030 693 687 -901 -79 831 -628 -499 1060
4814 1060 -7 -984 457 400 -786 219 824 -731 -606 864 59 -691 543 329 -864 113 870
4831 870 -425 -383 703 -228 -709 642 482 -788 -29 576 -487 -160 790 -114 -729 437 353 -553 256
4850 256 530 -629 -300 717 34 -515 358 113 -597 245 604 -440 -316 377 -163 -341 552 218 -651
4869 -651 30 449 -257 -19 406 -229 -451 348 266 -307 131 139 -419 -112 605 38 -318 121 -11 -285 195
4890 195 410 -290 -257 220 33 -107 249 4 -433 2 298 -6 -19 106 -216 -188 195 177 -119 -103 5 -75
4912 -75 -25 283 -52 -335 -49 90 51 61 80 -210 -199 81 202 0 -20 -14 -75 -77 238 97 -177 -148 -9 84 135
4937 135 202 -30 -256 -10 203 29 -47 43 -208 -214 252 266 -165 -159 45 -191 26 369 -54 -377 79 146 -106
$$ packed form
4796h92J507J9j762J037J103j497k1J455j146q33J723oj588Q22R10j459J29J559
4814A060j067r77J441n7j186J005O05j555J25J470q05p50J234k14j193R77P57
4831H70j295M2J086r31m81J351j60j270P59O05j063L27R50r04o15J166q4r06Q09
4850B56K74j159L29J017o83n49Q73k45p10Q42L59j044J24O93n40j78Q93l34q69
4869f51O81M19p06K38M25o35k22P99q2n73M38Qn58L07P17n67l56M39j32k74M80
4890A95K15p00L3M77j87j40L56k45m37M35K96l04j3J25l22K8L83j8k96J6J08q0
4912g5N0L08l35k83K86J39l9J0J9k90J1K80J21k02k0Oo1kL15j41k74K9J39R3N1
4937A35O7k32k26K46K13j74p6R0k51oM66J4m31OK04k36K17L43m23l23M56O7k52
$$ plain form
4960 -106 139 264 -263 -295 356 112 -169 156 -35 -426 153 486 -132 -272 186 -179 -290 432 248 -475
4980 -475 -94 341 -232 -43 507 -215 -498 334 356 -313 104 312 -552 -273 653 33 -469 250 47 -486
5000 -486 269 602 -451 -364 436 -127 -346 560 167 -771 55 522 -302 -91 573 -328 -602 666 355 -612
5020 -612 124 386 -594 -53 893 -214 -657 441 130 -624 461 647 -820 -282 779 -178 -419 616
5038 616 2 -981 389 738 -563 -71 706 -539 -576 953 256 -881 209 502 -728 57 924 -481
5056 -481 -743 773 75 -732 591 557 -1049 -153 1039 -274 -539 745 -177 -944 645 734 -898 -151
5074 -151 786 -649 -409 1094 -53 -1047 489 569 -866 231 894 -850 -698 1010 106 -820 657
5091 657 342 -1119 206 1041 -625 -510 944 -239 -930 922 630 -1140 -5 861 -682 -259 1144
$$ packed form
4960a06K45J25n27l2O51k44k81L25j91l91N79L33o18j40M58l65j11P22j84p23
4980d75L81M35n73J89N50p22k83Q32K2o69M17K08q64K79R26o20n02P19k03n33
5000d86P55L33j053Q7Q00n63k19R06l93r38Q26M67q24K11O64r01k74J268l11r67
5020f12P36K62r80N41R46j107m43J098l11p54J085J86j467N38J061r57k41J035
5038F16o14r83J370L49j301M92P77j245l7J529o97j137J090K93j230P85Q67j405
5056d81k62J516o98q07J323l4j606Q96J192j313k65J284r22p67J589Q9j632P47
5074a51R37j435K40J503j147r94J536Q0j435J097O63j744J52J708r04r26J477
5091F57l15j461J325Q35j666J15J454j183o91J852k92j770J135Q66j543M23J403
$$ plain form
5108 1144 -292 -1171 784 562 -988 302 827 -1004 -456 1190 -122 -893 722 165 -1200 482
5124 482 1131 -933 -548 1045 -305 -829 1051 309 -1250 279 864 -864 -88 1167 -590 -1043 1047
5141 1047 520 -1112 313 683 -1013 -118 1294 -418 -923 919 129 -1136 671 975 -1177 -423 1062
5158 1062 -357 -574 1045 -83 -1279 577 861 -999 -137 1084 -706 -801 1167 260 -1082 464
5174 464 511 -1042 153 1231 -790 -883 1119 68 -926 760 610 -1233 -48 1102 -538 -498 1005
5191 1005 -282 -1156 883 875 -1056 -98 855 -756 -427 1216 -144 -1031 736 439 -1073 341 1082
5208 1082 -962 -732 1092 0 -773 742 237 -1109 295 1080 -748 -378 938 -378 -887 1038
5224 1038 545 -1104 72 725 -727 -137 1088 -466 -1007 817 332 -888 419 710 -1034 -368 1103
$$ packed form
5108A144j436q79J955k22j550J290N25j831N48J646j312p71J615n57j365J682
5124D82O49k064L85J593j350n24J880p42j559J529N85j728P76J255j757m53K090
5141A047n27j632J425L70j696Q95J412j712n05J842p90j265J807L04k152P54J485
5158A062j419k17J619j128j196J856K84j860Q62J221j790r5J968r07j342J546
5174D64M7j553J195J078k021r3K002j051r94J686j50j843J185J150j640M0J503
5191A005j287q74K039qj931R58R53j611L29J643j360q87J767k97j512J414P41
5208A082k044K30J824j092p73J515n05j346J404P85j828L70J316j316n09J925
5224A038m93j649J176O53j452N90J225j554n41J824m85j220J307K91j744O66J471
$$ plain form
5241 1103 -199 -754 687 -22 -1004 578 899 -914 -323 893 -404 -568 985 115 -1123 306 654
5258 654 -683 59 863 -706 -664 940 238 -815 418 438 -932 33 1037 -422 -556 710 -117 -692
5276 -692 774 596 -1000 -137 773 -420 -293 891 -188 -974 526 569 -681 131 604 -748 -423 1003
5294 1003 -9 -801 450 263 -738 249 813 -644 -434 666 -168 -567 777 245 -1011 86 756
5311 756 -418 -204 692 -402 -695 629 382 -660 189 417 -750 -178 890 -188 -718 396 161
5328 161 -569 350 532 -669 -321 619 -133 -341 523 40 -786 259 568 -398 -140 398 -371 -407 681
5347 681 199 -601 141 313 -401 88 641 -295 -579 394 138 -411 356 307 -664 -121 545 -61 -265 325
5367 325 -92 -520 375 493 -348 -225 258 -257 -99 519 25 -560 107 277 -221 98 329 -313 -380 358
$$ packed form
5241A103j302n55J441p09r82J582L21j813N91J216j297j64J553q70j238J429L48
5258F54j337P42Q04j569M2J604p02j053J233K0j370R65J004j459j34J266q27n75
5276f92J466j78j596Q63R10j193J27J184j079p86J500M3j250Q12M73j352L25J426
5294A003j012p92J251j87j001R87N64j457K10J100q34l99J344n32j256J097O70
5311G56j174K14Q96j094k93J324k47j042Q49K28j167N72J068j078n30J114k35
5328A61p30R19J82j201L48R40p52k08Q64m83q26J045L09r66K58N38p69l6J088
5347F81m82q00P42J72p14M89N53r36k84R73k56n49P67m9r71N43O66o06k04N90
5367C25m17m28Q95J18q41J23M83n15J58O18m94n85O67J70m98L19K31o42o7P38
$$ plain form
5387 358 156 -188 97 52 -459 150 461 -44 -237 108 -15 -236 294 230 -323 -173 128 -61 53 234 -138
5408 -138 -366 113 276 -64 -24 118 -212 -173 228 133 -152 -65 -75 -159 159 290 -113 -247 5 120 34 121 88
5431 88 -183 -180 100 176 15 -47 -111 -152 63 278 80 -184 -129 30 -2 127 126 -118 -213 14 132 8 118 6
5455 6 -231 -97 272 147 -145 -42 -1 -149 134 343 -90 -194 48 27 -46 261 115 -331 -105 271 119 -35
5477 -35 168 -104 -292 161 362 -142 -113 174 -200 -139 423 171 -400 -70 142 -105 81 324 -234 -368 252
5498 252 149 -231 163 85 -478 -110 437 -14 -241 167 -42 -385 340 391 -357 -177 308 -156 -128 519 -6
5519 -6 -539 160 359 -211 25 297 -321 -398 440 171 -373 161 89 -543 159 624 -225 -429 298 19 -315
5540 -315 395 339 -622 -136 437 -191 -137 518 -185 -640 272 441 -373 32 328 -457 -254 709 -12 -583 258
$$ packed form
5387C58k02l44K85m5n11O09L11n05j93L45j23k21N30o4n53J50L01j89J14J81l72
5408a38k28M79J63l40M0J42l30L9M01r5k85Q7j0q4L18J31m03j34K52J15q6Q7l3
5431H8k71LK80P6j61o2o4m1K15K15j98k64N5J59l2J29jk44r5K27J18j24J10j12
5455Fk37J34L69j25k92J03M1j48K83K09m33j04K42k1p3L07j46m46K26L76j52j54
5477c5K03k72j88M53K01n04K9K87l74O1N62k52n71L30K12k47J86K43n58j34O20
5498B52j03l80L94p8n63L68N47m51k27M08k09l43P25N1p48J80M85m64K8O47n25
5519fn33O99J99n70K36K72o18p7Q38k69n44N34p2o32P02M65q49k04P27k79l34
5540c15P10n6r61M86N73o28N4O55p03m55R12J69q14M05K96p85K03R63p21n71Q41
$$ plain form
5561 258 213 -497 225 618 -421 -343 444 -38 -366 579 154 -767 63 672 -244 -341 481 -264 -551 574
5581 574 331 -563 35 383 -524 -83 854 -180 -694 405 261 -451 286 482 -673 -291 747 -119 -429
5600 -429 579 87 -799 296 677 -520 -200 550 -380 -425 799 221 -747 153 469 -501 -9 737 -415
5619 -415 -620 551 88 -564 431 392 -900 -41 883 -239 -569 487 -20 -678 493 561 -679 -62 622
5638 622 -477 -360 848 44 -846 356 504 -590 107 645 -621 -463 825 41 -679 434 328 -787
5656 -787 86 854 -379 -426 596 -197 -599 699 365 -900 -72 749 -395 -266 843 -172 -749 478
5674 478 344 -579 236 545 -721 -296 1000 -6 -766 464 309 -618 305 612 -592 -289 679 -202
5692 -202 -537 722 237 -947 82 728 -405 -205 636 -352 -569 738 206 -762 211 497 -762 -136
$$ packed form
5561B58m5p10P22L93j039P8P87m82l28R45m25r21Q30O09r16r7Q22p45k87J125
5581E74k43q94N98L48r07M41R37j034n14J099j44p12P37J96j155L82J038q66l10
5600d29J008m92q86J095L81j197L20P50r30m5J224n78r68R00L16r70M92P46j152
5619d15k05J171m63o52R95l9j292Q59R24j122l30J056n07o58J171O8j240O17O84
5638F22j099J17J208q04q90J202J48j094O97N38j266J58J288p84p20J113j06j115
5656g87Q73P68j233m7J022p93m02J298l34j265Q28Q21j144J29J109j015n77J227
5674D78j34r23Q15L09j266M25J296j006p60J230j55r27R23L07j204L03R68q81
5692b02l35J259m85j184J029O46j133K00Q41r88k17J307n32r68R73K86j259O26
$$ plain form
5710 -136 955 -165 -674 427 134 -542 443 479 -741 -185 733 -218 -422 669 77 -780 312 581
5728 581 -464 -36 478 -439 -369 762 125 -779 249 383 -617 94 696 -346 -466 516 9 -453 424
5747 424 274 -772 -28 768 -252 -370 537 -108 -556 406 359 -463 6 446 -486 -158 746 -113 -681 259
5767 259 360 -477 160 479 -478 -279 577 -32 -359 474 107 -691 111 633 -323 -297 390 -165 -367 554
5787 554 220 -567 84 351 -402 -64 603 -261 -567 363 231 -355 167 265 -517 -62 585 -116 -396 333
5807 333 42 -495 261 431 -425 -194 339 -164 -134 488 30 -540 206 348 -325 -44 424 -294 -337 378 131
5828 131 -350 124 129 -391 44 445 -220 -321 240 11 -270 267 216 -393 -110 275 -116 -67 388 -112 -410
5849 -410 268 312 -273 14 264 -272 -131 380 76 -293 164 54 -259 135 288 -237 -241 212 -42 -151 288
$$ packed form
5710a36J091j120n09J101k93o76R85L6j220N56R18r51k04J091n92q57J092K69
5728E81j045M28N14r17P0J131o37r04J028J34j000P11O02j042j20R82n07m62Q77
5747D24j50j046P44P96j020j18R07o45m48R62m7q22M69M40r32L28R04q59n68R40
5767B59J01q37O37L19r57J99Q56o09l27Q33l67p98Q02N22r56K6O87n55k02R21
5787E54l34p87O51K67p53L38O67q64l06R30j32n86N22R8p82M55O47p01k80P29
5807C33k91n37P56J70q56K31N33n03L0O22m58n70P46J42o73K81M68p18m3P15k47
5828A31m81M74Nn20M35M01o65j01N61k29k81N37n1o09K83L85l91M9M55n00k98
5849d10O78M4n85K87K50n36J41N11l04l69M57j10l13L94J53n25mM53k54j09M39
$$ plain form
5870 288 45 -369 -1 306 -66 -44 153 -248 -262 254 228 -262 0 118 -165 -22 319 -11 -240 99 80
5891 80 -117 162 173 -263 -81 220 17 -90 191 -74 -265 72 234 -87 -86 20 -124 -94 264 95 -222 2
5913 2 61 -71 35 186 -130 -227 38 34 -26 59 72 -231 -134 183 103 -88 -53 6 -76 89 158 -36 -38 7 -18 -48 127
5940 127 68 -188 -135 55 103 22 -31 -68 -50 85 93 -6 -54 -60 -43 -40 130 57 -77 -140 -18 61 36 65 -53 -123 -21
5967 -21 121 7 -17 9 -67 -38 101 204 -61 -111 -61 11 17 150 -4 -184 4 93 35 8 106 -76 -114 118 176
5992 176 -52 23 67 -199 13 229 18 -109 -22 41 -64 88 151 -136 -122 84 27 -25 151 9 -224 17 244
6015 244 -44 -61 138 -59 -136 161 126 -162 -26 98 -137 23 207 -44 -268 90 143 -180 101 167 -235 -143
6037 -143 189 -12 -144 137 -51 -280 141 316 -172 -101 150 -122 -162 225 86 -241 73 160 -210 29 250
$$ packed form
5870B88k43m14L68L07l72K2J97m01j4N16k6m90K62J18k83J43L41l30k29L39j9
5891H0j97K79J1m36J82L01k03j07K81k65j91L37J62l21JJ06j44L0L58j69l17K24
5913BN9j32J06J51l16r7K65mo0Q5J3l03R7L17q0j91L5N9q2J65O9j94kM5k5l0J75
5940A27n9k56N3J90M8q1n3l7J8J35Qr9m8oJ7LJ70p3j34o3J22P9k5K9j18p0J02
5967b1J42j14k4K6p6K9J39J03k65n0N0P2OJ33j54j80J88Q9n8k7R8j82l8K32N8
5992A76k28P5M4k66K12K16k11j27Q7O3j05J52O3k87J4K06n7n2J76j42k33K41K27
6015B44k88j7J99j97p7K97l5k88J36J24k35J60J84k51k24L58N3l23K81O6m02R2
6037a43L32k01j32K81j88k29M21J75m88P1K51k72m0L87j39l27L14Q7l70K39K21
$$ plain form
6058 250 -164 -245 178 147 -218 115 154 -253 -48 270 -56 -120 200 -20 -265 210 296 -254 -128 201 -90 -142
6080 -142 266 -3 -285 181 231 -163 19 307 -281 -236 293 73 -212 144 92 -251 93 318 -186 -253 252
6101 252 1 -238 197 200 -295 -5 187 -159 -31 283 -117 -353 250 195 -224 0 177 -209 -81 337 -27
6122 -27 -220 204 84 -280 107 354 -302 -166 276 -49 -168 197 73 -344 122 239 -236 -70 280 -140
6142 -140 -312 312 161 -229 62 96 -217 -24 343 -189 -276 250 102 -278 121 230 -305 -107 253 -65 -141
6163 -141 258 -95 -378 167 263 -253 -167 251 -174 -175 266 0 -289 164 73 -252 76 342 -178 -304 260 107
6185 107 -170 129 64 -306 27 326 -204 -164 247 -86 -303 229 285 -233 -136 214 -188 -31 315 -107 -275
6206 -275 164 190 -272 54 296 -155 -186 210 -33 -197 118 32 -326 138 265 -270 -144 262 -22 -188 193
$$ packed form
6058B50m14q1M23l1l65L33L9m07K05L18l26o4L20k20k45M75Q6n50J26L29k91n2
6080a42M08k69k82M66N0l94J82K88n88M5N29k20k85L56n2l43L44K25n04o7N05
6101B52k51k39M35Lm95K90J92l46J28L14m00k36O03n5m19K24J77l86J28M18l64
6122b7j93M24j20l64L87K47o56J36M42l25j19L65j24m17M66J17m75J66L50m20
6142a40j72O24j51l90K91L4l13J93L67n32q7N26j48l80L99J09n35J98L60l18p6
6163a41L99l53k83N45R6n16Q6M18m25jM41k66k89M53r1l25L28K66n20j26N64j53
6185A07k77K99o5l70L33K99n30M0M11l33k17N32N6n18R7L50m02J57L46m22j68
6206b75M39K6m62L26K42m51l1L96k43j64L15q6l58M64J27n35J26M06k84j66L81
$$ plain form
6227 193 104 -253 31 153 -165 -54 323 -139 -251 239 131 -260 29 162 -138 -110 181 -96 -191 161 20
6248 20 -277 127 236 -213 -136 226 -24 -204 100 1 -171 106 198 -200 -12 232 -138 -250 257 106 -190
6269 -190 84 129 -145 -29 242 -125 -135 163 33 -147 152 136 -179 -81 196 -34 -106 141 -61 -165 135 93
6291 93 -211 -53 171 -81 -103 117 48 -150 14 7 -121 46 158 -116 -155 182 71 -138 105 45 -176 -14
6313 -14 165 -50 -45 130 -97 -170 146 79 -125 -34 133 -82 -15 125 -35 -125 53 -21 -140 64 61 -101 -71 188
6337 188 11 -31 80 -60 -111 20 70 -96 -59 87 -19 -82 95 36 -74 -12 101 -50 -10 85 -64 -79 24
6360 24 66 -40 30 23 -102 -38 99 -56 -64 36 -6 -78 42 50 -98 -65 59 -53 -52 -12 19 -41 6 34 -13 -10 5 -67
6388 -67 -40 16 -2 -77 32 -1 -76 -12 94 -14 -14 17 21 -32 -33 8 -74 93 50 1 -29 78 40 -56 43 4 17 37 19
$$ packed form
6227A93q9l57K84J22l18J11L77m62j12M90j08l91K89J33l00K8K91k77r5L52j41
6248B0k97M04J09m49P7L62k50j80L04r9j72K77R2l98J88K44l70j12N07j51k96
6269a90K74M5k74J16K71l67j0K98j30j80K99j6l15R8K77k30p2K47k02j04L00m2
6291I3l04J58K24k52k2K20o9j98J64pj28J67J12k74l9L37j11k09K43o0k21J62
6313a4J79k15NJ75k27p3L16o7k04R1J67k15O7J40j60r0J78p4j19K04lj62L0K59
6337A88j77m2J11j40n1J31N0j66L7J46j06o3J77n9j10O2J13j51M0R5j49j5J03
6360B4M2j06P0pj25O4J37j55qJ00m2p2J20Qj48L3J24j12JM0L1o0M7K8m7LJ5p2
6388f7K7N6j8p5J09l3p5O4J06j08%L1Mn3jM1q2J67m3m9l0J07l8r6R9l9J3K0j8
$$ plain form
6417 19 -30 51 26 -61 -54 -8 -21 12 4 45 -72 -64 7 -29 17 10 21 -28 -40 18 -67 48 41 13 46 16 18 51 -32 -10 10 37
6449 37 24 14 -72 -23 12 -8 -3 75 66 -24 5 -9 28 -11 -76 58 63 -19 17 -5 -18 -2 29 -8 19 -11 -29 -51 -18 18 -30
6480 -30 -6 23 -17 -57 31 21 -36 -14 56 -40 -64 -8 -19 -33 -13 -11 -13 -13 25 -49 21 30 -20 -12 40 -78 -8 25 -14 -24 -53 24
6512 24 -23 -23 42 42 7 -22 24 -47 -10 36 -55 -4 67 2 -61 18 74 -54 -36 67 -8 -43 4 -22 -41 -37 -4 -73 30 42
6542 42 -75 -35 57 -10 -115 39 -21 -22 18 53 -29 -14 5 37 -52 42 -30 -46 0 90 -73 -54 32 -20 -54 -17 41 -58 17
6571 17 17 -9 -19 75 -2 -65 24 8 -80 -51 70 -29 -80 27 17 -93 72 36 -35 17 56 -30 -76 5 4 -12 21 18 -32 75
6601 75 99 -3 -73 21 0 -100 38 -14 -29 -4 -7 -8 -45 35 -30 -92 81 33 -134 -7 47 -50 -36 43 -10 -84 44 56
6629 56 -119 -1 139 -9 -102 65 -23 -115 -11 26 -31 -20 87 -45 -60 93 53 -34 37 25 -46 -40 62 19 -42 47
$$ packed form
6417A9m9Q1k5q7PM6j3L3qM1j17QP1l6M6pJ1m9j2N8q5J15pk8L3l0KL3q3K2K0K7
6449C7j3j0q6M9L5k0NP8rr0K9j4L7l9o5J34Nq2L6k2j3J6L1l7K7l0j8k2L3L6m8
6480c0K4K9m0m0Q8j0n7K2P0r6k4N6j1j4K0Kk%L8p4P0Rn0QN2j18P0L3l9j0k9P7
6512B4m7%O5%l5k9M6p1L7M6r1N1P1o5o3P9N6j28J8J03p5l5M7k6j9ML3o9J03J2
6542D2j17M0R2o7j05J54o0jM0L5q2J5J9L2q9R4p2j6M6R0j63J9Q6n2l4L7N8r9P5
6571A7%k6j0R4p7o3Q9j6q8K9J21r9n1J07j0j10J65l6p1N2L9q6m6Q1jj6L3ln0J07
6601G5K4j02p0R4k1j00J38n2j5K5ljl7Q0o5o2J73m8j67J27N4r7J4P9n3p4J28J2
6629E6j75J18J40j48r3J67q8r2J04L7n7J1J07j32j5J53m0q7P1j2p1OJ02m3o1Q9
$$ plain form
6655 47 1 -112 64 50 -110 -17 112 -47 -85 75 1 -89 71 30 -133 22 82 -63 -117 75 46 -147 27 37
6679 37 -31 26 71 -55 -34 70 2 -98 46 56 -67 -15 91 17 -28 89 -25 -125 48 36 -133 69 116 -50
6703 -50 -39 84 -4 -142 68 -23 -77 16 67 -103 -81 149 44 -99 88 49 -77 -4 76 -68 -77 106 -26 -84 81
6728 81 31 -114 -42 57 -12 -42 136 -35 -69 78 28 -128 27 155 -127 -76 132 45 -141 29 28 -140 0 108
6752 108 -97 -101 103 -18 -97 78 58 -134 13 76 -97 -86 115 -48 -136 152 97 -127 -8 127 -77 -39 134
6775 134 -42 -134 82 51 -118 25 85 -124 -92 97 -80 -97 122 81 -151 51 97 -84 -38 127 -33 -141 141
6798 141 113 -139 -9 115 -109 -39 164 -63 -123 107 6 -120 25 133 -104 -81 202 -16 -93 88 -4 -121
6820 -121 36 101 -119 -67 151 -30 -98 105 49 -134 60 81 -137 -74 128 -99 -124 70 22 -80 83 64 -142
$$ packed form
6655D7m6j13J76j4j60R3J29j59l8J60p4r0J60m1j63J55O0j45n4J92k9j93J74J0
6679C7o8N7M5j26K1J04o8j00J44J0j23N2J06p4m5J17j14j00J73j2j69K02M7j66
6703e0J1J23q8j38K10r1n4R3N1j70K2K30j05j43J87l9j26P3Q0j44rJ83j32n8J65
6728H1n0j45P2R9o9l0J78j71l4J47n0j56J55J28k82N1K08q7j86J70jj68J40J08
6752A08k05mK04j21p9J75k0j92J47O3j73J1K01j63q8K88n5k24J19J35k04L8J73
6775A34j76r2K16l1j69J43O0k09L2J89j77j7K19m1k32K02M6j81M6J65j60j08K82
6798A41k8k52J30J24k24P0K03k27o0K30j01j26J45J08k37K3K83k18p7J81r2j17
6820a21J57O5k20N2K18j81o8K03n6j83J94K1k18O3K02k27k5J94m8j02J63j9k06
$$ plain form
6843 -142 -24 94 -59 -71 72 46 -131 27 72 -102 -19 144 17 -83 74 -25 -82 58 137 -81 -63 133 -101
6866 -101 -60 128 8 -95 79 86 -98 -21 66 -33 -60 94 -41 -168 73 43 -91 -6 111 -28 -55 98 5 -80
6890 -80 55 68 -107 -39 106 -15 -5 87 -39 -145 54 40 -88 -13 60 -52 -41 83 -48 -24 58 60 -75 17 36
6915 36 -84 -48 100 -19 -88 87 34 -128 -6 28 -46 -59 36 -3 -105 50 32 -13 -39 79 -36 -38 64 -53 -15
6940 -15 19 25 -51 9 63 -30 -52 37 -49 -108 31 34 -84 16 71 27 -26 140 29 -87 17 -28 -78 -43 63 -34 -2
6967 -2 27 39 -34 23 80 -63 -26 1 -6 -38 28 12 -37 -28 43 -29 16 57 37 -39 -9 6 12 -30 89 2 -67 58 22 -43 -40
6998 -40 19 -34 -66 72 -13 -83 4 15 -104 -19 74 14 7 84 32 -77 36 13 -102 -12 124 -39 -61 102 -34 -50
7024 -50 79 97 -47 -18 98 0 -55 75 -17 -93 51 93 -102 44 81 -106 -101 117 9 -123 50 84 -113 -68
$$ packed form
6843a42J18J18j53j2J43k6j77J58M5j74Q3J63j27j00J57r9n7J40P9k18J8J96k34
6866a01M1J88j20j03J74Pj84P7Q7r9k7J54j35j27K41l0j34Q5J17j39k7J53r3q5
6890h0J35J3j75O8J45j21J0R2j26j06J99j4j28P5P3j12J1J24j31K4Q2Kj35R2J9
6915C6j20L6J48j19o9J75n3j62J22L4p4j3R5l9j02J55j8m5k6J18j15kJ02j17L8
6940a5L4Op6O0N4r3k2Q9q6n9J39Lj18J00N5m4n3J66j11j16J04m5n0L5J06r7L2
6967bK9J2p3N7N7j43L7K7pl2O6j6m9RP1p2M5M1k0p6L0J5Om2J19q7o9J25l6o5L
6998d0N9n3l2J38q5p0Q7J1j19Q5R3o0pP7n2j09J13k3j15R0J36j63k2J63j36j6
7024e0J29J8j44K9J16r8n5J30r2p6J44M2j95J46L7j87NK18j08j32J73L4j97M5
$$ plain form
7048 -68 121 -69 -103 112 8 -157 111 58 -107 12 159 -72 -67 105 -21 -104 85 136 -134 -1 125 -106
7070 -106 -93 126 0 -88 114 91 -117 11 158 -140 -87 196 13 -199 167 100 -158 11 193 -165 -97 204
7092 204 -73 -160 113 88 -165 -12 123 -201 -119 185 -47 -226 123 90 -210 41 156 -174 -78 148 -37 -190
7114 -190 146 89 -187 95 169 -161 -54 197 -53 -184 161 142 -304 67 195 -132 -114 217 -79 -218 185
7135 185 100 -225 68 174 -200 -123 194 -74 -202 174 93 -226 84 187 -197 -56 250 -88 -168 232 88
7156 88 -264 65 200 -207 -70 259 -156 -207 267 27 -260 78 132 -264 -52 236 -115 -219 191 2 -264
7177 -264 120 124 -295 -49 285 -174 -164 225 12 -277 132 185 -251 -55 146 -178 -177 246 14 -236 188 152
7199 152 -246 52 282 -207 -220 293 25 -206 186 151 -328 39 300 -205 -100 215 -65 -239 207 126 -301
$$ packed form
7048f8J89j90l4K15j04j65K68n3j65J19J47k31NJ72j26q3J89N1k70J33J26k31
7070a06J3K19j26q8K02k3k08J28J47k98N3K83j83k12L66o7k58J69J82l58O8L01
7092B04k77q7K73k5k53J53J35l24Q2L04k32j79L49l3l00K51J15l30R6K26j85j53
7114a90L36n7k76K82P4l30J07K51k50j31L45j9m46L71J28l27J8L31k96j39M03
7135A85q5l25K93J06l74P7L17k68j28L76q1l19L10J03l84J41L06l38q0M00j44
7156H8l52L29J35m07J37L29m15n1M74k40k87L38N4l96K12K88l51j04M10j89k66
7177b64L84Mm19K46L34m59J0L89k13k89M09N3m36J96K01l24JM23k32k50M24l6
7199A52l98K98K30m89j3N13k68k31L92l5m79L67K61n05J05L15k80j74M46q1m27
$$ plain form
7220 -301 51 172 -174 -100 333 -27 -257 203 49 -329 107 250 -252 -127 322 -47 -264 240 64 -287
7240 -287 105 265 -214 -128 280 -103 -181 269 74 -342 76 203 -252 -76 301 -138 -240 304 46 -274 108
7261 108 228 -296 -90 303 -135 -287 253 61 -296 209 276 -276 -86 325 -147 -174 328 -47 -282 140 210
7282 210 -248 -16 224 -170 -223 300 69 -273 141 201 -217 -31 301 -147 -239 306 15 -235 172 136 -316
7303 -316 -25 266 -152 -150 259 -80 -330 220 251 -224 12 242 -144 -111 277 24 -247 162 126 -217 65 301
7325 301 -147 -197 248 15 -295 183 124 -270 -10 257 -107 -137 215 -45 -253 198 125 -294 -27 169 -168
7346 -168 -82 238 -73 -237 164 88 -230 48 228 -209 -138 267 -55 -211 127 83 -241 130 259 -172 -106 155
7368 155 -17 -165 202 116 -227 74 172 -152 -76 180 -78 -176 134 56 -249 54 132 -199 -31 221 -28 -168
$$ packed form
7220c01L52J21l46P4M33l60k30M60j54l78M36J43n02J25M49l69k17N04j76l51
7240b87L92J60m79Q6M08l83p8M50j95m16M18J27m55J76L77m39j02N44k58l20L82
7261A08J20n24K06L93m38j52N40j92l57N05O7n52J90M11m72k7N02l75k35M22P0
7282B10m58K32K40l94n3N23k31l42M14O0m18J86L32m48r2N45k91k50M07l6m52
7303c16K91K91m18KM09l39k50N50L1m75K36K30l86L3L88k53k71M09l6l43K82K36
7325C01m48n0M45k33l10M78n9l94K60K67l64l0L52k60k08M51p3m19K67J96l37
7346a68Q6L20l11j64M01p6l18K78J80m37P1M05l22j56L38m4l24L71J29m31O6K61
7368A55j72j48L67q6l43L01R8l24P6K56k58r8L10p8l05L03P8l31J68K52k49j40
$$ plain form
7390 -168 119 49 -186 51 113 -113 -91 160 -26 -64 145 34 -171 26 113 -152 -42 139 -123 -96 125 72
7412 72 -123 20 110 -112 -64 169 -52 -198 117 54 -134 14 88 -156 -97 147 25 -108 111 -16 -159 33
7434 33 122 -72 -65 43 -10 -96 153 8 -148 -16 61 -17 -50 117 8 -142 36 88 -82 84 1 -64 -42 103
7458 103 -41 -109 -21 52 -127 50 137 -74 -135 38 -43 -25 74 44 -121 -80 65 -2 -71 81 -5 -176 59 95 -34
7483 -34 -99 58 -48 -78 100 94 -63 -8 34 -59 20 68 -38 -127 18 61 -20 -8 97 -54 -67 98 -6 -69 -10 35
7509 35 -139 -3 88 -44 -136 56 42 -72 83 12 -173 -73 82 27 -51 8 -60 -151 134 84 -59 -93 97 -41
7533 -41 -86 138 68 -146 15 146 -82 6 65 -88 -136 95 53 -81 34 83 -166 -8 160 -60 -145 54 -13
7556 -13 -172 98 107 -155 -79 78 -38 -56 184 33 -192 111 182 -113 -58 91 -114 -92 166 27 -194 45 99
$$ packed form
7390a68K87p0k35K37O2k26K2K51j86l8K09j11k05J97Q7k65J10J81k62K7K21n3
7412G2j95J43R0k22M8K33k21j46L15o3j88J48P4k44N9K44j22j33K19j27j43J92
7434C3Q9j94PJ08n3q6K49j45j56J32P7p8l3J67j09j50J78N2j70J66q3o5K2J45
7458A03j44o8Q8P3j79J77Q7k11o1J73q1J8R9l0j65M1J45o7o9J52q6j71K35L6j29
7483c4o5J57j06l0J78oj57N5M2r3P9M8j06q9J45M3q1J2J05j51j3J65j04o3N9M5
7509C5j74J36R1j32r2J92j4j14J55p1j85J00J55n5p8N9o8r1K85n0j43l4J90j38
7533d1m5K24p0k14J61J31k28Q8N9j53m8K31m2j34J15M9k49J58J68k20q5J99o7
7556a3j59K70Rk62P6J57j16j8K40j51k25L03P1k95N5J49k05K2K58j39k21K39N4
$$ plain form
7579 99 -161 -17 219 -84 -165 116 23 -186 157 157 -238 -90 177 -43 -179 204 -20 -271 115 209 -158 -89
7601 -89 146 -137 -126 245 -2 -290 86 179 -168 40 279 -124 -159 225 66 -132 157 150 -275 -20 267 -98
7623 -98 -173 177 24 -247 140 233 -233 -93 243 -208 -111 320 30 -291 90 177 -190 -28 291 -215 -217 266
7645 266 35 -234 119 131 -240 -20 331 -168 -187 208 -29 -165 256 178 -327 10 326 -183 -119 267 -25
7666 -25 -274 189 192 -248 25 199 -290 -185 336 31 -292 80 142 -238 122 267 -277 -187 268 -89 -172 269
7688 269 171 -319 12 287 -187 -75 244 -119 -294 274 145 -317 50 250 -289 -136 356 -75 -230 207
7708 207 98 -282 146 209 -309 -71 307 -99 -268 227 86 -328 111 317 -264 -97 224 -212 -193 364 130
7729 130 -346 46 230 -252 -66 349 -157 -273 246 69 -198 183 168 -343 -25 309 -60 -209 216 -17
$$ packed form
7579I9k60J44K36l03q1K81r3k09L43%l95J48K67k20j36L83k24k51L86R4l67O9
7601h9K35k83J1L71k47k88L76R3l47K08K39m03l5L84j59j98K89pm25K55K87l65
7623i8p5L50j53k71L87R3m66J40L36m51R7M31k90l21L81Q7l67J62L19n06kM83
7645B66k31k69L53J2l71K20L51m99j9L95k37j36M21p8n05L37L16n09O4L86k92
7666b5k49M63Lm40K73J74m89J05N21l05l23L72O2l80L60J45n44R0M55l57q3M41
7688B69r8m90L31K75m74J12L19l63j75N68j29m62L67K00n39J53M92m31j55M37
7708B07j09l80M28O3n18K38L78m06j69M95j41m14M39K06n81J67L21m36J9N57k34
7729A30m76L92J84m82J86M15n06j16N19j77k67L81j5n11L18L34l69j49M25k33
$$ plain form
7749 -17 -271 209 241 -236 4 227 -241 -168 305 18 -363 103 192 -225 47 227 -216 -165 321 20 -261 169
7771 169 108 -379 43 365 -117 -165 192 -102 -229 251 154 -354 10 289 -194 -126 319 -88 -312 238 182 -218
7793 -218 93 151 -278 -81 388 -32 -267 204 59 -299 114 239 -225 -124 227 -173 -189 301 69 -365 21
7814 21 245 -166 -100 272 -135 -215 252 121 -251 205 126 -236 35 386 -85 -290 123 75 -203 192 196 -286
7836 -286 -62 301 -94 -168 251 -13 -335 69 216 -164 -16 181 -170 -136 295 60 -288 81 114 -224 2
7857 2 243 -144 -224 253 -3 -188 152 188 -311 -25 329 -58 -95 196 -68 -243 206 182 -191 -52 188 -164
7879 -164 -58 289 22 -220 19 142 -167 46 240 -184 -195 181 30 -92 90 10 -227 40 238 -61 -119
7900 -119 133 -84 -186 198 165 -251 -85 134 -91 -22 278 -38 -271 91 123 -81 38 116 -150 -144 225 61
$$ packed form
7749a7k54M80L2m77K40K23m68P3M73k87l81M66Q9m17K72J80m43N1M86l01k81M30
7771A69o1m87M22L22m82m8L57k94j27M80r7n08L64K79m83O8M45m07k24N50n6m00
7793b18L11N8m29J97M69m20k35M71j45l58M13J25m64J01L51m00j6M90k32m34L86
7814B1K24m11O6L72m07q0M67j31l72M56p9l62K71L51m71k05M13m8k78L95Mm82
7836b86K24L63l95p4M19k64l22M04J47l80J48J97l51L4M31k35l48L69L3l38K26
7857BK41l87q0M77k56j85L40L6m99K86L54l87l7K91k64j75M49k4l73J39K40l52
7879a64J06L47k67k42K39J23l09K13J94m24j1L76j51j22J82q0k37K67J98k99n8
7900a19K52k17j02L84l3m16J66K19k25O9L00l16k33L62L2k04J19P8k66OL69j64
$$ plain form
7922 61 -88 27 -1 -149 79 227 -167 -165 123 -23 -106 138 77 -249 -74 112 -21 -23 113 -89 -190 108 162
7945 162 -43 -98 55 -87 -41 137 12 -128 -15 38 -43 107 199 -39 -195 125 60 -17 40 -18 -119 -32 146
7968 146 74 -81 54 -57 -103 69 158 -55 -156 56 12 -27 92 -13 -157 28 95 -14 19 100 -96 -136 127
7991 127 127 6 -71 1 -77 16 181 -12 -110 29 62 -66 73 134 -77 -145 39 80 28 38 -22 -116 5 135 16
8016 16 -59 52 -30 -79 120 119 -2 -145 84 16 -3 125 -15 -169 41 143 -28 -60 56 -63 -119 163 78 -96
8040 -96 -17 74 -151 12 209 10 -195 8 39 18 43 100 -170 -135 79 40 -77 73 5 -171 -6 216 -2
8063 -2 -124 56 -64 -112 119 95 -153 -46 35 -68 -26 191 -73 -258 55 105 -118 22 126 -205 -82 265
8085 265 11 -153 74 16 -240 90 205 -141 -151 164 3 -133 201 90 -255 -35 152 -18 10 147 -78
$$ packed form
7922F1j49J15k8j48K28J48l94KK88j46q3K44o1l26J75J86j33kJ36k02j01K98N4
7945A62k05n5J53j42M6J78j25j40J13N3q1J50R2k38j56L20o5p7N7n8j01Q7J78
7968A46p2j55J35j11m6J72Q9k13j01K12m4l9J19j05j44J85O7j09L3Q1j96m0K63
7991A27%j21p7P2p8R3J65j93r8J39L3j28J39O1k11o8J84M1n2J0o0r4J21J30j19
8016A6p5J11q2m9J99jj21j43K29o8j9J28j40j54K10J02j71l2J16j19n6K82q5j74
8040i6P9R1k25J63J97j99k05K03L1k1K5N7k70L5K14l9j17J50o8j76J65K22k18
8063bj22J80j20m8K31k4k48J07Q1j03M2K17k64j85L13N0k23J40J04l31J23L47
8085B65k54j64K27n8k56L30J15l46j0L15j61j36L34j11l45K20J87j70K8J37k25
$$ plain form
8106 -78 -193 216 79 -166 87 112 -161 -57 217 -23 -196 120 23 -210 158 207 -220 -113 187 -3 -108
8127 -108 176 41 -305 39 142 -157 -40 170 -132 -184 266 157 -215 33 95 -127 55 287 -133 -182 227
8148 227 63 -200 147 149 -269 -87 251 -26 -111 147 -38 -274 128 276 -217 -73 179 -125 -131 253 84 -251
8170 -251 74 178 -221 68 277 -187 -318 134 122 -157 96 78 -303 -51 304 -76 -216 216 -26 -267 235
$$ packed form
8106g8j15M09j37k45K53K5k73J04K74k40j73L16r7k33L68M9m27J07L00j90j05
8127a08K84j35l46L44J03k99J17K10l02n2M50j09l72K48O2k22J82K32m20m9M09
8148B27j64k63L47Km18J82L38k77q5K58j85k36M02J48m93J44K52l04oL84j69l35
8170b51L25J04l99K89K09m64j31M52j2k79K53j8l81K52L55l80j40M32k42k41N02
8191B35
$$ Imaginary data points
##PAGE= N=2
##DATA TABLE= (X++(I..I)), XYDATA
$$ plain form
0 0 0 0 0 0 0 0 0 0 0 0 -4 8 -8 8 -12 16 -19 25 -32 35 -43 51 -61 73 -84 100 -115 134 -154 177 -201 228 -261
33 -261 293 -332 373 -420 470 -525 583 -650 724 -802 887 -981 1083 -1195 1319 -1453 1600
50 1600 -1761 1942 -2141 2363 -2610 2892 -3211 3579 -4008 4511 -5120 5870 -6817 8055 -9750
65 -9750 12225 -16177 23469 -41253 171991 83767 -341160 109527 177699 -199752 -6032
76 -6032 241616 -178600 -152278 257300 280 -251788 183673 151672 -289950 -23927 285910
87 285910 -107370 -155131 187082 -27798 -200937 192145 127886 -262952 5396 234160
97 234160 -154199 -126269 245971 -5502 -237766 117810 121358 -178631 47556 175006 -194510
108 -194510 -104733 255296 -10718 -212904 133181 97597 -208692 34882 196760 -135400
$$ packed form
0@%%%%%%%%%%mJ2j6J6k0K8l5M4n7O7p8R4j12J34j57J84k15K49k88L31l78M29m89
33b61N54o25P05p93Q90r95J108j233J374j526J689j868K064k278K514k772L053
50A600l361L703m083M504m973N502o103O790p587Q519r631J0990j2687J4872j7805
65i750K1975k8402L9646o4722K13244q8224m24927M50687O8172l77451J93720
76f032K47648m20216K6322M09578k57020k52068M35461l2001m41622K66023L09837
87B85910l93280m7761L42213k14880j73139L93082o4259l90838K68348K28764
97B34160l88359K7930L72240k51473k32264L55576L548k99989K26187J27450l69516
108a94510Q9777L60029k66014k02186L46085l5584l06289K43574J61878l32160
$$ plain form
118 -135400 -92930 176639 -58499 -154046 188525 79541 -237578 22874 187044 -121548
128 -121548 -69265 176455 -59657 -158855 147972 68328 -169423 61545 130348 -171012 -52040
139 -52040 208232 -37692 -156109 112072 42693 -146725 76804 124473 -150870 -46865
149 -46865 156406 -60221 -104606 149415 24229 -177017 53967 127091 -107457 -21872 123905
160 123905 -86382 -95695 149218 27803 -144445 58895 83955 -129655 -1617 148598
170 148598 -69049 -101736 107225 7568 -106941 89017 71254 -142493 -10166 130950
180 130950 -58524 -65670 110911 -16540 -120882 79815 78123 -103944 2469 88646 -85112
191 -85112 -47327 128540 -5925 -112640 56973 48396 -90942 29044 93143 -83453 -56549
$$ packed form
118a35400M2470K69569k35138r5547L42571j08984l17119K60452J64170l08592
128a21548N2283K45720k36112r9198L06827p9644k37751K30968O8803l01360J18972
139e2040K60272k45924j18417K68181o9379j89418K23529M7669k75343J04005
149d6865K03271k16627m4385K54021j25186k01246K30984P3124k34548Q5585J45777
160A23905k10287r313K44913j21415j72248K03340K5060k13610J28038J50215
170A48598k17647l2687K08961r9657j14509J95958j7763k13747J32327J41116
180A30950j89474p146J76581j27451j04342K00697j692j82067J06413Q6177j73758
191h5112L7785J75867j34465j06715J69613q577j39338J19986O4099j76596K6904
$$ plain form
202 -56549 95888 -8519 -70458 75058 25842 -109284 20439 93209 -56299 -35064 74178
213 74178 -35106 -69073 81866 37516 -87421 13254 56276 -64261 -9044 90788 -32526
224 -32526 -76082 56716 25015 -61440 37074 49114 -77994 -21500 79070 -16541 -44751
235 -44751 53345 -3401 -72518 40471 59670 -55221 -17496 49276 -34604 -30961 69475 7537
247 7537 -68524 18280 35451 -41147 9565 52628 -42313 -43173 50525 12057 -37798 27929 16223
260 16223 -56329 3505 56403 -18670 -28480 29505 -10767 -34417 39499 28981 -44136 -8898
272 -8898 28274 -19463 -5541 42215 -11152 -44870 17944 23821 -19344 8761 19409 -33650
284 -33650 -17039 37134 7334 -21143 9880 -792 -26881 14882 32367 -15955 -19837 10652
$$ packed form
202e6549J52437j04407o1939J45516m9216j35126J29723P2770j49508K1235J09242
213G4178j09284l3967J50939m4350j24937J00675M3022j20537N5217R9832j23314
224c2526m3556J32798l1701q6455R8514J2040j27108N6494J00570r5611k8210
235d4751R8096n6746o9117J12989J9199j14891L7725O6772q3880L643J00436o1938
247G537p6061Q6804J7171p6598N0712M3063r4941q60R3698l8468m9855O5727j1706
260A6223p2552N9834N2898p5073r810N7985m0272k3650P3916j0518p3117L5238
272h898L7172m7737J3922M7756n3367l3718O2814N877m3165K8105J0648n3059
284c3650J6611N4173k9800k8477L1023j0672k6089M1763J7485m8322l882L0489
$$ plain form
296 10652 -3629 -6775 23669 6875 -27828 -6669 15096 435 3135 10512 -13876 -18748 11456
309 11456 16362 -2018 -3300 -3770 -11519 716 17352 7415 -10194 -10845 -2486 4765 9543 6504
323 6504 -5342 -14108 -5640 11299 11442 -1706 -5516 -6285 -8586 6609 19571 -1092 -17723 -1922
337 -1922 4065 -2563 12219 11680 -19824 -15401 15976 6981 -5655 10974 -3140 -26935 6612
350 6612 28052 -8206 -12125 11863 -11634 -16681 28691 16738 -29636 -5321 16799 -14987 495
363 495 33114 -13109 -35372 18983 17247 -20701 12340 19935 -36570 -14572 41465 429 -26417
376 -26417 20228 1515 -37566 20052 39341 -30388 -19298 30143 -13928 -22499 42933 9691
388 9691 -51383 7812 34525 -27620 -2706 42001 -27575 -40862 42662 18570 -40008 17320
$$ packed form
296A0652j4281l146L0444j6794l4703K1159K1765j4661K700P377k4388m872L0204
309A1456M906j8380j282m70p749J2235J6636r937j7609o51Q359P251M778l039
323F504j1846q766Q468J6939J43j3148l810p69k301J5195J2962k0663j6631J5801
337a922N987o628J4782n39l1504M423L1377q995j2636J6629j4114k3795L3547
350F612K1440l6258l919K3988k3497n047M5372j1953m6374K4315K2120l1786J5482
363D95L2619m6223k2263N4355j736l7948L3041P595n6505K1998N6037m1036k6846
376b6417M6645j8713l9081N7618J9289o9729J1090M9441m4071q571O5432l3242
388I691o1074N9195K6713o2145K4914M4707o9576j3287Q3524k4092n8578N7328
$$ plain form
400 17320 24415 -49442 -3307 59494 -17991 -40311 36368 2196 -45877 35320 39781 -54289
412 -54289 -15082 48732 -21906 -25415 53977 -3817 -63558 28914 42779 -44404 -802 47424
424 47424 -41212 -35219 62992 8358 -55482 27097 25968 -56405 10487 63927 -39070 -42135
436 -42135 51655 -1768 -47648 46397 28673 -69924 1010 61012 -34268 -25813 59463 -17357
448 -17357 -63196 49251 38832 -59203 6663 47452 -52614 -20531 76480 -12969 -65218 43954
460 43954 24695 -62869 24180 59910 -58935 -31702 66204 -13895 -46678 58436 11656 -79811
472 -79811 25404 66036 -53037 -22395 63653 -29834 -52838 65942 21233 -70643 22607
483 22607 44899 -62822 -3688 80019 -35609 -63526 59494 18237 -61937 35791 43769 -72159
$$ packed form
400A7320P095p3857M6135O2801p7485k2320P6679l4172m8073Q1197M461r4070
412e4289L9207O3814p0638l509P9392n7794n9741R2472J3865q7183M3602M8226
424D7424q8636N993R8211n4634o3840Q2579j129q2373O6892N3440j02997l065
436d2135R3790n3423m5880R4045j7724r8597P0934O0002r5280Q455Q5276p6820
448a7357m5839J12447j0419r8035O5866M0789j00066L2083R7011q9449n2249J09172
460D3954j9259q7564Q7049L5730j18845K7233R7906q0099l2783J05114m6780r1467
472g9811J05215M0632j19073L0642Q6048r3487k3004J18780m4709r1876R3250
483B2607K2292j07721N9134Q3707j15628k7917J23020m1257q0174R7728P978j15928
$$ plain form
495 -72159 -8937 74811 -32739 -44404 67287 -2576 -79073 44599 58782 -65917 -11624
506 -11624 61046 -42895 -34553 79078 -4742 -79745 44740 45096 -72448 7332 76448 -52495
518 -52495 -50851 71989 2269 -60463 50899 25737 -84885 17459 82427 -54940 -44291
529 -44291 74783 -11498 -70261 58169 40015 -75597 8248 58838 -57414 -18350 86969
540 86969 -27074 -81233 61297 41269 -73545 15320 61019 -62332 -26952 78211 -19697
551 -19697 -58088 63336 13471 -86603 34443 77116 -66475 -35566 72416 -21024 -51996
562 -51996 67486 13146 -81872 32461 58494 -70077 -10019 85682 -40455 -70775 70707
573 70707 27202 -70542 28615 42814 -72803 159 84730 -43645 -58640 74053 7754
$$ packed form
495g2159O3222Q3748j07550j1665J11691o9863p6497J23672J4183j24699N4293
506a1624P2670j03941Q342J13631q3820p5003J24485L56j17544P9780O9116j28943
518e2495J644J22840o9720o2732J11362k5162j10622J02344O4968j37367J0649
529d4291J19074q6281n8763J28430j8154j15612Q3845N0590j16252L9064J05319
540H6969j14043n4159J42530k0028j14814Q8865M5699j23351L5380J05163r7908
551a9697l8391J21424m9865j00074J21046M2673j43591L0909J07982r3440l0972
562e1996J19482n4340r5018J14333K6033j28571O0058R5701j26137l0320J41482
573G0707m3505r7744R9157J4199j15617P2962Q4571j28375j4995J32693o6299
$$ plain form
584 7754 -80994 43577 60315 -71783 -16339 67127 -35973 -34638 75387 -10556 -84077 50764
596 50764 56587 -73503 -5818 72135 -44665 -46703 71729 3899 -64453 42880 29198 -75889
608 -75889 16989 80240 -54762 -51776 71311 1552 -62955 47684 33300 -73430 8138
619 8138 64124 -49223 -26426 75126 -21188 -74299 57693 44341 -69415 4720 55062
630 55062 -51525 -21760 74785 -18441 -63809 53152 24592 -71016 23367 64622 -58298
641 -58298 -34080 66460 -11136 -47924 52591 12619 -72038 25287 60056 -53070 -21580
652 -21580 63335 -24430 -52387 56895 23009 -62548 16042 41269 -50927 -5629 66088 -29369
664 -29369 -53461 51464 17339 -55282 25682 41113 -55461 -13138 58955 -20225 -36310 48278
$$ packed form
584G754q8748J24571J6738j32098N5444Q3466j03100J335J10025q5943p3521J34841
596E0764N823j30090O7685P7953j16800k038J18432o7830o8352J07333j3682j05087
608g5889R2878O3251j35002K986J23087o9759o4507J10639j4384j06730Q1568
619H138N5986j13347K2797J01552r6314n3111J31992j3352j13756P4135N0342
630E5062j06587K9765R6545r3226m5368J16961k8560r5608R4383M1255j22920
641e8298K4218J00540p7596l6788J00515l9972q4657R7325L4769j13126L1490
652b1580Q4915q7765k7957J09282l3886q5557P8590K5227r2196M5298P1717r5457
664b9369k4092J04925l4125p2621Q0964J5431r6574M2323P2093p9180j6085Q4588
$$ plain form
676 48278 296 -58566 32850 45120 -50783 -12014 49042 -27049 -31191 53448 3883 -55022
688 -55022 24194 31949 -44547 3770 49684 -34798 -35721 48729 6287 -42596 27082 22072 -49096
701 -49096 3652 49005 -26096 -26711 39219 -6603 -39616 34303 25831 -44829 -1322 35942 -25369
714 -25369 -14161 42768 -9413 -41519 26954 21548 -34047 8077 30229 -32598 -16767 40828
726 40828 -3202 -30417 23455 8372 -36032 13885 33815 -27868 -16286 30149 -9175 -22605
738 -22605 30549 9007 -36707 7143 25760 -21428 -4123 29227 -16642 -26080 27441 11273
750 11273 -26163 9644 15926 -26953 -2741 31572 -9482 -21116 18238 1610 -21633 16751
762 16751 18172 -25056 -6972 21630 -8379 -10438 21387 -1915 -25092 10535 16791 -14705 -729
$$ packed form
676D8278m7982n8862R1416J2270r5903L8769O1056p6091m142Q4639m9565n8905
688e5022P9216P755p6496M8317M5914q4482r23Q4450m2442m8883O9678n010p1168
701d9096N2748M5353p5101o15O5930m5822l3013P3919q472p0660M3507L7264o1311
714b5369J1208N6929n2181l2106O8473n406n5595M2124K2152o2827J5831N7595
726D0828m4030k7215N3872j5083m4404M9917J9930o1683J1582M6435l9324j3430
738b2605N3154k1542m5714M3850J8617m7188J7305L3350m5869r438N3521j6168
750A1273l7436L5807O282m2879K4212L4313m1054j1634L9354j6628k3243L8384
762A6751J421m3228J8084K8602l0009k059L1825k3302k3177L5627O256l1496J3976
$$ plain form
775 -729 14708 -14657 -11078 21407 3667 -17256 6464 6336 -15455 4655 18732 -10772 -12904
788 -12904 11559 677 -9093 11701 5530 -17320 -1345 13348 -4099 -3629 9514 -5862 -12238
801 -12238 9976 9345 -8333 -1271 4473 -7557 -1287 12184 -13 -9721 1169 2242 -3372 4875
815 4875 5748 -7492 -6168 4970 2709 -760 2493 -1471 -6496 321 6282 2020 -2032 -2241 -2443
830 -2443 -283 3851 3654 -1370 -4791 -2100 2715 2855 973 378 -3255 -5003 2793 6821 -1199 -3918
846 -3918 662 -2144 -2108 7320 3776 -8114 -2511 4768 -2198 443 8038 -4386 -10485 5908 6660
861 6660 -6041 1812 5534 -10351 -4321 13631 782 -9998 5218 1835 -11308 6299 13293
874 13293 -10815 -8079 11260 -2541 -8585 13591 4027 -18467 1948 14290 -8993 -3579 14428
$$ packed form
775g29J5437k9365L579L2485j7740k0923K3720j28k1791K0110J4077k9504k132
788a2904K4463j0882r770K0794o171k2850J5975J4693j7447M70J3143j5376o376
801a2238K2214o31j7678P062N744j2030O270J3471j2197r708J0890J073n614Q247
815D875Q73j3240J324J1138k261l469L253l964n025O817N961m262m052k09k02
830b443K160M134j97n024l421K691M815J40j882n95l633j748P796M028q020k719
846c918M580k806L6R428l544j1890N603P279o966K641P595j2424o099J6393P52
861F660j2701P853L722j5885O030J7952j2849j0780J5216l383j3143J7607O994
874A3293k4108K736J9339j3801o044K2176r564k2494K0415J2342k3283N414J8007
$$ plain form
887 14428 -8296 -15050 15687 8398 -16410 3967 11261 -16481 -2944 22484 -5950 -17826 13663
900 13663 4675 -17856 10649 16190 -20824 -7573 21533 -6426 -13901 19776 1389 -25708 10683
913 10683 20075 -18954 -4534 21445 -13564 -16699 25614 5545 -26031 9505 15583 -22759 475
926 475 27780 -15358 -20673 23834 3392 -24036 16283 16188 -29233 -2594 29238 -12956 -16469
939 -16469 25175 -2526 -28298 19634 19734 -28107 -1486 25937 -18859 -14816 31942 -1303 -31102
952 -31102 17137 16347 -27759 5176 28583 -23953 -17918 32240 -1574 -27455 22139 12781 -34273
965 -34273 6151 32021 -22325 -15196 30846 -8571 -28431 28386 15085 -35850 5202 28331
977 28331 -24926 -10097 35381 -11089 -31203 27234 13010 -33182 11580 27530 -31344 -11773
$$ packed form
887A4428k2724o754L0737p289k4808K0377P294k7742J3537K5428k8434j1876L1489
900A3663q988k2531K8505N541l7014J3251K9106k7959p475L3677j8387k7097L6391
913A0683R392l9029J4420K5979l5009l135M2313k0069l1576L5536O078l8342K3234
926D75K7305m3138n315M4507k0442k7428M0319r5m5421K6639L1832m2194l513
939a6469M1644k7701k5772M7932J00m7841K6621K7423m4796M043M6758l3245k9799
952c1102M8239p90m4106L2935K3407n2536O035N0158l3814k5881M9594r358m7054
965c4273M0424K5870n4346P129M6042l9417j9860N6817j3301n0935M1052K3129
977B8331n3257J4829M5478m6470k0114N8437j4224m6192M4762J5950n8874J9571
$$ plain form
989 -11773 37699 -8619 -28029 26616 7215 -34948 15475 29027 -31240 -10179 34763 -14170
1001 -14170 -25912 33231 8173 -38079 12401 26551 -28641 -3762 34421 -19947 -26418 35078
1013 35078 6682 -36165 17109 23783 -34814 -3408 37669 -17657 -24135 31814 -429 -34203
1025 -34203 24857 23280 -38679 -2505 36727 -20228 -20551 35626 -2435 -35955 23394 20457 -35005
1038 -35005 4783 33407 -28443 -19707 40116 -1618 -35199 22655 16294 -35056 8067 33120
1050 33120 -28056 -16463 36809 -8072 -31796 30315 15653 -39752 5896 32613 -25027 -11933
1062 -11933 34500 -13217 -30074 32277 12519 -38354 11469 29853 -31875 -10896 39188 -11095
1074 -11095 -29810 28442 7590 -34684 18031 27234 -36010 -8295 39277 -15068 -27452 33278
$$ packed form
989a1773M9472m6318j9410N4645j9401m2163N0423J3552o0267K1061M4942m8933
1001a4170j1742N9143k5058m6252N0480J4150n5192K4879L8183n4368o471O1496
1013C5078k8396m2847N3274O674n8597L1406M1077n5326o478N5949l2243l3774
1025c4203N9060j577o1959L6174L9232n6955l23N6177l8061l3520N9349k937n5462
1038c5005L9788K8624o1850Q736N9823m1734l3581N7854o361n1350M3123K5053
1050C3120o1176J1593N3272m4881k3724O2111j4662n5405M5648K6717n7640J3094
1062a1933M6433m7717j6857O2351j9758n0873M9823J8384o1728K0979N0084n0283
1074a1095j8715N8252k0852m2274N2715R203o3244K7715M7572n4345j2384O0730
$$ plain form
1086 33278 5915 -38114 16543 26670 -31777 -3393 34518 -21757 -24061 38021 4249 -38645
1098 -38645 17917 24252 -33336 -1206 35706 -20775 -22967 33779 -103 -33699 23724 20985
1110 20985 -38096 -764 36778 -19728 -20792 32678 -2815 -32634 24288 19119 -35386 3298
1122 3298 32605 -25299 -17724 37545 -3066 -34304 22204 16887 -32541 7167 29954 -27810
1134 -27810 -15116 36540 -6742 -30914 26812 14035 -36351 7311 31233 -24711 -12866 32294
1146 32294 -10644 -27214 29595 11447 -36138 9147 28314 -26652 -10240 33798 -10708 -27429
1158 -27429 26197 9635 -31182 12352 24224 -29070 -8254 33811 -10621 -24842 25631 6520
1170 6520 -30742 13259 23615 -26837 -6599 29531 -13384 -21018 27981 5015 -30975 12460
$$ packed form
1086C3278k7363m4029N4657J0127n8447K8384L7911n6275k304O2082l3772m2894
1098c8645N6562O335n7588L2130L6912n6481k192N6746l3882l3596N7423k739
1110B0985n9081L7332L7542n6506j064N3470l5493k9819N6922n169n4505L8684
1122C298K9307n7904P575N5269m0611l1238N6508n317m9428L9708K2787n7764
1134b7810J2694N1656m3282k4172N7726j2777n0386M3662K3922n5944J1845M5160
1146C2294m2938j6570N6809j8148m7585M5285J9167n4966J6412M4038m4506j6721
1158b7429N3626j6562m0817M3534J1872n3294K0816M2065m4432j4221N0473j9111
1170F520l7262M4001J0356n0452K0238L6130m2915p634M8999k2966l5990M3435
$$ plain form
1182 12460 21213 -25028 -3110 28018 -15473 -19812 27280 3572 -27599 14581 17652 -26896
1194 -26896 -1424 28115 -14583 -17770 24449 187 -24978 16822 15905 -26423 -503 24957
1206 24957 -15158 -14017 25000 -1463 -24685 15556 14389 -22904 1607 21570 -16512 -12228
1218 -12228 24088 -1567 -21647 14613 10762 -22159 3446 20881 -15327 -11336 20720 -2648
1230 -2648 -18067 15425 8948 -21297 3180 18288 -13895 -7886 19303 -4928 -17156 14959
1242 14959 8239 -18565 3867 14800 -14296 -5857 18560 -4685 -14971 13071 5375 -16190
1254 -16190 6022 13402 -14093 -5327 16054 -4683 -11601 12648 3327 -15370 5397 11672 -11475
1267 -11475 -3350 12922 -5967 -9672 12186 2947 -12922 4730 8545 -10353 -1375 11947 -5370
$$ packed form
1182A2460Q753m6241K1918L1128m3491m339M7092k3708l1171M2180L071m4548
1194b6896K5472K9539m2698l187M2219k4262k5165M1800r17m2328K5920K5460
1206B4957m0115J141L9017k6463k3222M0241j167l7293K4511J9963l8082M284
1218a2228L6316k5655k0080L6260l851l2921K5605J7435l6208L991L2056k3368
1230b648j5419L3492o477l0245K4477J5108l2183O009K7189k4231j2228L2115
1242A4959o720k6804K2432J0933k9096Q439K4417k3245j0286K8042p696k1565
1254a6190K2212P380k7495Q766K1381k0737o918K4249r321j8697K0767O275k3147
1267a1475Q125J6272j8889l705K1858r239j5869J7652L815j8898Q978J3322j7317
$$ plain form
1280 -5370 -8609 9464 1838 -9704 5242 6387 -9778 -1103 9853 -4402 -5877 8036 -8
$$ packed form
1280e370l239J8073p626j1542J4946J145j6165Q675J0956j4255j475J3913q044
$$ [...]
8191B50
##END NTUPLES=NMR FID
##END=
