##TITLE=1H_IBA1103A
 CDCl3
 8 sc, 
 12.3.2024
##JCAMPDX= 6.0         $$ Bruker NMR JCAMP-DX V2.0
##DATA TYPE= NMR FID
##DATA CLASS= NTUPLES
##ORIGIN= UXNMR, Bruker Analytische Messtechnik GmbH
##OWNER= root
$$ XWIN-NMR		Version 3.5
$$ Tue Mar 12 14:59:42 2024 Russian Standard Time (UT+4h)  she@DPX200
##.OBSERVE FREQUENCY= 200.1313
##.OBSERVE NUCLEUS= ^1H
##.DELAY= (6, 6)
##.ACQUISITION MODE= SIMULTANEOUS
##.ACQUISITION SCHEME= undefined
##.AVERAGES= 8
##.DIGITISER RES= 18
##SPECTROMETER/DATA SYSTEM= spect
##.PULSE SEQUENCE= zg30
##.SOLVENT NAME= CDCl3
##.SHIFT REFERENCE= (INTERNAL, CDCl3, 0, 15.7039)
##AUDIT TRAIL= $$ (NUMBER, WHEN, WHO, WHERE, WHAT)
$$ ##TITLE= Audit trail, XWIN-NMR		Version 3.5
$$ ##JCAMPDX= 5.01
$$ ##ORIGIN= Bruker BioSpin GmbH
$$ ##OWNER= she
$$ F:/spectra/data/she/nmr/H-F/1/audita.txt
$$ ##AUDIT TRAIL=  $$ (NUMBER, WHEN, WHO, WHERE, WHAT)
(   1,<2024-03-12 14:57:47.14 +0400>,<she>,<DPX200>,
      <created by zg, POWCHK disabled, PULCHK disabled
       configuration hash MD5:
       00 E9 B6 7A A2 85 ED C7 34 08 36 98 17 FE 4E 26
       data hash MD5: 16K
       7C E8 3E 3C B3 4A BD B3 C7 12 7E B2 9F 70 09 8E>)
$$ ##END=
$$ 
$$ hash MD5
$$ C3 C4 DC C1 A1 90 5F C4 E4 E8 A9 ED BB B7 05 F0
##$RELAX= 
##$RELAX= 
##$RELAX= 
##$RELAX= 
##$RELAX= 
##$RELAX= 
$$ Bruker specific parameters
$$ --------------------------
##$DU= <F:/spectra>
##$EXPNO= 1
##$NAME= <H-F>
##$PROCNO= 1
##$TYPE= <nmr>
##$USER= <she>
##$AMP= (0..31)
100 100 100 100 100 100 100 100 100 100 100 100 100 100 100 100 100 100 
100 100 100 100 100 100 100 100 100 100 100 100 100 100 
##$AQSEQ= 0
##$AQ_mod= 1
##$AUNM= <au_zg>
##$AUTOPOS= <>
##$BF1= 200.13
##$BF2= 200.13
##$BF3= 200.13
##$BF4= 200.13
##$BF5= 200.13
##$BF6= 200.13
##$BF7= 200.13
##$BF8= 200.13
##$BYTORDA= 1
##$CFDGTYP= 0
##$CFRGTYP= 5
##$CHEMSTR= <none>
##$CNST= (0..31)
1 1 145 1 1 1 1 1 1 1 1 1 1 1 1 1 1 1 1 1 1 1 1 1 1 1 1 1 1 1 1 1 
##$CPDPRG= <>
##$CPDPRG1= <>
##$CPDPRG2= <>
##$CPDPRG3= <>
##$CPDPRG4= <mlev>
##$CPDPRG5= <mlev>
##$CPDPRG6= <mlev>
##$CPDPRG7= <mlev>
##$CPDPRG8= <mlev>
##$CPDPRGB= <>
##$CPDPRGT= <>
##$D= (0..31)
0 1.2 0 0 0 0 0 0 0 0.06 0 0.03 0 0 0 0 0.0002 0 0 0 0 0 0 0 0 0 0 0 0 
0 0 0 
##$DATE= 1710241066
##$DBL= (0..7)
120 120 120 120 120 120 120 120 
##$DBP= (0..7)
150 150 150 150 150 150 150 150 
##$DBP07= 0
##$DBPNAM0= <>
##$DBPNAM1= <>
##$DBPNAM2= <>
##$DBPNAM3= <>
##$DBPNAM4= <>
##$DBPNAM5= <>
##$DBPNAM6= <>
##$DBPNAM7= <>
##$DBPOAL= (0..7)
0.5 0.5 0.5 0.5 0.5 0.5 0.5 0.5 
##$DBPOFFS= (0..7)
0 0 0 0 0 0 0 0 
##$DE= 6
##$DECBNUC= <off>
##$DECIM= 32
##$DECNUC= <off>
##$DECSTAT= 4
##$DIGMOD= 1
##$DIGTYP= 9
##$DL= (0..7)
0 120 120 120 120 120 120 120 
##$DP= (0..7)
150 150 150 150 150 150 150 150 
##$DP07= 0
##$DPNAME0= <>
##$DPNAME1= <>
##$DPNAME2= <>
##$DPNAME3= <>
##$DPNAME4= <>
##$DPNAME5= <>
##$DPNAME6= <>
##$DPNAME7= <>
##$DPOAL= (0..7)
0.5 0.5 0.5 0.5 0.5 0.5 0.5 0.5 
##$DPOFFS= (0..7)
0 0 0 0 0 0 0 0 
##$DQDMODE= 0
##$DR= 18
##$DS= 0
##$DSLIST= <SSSSSSSSSSSSSSS>
$$ [...]
##$SUBNAM2= <"">
##$SUBNAM3= <"">
##$SUBNAM4= <"">
##$SUBNAM5= <"">
##$SUBNAM6= <"">
##$SUBNAM7= <"">
##$SUBNAM8= <"">
##$SUBNAM9= <"">
##$SW= 18.0517328524113
##$SWIBOX= (0..15)
0 0 2 0 0 0 0 0 0 0 0 0 0 0 0 0 
##$SW_h= 3612.71676300578
##$TD= 16384
##$TD0= 1
##$TE= 0
##$TE2= 300
##$TE3= 300
##$TEG= 300
##$TL= (0..7)
0 120 120 120 120 120 120 120 
##$TP= (0..7)
150 150 150 150 150 150 150 150 
##$TP07= 0
##$TPNAME0= <>
##$TPNAME1= <>
##$TPNAME2= <>
##$TPNAME3= <>
##$TPNAME4= <>
##$TPNAME5= <>
##$TPNAME6= <>
##$TPNAME7= <>
##$TPOAL= (0..7)
0.5 0.5 0.5 0.5 0.5 0.5 0.5 0.5 
##$TPOFFS= (0..7)
0 0 0 0 0 0 0 0 
##$TUNHIN= 0
##$TUNHOUT= 0
##$TUNXOUT= 0
##$USERA1= <user>
##$USERA2= <user>
##$USERA3= <user>
##$USERA4= <user>
##$USERA5= <user>
##$V9= 5
##$VALIST= <valist>
##$VCLIST= <CCCCCCCCCCCCCCC>
##$VD= 0
##$VDLIST= <DDDDDDDDDDDDDDD>
##$VPLIST= <PPPPPPPPPPPPPPP>
##$VTLIST= <TTTTTTTTTTTTTTT>
##$WBST= 1024
##$WBSW= 4
##$XGAIN= (0..3)
0 0 0 0 
##$XL= 0
##$YL= 0
##$YMAX_a= 691420
##$YMIN_a= -753399
##$ZGOPTNS= <>
##$ZL1= 120
##$ZL2= 120
##$ZL3= 120
##$ZL4= 120
##$ABSF1= 10
##$ABSF2= 0
##$ABSG= 5
##$ABSL= 3
##$ALPHA= 0
##$AQORDER= 0
##$ASSFAC= 0
##$ASSFACI= 0
##$ASSFACX= 0
##$ASSWID= 0
##$AUNMP= <proc_1d>
##$AZFE= 0.1
##$AZFW= 0.1
##$BCFW= 1
##$BC_mod= 2
##$BYTORDP= 1
##$COROFFS= 0
##$CY= 11.3945322036743
##$DATMOD= 1
##$DC= 2
##$DFILT= <>
##$DTYPP= 0
##$F1P= 15.7292609196834
##$F2P= 12.9074282941183
##$FCOR= 0.5
##$FTSIZE= 0
##$FT_mod= 4
##$GAMMA= 1
##$GB= 0.15
##$INTBC= 1
##$INTSCL= 1
##$ISEN= 128
##$LB= 0.24
##$LEV0= 0
##$LPBIN= 0
##$MAXI= 10000
##$MC2= 0
##$MEAN= 0
##$ME_mod= 0
##$MI= 1.114404
##$NCOEF= 0
##$NC_proc= 0
##$NLEV= 6
##$NOISF1= 3.799351
##$NOISF2= 2.8
##$NSP= 1
##$NTH_PI= 0
##$NZP= 0
##$OFFSET= 15.70392
##$PC= 1
##$PHC0= -25459.7
##$PHC1= 11.18731
##$PH_mod= 1
##$PKNL= yes
##$PPARMOD= 0
##$PSCAL= 0
##$PSIGN= 0
##$REVERSE= no
##$SF= 200.130013532006
##$SI= 16384
##$SIGF1= 3
##$SIGF2= 2
##$SINO= 400
##$SIOLD= 16384
##$SREGLST= <1H.CDCl3>
##$SSB= 0
##$STSI= 0
##$STSR= 0
##$SW_p= 3612.71676300578
##$SYMM= 0
##$S_DEV= 0
##$TDeff= 0
##$TDoff= 0
##$TI= <>
##$TILT= no
##$TM1= 0
##$TM2= 0
##$TOPLEV= 0
##$USERP1= <user>
##$USERP2= <user>
##$USERP3= <user>
##$USERP4= <user>
##$USERP5= <user>
##$WDW= 1
##$XDIM= 8192
##$YMAX_p= 0
##$YMIN_p= 0
$$ End of Bruker specific parameters
$$ ---------------------------------
##NTUPLES= NMR FID
##VAR_NAME=  TIME,          FID/REAL,        FID/IMAG
##SYMBOL=    X,             R,               I
##VAR_TYPE=  INDEPENDENT,   DEPENDENT,       DEPENDENT
##VAR_FORM=  AFFN,          ASDF,            ASDF
##VAR_DIM=   8192,          8192,            8192
##UNITS=     SECONDS,       ARBITRARY UNITS, ARBITRARY UNITS
##FACTOR=    0.0002768,     1,               1
##FIRST=     0,             0,               0
##LAST=      2.2672688,     0,               0
##MIN=       0,             -753399,         0
##MAX=       2.2672688,     691420,          0
$$ Real data points
##PAGE= N=1
##DATA TABLE= (X++(R..R)), XYDATA
$$ [...]
2368G95j144l91M72M23P1Q6j69p36j61J254L93j138k70M81l25L02J159o69j350
2387i17M83J144p05j26N99j141o38J995N39j682J18M38r92N88J917r53k168J111
2405c90J112j105M73J531k049j168K465K85k104Q41P84j745M12K435j223k122
2421a568J564Q41j949J174J615k729p56L072m02j829J429N20k606R87K979k011
2437C31k068K135J18k299K137J630l150n12L343r82k028K186%l087J693L140k560
2454B7j782L093p67k661L064J369m246J18L928j941j898L370n56l951K449L233
2470B849l700j086L864j719k767M368O65n050J166L743k997j075M421j683m568
2485c569L847K759m827L03L984l541j850N718m73n451K584L158m459K70N204l459
$$ y = [795, -349, -740, -268, 155, 226, 312, 143, -593, -754, 500, 893, -245, -515, -34, -359, -57, 1102, 433, -917, -434, 710, 5, -121, 478, -663, -1301, 694, 1233, -449, -331, 107, -885, -297, 1620, 667, -1501, -390, 722, -383, 90, 1621, -428, -1596, 869, 1154, -950, -109, 675, -1070, -658, 1777, 554, -1568, -4, 837, -1112, 62, 1677, -1052, -1808, 1264, 862, -967, 462, 982, -1624, -637, 2342, 331, -1737, 398, 516, -1783, 354, 1984, -1166, -1678, 1665, 683, -1345, 841, 841, -2246, -553, 2587, 27, -1755, 1338, 571, -2090, 974, 2343, -1903, -1785, 2143, 202, -1696, 1674, 1118, -2833, -384, 2849, -851, -1937, 1927, 208, -2559, 1809, 2474, -2576, -1410, 2333, -664, -1739, 2682, 999, -3569, 278, 3037, -1790, -1487, 2497, -1044, -2894, 2824, 2351, -3100, -516, 2642, -1817, -1547, 3657, 198]
2501A98m102N356J394n465K284L581n570o55O687k120n255M296J924n735K265
2516i17N396n288l089O406p07n309M531K501o852Q11O811l903m015N505q7n896
2532d102M297M449o930j025O880l000m359O154P44p331K936N637n262j898O066
2547C256k708n244O447K632p877J155O345m687k823O837j400o752M725M118o198
2562b174L46O127m895m260P414J237p471K560M710n562m67O737l503n719N983
2577A063K536o849J832O024n593l395P518k76o584L781L017o260J242P133m776
2592D13n454O733J523o949L102N041o552j603P475k321n504N883J451p875L043
2607a594P167o100m004P285o77o088N093K973p848J144P425m960m024P407o49
$$ y = [198, -3904, 1452, 2846, -2619, -335, 3246, -2324, -2979, 3708, 1588, -3667, 629, 2553, -3182, -917, 4479, -809, -3898, 2508, 1801, -3508, 1023, 3524, -3328, -2517, 4294, 391, -3624, 1881, 1794, -4102, 195, 4644, -2286, -3311, 3569, 569, -3790, 2364, 3108, -4223, -1287, 4350, -912, -2810, 3256, 548, -4696, 1751, 4383, -3494, -2339, 4006, -681, -3504, 3333, 1933, -4819, -94, 4024, -2174, -1828, 4299, -596, -4856, 2558, 3795, -3676, -1116, 3594, -1968, -2435, 4302, 799, -4920, 1063, 3599, -3250, -1418, 4606, -987, -4382, 3136, 2860, -3724, 57, 3074, -3186, -1944, 5189, 413, -5041, 1692, 3215, -3734, -632, 4409, -2143, -3746, 3729, 1408, -4096, 1787, 3238, -4637, -1594, 5573, -527, -4531, 2754, 2077, -4011, 1082, 4055, -3793, -2649, 4776, -184, -4208, 3199, 2550]
2622B550p738M948N286o904j253O736l587m302P480K53q436L869O031o494j776
2637c337P520l247n861O274K407o928J991N274o082j824Q129k099o952M825L531
2652C621o145J104N289m663l050O663n18n869L929L163o353K03O867l293m770
2667c822M768J083m809K927L515n400j544O236j445m557M060J721n759J529N163
2682C666l821k656M699j025m218M090L054o143n83O008k191l949M535O68n571
2697c437K734M503m653j557N138k253m154N181K066o417R45N245l852k123N759
2712C125j873n727M880L245n853Q26N029m367k840O338l14n927L240L163n236
2727b291Q73N520m502l578N806K37n068L175K967n535K09N590k742l847M457L32
$$ y = [2550, -5188, -240, 5046, -1858, -3111, 3625, 38, -4264, 3216, 3469, -4967, -1098, 4933, -1561, -3337, 4183, 936, -4925, 1349, 3756, -3172, -1181, 4093, -1989, -3813, 4316, 2217, -4735, 90, 3621, -2524, -1420, 3869, -794, -3844, 2819, 2301, -3568, 361, 3524, -2829, -2626, 4241, 948, -3822, 946, 2029, -2780, 147, 3662, -1738, -3282, 2954, 1509, -3048, 1012, 2733, -3026, -1497, 3666, -155, -2811, 1888, 863, -3355, 735, 3789, -2354, -2937, 3071, 880, -3069, 1466, 2134, -3437, -703, 3800, -853, -2410, 2728, 475, -3679, 1502, 3568, -2849, -1904, 3341, -511, -2634, 3125, 1252, -4475, 405, 3650, -2203, -1377, 3652, -715, -3555, 2783, 2469, -3458, -218, 2945, -2291, -1418, 4102, -400, -3978, 1828, 2065, -3003, 172, 3139, -2396, -2187, 3403, 661, -3186, 1271, 1603]
2743A603m690L242L492m886j272M707j701k812L761K96m518J822L870l217j433
2758a736L297j279k855L397J552l736O8L005j704j432K873m07l266J563K563k113
2774b10q56K135q82k103K412J406k862j22K246j087j334K599j67l161J284K722
2790B020k177j064K744j253k684L075J596l494L6K787k008j136L382n79l819K286
2806b88K323l022K95K955k808j912M055L0l453J733J721l142M42L607k301k672
2822b437L120M19k776K061J526l441M9L156j230j621J989l88k220K006J745k483
2838e25m37J795j238o95K306m26j987Q27J189q71k6O22r35n64J283M27p64p1N1
2857c9l23L37M08l03k02l96K32P37op18J72k35j73Q08M73j076l56R90k57l21R27
$$ y = [1603, -3087, 155, 3647, -1239, -2511, 2196, 495, -2317, 1444, 1740, -2778, -956, 2914, -303, -1736, 1561, 282, -2573, 824, 2376, -1360, -1292, 1713, 9, -1423, 1450, 1043, -2223, -660, 1903, -210, -1066, 1069, 187, -1916, 496, 1902, -960, -1082, 1164, 77, -1257, 1342, 1175, -1986, -702, 2020, -157, -1221, 1523, 270, -2414, 661, 2257, -1237, -1201, 1586, -422, -1558, 1824, 1245, -2574, -288, 2035, -987, -692, 2263, -545, -2457, 1598, 1628, -1825, -92, 1629, -1513, -1071, 2536, 235, -2437, 683, 1102, -1674, 387, 1913, -1528, -1479, 1677, 447, -1174, 815, 427, -1793, 213, 1958, -525, -962, 833, -405, -1100, 1206, 780, -1207, -380, 809, -62, -88, 534, -401, -965, 318, 745, -19, -90, -39, -362, -25, 383, 80, -122, -518, -286, 451, 445, -273, -101, -336, -509, 299, 772, -304, -660, 330, 73, -248, 679]
2878F79l24j510Q90J299j104j68P70j021m35J699M6j604L18R18r73K36J478j102
2896I2j389J508N44j126L94N35j276p0J709k48j284L27M19n67M53Q77j031r67
2914a100J000M55k91L78O3j040o8J050J60q42l7M40l96LJ083n60j371O23R89n67
2934b8j95P38p19p60J318P54j569j15J220j104k08J965o66j962J070J155j365
2951d71K36J478j731j073K394L36k211Q32J112k145M72K612j606j918K127M67
2967I11k053J421J428k715n89K954p26k044K016L39k899J581K497k524j143K583
2983A037o20k007K328J013l320M09K900j749j345K716o76k921K365K016k877m85
2999a216K634j730j618L249L12l530J204K576k548m35L113j801k678L289J220
$$ y = [679, 355, -1155, -265, 1034, -70, -238, 532, -489, -924, 775, 821, -783, -465, 453, -520, -284, 1194, 92, -1297, 211, 755, -371, 23, 558, -718, -788, 921, 673, -611, -284, 135, -432, 21, 898, -133, -1100, -100, 355, 64, 442, 505, -535, -603, 447, 607, -235, -272, 168, -228, -225, 858, 298, -1073, -450, 539, -28, -223, 515, -204, -964, 354, 1108, -461, -576, 644, -460, -668, 1297, 631, -1331, -261, 894, -471, -235, 1243, -488, -1561, 833, 1169, -1042, -210, 902, -1243, -771, 1841, 235, -1683, 444, 911, -1142, 279, 1707, -1008, -1597, 1357, 631, -1413, 603, 942, -1957, -376, 2121, -403, -1546, 1037, 417, -1590, 738, 1751, -1569, -1160, 1740, -9, -1354, 1362, 686, -2235, 130, 2146, -731, -1216, 1418, -312, -1930, 1319, 1631, -1899, -695, 1881, -667, -1102, 2011, 210, -2468, 821, 2041]
3014B041l446Q24K492k816r77L964q05l720K483J695l336R51L193k996k147L971
3030A371J82l440K016J863l692K46L990k048k835L301L57l438K136K683l660j155
3046b123L920r08k898K944N88l808J201L954l003k049L660n95l386K974J915m031
3062a645K7L692j918k209L668n5m391K194L502l520j132L669j613k778L787J022
3078B300m427R20L724l085j664M514q93m566L139K816m174R9L834l100k278M909
3094B068J89n056K230L416m199o60M911k221l846M198J274m737K116L474m841
3109a684j140N621j227m528L450J835m611J293M139l884k044M854p62m050L498
3124G60K076m960K96M482k157k682L593j97l713K672K729m193r06M413j685k907
$$ y = [2041, -1405, -581, 1911, -905, -1882, 2082, 1277, -2443, 40, 1735, -1601, -650, 2543, -453, -2600, 1371, 1553, -1887, 129, 1992, -1700, -1454, 2536, 488, -2347, 954, 1311, -2127, 9, 2692, -968, -2123, 1797, 889, -2009, 935, 1523, -2285, -1084, 2870, -133, -2182, 1478, 883, -2503, 471, 2386, -1645, -1618, 2074, 156, -2053, 1615, 1560, -2831, -637, 2865, -655, -1787, 1882, 269, -2509, 1278, 2300, -2127, -1207, 2517, -568, -2232, 2282, 1389, -3177, -38, 2778, -1396, -1297, 2537, -563, -2841, 2068, 2257, -2799, -569, 2847, -1352, -2012, 2899, 678, -3168, 1030, 2304, -2433, -317, 3157, -1684, -2824, 2797, 1570, -2958, 492, 2327, -2284, -991, 3148, -736, -2780, 2074, 1312, -2738, 760, 2836, -2124, -1828, 2654, 497, -2185, 1408, 1211, -2502, 170, 2899, -1294, -2200, 2213, 528, -2379]
3140b379L488Q97m028R89L265k518j403L334r62l320L040K303l898o18L617j552
3156B55k369L242N44l752J231L166k949j146L798j242l810L503K362m232ML549
3172B154k560j747M094n12m330K703K928m124l13M454k697l202M422Q63m464K167
3188a64K468m171m0M938k436l687M008J184m445J839L366m272q28M489j663l106
3204b520L598O15m236J850L726l569j614L876r60l067L218J152m173J047L228
3219B171k529j163L221q59l018K293J743k880QK422j681j253K779j58k853J264
3235d93J863j932l46K360j191k021K010J212k315J83J830j508j013K617k13k403
3251a360R10J668j720k24K123j057k145K233J113k490N59J757k138p85L138n55
$$ y = [-2379, 1109, 2006, -2022, -1033, 2232, -286, -1689, 1645, 683, -2637, 403, 2706, -1192, -1810, 1807, 255, -2114, 1128, 1672, -2080, -849, 2317, -632, -1778, 2020, 778, -3032, 471, 2833, -1399, -1395, 2154, -406, -2153, 1941, 1429, -2901, -198, 2730, -1394, -1707, 2747, 50, -3152, 1270, 2133, -2331, -164, 2304, -1867, -1907, 3031, 595, -3092, 916, 2100, -2345, -506, 2860, -1412, -2240, 2249, 586, -2520, 1078, 1693, -2543, -693, 3033, -536, -2150, 1726, 766, -2301, 917, 2069, -2104, -1057, 2171, -358, -1521, 1700, 841, -2177, 116, 1859, -1021, -1013, 1409, -272, -1525, 1254, 1096, -1757, -493, 1370, -562, -908, 1452, 261, -1760, 250, 1462, -853, -670, 1160, -348, -1361, 1256, 1043, -1360, -450, 1218, -502, -726, 1397, 340, -1805, 428, 1541, -949, -390, 1367, -771, -1556, 1582, 1027]
3267A027k772J808J191k509N56K537k106j735L071J07k699J828J274l109M85K922
3283A876j738j679K503k44k376J868J614k844m42K964j294j554K543k67k748J620
3299a98J790k196j33K045j365j394K356K05k292R76J313j757J0J925j205j579
3315a499J851N37j537M96J055j471l36J687k25j398Q68M58j112N25J109j056p30
3332g78J035n5o27N10M30r75m1J126k34r07M77K92o99M35O25n17o40N86K81n20
3352a96K18L78q49n0R33r5o81L42Q7o52M20Q16n66p15O59K74o05M37L08r08o0
3373e05Q73P5o74M05j21n56M39O57n38m48M48N3l02N10J02p95L3N98pk47K15k88
3395g3j85L05K44j37l28P3N2J90P5p3l48j45L02K33L1k28j54J88k43L80L26o19
$$ y = [1027, -1745, 63, 1254, -1255, -699, 1838, -268, -2003, 1068, 1175, -1524, 304, 1578, -1531, -1046, 1876, 138, -1541, 962, 718, -1658, 210, 1824, -1020, -1462, 1502, 208, -1346, 1197, 930, -1818, -198, 1592, -604, -737, 1308, -57, -1451, 905, 1110, -1182, -206, 1107, -650, -640, 1285, 80, -1499, 352, 889, -648, -152, 903, -568, -904, 783, 558, -840, 28, 486, -626, -101, 1008, -48, -778, 257, 202, -425, 85, 515, -460, -501, 625, 391, -516, -39, 253, -446, -11, 614, 97, -543, 43, 324, -196, 22, 400, -449, -499, 434, 339, -342, 0, 87, -565, -145, 671, 105, -610, 49, 323, -282, 155, 463, -445, -505, 368, 443, -231, 174, 53, -503, -64, 593, 55, -393, 55, 108, -194, 316, 418, -377, -344, 254, 247, 0, 215, -73, -258, 47, 291, 154, -174, -101, -49, 141, 216, 143, -205, -350, -48, 185, 216, -12, -166, 22, -221, 159, 485, -134]
3417a34k62M74J81l65L29N5p26O7R20l47o37N66j01n32O10O06q70m11R10k17n93
3438d77Q60j06j006M57J021q93l83R59n47p23J114N88j499J07J090p45k40J137
3456G14l07j340R20P87j091jJ145j068o60J506J72j320L72P54j039p4J388p19
3474A39j140J200N66j374M82Q77j236l44J593j25j398O93O60j322K86J486j015
3491B8j010J438M3j271Q45Q81j646j37J842o73j234J261K50j545N87J693j594
3508b42p79J703k83j436J528N29k034K95J744r79j068J793k48j630J133J260j804
3525e18k93J759r72j062J880J70k148O67J772j551o18J898p65j580J705J032k253
3542h77M35J630j669n68K165m99j966J362J206k025O1K105j442j307K220O0k214
$$ y = [-134, -396, 78, 259, -106, 223, 278, -448, -381, 539, 192, -445, 121, 20, -512, 98, 704, -166, -577, 333, 116, -477, 383, 277, -729, -272, 749, -144, -527, 432, -115, -838, 276, 864, -635, -528, 562, -183, -423, 714, 407, -933, -13, 774, -317, -318, 827, -241, -901, 605, 777, -543, -171, 583, -456, -530, 858, 139, -1001, 199, 765, -609, -127, 750, -486, -830, 763, 638, -760, -67, 593, -729, -443, 1043, 28, -982, 456, 499, -772, 73, 954, -692, -829, 1013, 340, -894, 367, 617, -928, -341, 1352, -242, -1021, 682, 399, -1037, 491, 1020, -1014, -719, 1025, 46, -1022, 771, 523, -1107, 26, 1286, -518, -811, 948, -24, -1086, 794, 964, -1184, -517, 1255, -296, -914, 984, 219, -1361, 344, 1376, -877, -442, 1188, -481, -1049, 1116, 617, -1349, 13, 1219, -806, -745, 1360, -82, -1389, 831, 891, -1323]
3559a323J208J312k078r2K393j080j734J953M52k203J076J794k298p70K590o81
3575E19k081J989P51k494P70K209k011j022K330k64k158J698J482k800L6K562
3591A516j382j402K347j40k689J640J906k553m03K552j225j762K327O38k774Q58
3607e46J985k066m91K584j063k158K068J263k558K64K217j754j178K658j90k657
3623a622J594J338k311M3K557j365j894K204O40k441Q64J882k128o14K880j064
3639E63k200K073R22k531N00K368j817j525K518Kk339J604J429k657j87L022j404
3656C41k052K419L96k627J276K168k491r38K859q47k176K292P67l009O81K899
3672A958k104j295K565m64k319K000J422k883J20K656j714j656K842mk914J643
$$ y = [-1323, -115, 1197, -881, -973, 1420, 340, -1394, 559, 1011, -1192, -116, 1678, -620, -1390, 1200, 519, -1562, 427, 1178, -1316, -546, 1663, -348, -1370, 960, 696, -1462, 236, 1718, -1082, -1046, 1516, 134, -1268, 1079, 939, -1750, -110, 1796, -757, -1160, 1392, 167, -1595, 732, 1370, -1404, -546, 1439, -627, -1118, 1466, 403, -1755, 313, 1576, -982, -718, 1499, -255, -1433, 1225, 1035, -1622, -28, 1310, -1001, -958, 1599, 234, -1660, 544, 1184, -1257, -393, 1489, -639, -1253, 1627, 563, -1637, 436, 1358, -1173, -673, 1695, -122, -1647, 871, 873, -1466, 138, 1567, -1090, -1277, 1745, 341, -1711, 708, 1104, -1523, -247, 1921, -570, -1508, 1351, 504, -1672, 620, 1387, -1622, -941, 1958, -146, -1441, 1124, 660, -1659, 341, 1763, -1120, -1000, 1656, -58, -1714, 1128, 1124, -1790, -147]
3688a47J875k443j56K339j432j737K481N15k701J000J918k078n42K516r18k125
3704a635J970R76k403O72J986j928j129K610k77k178J322J297k138J51K062j289
3720F9j386J954K16j959R87J332j712n79K063m61j664J419O46j912N26J667j455
3737b49p11J556j01j497J100R84j781q6J768o98j337J503K50j651P81J354j518
3754c33n87J642m45j335J492N16j673J59J663j151q07J684l86j688J446J019j839
3771f23N2J464j054q95J778Lj718P25J248j459q0J448r41j119J676K15j543O69
3789a54J065j475o6J603p25j159J127N13j355M89J031j148n42J439l74q29P02
3806A42L62j162L38J028q03n47J044k12q42Q34N52j111o9R41m33n13P23K4q47
$$ y = [-147, 1728, -715, -871, 1468, 36, -1701, 780, 1295, -1406, -406, 1512, -566, -1108, 1408, 490, -1635, 335, 1311, -1092, -420, 1566, -362, -1491, 1119, 842, -1336, -14, 1283, -855, -704, 1358, 69, -1317, 637, 853, -1106, -119, 1213, -499, -1078, 985, 524, -1140, 279, 925, -987, -461, 1206, -249, -960, 596, 495, -1002, 98, 1082, -699, -785, 983, 285, -1052, 451, 701, -950, -169, 1185, -333, -920, 722, 277, -1058, 434, 950, -723, -564, 1099, -52, -859, 825, 439, -1249, 197, 1216, -623, -571, 893, -161, -1056, 722, 725, -993, -268, 980, -479, -559, 889, -52, -1171, 505, 720, -823, -154, 911, -564, -630, 973, 248, -911, 216, 729, -626, -137, 894, -254, -796, 643, 269, -560, 142, 504, -658, -320, 708, -95, -642, 402, 190, -652, 182, 734, -377, -446, 495, 62, -451, 272, 296, -551]
3825e51M84O07p03k86Q62l90n80Q60K51q99n3Q88m86m46P85l8q07M29P26p84k40
3846c71P91m11n62P61J85p27L05M55n33j20N81j80p64P47L31o97q0O89o08k65
3866d73P86L4p11L05L12m37K8N19m32l55N74J69n77L62K33n48J8M98k25l40L60
3887A00l9j84J92K52l96n6J92r5lJ26p2j50O9J27o2k9o4Q5m8N3L1q4l8J6PJ71
3913A01j55K8J76k92o1L15J36m38J66K31l23J57J87k91j53M19p2l48L54N7m80
3934b86J88N41l89k38L82j26m52L75K24l12k27N66k01k90M29J16o97L21M40l71
3954gl49N49p7n11M25M06o52m2N96l28l82O93r3p08M76N00n79j60O25l03m38N24
3976A65L44q18R5O22l81m18O80k9q94O70N12q52m3Q13m11m43O11J68j004L76R00
$$ y = [-551, -67, 540, -163, -449, 413, 23, -557, 303, 554, -345, -398, 490, 4, -442, 343, 305, -502, -73, 653, -131, -371, 420, 9, -553, 208, 393, -334, -29, 426, -107, -227, 354, 174, -590, 157, 488, -209, -289, 400, -208, -473, 313, 347, -364, -59, 253, -184, -156, 363, -69, -424, 150, 319, -258, 104, 337, -211, -193, 305, 80, -260, 100, 61, -123, 69, 321, -75, -131, 61, -34, -37, 89, 17, -133, -64, 63, 1, -28, -92, -7, -55, -2, 29, -55, -93, -77, -70, 101, -54, -26, 150, -142, -203, 112, 248, -190, -24, 207, -116, 41, 228, -63, -216, 203, 131, -217, 137, 194, -286, -98, 443, 54, -184, 198, 72, -380, -5, 219, -93, -320, 246, 45, -245, 184, 300, -397, -76, 364, -7, -356, 193, 116, -395, 30, 436, -216, -258, 338, 10, -372, 321, 228, -480, -4, 496, -83, -243, 382, 79, -359, 165, 509, -309, -214, 408, 27, -391, 289, 260, -634, 36, 548, -304, -347, 466, 55, -388, 223, 391, -613, -237, 663]
3997F63q02k10Q97k71j041R02L70j009K17R94q22n30J177j98j018O66P88j148
4015c75N5J038p42p52J055K09j165N98Q63j130l51J330m00j039R93N02j317L96
4033b32J042r13n81J232k10j145Q73O95j298K4J398r64q16J436k5j371Q88P68
4051H01j183j78J321o58r83J260K35j390O30J164j346m00J572n33j223J232M29
4068G50j496M30J180r84p06J516k23j436J022Q16j408J48J266r38p90J374l1j350
4086h60R08Q82j387l47J744q55j005J385J61j415O35J137j292m37J512n19j150
4103i03J046O52j589L47J404j197o20J545k09j408R86Q24j395j38J548q26r79
4120i12J445J39j469O51J214j487k73J540n46j212J355M26j635L41J411j258o36
$$ y = [663, -139, -349, 548, 277, -764, 138, 508, -501, -284, 710, -112, -642, 535, 337, -681, -15, 773, -375, -320, 718, -24, -776, 279, 488, -677, -79, 784, -346, -697, 633, 233, -806, 187, 689, -628, -232, 810, -103, -684, 548, 338, -807, 66, 761, -537, -513, 885, -79, -895, 541, 516, -855, 33, 801, -382, -560, 761, 103, -880, 380, 615, -775, -145, 1019, -327, -727, 845, 312, -911, 321, 750, -746, -316, 864, -120, -826, 690, 467, -969, 53, 869, -539, -391, 875, -63, -853, 521, 490, -860, 48, 930, -457, -804, 940, 85, -920, 465, 626, -789, -154, 983, -309, -746, 766, 247, -903, 143, 795, -794, -447, 957, -240, -860, 685, 476, -932, 54, 878, -517, -655, 893, 67, -912, 533, 672, -797, -146, 1068, -419, -692, 848, 302, -910, 445, 871, -764, -423, 988, -270, -906]
4137i06J592k19j417J062R08j734K66J462j050j002J741j04j565R51J070j594
4153e39j93J764r00j214J590K89j945J077J176j490m18J772o26j563J590O10j806
4170h26M79J502j388p44J916n35j511J336P81j719K92J427j060r33J519N2j626
4187a038R90J152j679r2J630q77j075J339K32j443O70J209j298o06J671l89j377
4204i81J093P81j574J61J372p83q51J319kj358P77Q77j227k95J568o08j295J306
4222B80M34j479M59J172r83p96J616k70j288R97P62j555J26J528j024r49J453
4239D83J17j546R36R84j580j35J635q50r87J430J0j388P66R98j305k09J431n41
4257B49j044J132M15j444M70J009j024m19J206r4j224R29N53j121R1J072p62o89
$$ y = [-906, 686, 467, -950, 112, 1020, -714, -448, 1014, -36, -1038, 703, 599, -966, -15, 1055, -539, -732, 1032, 132, -1082, 508, 797, -1148, -71, 1105, -385, -803, 969, 343, -1220, 370, 980, -826, -347, 1155, -233, -977, 939, 404, -1107, 229, 1010, -709, -417, 1010, -50, -983, 536, 588, -1038, -48, 1104, -575, -667, 963, 86, -989, 350, 582, -861, -191, 1018, -280, -886, 785, 396, -981, 112, 893, -681, -520, 852, 69, -782, 537, 535, -823, -46, 831, -396, -691, 877, 269, -1026, 280, 714, -765, -306, 866, -117, -913, 703, 433, -855, 142, 904, -651, -525, 1003, -21, -970, 483, 600, -946, -10, 974, -606, -741, 894, 44, -943, 487, 497, -891, -125, 873, -432, -641, 790, 249, -795, 337, 752, -692, -222, 787, -237, -656, 550, 456, -768, 161, 714, -407, -316, 756, -6, -695]
4275f95J175k2j099O27O13j038L4R56l88p74R58J67r72L34P72p91k69P99j88n77
4295c78L24N91q83J2Q33l41q28R97M5p62K73N72o64j76Q66j30q60N99L15q61K27
4316b29Q16n92n07Q07o6o45L76N61q86p4R14l53o50Q73R8r22M35P17r50j47Q43
4337D19m15n53Q08P0o80K55N65o06j50O93l50n81O80K27o46J89M10n55M8N55k31
4358A52n22M27K80n76J25L98l29j60M26m1l56K09J00k74r3M24j61k28L08l6k26
4379a53K64pj23r1K10l7j19J85m8k30O1J59N7j69J41q1j13J22K9q8o5M0K12k08
4403e2M1P9j03j12J90j1l4k7J19p6oK38j41k25K29jk02J66r1l8l3J75O4k00P3
4428B2n1K8nJ23pk13P6R7n9j06J66n6j87K76n3j28J5J71j25j76K16O5l36O0L52
$$ y = [-695, 480, 458, -641, -14, 599, -439, -405, 551, 163, -611, 347, 514, -458, -124, 648, -143, -412, 387, 199, -378, -54, 537, -346, -334, 499, 158, -670, 327, 372, -390, -117, 455, -209, -385, 481, 351, -509, 90, 405, -456, -229, 587, -5, -512, 295, 229, -416, -40, 521, -365, -439, 475, 122, -528, 345, 443, -479, -44, 673, -277, -424, 419, 4, -549, 259, 329, -351, -96, 469, -137, -287, 406, 56, -525, 155, 382, -264, -75, 335, -220, -172, 383, 152, -370, 57, 337, -239, -114, 284, -45, -205, 221, 180, -176, 33, 133, -141, -234, 190, 29, -199, 109, 73, -153, 111, 104, -19, -110, 100, 63, -56, 129, 81, -149, -88, 71, 128, -41, 100, 19, -94, 28, 57, -31, -96, -56, 156, -52, -11, 68, -35, -147, 43, 32, -2, -29, 90, 14, 8, 246, 105, -120, 109, 108, -94, 72, -19, -57, -90, 85, 149, -51, 22, -29, -1, -6, 117, 110, -103, -27, 70, 11, -95, 71, 15, -172, 104, 51, -77, -62, 109, -16, -192, 24, 89, -247, -187, 165]
4453A65j21k25K51j11k36L02J58j63j61K19q6j85L19M0l57L5L98k14j85M11j47
4474A07l53L71P0l99P0M58l06l46O10j4o25L45L87n01q9N87m18l40M78K41n21
4495a88J74L14m21k96P16nn95L65J56m52J35M98m40l84N79J53o35L77M39p33q4
4516c27Q17k92p52Q16np07L58N74o42l14P65k5p50O03L20r17K36P90o82l13P91
4537C44o1q35O91K93q70M1Q37l75n51P90p3r33N88O61o99j89Q06l59o30P54K49
4558D79j022K74Q52p24k81R22l16q90P55N27r24J1Q57n33n64R10M4q67M65N05
4578D80p80p6Q94m56o33P87K69r01K59Q17r85j55R63k17p66O52K89r40K21J041
4598G63p96n63R70q5q29O12L94q49j8R57m48p19R50Qr42N27P08q53l40R19k98
$$ y = [165, 44, -181, 70, -41, -277, 25, 183, 20, -141, 78, -8, -193, 126, 166, -191, -156, 242, 28, -157, 254, 107, -246, 125, 195, -204, -134, 324, 18, -328, 282, 268, -357, -12, 375, -126, -215, 372, -46, -386, 92, 333, -188, -14, 300, -121, -417, 299, 294, -301, 64, 220, -232, -97, 401, -39, -423, 156, 309, -326, 51, 490, -243, -327, 490, 198, -554, 262, 257, -450, -92, 482, -160, -474, 291, 266, -484, 119, 439, -478, -242, 548, -134, -447, 344, 283, -552, 139, 432, -438, -397, 440, 65, -486, 304, 231, -702, -114, 547, -152, -341, 465, 106, -524, 230, 479, -543, -269, 583, -141, -422, 500, 184, -706, 49, 576, -348, -337, 520, -13, -577, 333, 377, -490, -25, 480, -300, -376, 518, 62, -571, 216, 485, -416, -157, 660, -325, -480, 483, 266, -500, 152, 441, -499, -278, 763, -33, -596, 374, 289, -540, 72, 466, -383, -401, 556, 108, -611, 339, 347, -595, -68, 640, -213, -553, 366, 68]
4619F8o37P42L54j013K44R24p32m61R96j82j007Q13N10r59L2Q64o00m96J082j58
4639C84j093O78O58r29J5J007p69p16J135R0j023N96M69q44l5R12m19p53P93L45
4659E01r45L80O51p91k64R17j89q23P10L87r40J57Q72o56n36R02L5q92N84N37
4679E97j004l4J006m22o27Q21J01r21L99O48p50l29R89l01p57R28N0r88M05P56
4699E67n52n26Q96j23q32O67N19r51o6J000n22p04R70J90j106L50P85p79n5Q81
4719F09m21r34R74M23j137K46R12r70j45J028k46r15O71M64r40J99P54p43n09
4738f80J131r4q78O05M96j051L3J173o94o91Q71J25q11M76N90q20k36R40l07p58
4758e80Q23J15p47J33Q13o72l47Q69j62p58O26M30q52J2O80l93l88P26o4p03L92
$$ y = [68, -569, 173, 527, -486, -242, 682, -50, -511, 485, 303, -704, 109, 619, -340, -308, 556, -44, -540, 542, 384, -709, -31, 627, -302, -287, 720, -49, -765, 370, 460, -563, 33, 502, -342, -377, 535, 116, -637, 156, 501, -444, -64, 587, -204, -468, 449, 260, -563, 147, 534, -406, -249, 623, -33, -569, 333, 368, -524, 60, 597, -407, -441, 565, 143, -484, 337, 438, -483, -84, 564, -186, -515, 474, 173, -584, 344, 394, -594, -189, 567, 15, -511, 385, 262, -570, 97, 616, -335, -401, 599, 77, -627, 343, 533, -573, -223, 562, -217, -272, 609, 188, -746, 228, 651, -486, -240, 672, -298, -443, 585, 339, -576, 95, 559, -381, -182, 572, -171, -680, 451, 357, -521, 84, 580, -471, -438, 735, 41, -650, 221, 346, -465, 11, 601, -219, -455, 485, 178, -580, 243, 358, -389, -256, 557, -115, -462, 407, 245, -513, 113, 543, -309, -297, 383, -10, -398, 328, 264, -439, -47]
4779d7M54n18p6M97l43m72O64K26p08R7O05n04k29P65k29o50N41M43p17pO96n17
4801b9m82P68J50q41K20N66n75M0N86m85m29O38K45p13K34N75n01l16P52j73o03
4822c73M30K45n86K24M68m68l88N68J76n08J90M35p78m5Q78l41l36M29j13l85
4842b78L24M10o07m4M60j95k11L26P1n11J79L56k36r8L22j91l05M20j5k89K4J19
4864C1j41l7L02j9m58L08J84j80K1N6o7j85K56J58k65r6K92j11m8J80j38k08Q9
4887g6J65k9j81J37L2j93J98J07k11M1R5j69K8L17j59j64K8J76j27j0K17j59k08
4910a45K04J54k91M5P9n5o7K33p5k30J05k9L9J09l4m4r0J74L1r3J8j16rJ70L3
4935A16oq0o6J16o1O0j20J07j54L1J58j20Lm0J10j37J30M6o7k61J98M3m8J26J18
$$ y = [-47, 407, -111, -187, 310, -33, -505, 159, 385, -323, -226, 379, -125, -354, 411, 182, -468, 73, 516, -201, -208, 488, -29, -511, 257, 407, -434, -214, 352, -223, -183, 403, -82, -511, 127, 372, -341, -107, 468, -33, -349, 403, 230, -373, 57, 302, -284, -60, 408, -60, -448, 120, 296, -212, -22, 413, -365, -410, 468, 127, -209, 220, 107, -278, 46, 456, -151, -195, 265, 70, -141, 185, 256, -255, -76, 280, 44, -54, 268, 77, -228, 192, 177, -112, -88, 31, -110, -147, 155, 136, -322, -14, 170, -10, 11, 67, 0, -185, 71, 229, -36, -132, 160, 49, 1, 181, 43, -165, -76, 89, 60, -121, 16, 48, -145, 53, 160, -51, -10, 85, -84, -56, 261, 102, -62, -34, 142, 15, 5, 222, 63, -145, 59, 213, -78, -33, 46, -9, -76, 157, 82, -148, -43, -72, -33, 76, 42, -2, -92, 82, 113, 20, 38, -78, -87, 83, 116, 110, 30, -36, 80, 19, 79, -41, 66, -88, -57, 101, -19, -16, -56, 54, -83, 47, 93, 26, -235, -37, 6, -42, 84, 202]
4960B02m12J41K34n7l06J83J06k12J32L23l96r8K78l4p4J37K7m03J98K19k30m8
4982i0J66N4l30J73K73l58O4J53j70j15M92k09m01K72O9j29J09J99j43l25L59
5003A13O8k27k1J91k28m6M67k82k83K55J73k04K5K21l43j34L61l9k42J74R8l21
5025b24R9M29j75l85K30K02l38K19K99n92k2M49m6m35L58J36m28P0N60k99m23
5046c16L66M5l34L13K63n35k7M83j73m31N78Ko21K75N32m46j86O07l60l22M49
5067A62J73o17O5N34l10j65M39k17n75M25N58o58k0O08m01m07P43J00q15K73M18
5088C13m98l6O27k88n42M89L65o28O3N37m64k81O49M0q10M92K74n49P1O16n37
5109i7m20O85P6n28L01L02o15nP08j79n75M02P6l72K01M17n53j39O75j28n34M13
$$ y = [202, -210, -69, 165, 108, -198, -15, 91, -121, 11, 334, -62, -160, 118, 84, 10, 147, 174, -229, -31, 188, -42, -90, 76, 130, -200, -27, 246, -112, -48, 105, -65, -180, 312, 103, -298, -26, 43, -86, 23, 222, 79, -246, 113, 181, -46, -67, 124, -104, -150, 317, 35, -248, 7, 180, -24, 1, 222, -121, -255, 106, 67, -175, -1, 97, -224, -125, 304, 129, -256, -26, 176, -162, 57, 356, -236, -258, 191, 145, -290, 68, 204, -224, -154, 406, 107, -316, 50, 95, -239, 74, 337, -198, -225, 258, 85, -346, 232, 234, -387, -112, 420, -26, -212, 395, 35, -287, 162, 335, -282, -217, 317, 7, -158, 281, 64, -511, -86, 472, -186, -206, 402, 1, -406, 337, 437, -378, -105, 313, -185, -221, 406, 118, -424, 65, 430, -198, -135, 402, -62, -343, 306, 346, -464, 28, 302, -247, -176, 440, -97, -517, 168, 244, -284, 17, 319, -296, -301, 407, 228, -347, 55, 131, -241, -40, 377, -176, -315, 360, 232, -302, 111]
5131A11K12p55K77O27m45l53M71Q4o84N37M03q75Q5O65l21l01M53R2p10M19M27
5152D19n07j27N12j92n72O06L43p60J48M83n46j77O89j38o75N24K73m84J10M78
5172D07n31k82P31o4n01L7M07m33R1N73m03m43N78J35p02L50M40n60j16N90j81
5193A23m72N21O7o86L65N06m80l86O99r5n15M99K80p67M5P97n39l13N34p0n36
5214d23M68L81o28J3M64k68l38O01j6n69K73L82m81j16N71l20m34N86K75o32P8
5235a33M46m91oN09j81n29L45K87m44Q1M29m19l03O65q6l71J42K42m36l3Q53m54
5257A13n51N57J69n25K40L72n78o5N27j57m37M64J92n15J9M92m16k51M63N0n25
5278c62M25K57n61p5O22k25k99M14L5n99K94N06m98k34M36j8m60N46R8n32L3N41
$$ y = [111, 323, -432, -155, 472, 27, -326, 145, 229, -455, 82, 485, -390, -305, 360, 39, -262, 191, 283, -427, -8, 419, -88, -215, 297, 105, -467, 139, 482, -278, -130, 353, -193, -370, 319, 181, -494, 30, 303, -181, -71, 407, -124, -406, 325, 261, -240, -203, 204, -229, -138, 435, 32, -411, 167, 302, -400, -50, 390, -170, -286, 304, 123, -349, 172, 239, -447, -82, 424, -56, -442, 257, 162, -353, 146, 426, -341, -296, 501, -38, -351, 183, 113, -423, 45, 426, -202, -189, 275, 7, -331, 270, 254, -315, -42, 340, -141, -257, 314, -6, -440, 146, 421, -211, -133, 313, -178, -184, 325, 144, -385, -40, 247, -197, -116, 313, -106, -409, 256, 170, -201, -59, 183, -253, -286, 567, 113, -438, 119, 288, -237, 3, 375, -203, -268, 259, 102, -335, 129, 321, -194, -175, 317, -99, -350, 113, 163, -362, 63, 320, -241, -316, 306, 81, -218, 196, 231, -368, -74, 432, -66, -300, 136, 118, -342, 204, 302, -230, -197, 344]
5300C44m41j63M58j40m39N10K14m22O4J93k14k97O94j45n14K30L01l60K2M53k17
5321A31m49M19P2l33J59K17l48j1L57o6k70K09L6l35K19K26l31k01L21P3j83J41
5343E3J60l63k0L33p5k18J79M2k81K35J56k02j82K67j4j48J52J20m68K10K85k04
5365A7j70K66l8k41K14K76l97j05L61j89O0K03j34k54r1L95k07o1K28j72p7L20
5387B04j7l00J20J00j56PJ93n2k82J58R7q9N5J05k21m2K05j4j62P8J29l43K54
5410B7N9n1j03OJ22qp0R4j92QJ97k6o7O1j09N1m6J56j1q7j66J94Ol6O0k9j15L8
5438c7R5l8m7o8J46j30J60K8k23j3K6J87j08M3j57l5J44J43K1k47J19Rq2J87p9
5463D4j21K8R7Q1j81Q0O0j34m1J95l0j05J2k7m9J63Pk50J91J40j93N8J1J2j05
$$ y = [344, -97, -260, 198, 58, -381, 129, 343, -79, -15, 178, -36, -333, 361, 216, -298, -68, 233, -127, -105, 348, 131, -318, 101, 173, -160, -1, 216, -132, -143, 214, 148, -122, 87, 123, -212, 7, 233, -98, -299, 22, 95, -88, 53, 213, -150, -170, 163, 88, -130, 49, 91, -190, 45, 201, -1, -183, 84, 70, -78, 74, 194, -274, -64, 221, 17, -153, 113, 75, -166, 48, 324, -73, -178, 183, -6, 54, 257, 123, -131, -222, 173, -34, -95, 133, -39, -116, 204, 187, -113, 7, 107, -49, -42, 151, 99, -183, -25, 72, -17, 38, 143, -78, -120, 85, 71, -91, -13, 116, -227, 27, 86, 35, -68, -62, 60, 52, -18, 76, -116, -108, 89, 63, -4, 57, -52, -1, -47, 109, 98, 11, -155, 39, 45, 9, 69, 40, -75, -37, 58, 20, -27, -95, 51, -79, 81, 109, -114, -127, -101, 86, -22, 21, -136, -171, -27, 116, 137, -110, 9, 18, -64, 123, 44, -77, -49, 48, 129, -52, 28, 88, -46, -87, 108, 78, -27, -15, -42, -91, 72, 79, -171, 20, 160, -33, 25, 36, 48, -57]
5488e7QJ15Mj57J84n8k00J98J05q5k21J56Rk1K05p3j90J7K57j86k7J32j66o3J65
5513E1J40k93O1N2n8N6J22q9l64L08J14k04L7K65k58j67L40O0l35J47J32l09j1
5536b03L87j08l56K91M0j48J09K11k56j66L91n2l81K57P7k44J18K74m14lL72j56
5558D0j38K49J21l99j11M82q6k42K11l6m71L59L85n57K5M08k51j29K82rk77L9
5580a05L15k55j55L99j90l75M17K38l80o5L67k37k68N30p8m64K06L78k62l51O44
5601C09l23l31N37M1m39J39L23l52j44N14J1o64L93K39m47O6L77l60k46N83k3
5622B03m71K51K70l97r4N00j74l99L30K47n34K62M22n38j86M73j2k57J43K05l92
5643a48j8N05l27k30L11N5m91L49L34m93n2M68k29k80M00M4n07J82M89m80l8M43
$$ y = [-57, -49, 66, 70, -87, 97, 39, -161, 37, 142, 57, -164, -8, 1, -20, 185, 112, -78, -61, 196, 10, -17, 115, -51, -114, 51, 191, -102, -41, 11, -47, 9, 131, 42, -322, -14, 100, -104, -67, 198, -60, -227, 113, 173, -162, -15, 117, -192, -203, 184, 76, -280, 11, 51, -97, 12, 223, -33, -199, 192, 140, -241, 16, 93, -151, -33, 241, -173, -176, 196, 40, -98, 151, 272, -127, -238, 244, 158, -84, 127, 91, -380, -21, 364, -193, -168, 240, -11, -140, 142, 133, -144, -105, 210, -45, -200, 199, 9, -366, 51, 289, -91, -156, 211, -26, -294, 236, 158, -306, -100, 278, 16, -335, 309, -14, -345, 192, 233, -206, -67, 256, -96, -240, 274, 285, -379, 14, 253, -194, -128, 249, -111, -357, 226, 203, -268, -17, 253, -144, -238, 262, 88, -311, 19, 266, -268, -6, 416, -122, -308, 165, 153, -104, 39, 244, -148, -166, 339, 12, -218, 93, 148, -343, 6, 340, -153, -205, 263, 34, -246, 154, 198, -309, -127, 362, -118, -156, 287]
5665B87l19l60N93J42n43K47J48l45m0N14k34m07K58L64n57J68L32l10k54O62
5685C46j98m70K88L33m48o5O20l67l43M38N0m69L49L00o16K6M93k28l37L32J35
5706A69l91K10L45l11l34M03k4k99N17J2o10Q5M47q2k83K35M7m65K87K88l60o4
5728a78M27j94k79N07q8m11J13L38k45j36L74k34k86L50P3l34O9L98k67k62M98
5749B33q0n01J66L67k36P4J78l22k78O27N5l90P7K13l66RN91l58l43K88K41l49
5771a04M6K91m03k9K67J02l65L12P3k87rK74k29r2K80ml85K73K57n05n7M68q9
5794H5k48M11j56m30L24K59k62j45L76j95k41L32J04m05J22K18j85k1K04j21l21
5815b95L52K28m13O9J83j52j28L25J09m91J79J77k05j77M68k32l19L25K26m35
$$ y = [287, -32, -392, 201, 343, -200, 47, 195, -150, -190, 324, 90, -317, -59, 305, -252, -84, 248, -62, -316, 346, 148, -322, -34, 299, -149, -214, 406, 39, -304, 134, 184, -285, 64, 364, -252, -226, 267, 39, -298, 34, 169, -222, -12, 333, 22, -312, 91, 67, -232, 285, 297, -313, -228, 219, 137, -146, 89, 136, -329, -42, 246, -114, -178, 249, 55, -224, 283, 195, -216, -103, 235, -10, -146, 228, -6, -292, 58, 131, -203, -134, 264, -3, -265, 233, 153, -348, -182, 185, -51, 23, 201, -121, -399, 228, 283, -107, -30, 183, -183, -174, 417, 59, -284, 4, 245, -104, -58, 233, -170, -199, 68, 170, -195, 117, 190, -97, -106, 168, -61, -153, 127, 123, -262, 11, 268, -237, -294, 174, 85, -163, 248, 92, -338, -14, 245, -17, -162, 214, 19, -222, 110, 214, -191, -69, 149, -36, -57, 147, 26, -295, 57, 285, -128, -59, 124, -28, -156, 169, 278, -213, -34, 143, -62, -239, 229, -3, -322, 3, 229, -206]
5835b06J12K35k61r3M54r8l73K52Q4j91k6L31l54j11M56N2l56Q4K19l86p8N32
5857B78l03j91J79J49k57K37J73l03j26K91k7k53K85j8l01J41K71k88j48K90r7
5878a8j29K43J37l79j05K88j09j4K93j50k09J04J18k2r5J67j61oJ91k3j97l5J02
5901iJ08k56K92j31q6kJ70j01m8J17L2j69J58P2j93k7J28o3n3J66n0o3l2J38k4
5926G4l0o1Kk1M6Q2r8o1Q7%n8O9J21k70lJ02O2j6N9n5j21P5J44p6p6K8m1kK12
5955A74j54j14P2k2R9o6M6q1L6P5K3j12l6L6M7n8M2J24j24m9J0J5Q4l5r9P1N5
5982E9mP4r7o7M8o1J25K2k03K6P8l4J11L0Q0l49Q3K61j85l6J5O3j08J45Q8k47
6008h3q9K23k1j6O6Rk33j0K37p1l9P4n8p8L16%l87J60J39j83j87L17j29J7r4K48
$$ y = [-206, -94, 141, -120, -213, 241, 143, -230, 22, 106, -85, -111, 220, -134, -245, 211, 263, -93, -9, 210, -176, -254, 278, -25, -216, -37, 112, -145, 92, 265, -38, -164, 127, 100, -153, 132, 114, -187, -46, 225, -63, -211, 79, -18, -147, 96, 233, -146, -251, 37, -72, -86, 207, 57, -152, -48, 70, 48, -47, 120, -41, -47, 144, 121, -76, -111, -9, 99, -157, 135, 4, -82, -84, 86, -15, -63, 54, 86, -83, 75, 147, -46, -73, 55, -8, -61, 105, 55, -8, -40, 98, 74, 44, -17, -15, -36, 10, 92, -6, -67, 20, 20, -38, 31, 152, -118, -121, -19, 43, 27, 86, 31, -90, -15, 129, 53, -23, 5, -36, -38, 174, 20, -94, -22, -44, 55, -11, 35, -46, -10, 65, 88, -24, -60, -24, 23, -35, 7, 131, 7, -42, -32, -17, 67, 32, -67, 4, 59, 55, 129, 32, -35, 13, -48, 77, 99, -104, -78, 0, -34, 77, 107, 187, -162, -79, 182, -3, -39, -24, 39, -69, 76, 164, -83, -172, 51, 30, 14, 80, 89, -144, -154, 83, 12, -27, 47, -11, -89, 227, 227, -160, 0, 139, -44, -231, 86, -43, -26, -120, 128]
6034A28k02N3J62k31j30L53k9j96O2Q3k05J10K54k74n7J06K77l66J45Q7k24N2
6056d2L28j78j86K5J46k39O4L03k56j82K46n4o7J35J38l02r8L78j46j13J03K3
6078B6k11J31L12l19j20L21q0l20L74N0k46r8L47j55j00J98j86j63L68J14m16
6099a73R6K42j75j69L57J7m71K35K76l40L8L14j21l94L54J42l53o0L55k62k9L68
6121B47j49m16L42J77l59J01L17l34k53M78K7k69L3L03m96J03M74k17l51K95J66
6142B19l47J17K11k78j16L14J1l27K91J82n47J60N14n55j29L33Q3m22L62J65n27
6163b86O2M48j48k43L79o3l77J56L04l39p7K96j87k48M96N7m49J50L12j92k19
6184a68L56o2m69M71R8m30NL34j27l70O33K9n56O7L71l20lM28k50l73K96K67m38
$$ y = [128, -74, -21, 141, -90, -220, 133, 104, -92, -30, 53, -152, -42, 212, -62, -119, -13, 264, -102, 43, 130, -94, -42, 286, 108, -78, -53, 93, -146, -82, 221, -35, -217, 29, -25, -92, 43, 181, -121, -219, 159, 13, -100, 3, 26, -185, -54, 258, -61, -181, 140, 60, -260, 114, 164, -82, -180, 167, 12, -88, 110, -76, -239, 129, 243, -173, -77, 165, -10, -179, 178, 195, -276, -41, 235, -105, -67, 247, 126, -268, 86, 228, -125, -185, 170, -92, -121, 247, 98, -318, 24, 201, -158, -57, 260, -74, -327, 151, 178, -91, -58, 245, -251, -148, 326, 109, -242, 53, 219, -128, -11, 200, -78, -194, 120, 131, -196, 95, 277, -270, -110, 404, -151, -280, 53, 136, -286, 76, 241, -286, -224, 224, 76, -167, 212, 149, -228, -72, 232, -107, -184, 112, -75, -323, 173, 230, -219, -69, 243, 51, -168, 188, 126, -343, 128, 226, -204, -199, 135, 8, -362, 271, 300, -256, -189, 182, -138, -141, 287, 37, -336, -40, 227, -211]
6207b11L3N07l84k47M89o3l53J89J67k40J41L00l61j97L41N1l47L38Q9l60m9M91
6229C24k91j59K66j1m78L69L30l45k60M28j23k63K79M3l25J4M74l60j03L85j95
6250ak82M02J64m01n3L88k73j51L90k1l82J33K79k70j01L66j16k69L35M8l32N1
6272i6J78j51j56M44j21l49K18J83k95P4K56k72r9L76j02k59P6J09j70J5L47r8
6294A08l68K64N8k01n9L26l28J49K70k26j98J56O7j97N4M28k73k32K86j25k14
6315b55L47J87n09J47K45k05j32K52n3j40Q1K53l28K0K59k14k40M18Pl71J16J95
6337H0q1q1K61j40l34M13M0k99P1J55k14n2L71j56k61L27M7j24M0J33k43q4J88
6360E7J23l08J36J92l84J02L01j17k41J22R1k62J97J31j90J5J24r9j28J77J16
$$ y = [-211, -178, 329, -55, -302, 187, 124, -229, -40, 127, -113, 28, 328, -33, -230, 111, 162, -185, 153, 242, -118, -167, 324, 33, -126, 140, 129, -349, 20, 350, 5, -255, 173, 50, -213, 66, 109, -216, -202, 272, -88, -191, 194, -1, -283, 119, 283, -118, -171, 217, -56, -207, 183, 162, -220, -87, 192, -78, -179, 187, 71, -198, 137, 185, -147, -96, 82, -69, -225, 219, 98, -251, -33, 150, -145, -71, 185, -87, -186, 190, 88, -171, -95, 14, -156, -141, 206, 108, -260, 4, 62, -139, -198, 128, -200, -51, 219, -7, -205, -49, 18, -179, -125, 303, 30, -202, 84, -41, -255, 92, 279, -230, -83, 162, -43, -175, 77, 24, -116, -35, 218, -110, -90, 169, -45, -285, 133, 140, -231, -115, 80, -1, -82, 179, 39, -295, 118, 158, -141, -70, 85, -129, -181, 190, 34, -227, 100, 147, 23, 63, 196, -47, -131, 57, 180, -128, 8, 200, -184, -82, 219, 102, -139, -17, 74, -188, 9, 140, -50, -35, 89, -10, -138, 39, 155]
6381A55j50j83L09j21j24J59M3j89O5J61k55P6J05k7p3J84n3j26K7J31j23ok2
6404c7J9R8M1J19l47%K10j17%J16j48l3R2J03k9j95R6J1j80K75m6r9j1J98j37
6429aj11K44j07o1L3J11j5j39J08j34r9J63J01p3j01J72j43O6p0J18q4j3Q4p6
6453b7rN5j0j13O1J18l9r9k8N7Q1j13J17q8k7J62o6Jj7n5m9O0Pl2L3N2Rl5j9o8
6483h1KP4J0k5j5M3J15j43M7k5O0p8L2J7j35J44K7k78J66P9p7N0mL3j51O9J51
6510A07j45J1N7m5j00M7J92j97L8O3O5j96J31J0j60K5J97q6j47J91Pj60R2L5j25
6535i3nJ89j04k4K02l8k52P3K52j94j03J95j95q0K24L8j80m2K48j33k5K85j77
6558F1k56K54Qr8j2J38j40n8J92K2k75K35k4j71JK14j77p4L26O7l36O6J77k45
$$ y = [155, 5, -178, 131, 10, -114, 45, 88, -101, -36, 125, -130, -54, 51, 24, -49, 135, 82, -44, -17, 114, -9, -15, -37, -18, 80, 121, 240, -107, -107, 103, -14, -14, 102, -46, -79, 13, 116, 87, -108, -12, -1, -181, 94, 48, -51, -62, 136, -1, -112, 132, 25, -36, -3, 108, 93, -46, 62, -72, -171, -8, 93, 20, -81, 91, -52, 14, -56, 62, -22, -35, 49, -27, -36, 19, 9, -104, -43, 75, 36, -63, -91, -34, 47, -66, 51, -37, -64, 98, 32, 33, 16, -39, -88, -28, -21, -53, -20, 32, 41, 6, -13, -81, -79, -5, 5, -20, -35, 8, 123, -20, 27, 2, 62, -16, 16, 33, -102, 42, 69, -209, -43, 36, -41, 9, 5, 38, -113, -44, 107, -38, -27, 30, -15, -115, -68, 124, -73, -35, 28, 93, -103, 28, 38, -122, -97, 100, 14, -133, 58, 65, -95, -3, 32, -93, -98, 91, -13, -37, 165, 127, -125, -52, 200, 6, -97, 98, -97, -177, 47, 85, -95, -137, 111, -22, -47, 238, 61, -195, 59, 67, -31, -43, 95, -45, -103, 89, 111, -164, 71, 47, -124, -123, 91, -86, -160, 166, 233, -103, -37, 140, -105]
6582a05j05L58p5k26K64Jk52R6J92k74n7L18j37k08K94K6j52L4K02j18j78J69
6604F7j4k25Q3L20k80p2L08j21j57K01q4j85M4K65k34l6K50k5l44L21Kl19J48
6627h7K63k45j28L81n9l92K37J09o0j29K40j58k00K88J25l49J47K31l32p4L72
6648A80rm47L07J47k95L4L16k87j56K14J83l16N6L51l75L6K33k24l4J68J5k82
6670a85J59J86k85j43L99o2l29L49J8l69J46L58l36n7L68j76k36K88J79m22Q0
6691g0K73j37l54M79o7k78K00J50l30k9M07k81q2K43J44m65R1L61m66J46K16p2
6713G9l78M16J59l91j4L58k74k9L26j22l40K68J75l66oL75j91k13L50L3l72J04
6735e3M09n66R5L86j46m94K96K87n02J76L07k00j83L77j23l87M48M6l71J31M49
$$ y = [-105, -210, 148, 73, -153, 111, 112, -140, -44, 148, -126, -183, 135, -2, -210, 84, 110, -42, -8, 194, 76, -102, 67, 53, -172, -89, 231, -49, -121, 187, 66, -91, 110, 26, -159, -115, 150, -84, -120, 130, 105, -239, 82, 84, -235, -87, 176, -69, -197, 184, 125, -267, -30, 79, 19, -110, 130, -28, -228, 60, 185, -164, -17, 214, -118, -192, 180, 171, -276, 31, 178, -117, -83, 233, -54, -210, 4, 187, -129, -73, 278, -97, -61, 172, -52, -86, 82, 97, -185, -26, 160, -125, -268, 131, 69, -260, 89, 107, -262, -116, 242, -94, -151, 217, 41, -195, 93, 272, -150, -70, 203, 66, -288, 191, 124, -154, 46, 196, -134, -163, 244, -37, -119, 124, 268, -197, -106, 255, -211, -65, 151, 79, -299, 117, 276, -115, -129, 229, -45, -74, 252, 130, -210, 58, 233, -133, -139, 236, 45, -168, 182, 215, -157, -53, 356, -210, -115, 271, 125, -369, -73, 214, -288, -112, 195, -5, -188, 189, 66, -321, 127, 173, -198, -67, 382]
6756C82l94k88M49k8l27K52K29m33j0L90j33l88M32Q5m42J51J84k09j07M42j49
6777H8l67L57J78m18Q9L85l93m6L12r8k45J84J02k52N4K52k07k85M25Q9m01K08
6799A1J20k49O7J54p6j41K07K7l24R4K03j34j63L35j7l76L20J35l67J23L05k89
6821c5j14L08q6k55K77J09k23j24L15j72j89K16Q4k51L5K34k72K6K15j23m3J03
6843C5J70m16Q2K11j69r9L17k0k61J46K11k37j7J50k00p5K01J63l97K11J47k51
6865i8k4K90j4l34K26J25l00N3J71r8J2R3k7j34J39l3j70J04J07j30q2R1J26k21
6889a28J58P0j88l3J87r3QP9J2k93K30R2j83J21J48k08j33K60K9k27k6K97j46
6912C3j97K60m1k42K04R2j57l9J68j27q1J34M4r4N7J82k74q2K62m0p7J37j87j9
$$ y = [382, -12, -300, 149, 121, -206, 46, 275, -158, -168, 222, 89, -299, 133, 218, -224, -73, 111, -98, -205, 237, 88, -279, 78, 256, -162, -73, 312, -81, -127, 185, 87, -158, 26, 128, -124, -70, 182, -25, -310, 115, 204, -197, 11, 131, -118, -51, 103, 27, -114, 93, 120, -204, -110, 93, -41, -204, 131, 114, -262, 58, 193, -174, -51, 254, -35, -149, 159, 73, -182, 95, 204, -19, -143, 172, 0, -189, 27, 111, -140, -105, 129, -143, -117, 98, -25, -68, 35, 205, -211, -129, 82, -87, -186, 131, 111, -150, -4, 207, -30, -47, 103, -97, -172, 29, 192, -205, 6, 153, -98, -122, 168, 154, -180, 46, 171, -129, -76, 95, -3, 9, 102, 75, -59, 80, 47, -123, -19, 88, -42, -124, -33, 93, -128, 30, 100, -88, -121, 66, -27, -19, 60, 72, -221, 9, 101, -82, 39, 187, -21, -154, 106, 135, -92, -118, 179, 33, -164, 96, 55, -187, 17, 109, -48, -87, 81, -46, -127, 7, 51, -43, 14, 196, -78, -160, 102, 62, -15, 122, -65, -84]
6936h4L9J32j29J1N9K3j25J14l3q3Q1k4K4k4K0j07J05j5N7jj56P4Q5j40K81k61
6962g7Q4Qo1Q2n3J13k1r7K0m8k2p0J08O6j92K50k00J46O5j79K64k49MJ59o6n6
6988b2K9kp0P7Op0MJ03m0L2j02Q9k04J78M9j75J40n7L6o0P4K5j00j1R8l2n9l5
7016i9J85r4L0Nn0K6Q7m3j10M3N4j27J9J44L0j03N1j3l5q8J78r8p7J88r2q1Q1
7043A1J9q8j1J12j0j46J80o9p3M6J06p3q4J39q2j04J96mk43J46J70j61n9J68o3
7068B3j87L47j08k03J60J96j74j98K73j6k48O8J79j59n2J75p3p9J07M9k10j4L40
7091A96l17O4J16J0k19K54L3k74P2K19j81p4L08q8k17K9J85k89P5K45q7j46J65
7114G9J8k62J43J60k60R4J63q4l33M35j35j94R2K22j86k19M19m7k89L14P4k96
$$ y = [-84, -45, 87, -42, -31, 28, 51, -74, 40, 7, -76, 5, -19, 5, -19, 1, -106, -1, -16, 41, 40, -116, -42, 43, -97, 184, -77, 7, 15, -46, 36, -17, 96, 75, -22, -2, -50, -72, -142, -34, 32, -160, 90, -110, 36, 101, -78, 186, -63, -59, 100, 34, -22, 7, 5, -65, 12, 18, -52, -48, 55, 15, 47, -55, 34, -170, 8, 57, -118, 22, -35, 1, -59, 15, 40, -60, -71, 27, -5, -64, -99, 86, -8, 22, 27, -23, 3, 90, 47, -63, -20, 34, -93, -74, 70, 100, -3, 48, 35, 0, -88, 90, -8, -85, 103, 11, -70, 11, 30, -58, -69, 43, 33, -113, 67, -2, -75, -29, 77, 4, -80, 59, -23, -127, 69, 65, -178, -32, 138, -23, -82, 86, 23, -164, 183, 75, -128, 32, 228, 54, -144, 129, 113, -135, -67, 112, -47, -99, 76, 3, -76, 31, 80, -130, -144, 196, -121, -57, 59, 69, -150, 104, 137, -137, -65, 154, -27, -101, 207, 119, -98, -69, 116, -173, -98, 147, 60, -86, 79, 97, -165, -22, 138, -122, -28, 135, 51, -282, 153, 18, -176, -84, 138, -48, -267, 152, 105, -184, 130, 204, -92]
7136i2J0J80r9k57L30K6k98K74J03k65n9K88q4k35K65N8k34J7K02k77O4K48o5
7159A00k27J59O7k01nL86l75p7L21j59j78K86R3l18RL32k46k04M68j54l01J92
7181c2J84k00Q7J31k04j83L39J47m40J63K34k25j73M05j79k81J59J24j82m4M07
7202B37k74k40L73Q4l58J84K32l55l6K84j01k58L76l4k52J9L46l29J3K85j04l02
7224b10K79R5l80K48J41j67j05K50q3k97J56L02l90m1L99j64j96K85r1j65R6K81
7246B43l98R0K02j19k52L61J29m54P7K84k37j59L93j30k60L04K00k97o1L28k35
7267Ik15L39Q0m58K09K05l22R9K69k19j79K91J48m08J76J94l29J1M58l57k18K19
7289BK08m05O4L82k96o9J91N5l50K11N6j45O2K68k08j97K12J36k99J75J79k52
$$ y = [-92, -82, 98, -1, -258, 72, 98, -200, 74, 177, -88, -147, 141, 57, -178, 87, 145, -89, -72, 130, -147, -83, 165, 100, -127, 32, 99, -102, -107, 279, -96, -173, 148, -11, -189, 97, 190, -128, -119, 213, -33, -237, 231, 77, -224, -32, 152, -48, 39, 170, -34, -217, 122, 269, -171, -8, 226, 1, -172, 233, 54, -227, -68, 56, -126, -170, 237, -37, -277, 96, 180, -178, 6, 238, -117, -153, 131, 30, -228, 148, 114, -138, -119, 227, -102, -89, 196, 92, -210, 69, 164, -216, 32, 173, 6, -99, 151, 68, -229, -73, 229, -161, -202, 197, 33, -163, 122, 31, -134, -38, 243, -155, -65, 137, 18, -234, 127, 256, -198, -121, 163, -74, -233, 160, 30, -230, 74, 274, -23, -84, 244, 9, -206, 133, 213, -245, -36, 169, -153, -54, 215, -4, -183, 108, 256, -152, 24, 218, -111, -100, 358, 1, -217, 2, 210, -195, -131, 251, -45, -114, 77, 132, -218, -7, 49, -96, -34, 234, 26, -171, 41, 177, -122, 53, 232, -20]
7311b0j41K88r5j06J09J69l70Q7L23k63j09K78O7m70L97Qj53j51L71k03j82J60
7333fM7j98L9K72k05k0J85j30j74K72Oj84N4K20k94J14J93j27l05K33J76k41J5
7356e8J68j43j60K95Q9l77J41Q8p4q4J79l0j77J33J04j24Q0J02k53Q3J60k9j76
7379f3L5J66k12J8K02j53p6J63L1j82J34k0k42P4K75j52j48J72J70l17J62J25
7401A62k72L6J71k6k02K23P6k62Q6K06j90p2J90j46j59K75Qq0J5N2j31j07K51
7424A04n8j73P2Q8m8J48p3j97P9Q1K6j21Q6J8j19mK47p2k32J44j27J55L0P2j67
7449d1m0J36l0Pl5j4j49J46J40l0j16O0l0p2L4J08j62O4N3P9j48Oj4N9oN6L1J3
7477A05n1oj28J54l4r4l3P4O7k7QJ19j33M9L7j4o7k0m5J24p7Plj6OM6j4N2J4k04
$$ y = [-20, -161, 127, 32, -74, 35, 204, -166, -79, 244, -19, -128, 150, 217, -253, 144, 152, -1, -152, 219, 16, -166, -6, 41, -157, -118, 154, -51, -71, 114, -16, -190, 82, 88, -96, -42, 178, -116, -2, 191, 64, -241, -8, 168, -73, -58, 110, -33, -193, 102, 191, -186, -45, 43, -31, -115, 64, 34, -143, -10, 94, -30, 50, 152, -101, -18, 142, 113, -63, -28, 138, -74, -56, 146, -7, -83, 80, 111, -71, 63, 43, -199, -125, 150, -2, -150, 22, 192, -125, 37, 162, -110, -74, 97, 71, -131, 92, 168, -94, -8, 198, 8, -64, 126, -20, -179, 96, 104, 24, 39, 91, -40, -147, 104, 46, -127, -55, 33, -15, 133, 60, -137, -58, 23, 49, -72, 14, 32, -87, -91, 156, 84, -148, -4, -131, 24, 54, 126, -41, -81, 55, 25, 32, -3, -17, -166, -20, 120, 90, -26, 34, 4, -68, -34, 74, -88, -24, 29, 108, -40, -34, -48, 11, 5, 61, 92, 105, 54, 48, -80, 74, 40, -54, -87, -13, 54, 27, 35, 154, 21, 70, 107, 93, 26, 6, -39, 85, 8, 15, 12, -4, 2, 48, 34, 86, 100, -104]
7507a04J78q0J39j10k2L7o5l3k7J80j29Qn2J9J89l8j83PJ91o9k6j34J70o2RK5
7533A8jn4k2J20j78K18Nj64o4P5J33p0l2N1j18P4J77p6k54J06P6j22Q1J30j04
7558Ej16K74j03j86K09n8p1q6L41k53j13J75Q8k25J35N4j64R1O6l2q2R2l5k29
7582b23J74R4L1k31J41l8M6N1Mr5o6K65j40r1N2J25k15O6J61j75m3K73q9j31K6
7607b8J55k82J45J76k52K8J22j0k04K65m2q7j30K40o2j96K41O4j94j06K50j00
7629gj27K88k05j09K45J04k51k6K02k20m6K98j9l02K56M2j79K7R6m5k82K91l8
7652gj49K54N6k13j39L46q1j58M3J43k20K07L7j81j04K28N5l76K37J59j97p2K55
7675A23o9j27O2Kj98K90K27m92N1K27j5k02K27Q9m52K62K56k59j1R4j02j61K64
$$ y = [-104, 74, -6, 133, 23, 1, 38, -27, -60, -87, 93, -36, -28, -80, -61, 128, 90, -93, -86, 105, 36, 10, -124, 46, -16, -7, 18, 17, -37, -59, 61, -117, 101, 106, -58, -122, -47, 86, 16, -16, 35, -83, -9, 168, 92, -162, -56, 20, -102, -21, 109, 5, -111, 163, 60, -126, 83, 25, -46, -132, 209, -44, -157, 18, 106, -119, 16, 70, -94, -3, 63, 31, -51, 41, 6, -223, -49, 45, 76, -155, -14, -52, -6, 45, 49, -46, -112, 153, 13, -78, -26, 99, -116, -50, 111, -64, -107, 166, 77, -54, -28, 127, -155, -10, 166, -86, -58, 64, 54, -150, 115, 73, -14, -144, 96, 34, -162, 79, 143, -51, -157, 93, -7, -134, 154, -51, -160, 85, 189, -62, -88, 114, -106, -152, 146, 127, -175, 81, 123, -56, -29, 67, 22, -260, 31, -7, -156, 98, 154, -59, -198, 148, 67, -91, -48, 95, -125, 82, 119, -62, -166, 62, 117, -259, -22, 137, -60, -132, 123, 54, -73, -11, -9, -207, 83, 310, -182, -131, 96, 81, -121, 106, 195, -257, 5, 261, 2, -9, 85, -17, -178, 86]
7698H6J36l82L6K68j50LP1r4j15J93K52l44j07L64k05k09L10O6k68J8J33j49Q
7721g9L53k46k06K81J15l55J57J36j26k32L56j25j80K21J14l14J73K05k55k22
7741b29J97K27l32K29L3l31J6L90j59k07J75R1l58K35L06k52k25K70o3j47J87
7762E3J51m24J30L13k75j05L11j9k73J35K84l19o2K52j48k49M68k1l91O3K66j35
7784Ej41K74o6k62L11K03n36J24J72j39r8K98p2l55L37O6r9j2J83k44k28L98M5
7807A64m04J83K62k02k32M96j67k86K80kl23K76J88l71l9L29q2j84J24J48l10
7828a52O5L04k68j13L40k41o4J17K51l45p8J69O4j12R4N4k75Q0L85l36k5K05m5
7851G4j82K13J18l22Q1J49kj80J72n8k54J18J91k5j87J78j6j46R4J31k22k8K13
$$ y = [86, 222, -160, -124, 144, -6, -3, 68, -26, -141, 52, 304, -40, -147, 217, 12, -197, 113, 179, -89, -71, 62, -87, -79, 274, 28, -178, 103, 218, -137, 20, 156, 30, -202, 154, 29, -151, 70, 184, -130, 43, 248, -7, -229, -32, 195, -137, 92, 125, -206, -190, 200, 41, -166, 9, 100, -258, -23, 283, 31, -194, 76, 13, -134, 53, 204, -220, -90, 223, -52, -157, 154, 135, -138, -3, 281, -38, -100, 152, 4, -245, 223, 202, -189, -126, 140, 5, -136, 138, 72, -190, 121, 324, -212, -88, 84, -55, -153, 145, 73, -282, 55, 121, 22, 10, 193, -51, -279, 119, 164, -240, -57, 205, 3, -229, 267, 100, -186, 94, 92, -231, 45, 233, -138, -177, 152, 70, -114, 10, 158, -152, -87, 217, -51, -164, 176, -65, -129, -12, 239, -106, -184, -15, 49, -63, 31, 85, -190, -110, 275, -61, -86, 119, 74, -108, 105, 223, -99, -18, 131, 129, -51, 121, 63, -191, -73, 118, 93, -94, 84, 68, -78, 16, 147, -75, -103, 110]
7874A10j28r8K44j3l65K52J22j46O6Q3k69O0J91n0q5M4no4q9K62m8j97J06J35
7898A18j63nJ18j46M0J84r5q8l4L7k6J05J56k64r3K19j6n0M1K8k27P9J62K2j81
7923g9J69j18jJ10Rj82j02K11j2m5l4Q5j14K8J14Jj41R8n5K3kJ99j14j77J86m8
7949IL9M6m8j46P1J44j67L4Q4j6k23J45R9M2j40kr5J85m6k0o2%QQ2l4N1p8o5R2
7978a1Q4j86N7J25j84J82KL0j58J8J02NQ5o0n0n2R1j5j18J11l2j4l7J25M1j86
8004d5n7J02J26p7J27k29j03J86Om7k0j7j0P0n9N5llK3j16K00n5j2k11J65N0n3
8031gj2k6K7J9R6j04J10k08J34m3q1K12j01n0M1J42j27%K9j93K6K83o4j21p3J87
8057I6j82J39l6N0k24K14j00J14k7j2r5L5J59N3l28M3J47j54K09k9j82oJ17N9
$$ y = [110, -18, -116, 128, 115, -250, 2, 124, -22, 44, 127, -142, -82, 109, 59, -26, 18, 13, -51, -140, 122, 74, -123, -17, 118, -45, -50, 68, -78, -38, 146, 51, -37, -71, -34, -60, 45, 201, -63, -156, 63, 47, -3, 38, 66, -161, -82, 80, 102, -79, 90, -28, -29, 81, 90, -92, -194, 17, 5, -40, -74, 11, -103, -75, 39, 40, -101, -3, -58, -35, -37, 162, 48, -129, 57, 9, 48, 94, 46, -100, -29, 115, -52, -18, 66, 50, -173, -28, 71, 113, -27, -29, -124, 61, 15, -5, -67, -67, -59, 23, -11, 40, -38, -103, -11, 73, -113, -56, 69, -115, 67, 69, 99, -59, -41, 61, 66, 151, 91, 41, -11, 80, 65, -53, 58, 26, 12, -25, 100, 141, -45, -102, 0, 126, 49, 176, -53, -156, 30, 36, -11, -31, -48, -58, 12, -47, 8, 5, 2, 25, -91, 109, 54, 42, -169, -4, 46, -7, -19, -45, -18, 1, 97, -7, 103, -105, 29, -14, -95, 117, 16, -34, 7, 149, 22, 22, 51, -142, -116, 167, 103, -18, -91, 96, -86, 53, 17, 67, -157, 57, -43, 71, 44, 32, -63, -28, 131, 184, -144, -101, 46, -108, 101, 72, -110, -116, 1, 60]
8081F0k0L8m7l4j23J59K57l81qJ81k61K33O1q3k38R3L9J4M8Q0k01P2M4K4k1J17
8107A03J7k82K05J58j28j43J05L7j59K76q0j91OK10j9j15J16k08k0K2K49j59j12
8130a12K02o8j67J95J31k32p1O9M5j17K62k04r9K20L3q4j01K14j75j29L21j19
8152A4r3O1J25p0q3K27j86k80M42J27k25n0J21j88P1J29j00j06O1J84k55PK77
8175B10k20j22J25Q9j50P3J05l17J21K71j05j54J04J13j84N3
$$ y = [60, 40, 78, 31, -3, -126, 33, 290, -91, -99, 82, -179, 54, 115, 32, -206, -113, -74, -60, -12, 68, -133, -61, -17, 7, -14, 103, 120, -162, 43, 201, 73, -70, 35, 72, -87, 189, 109, -82, -76, 134, 115, 0, 116, -92, -112, -90, 159, 0, -112, 90, 22, -145, 50, 181, -51, -122, -53, -8, -125, 137, -67, -166, 54, 87, 3, -98, 116, -59, -188, 133, 14, -79, -18, 107, 37, -46, 181, -5, -285, 157, 284, 59, 9, 130, -58, 13, 142, 42, -64, -3, 181, -74, -67, 210, -10, -132, -7, 82, -68, 5, 110, -207, -86, 185, 80, -74, 30, 143, -41, 12]
8191A2
$$ Imaginary data points
##PAGE= N=2
##DATA TABLE= (X++(I..I)), XYDATA
0@%%%%%%%Qj6J6j6K4l9M7n6P1q7J06j30J55j82K21k68L17l67M26m98N81o70P69
30D12q80J003j144J297j463J648j852K078k324K591k885L207l562L947m364M821
46B530n321N870o470P127p852Q650r533J0516j1615J2852j4254J5860j7722J9907
60A0545k2514K5691k9662L4784m1672N1472o6595R3110j52418N03922j67914r92148
72g53399J049642R4924r50636M88113O54322r20156K3582Q32694n26502m44396
82d51812Q16417j91373o94020O36761L11731q01392K33948N93113o10952j91161
92c48740P24904k58694n26166N18144J73787n37787J88238L26486l80309l7695
102a57832L55879k10431j45799L10273r6661k49443K52056P6123k53109R3191
$$ y = [0, 0, 0, 0, 0, 0, 0, 0, 8, -8, 8, -8, 16, -23, 24, -32, 39, -48, 58, -72, 83, -99, 122, -146, 171, -196, 230, -268, 313, -357, 412, -468, 535, -609, 688, -775, 873, -979, 1099, -1225, 1366, -1519, 1688, -1874, 2073, -2291, 2530, -2791, 3079, -3391, 3736, -4116, 4534, -4999, 5517, -6098, 6754, -7500, 8360, -9362, 10545, -11969, 13722, -15940, 18844, -22828, 28644, -37951, 55159, -97259, 406663, 238749, -753399, 296243, 391167, -559469, -71356, 582966, -337190, -313608, 519086, -7416, -451812, 364605, 173232, -520788, 115973, 427704, -373688, -139740, 453373, -157579, -348740, 376164, 117470, -408696, 109448, 283235, -254552, -66314, 260172, -120137, -157832, 198047, -12384, -158183, 152090, 55429, -194014, 58042, 134165, -118944, -25753]
112b5753J33157j79274K5595J52992j26146n1198J29484n5092m8744R5980n8243
123g242n3500J18090m6372q8618J38840j2371j58852J25853Q7420j80016L9260
134c7508J37871j53670j7897J92512j19532j28500K06733j3417k01717J63871
144B8746J04591k41099M5360J96296j86362n4351K50190j11202j97888K27090
154F1371N4879k45432J10552J60043k24103r001K39049j40419j48699K23154j0444
165G0950k11374J61597J14751k33677K6465K05153j46145r6777J92686m8985j65012
176a30368J64048Q3707j92223L3183J43209j35530n5548J66981m2960j25344J13173
187B2328M3222j24772M6838R1048j06927l8573J09655k0984p0557O8420K0044
$$ y = [-25753, 107404, -71870, -46275, 106717, -19429, -70627, 58857, 3765, -44979, 51001, -7242, -60742, 57348, 10976, -77642, 61198, 48827, -110025, 15828, 103248, -76768, -37508, 100363, -53307, -71204, 121308, 1776, -126724, 80009, 66592, -135125, 28746, 133337, -107762, -62402, 133894, -52468, -106819, 143371, 32169, -165719, 61371, 116250, -129182, -18630, 141413, -82690, -91691, 147358, 6939, -141760, 81394, 70950, -140424, 21173, 135924, -97753, -71288, 133865, -12280, -109057, 83629, 34644, -130368, 33680, 117387, -74836, -41653, 101556, -33974, -89522, 77459, 34499, -90845, 22328, 65550, -59222, -12384, 78664, -28263, -66836, 42819, 21835, -48722, 19698, 39742]
198C9742q0014K6630N9981n3578k7032M8947n873k7031L1280J1392l9203q231
210b2990K9772N403j6579J291P871j0889k420K3464Q52l3249N31L0020j2157j2329
224a1409L5081q830m8854K6490L5718m0179j356M3837l4284l2576N5745P420n7015
237c0212K2761L5792m7696J942N8896l7536m7342N5748J2718n2112K8425L0979
249C2363n6652j275O3399k4387m5691L8502P296m4826L2403L9826n2750j6896
261b8688M9820j6862l0539M3846N265n1574J7746L9174l3595j2778L9765j6489
273E091l3743L7492J6091m2404O844K8132k6922l700L5945j7617l0339K7625J3601
286A6096k5184Q966J5614k9125m246L6238o053k4967J4019K759j7136J6589J3731
$$ y = [39742, -40272, -13642, 46339, -7239, -34271, 14676, 8803, -18228, 13052, 24444, -14759, -22990, 6782, 12185, -4394, -3103, 4768, -6121, -8541, 14923, 15775, -17474, -16943, 13077, 920, -11409, 23672, 14842, -34012, -7522, 28196, -11983, -13339, 30498, -3786, -36362, 19383, 26803, -30212, -7451, 28341, -19355, -17413, 41483, 3947, -43395, 12353, 25071, -27041, 1384, 32363, -24289, -25564, 37835, 13448, -32243, 6259, 13555, -31271, 1132, 40958, -11792, -28688, 21132, 4270, -26269, 17577, 22842, -28732, -10986, 28188, -5407, -18185, 21580, 5091, -28652, 8840, 24931, -17473, -10629, 17503, -9419, -13119, 22826, 5209, -25130, 2495, 16096, -9088, -122, 15492, -13633, -17879, 18359, 12306, -12661, 1358, 4117, -13019, 3570, 17301]
299A7301k3631o775J6051l223j687J4412p985j8442J0905J0177j1016M092P092
312G271j4388J202J7371o871r803O915n654n255J5940K700j5757K681Q040p843
326c451M712R642j8797q734K3196K949j0851J0195p975k2864J9042K2422j8486
339A000o964J3168j2846p177K5690j080k7284R434J5102j4812N275J6242k1021
352e273r829K3902k861j5611J4574K117k1351J0592K2886j6105j5363J4718j836
365E60j2151J8141J0024k3584o548J5922L84k213Q545o260j6798O086J7995l564
379F539r660M590k129q227J1520J1132j5375j1822J3356P121r782M006Q552j7153
393g332p428K4751J031k3463R874J3488j9710K953K6877j8446k6439K6665J2052
$$ y = [17301, -6330, -13105, 2946, -277, -1964, 12448, 4463, -13979, -3074, 7103, -3913, 179, 7271, -7117, -5915, 11456, 4585, -5218, 1697, -3957, -9212, 6728, 9428, -6329, -3648, 4392, -3451, 1261, 10903, -7894, -16628, 6568, 9517, -1334, 8861, 886, -21978, -2936, 19486, 1000, -5964, 7204, -5642, -12819, 12871, 11791, -15493, -6059, 9043, -5769, -494, 15748, -5273, -15102, 8800, 5939, -9672, 4902, 7019, -14332, -3740, 19146, 3041, -12322, 2396, 560, -11591, 6550, 16574, -7010, -13558, 2364, 2748, 535, 9080, 2820, -13978, -7892, 10103, 6539, -3121, 1469, -660, -8887, 2633, 13765, -1610, -13432, -76, 7045, -2737, 1269, 9821, -7332, -14760, 9991, 11022, -12441, -2567, 10921, -8789, -5836, 21041, 2595, -23844, 2821, 14873]
406A4873k8345J3731K4196l8291j1177M8318r700l8211L0599J0411m5174K1638
418g132M6542m3047k7046M9460q803m2126M4945K0705o4048J0855N7561m0460
430b594k7055N6214j5301n3113N0626L0888o5726M939N6504m1916k6007O5265
442C2724j4785o3908M8693L4853o2548J2504N4955n5141l0196P2551o305n9299
454c5902M3354K4128o6024J8011O2150n1538l1373O3371j3671n0716N2171K0903
466C4864o5534J4170N0211m1848j5641N2539k1948m3674M8027J9566n2156J0350
478a1074L3966l4753o100M2679j7352l1579K8165R046k7560J3974K1397k7668
490f859j3153K7729M811j6659M596K715j3591M021J8005k606j6471J467J2275
$$ y = [14873, -13472, 259, 24455, -13836, -25013, 23305, 13605, -24606, 5993, 16404, -28770, -7132, 39410, -3637, -30683, 18777, 9974, -32152, 12793, 33498, -30550, -19695, 37866, -2594, -29649, 26565, 11264, -41849, 8777, 39665, -26061, -21122, 35382, -6534, -32541, 32724, 17939, -45969, 2724, 37577, -24971, -12467, 42488, -12653, -42849, 29702, 23397, -35902, 7452, 31580, -34444, -16433, 45717, -5821, -37194, 26177, 12506, -38210, 13961, 34864, -30670, -16500, 33711, -8137, -23778, 28761, 6813, -36861, 11166, 30732, -21424, -11074, 22892, -11861, -17961, 24718, 7366, -24213, 3952, 12998, -14562, -588, 20809, -6859, -20012, 7717, 12528, -4131, 465, 3180, -10411, -6390, 11615, 9009, -7462, -5995, 6280]
503F280p075q241J7238J145k5631Q989K6071j7795j3370K3457r386k3687L2760
516A0755J3469m7841P695M7841l2124k7354M9611q731n1490M1643L1335n6623
528b1814Q798N0772n1697k7565P5657r725o9705M9886L7260p3103J3109O7299
540D9172o2158l4718Q6000j5061p5026O3613L8325q9125J0266P8708n5056l9304
552d4364P7414j5246o6320O7198K9806r3442J7424P9820o0538l6412Q4081j3957
564B5464p5296N5212L7614p6483J1472O8753n7107l7444Q4064j256p7892L5646
576g253M1879n7150K836N7190l9457l4387O1131R1o1848L4142M2270o0017j2820
589c3393O6200j6057m8902L8220J7172m8981J5514M4342m0741k7568N3982M975
$$ y = [6280, -795, -9036, 8202, 9347, -16284, -7295, 18776, 981, -12389, 11068, 1682, -22005, 10755, 24224, -23617, -15922, 31919, -205, -27559, 22052, 13321, -38169, 3474, 34809, -21814, -13016, 37756, -13941, -41506, 34151, 24426, -45279, 4607, 41867, -31236, -18127, 49172, -12986, -47704, 38296, 23235, -51791, 11822, 50147, -38978, -28712, 49996, -5060, -44364, 33050, 17804, -48516, 18682, 48488, -44954, -27530, 52290, -8248, -44660, 39421, 25464, -49832, 5380, 42994, -33489, -22017, 46736, -10371, -47815, 36249, 34993, -42899, -7253, 34626, -22524, -19688, 37502, -1955, -36342, 24789, 24880, -36968, -2826, 39444, -20573, -33393, 32807, 16750, -32152, 6068, 23240, -25741, -10227, 34115, -6626, -34194, 19788, 24763]
601B4763m9559K0502L0028m2368n543M8416j7740l2781L8639M394n1165K4532
613g882M8222m8736k9742N9936k82n2135L3989K9309n7059K083N6249l3493l3483
626c3024N5149q64n6916L6108L9033n9699p778N8541k9727l3648O0706k441o8267
639d2827L6484M7519n9404j0016O2792k8275m5694N4823J6459n7716J7665L6926
651B8736m7120n448N7290k4921m2932M5245J3602m8794J8172L5585m2506j3105
663b6196N0193j1587l9512L3007J6458m4127R255M1795k7374k5210L3546K025
675A2273l0231J6833J8255k9096k047L3924j1187k5462K1623O957l0687Q958K9857
688A9970j9233j7303K7045J972k7678J4523K0521l1121r578L8090n804l0843K3653
$$ y = [24763, -24796, -4294, 25734, -16634, -22177, 26239, 8499, -24282, 14357, 18751, -32414, -7882, 40340, -8396, -38138, 21798, 21516, -30619, 3370, 32679, -24380, -22297, 33952, 459, -33024, 22125, 21261, -35655, 453, 39486, -20213, -27991, 30550, 823, -32825, 27881, 25440, -42827, -6343, 41176, -18228, -28244, 34548, 6273, -39421, 15402, 31861, -25855, -8190, 28736, -18384, -23832, 33458, 8537, -34395, 10850, 24452, -24342, -6170, 29415, -13091, -26196, 23997, 12410, -27102, 5905, 22363, -21764, -12509, 29286, 1912, -23298, 10248, 12273, -17958, -1125, 17130, -11966, -14013, 19911, 8724, -16738, 4885, 11842, -18845, -9887, 19970, 737, -16566, 10479, 12451, -15227, -704, 19817, -11304, -20882, 17208, 11404, -19439, 4214]
701D214J4457l5779N685L4525k3986k1313L4950J33l3532K3503J9946m1354J51
714a8400M3018k0581k4230L7211l724m1769K7018K8604m0474m666L9330k0757
726E80k3862M1036K546m5064J7381K7696l3060R4L6931k3718k4762L7606M519
739A7923l6372J5611J9983l2409J167L8428j8061k7136K8138M129k9939J7551
751i87K0328l0333l814L1413r990j9103J9687L12k5352J3796K1173j9680o677
764i227J9702r501j3468K0349K685k2296N728J4703j1532k850J5427o976j4478
777a1734J2822Q905j3489K79R748j0101n068J4468j33j2113N527P447p749q40
791b031Q051p641q951J0740N797q456L446N497j0939j810J2691k299r895N451
$$ y = [4214, 18671, -17108, -11423, 23102, -884, -22197, 12753, 12886, -20646, 2857, 22803, -18551, -18400, 24618, 4037, -20193, 17018, 13294, -28475, -1457, 27147, -13327, -17993, 21337, 580, -23282, 17754, 20300, -24764, -7383, 20313, -12747, -12653, 24278, 560, -24202, 13404, 17923, -18449, -2838, 17145, -15264, -14097, 24331, 6270, -20866, 7272, 11401, -18538, -987, 19341, -10992, -14806, 16607, 6617, -12486, 7201, 7513, -17839, -4043, 17130, -2550, -9227, 10475, 974, -12494, 7855, 10540, -11756, -6028, 8675, -2857, -5707, 9720, 2744, -11734, 1088, 9993, -3496, -3217, 6531, -3570, -8638, 5830, 5697, -6416, -889, 6558, -1191, -2031, 6020, -1621, -10572, 168, 5965, -2491, 955, 6452, -4487, -6297, 6394, 4095, -5800, -349]
805c49L620q192L159J0139p282q106Q362J475o725O101K586j1003J609J0819m263
820A950o581O131k57p501Q214Q167j1797n275J0010k184n619Q304p36j0354O692
835h36R309p790l557O141n907n449J1390K132j0647M844O705r036P65R011q399
850a324o442R444M84n301P170J144j0497K172P287n664o36P230o703m790J1231
865D805o88r895N991K840q036N588P220j0374k802J0155l993o042R622j633j2384
880i626R662R904j3712n07J2869j0796q094J6121m84j4965J0711R443j6428J40
894e762J6844j1469j1900J8488J066j8640J2096J2468k0924j446K1746j0608j5428
907a3469J8460L476k0634J1012J7679k2051q829K4863m956j8443J8704O753k6599
$$ y = [-349, 3271, -4921, -1762, 8377, 1095, -7011, 1351, 2826, -3899, 2202, 4788, -6215, -4606, 6213, 1950, -4631, 1500, 1243, -6258, 1956, 10123, -1674, -6949, 3061, 877, -4742, 3562, 2826, -7528, -836, 8473, 683, -2874, 3267, -2640, -8089, 3301, 5433, -5214, -370, 6335, -2701, -1936, 7075, -1324, -7766, 1678, 2162, -3139, 4031, 5175, -5322, -3150, 4137, -1527, -2163, 5067, -1636, -6426, 4805, 4117, -5778, 213, 3053, -4983, 605, 7825, -2549, -5351, 4804, 811, -5231, 4391, 2758, -9626, 36, 9940, -3772, -4279, 8590, -2206, -10300, 5821, 5337, -9628, 1083, 10526, -5902, -5762, 11082, -387, -12287, 6201, 7267, -11373, 723, 13191, -7733, -9179, 12567, 1959, -13469, 4991, 8467, -12167, -1155, 16524, -5527, -14356, 10507, 5551, -12892, 5812, 12565, -14034]
920a4034O280K4645j6911j4370K2959r23k2863J7039J6021k7935l853K7773j1704
933B124j6947K5198K215k9616J2123K2841k3212p887K7129r755k2914K4689J1090
946A7078k9888N222K3201k0672r091K8625o880k6164J9026J4680k3641K209K1551
959A5256j8297j3812K7055J292k5093J2447J4533k1923o60K3736j1537j8183J8905
972C719O712k0814O970J7442j8382q614K3180l820j9989J5721J0724k2007J809
985g349K1541j4055j4591K1676K240k2905J3199J7239k5501o062K8265q888k0425
998a5616K2340N645k7758J1234K3211k5181j0291L0656q194k4589K6620J0361
1010A8438l6036Q428K9738k5985j1796L4299j0743k9470L0244J4074l8716P182
$$ y = [-14034, -7754, 16891, -20, -14390, 8569, 7646, -15217, 1822, 17843, -10092, -13945, 13828, 2124, -14823, 10375, 12590, -17026, -4903, 17938, -5274, -13161, 13968, 4213, -18701, 5988, 17078, -12810, -7588, 15613, -5059, -14150, 14475, 7595, -18569, 457, 15137, -8504, -6295, 15256, -3041, -16853, 10202, 11494, -13599, -1152, 13381, -8542, -9202, 14534, 2997, -15186, 3719, 10431, -10383, -3413, 14029, -4353, -12967, 10213, 6393, -13596, 2125, 12849, -9158, -7349, 14192, 137, -14454, 7222, 9462, -13443, -244, 16995, -8506, -14568, 13697, 4809, -15616, 6724, 12369, -15389, -4155, 19056, -6125, -16416, 14240, 6046, -18543, 8077, 18438, -17598, -9170, 20568, -5417, -17213, 17086, 6343, -23127, 7117, 21191, -17525, -10343]
1022a0343L2475k7605j4497L8076q469l2877K8440J4126l6576J0627L0621l1355
1034g357j4447L9028o318l1644K4452J3764l4157P738L1189k4583j6121L0857
1046A2401m511k6157K1663J4491k8668oK4507j2937j3162K0916p64k1414J3327
1059c14J5149k1518m916K1894o003j6647J4908R292j8538j238J7141p407j2071
1072a0268J5683L856k0399O006J9336j4677j1849J9761l71j9932J3176J4186k3320
1085h812k286K6426j3783k0143K8605N216l4389J3645K8220k8866j1496L4035
1097A6372j1119k6766L1261R204m0231J3649L3595l4335j2968M2602j3427l4367
1109b6530L5168J2130m2975J5534L3425l7572j0957M6430j4998l7595L5277J3794
$$ y = [-10343, 22132, -5473, -19970, 18106, 9637, -23240, 5200, 19326, -17250, -6623, 23998, -7357, -21804, 17224, 10906, -20738, 3714, 17478, -16679, -8941, 22248, -2335, -18456, 12401, 7890, -18267, 3396, 17887, -10781, -10787, 13720, 783, -12379, 8537, 7773, -13641, -314, 14835, -6683, -11599, 10295, 4292, -12355, 2553, 11845, -6693, -7931, 9210, 1803, -10268, 5415, 9271, -11128, -5122, 14214, -463, -12312, 7449, 7078, -12854, 322, 14508, -8812, -11098, 15328, 1545, -18598, 10007, 15223, -19166, -5521, 22699, -6167, -17663, 16372, 5253, -21513, 9748, 18952, -21279, -7630, 25965, -8370, -21338, 21264, 7837, -26530, 8638, 20768, -22207, -6673, 26752, -10820, -21777, 24653, 9655, -27940, 7337, 21131]
1121B1131m3054J4597L4597l5458j2807M1291j3286l1275L3024J0487l9768J1765
1133h756L1933k8099j2594L4085r769k7701K6942J2120l3633O240K8200k0503
1145a535j4611K6849r35k5197J3533J6902k0819m334K1566r173j7200J9482R036
1158A3564k2326K002J8889j3343j2098K1344K538k3574R007J9339j9411q271K4760
1171A2420p852k2882K1685J3726k8307J805K6140j8282j5417K9122j752l0058
1183a9652J9778K0023l0894r10L1328k0280k0763L3218K186l3261J7436K2150
1195B0359l1003l163L3215j7343k3429L0757M859l2258J6206K2533l0153n394
1207a4814L1289j2962k1546K6405N503k9964J1011K3286k3181r262K6753p287
$$ y = [21131, -21923, -7326, 27271, -8187, -20994, 20297, 7011, -24264, 8760, 19247, -20521, -8756, 23177, -4922, -17516, 16569, 6800, -20901, 6041, 18161, -15472, -9232, 18968, -1535, -16146, 10703, 9768, -15429, -1896, 15006, -5813, -10147, 11419, 2246, -14954, 4528, 13564, -8762, -6760, 12129, -1214, -13312, 8032, 10570, -13004, -3997, 15342, -4069, -12340, 12420, 4568, -18314, 3371, 17097, -11210, -9405, 16735, -1547, -16964, 12158, 10406, -19652, 126, 20149, -10745, -11655, 19673, -607, -21370, 11848, 14034, -19227, -1791, 20359, -10644, -13807, 19408, 2065, -21364, 9393, 14252, -18006, -1800, 20733, -9420, -14814, 16475, 3513, -18033, 8372, 13875, -16089, -5078, 18208, -4973, -14235, 12518, 5231]
1219E231k1313K0458R238k4983M469K0756j5480j0487K1024k027j9492J3193J2364
1232A2951j9646j622J8433r915j1661J8343K146j9055P180J3090j4622m443J7595
1245H774m583j4973J2871P735j6480K000J4142j1123p734J5651m80j4214Q422
1258HQ651j3450j038J3841p665r954J4099K749j4977N996J0536j2686k916J4577
1272G771n185j1674J1447N425j3626K794J1611j0512o077J3762k100j1339R420
1285A717N532j2964J950J0920q428n547J1990j086j1306P825P002j1910l60J1534
1299F869p074p104J1232O81j0248N736O374r965j602R416m051n528R049Q35r646
1314e026M248N704q243k28Q358m277m940O958O47o637K900M155n406q71N260k357
$$ y = [5231, -16082, 4376, 13614, -11369, -6900, 13856, -1624, -12111, 8913, 6886, -12606, 587, 12951, -6695, -8317, 10116, 201, -11460, 6883, 9029, -10026, -2846, 10244, -4378, -8821, 8774, 4191, -10782, 2089, 9824, -6656, -4656, 9486, -1637, -9371, 6280, 5800, -8414, 8, 8659, -4791, -5829, 8012, 347, -9607, 4492, 7241, -7736, -1740, 8796, -3890, -6806, 7771, 2586, -9088, 2359, 7784, -5842, -3048, 8563, -1949, -8026, 5736, 3636, -7703, 1717, 7249, -5715, -3765, 7155, -1273, -6820, 5170, 4084, -7222, 603, 7605, -4305, -4665, 6869, -205, -7309, 3923, 4604, -5644, 92, 6466, -3499, -5101, 4315, 264, -5264, 3785, 4620, -5026, -778, 4926, -3317, -3545, 4813, 536, -4404, 2554, 3201, -3436, -536, 3619, -1787, -2658, 2602, 245]
1330B45k737M139l21l591K426R68k491J163J668j429j40O33j618J89J229n6L94
1347F71Q40k172r34K593j003k204L108L17l567L124K697n056m32M025k695k276
1363b964N252K77n139K798L529n875p35O075l750m044P125R31o763L464L984o659
1379b494j185O833k816m897O629K454p437K142N391o951k406Q377j434o505N313
1394A014L012p213N93O846m411m603P087J221p892L794N645p271j999Q241k796
1409A268o688P002M042q393J11P900n881o301R695J413r566N295P098r832k338
1424e175J0572m053q574R217L875j1712L243J0848r229o041J2847k185j2531R474
1438E76P805j3507J63J3244q114r542J3707K634j4997O533J1229j3936l629J6350
$$ y = [245, -2492, 1647, 1326, -2265, 161, 1129, -1362, -199, 1469, 40, -100, 533, -1085, -896, 333, 277, 671, 1511, -661, -1595, 998, -5, -2209, 899, 1216, -2351, 773, 3470, -1586, -2018, 2007, -688, -2964, 2288, 2565, -2574, 224, 3753, -2122, -2857, 3218, -532, -4576, 2549, 3480, -3283, 181, 4165, -2494, -3679, 3154, 338, -4559, 2070, 4524, -2913, -771, 4620, -2331, -4737, 3640, 2206, -4299, 1014, 4026, -3187, -2594, 4252, -159, -4762, 2325, 3546, -4346, -552, 5093, -2178, -4177, 4064, 1268, -5420, 1582, 5624, -2769, -2658, 5242, -639, -6940, 2755, 4168, -5398, -103, 6995, -2837, -5175, 5397, 1344, -7230, 1987, 5862, -5850, -2607, 8241, -988, -7029, 5818, 3633, -8898, 576, 8381, -5126, -4963, 8281, 167, -9375, 4332, 6966, -8031, -1498, 9731, -4205, -7834, 8516]
1452H516n996j3104J4072N252j6697M931J4323j4103p574J8100k732j6618J3308
1465A678R306j8800J982J7609j3108j0503J9300n76j8111J1644J1454j9047q68
1478h040J9616j0811j3146J8998K298k0342R874J4401j8757l717J9985q357j4982
1491a2980J8037N905k0372N870J5890j6875o937K1231m965j7000J5721P833k0528
1504i170L854J7459j4318r571J9360j317j7962J2674J1053j8976k47J7841j1031
1517c51j1491J8100J790j7760Q761J1934j6104l254J7518o650j3545J4731N243
1530H922j7585N050J4701j3375p594J6751j785j4709J0532Q556j5895j1J6546
1543A0104q566j1763J4954L044j7198P146J3176j4875n287J7608m136j4749J3274
$$ y = [8516, 2520, -10584, 3488, 8740, -7957, -3026, 11297, -2806, -10380, 7720, 4988, -11630, 1678, 10984, -7816, -5834, 11775, -1333, -11836, 7464, 6888, -11223, 421, 11875, -7172, -8040, 11576, 765, -12381, 6617, 8915, -11427, -1553, 12848, -5909, -9626, 10359, 2002, -12980, 5057, 10962, -9410, -3540, 12350, -4525, -11462, 9769, 4804, -12196, 3525, 11358, -9170, -5316, 12143, -2175, -11746, 7614, 6297, -11665, 1009, 12062, -6914, -7161, 10680, -351, -11842, 6258, 8048, -9712, -951, 10983, -5121, -8375, 9143, 2493, -11052, 3679, 8922, -8663, -3613, 11088, -2287, -9881, 6870, 5085, -9624, 908, 9464, -6431, -6442, 10104, 1538, -10225, 4729, 7773, -9425, -2279, 10897, -3978, -9265, 8343, 4207, -10542, 2732]
1556B732P178j8839K854J7963j2642j0570J8807j075j8215J3030J1643k0340n80
1569h054J9970j1888j3269K0736K282k1974J0141J5001j9690k492K1722j1023
1581A462j5138K0329K770k1835J0582J5763j9986m086K2349r395j6556J9611M890
1594A0760k2610Q394J6630j8637n278K1640o629j6175J5925N463j9572N412J5913
1607A1236j3853o294J8220m550j5836J3051P913j7365J146J5547q941q925J4278
1620E627Q88j4930O555J0386j2720l070J4966m683j1885J1930N611j5414J550
1633e189J3613q719p845J3619p6j4616Q554J0776j4498l075J5571o498j1330J3972
1647D259L853j6724M936J3709j2814n462J7330m692j6316J3716Q720j8326K290
$$ y = [2732, 9910, -8929, -6075, 11888, -754, -11324, 7483, 6408, -11807, 1223, 12866, -7474, -8054, 11916, 28, -13241, 7495, 9777, -12197, -2056, 12945, -6745, -9237, 12485, 1462, -13676, 6653, 9423, -12412, -1830, 13933, -6053, -10139, 12210, 2815, -13741, 5870, 10760, -11850, -3456, 13174, -5463, -10741, 10899, 4270, -11905, 4020, 9483, -10089, -4677, 11236, -2617, -8911, 9309, 4759, -11077, 1974, 9887, -7478, -6332, 9215, 274, -8651, 5627, 6515, -8415, -1860, 8526, -4194, -7264, 7702, 3019, -8866, 3064, 8675, -6739, -5189, 8424, -295, -8140, 5479, 5403, -9213, -659, 10117, -4381, -7456, 8115, 1617, -9713, 4259, 8112, -8612, -3676, 10033, -2781, -8243, 9087, 4395, -11921, 1795, 10515, -7811, -5521]
1660e521J6558j2689q783J8345j778j7412J1849J0345j8349M70J8579j1519j2036
1673a1941J8329J350j7881J0052J0976j8084m81J8902r519j2871J6245K074j7814
1686a0663R217J3428j6465l899J7262p173j2196J5249L455j7298N914J3172j2538
1699b535m937J4835m373j2152J1467N481j4388K832J2065r882n643J3033j877
1712C926j1904P957P308j0773p66J0615n794q036R995L396j0912K440Q738p234
1726a044m307R684p45r805M770P016p942j921R744l949q194Q877L982j1340J738
1741c436R961p535n495J1543o14j1810P257Q085j1756j404J2069o911q345J2908
1755D517J618j3265N889Q599j1595r73J3031o448r757J1584K271j2376O377Q912
$$ y = [-5521, 11037, -1652, -10435, 7910, 6132, -11280, 569, 10914, -7435, -6965, 11614, 95, -11941, 6388, 7738, -10143, -91, 10885, -7199, -7680, 11222, 1703, -11168, 5077, 7151, -10663, -1446, 11982, -4483, -8382, 8880, 1707, -10489, 4760, 8215, -9083, -3169, 10003, -2535, -7472, 7363, 2990, -9162, 2305, 7786, -6602, -3770, 8295, -1587, -7230, 5803, 3926, -7978, -21, 7287, -3486, -4252, 6363, 569, -7467, 2528, 5924, -4988, -2548, 6190, -1044, -5351, 4333, 3588, -6217, -1447, 5569, -2373, -4294, 5450, 1501, -6693, 2184, 6166, -5174, -3436, 6525, -1010, -6505, 5038, 4424, -7386, -129, 7956, -3800, -5204, 6865, -46, -8391, 4517, 6135, -7130, -1241, 7358, -4237, -5210, 7821, 1373, -8384, 3200, 5471, -6905, -528, 8384]
1769H384j2360k257J3154n301q643J0272J386j1192N401Q059r543k285R816l962
1783I29o391Q563J096r453M193O353p009j363O895l774m744O394J876o080J748
1798g67L672m601p91M983j845l304L331Q50k616J237J606k577r95K278K86j080
1814c33P25N31j481k26J336j45j350K59J347O9r71N33L22k024L03K649j086j780
1832a322K014M61k103J384J264l076p22L198k70j735K317j1l826J251L250k552
1848d78j010L088j521k121L158J046l540J59K712j906q53L115j027l149K450J794
1864A917k597N7J348j705k75K964l53k454M47Q90r95P49J622j430j704J452P99
1881G32o22M6R7o15l01M91J218n47j750Q26J080j029J27J554j519j581K606Q95
$$ y = [8384, -3976, -6233, 6921, 1620, -7023, 3249, 4635, -6557, -1156, 6903, -2640, -4925, 4891, 929, -5462, 3101, 4197, -5256, -1063, 5290, -1719, -3082, 3813, 39, -4705, 1689, 3565, -2515, -767, 2905, -1696, -2487, 2496, 651, -2653, 678, 1528, -1088, 149, 1755, -822, -1817, 461, 747, -333, 392, 923, -558, -784, 552, 407, -943, -684, 663, 732, -239, 294, 616, -1408, -1105, 1544, 458, -1322, 692, 1153, -950, 434, 1698, -1378, -2100, 1098, 828, -907, 1410, 1399, -2427, -1176, 2074, -478, -1488, 1600, 79, -2042, 1116, 2162, -1378, -1219, 1493, -413, -1266, 1849, 822, -2327, 123, 1917, -680, -623, 725, -980, -1255, 1709, 1356, -1098, -651, 239, -756, -7, 1615, 185, -1519, -67, 732, 110, 156, 253, -362, -663, -172, 1046, 499, -1251, -425, 655, -374, -247, 1307, -212, -1793, 813, 1708]
1899A708k832N87J954k707l7M239k046l671L593O09l781K383L085m858q97N662
1915B991j695m234M184P32o006L212N409n355j896N800k887m362N858J468o918
1930c699K210N559n008j898O475k631o056N882L046o957J555N672n138k286P062
1945C788j812o928M577M290n892N61O057n304m541P386J149o835K972M352o138
1960b318o18P500l106o364N282L010o565K027O315o084l907P953l40p448M580
1975h3M223p438L49Q731m588o778P309J456q201M534O830q859k595R955k892p162
1991e209P494K037j0145L400R347p438m557R063k083q484Q094M798j0841P90R656
2006E922o090n485R804n54j0169N781P372q950j543R300m997o882R479K248j0763
$$ y = [1708, -1124, -537, 1417, -1290, -1327, 2912, 866, -2805, 788, 1397, -2384, -1, 3084, -1774, -2671, 2991, 1296, -2938, 1246, 1978, -4028, -816, 4593, -762, -2658, 3142, 255, -4107, 1751, 3219, -3699, -1489, 4070, -938, -2836, 3639, 1008, -5048, 834, 3880, -3077, -1522, 4150, -988, -3274, 3788, 1976, -4952, -375, 3915, -1977, -1416, 4641, -663, -5204, 2182, 3331, -3504, -532, 3820, -2318, -2936, 4564, 1458, -4906, 376, 3386, -3179, -1152, 5163, -921, -4828, 3125, 2785, -4663, -83, 4140, -3298, -2949, 5782, 1194, -5584, 1725, 3181, -5020, -486, 6344, -2515, -5110, 4845, 1953, -5209, 2285, 4322, -5823, -2423, 6924, -514, -5071, 3992, 1909, -6575, 1519, 6317, -4524, -3734, 5922, -168, -5653, 4151, 3597, -6572, -791, 6581, -2369, -3912, 5388, 391, -6491, 2988, 5236, -5527]
2021e527L302Q372p585l201R532k769r150P494N634r531R13Q860p677n767J1292
2036D192P13j0689M799O738q851p87J0444n548q510R740L179j0943M072Q750j0109
2051b810l617J2510k795j0297Q251M127j0940L457J0597r844o573J2564n84j1149
2065g103Q106N940j2244R98J1628p198o618J1016j062j1439P993Q512j1705j974
2079e150J1132n428p043J0450M32j1258O016Q013r895j998J0592m849q336R170
2093A848L824r933K200P612p447k549R665l198q684P357N027q636K15P941n698
2108d56n312Q344J131q133M311N151q451o02R748l943q082P117L862q114J847
2123a582P115o745m001R034j026q383O492M627r662P57R695n834o908Q652J289
$$ y = [-5527, -2225, 6147, -1438, -4639, 4893, 2124, -7026, 468, 6102, -3429, -2516, 6344, -1333, -7100, 4192, 4905, -5784, -985, 5753, -3098, -3885, 6559, 1011, -7499, 2241, 5420, -5523, -1451, 7299, -2810, -6427, 6083, 3288, -7009, 1242, 5369, -5571, -2114, 8483, -1361, -7934, 4630, 4046, -7103, 1003, 6943, -5301, -4303, 7325, 127, -6491, 4525, 3463, -7976, 17, 8529, -3176, -5150, 5982, 554, -6489, 3961, 4393, -6865, -849, 7164, -2731, -4729, 5863, 1014, -7322, 1848, 5672, -4261, -2061, 5551, -1896, -4445, 5220, 2022, -6662, 695, 5722, -2914, -2699, 5242, -456, -5768, 2576, 3707, -4426, -115, 5036, -3415, -4017, 5731, 1788, -6294, 823, 4685, -3429, -1582, 5533, -1212, -5213, 3821, 2795, -5588, 904, 5531, -4131, -3374, 6321, 487, -6421, 2231, 3520]
2138C520q426N456N827j0368j138J1277m730p762R256J760j0683M521Q248q679
2152a921k516R440m608o911R959K122j1847L762R098q373k999J0060l684q075
2166f493Q578L213r797K608P566p789l239J0462j949q932O062M305p958J505P022
2181E164o746l882Q797qp553M316M442p325o19Q074l406n859N780J739o527L288
2197c25N385o342l243P186k81o069L990L461o805L32P364m028n020O354P34o851
2213d158M026N519p456k516Q141j640o137N929K348q737K369Q130o437m196Q180
2228C365j505p339O853M420r441K98Q082n510m048R079j215r060O185N530q938
2243c244J73Q150n938m702R326J61q738M267N055p419K60Q010n221n479P610J016
$$ y = [3520, -4906, 550, 6377, -3991, -5129, 6148, 1418, -6344, 2912, 4672, -6011, -1490, 6758, -1921, -4437, 5003, 395, -6516, 3443, 5565, -6282, -2520, 6578, -1795, -4794, 5266, 1582, -6493, 2085, 5298, -4499, -1891, 5675, -2114, -5353, 5109, 3160, -5772, 290, 4595, -3363, -1858, 5164, -1582, -5464, 3333, 3325, -4228, 88, 4530, -2795, -3414, 4660, 1254, -4605, 1175, 2914, -3613, -325, 5060, -1282, -4525, 2661, 2380, -3689, 301, 3762, -3043, -2711, 4653, 625, -4395, 1959, 2693, -4158, -132, 5387, -2069, -4585, 3556, 1916, -4221, 1708, 4056, -4681, -2312, 5818, -619, -4815, 3365, 1860, -5479, 1374, 5794, -3647, -3349, 4733, -777, -4825, 4254, 3039, -6021, 164, 5694, -3244, -3071, 5079, -859, -5561, 3765, 3926, -4812, -545, 4510, -2909, -2649, 5361, 140, -5339, 2271, 3287]
2259C287o949L932L769p067n6P108k772m915M850P51n383L041M536n308k013N256
2275B067j068l316L566R92m762R84M029j973k292K792Ql280K245K789l395j473
2291b087L066k56k149J946J144l301j70L822p37k886J862O79k862J575L231k952
2307g5k122L052p5k491K436J304l873J1L990j774k213L152l66l549K578K702l642
2324i55o96L176j460j491K847O3l717J277K674j989l42K363k144j903L045Q48
2340A596k589N30J237j684L22K334q83k329J018J135j074M82R76j680p22J707
2356C76M53p91q5k41n23N70J008j78j126P6N01J10L53P2q14n72O75J013k12j014
2376c49j43J75q8Q41O54j294r75J118O22l62P1j05j018k11J944J17j442L06K86
$$ y = [3287, -3662, 270, 4039, -3028, -3084, 4024, 1252, -3663, 1187, 1938, -3445, -404, 4132, -1176, -3189, 2067, 999, -2317, 1249, 2241, -2521, -1537, 2492, 519, -1773, 1019, 1027, -2253, -8, 2781, -614, -2087, 979, 723, -1426, 520, 1664, -1637, -1807, 2015, 1278, -1608, 254, 933, -1929, -354, 2877, -75, -2197, 855, 780, -1711, 725, 2029, -1844, -1833, 2157, 383, -1830, 1322, 956, -2593, -15, 2687, -955, -1651, 1525, 65, -1426, 1421, 1484, -2233, -956, 1718, -271, -613, 1750, -394, -2297, 748, 1596, -993, -463, 774, -910, -588, 1746, 863, -1466, -448, 687, -387, 95, 1071, -609, -1331, 376, 829, 38, -47, -288, -811, -241, 767, 589, -537, -461, 40, 150, 503, 575, -239, -811, -136, 877, 665, -349, -492, -317, -405, 436, 1090, -204, -1179, -61, 561, 199, 270, 165, -853, -1064, 880, 997, -445, -139, 147]
2395A47r06R14J268j707j014J501L22r38P21M98j971P7K524n16k060J203J59j620
2413a398J433J996k078j358J778J96j395J527M43k896N17K746j029j417J814p33
2429A46k015K156J818k678q68K354p15j427K445K06l473Q93L129j781j029K166
2445A327j180k777K766K088l060m23K574j681j174L366j44m265J593K932k622
2460f80k02L237k274k900L647J665l999L57K941k927j115M727o63m668K620K382
2476B148l758N72L896l179k681M713P30m699J873K859m486k30N601k278m505M289
2492H65J136m602K111L896m827k007N858o25m654L696J916n876J346N766m113
2507a14l317N583n73n109M082L392o410l94O201k742l801N321R0o482L615N319
$$ y = [147, -759, 155, 1423, -284, -1298, 203, 525, -413, 308, 806, -1165, -1088, 1436, 920, -1140, 63, 222, -1398, 35, 2031, -47, -1405, 373, 569, -826, 701, 1144, -1752, -1235, 1511, 482, -935, 879, 146, -1869, 287, 2105, -573, -1441, 913, 198, -1229, 1216, 1422, -2051, -1158, 1971, 190, -839, 1327, 147, -2630, 136, 2224, -836, -1259, 1315, -366, -1540, 1826, 1682, -2583, -990, 1942, -680, -882, 2355, 81, -2819, 828, 2493, -1506, -1149, 1792, -1135, -2250, 2477, 1814, -2854, -234, 2148, -1610, -1038, 2858, -321, -3002, 1711, 2441, -2258, -385, 2474, -2012, -2242, 3359, 1081, -3424, 865, 2001, -2601, -490, 3406, -1421, -3428, 2430, 1805, -2849, 847, 2763, -3113, -1767, 3999, -114, -3431, 2152, 1579, -3530, 552, 3944, -2466, -2860, 3341, 599, -3202, 2119, 2209, -4273, -658, 4661]
2523D661n945j746O105k462m621N931J688p083J542N804m782k228O892k383o349
2538d976N408L833o634L35N711m522l094P183n18o900L773M260o408J10P157m198
2554E20n522O467J785o296K599M233o150r69P578k579o326N223K858o676J706
2569a549O373n165l869O557l13n725M461L202p325J10P888l292n663N748J133
2584B571o649L320N407o219j893P113k292n629N726K599q056J197P497m333m059
2599c700O311r88o087N233L937p808k47P614l810m813P081P43q055L198N888o073
2615a576j304P093l932n590P562K317q504J645O658n502k345P328k109o861N953
2630H33L105p303J705O757o246l830Q465k99p307L807L901o423Q44O774m869m682
$$ y = [4661, -1284, -3030, 3075, 613, -4008, 1923, 3611, -3472, -1930, 3874, -908, -3136, 3756, 1373, -4976, 432, 4265, -2369, -2034, 3677, -845, -3939, 3244, 2726, -4174, -401, 3859, -2549, -2439, 4718, 520, -5002, 1465, 3250, -3046, -447, 3786, -2364, -3333, 4245, 1666, -4660, 563, 3421, -3255, -1549, 4824, -341, -4210, 2347, 2034, -3691, 770, 3972, -3353, -3243, 4645, 1353, -4310, 1438, 2571, -4078, -758, 4649, -1570, -3463, 3650, 1358, -4271, 1455, 4054, -4002, -2805, 4692, 359, -3700, 2611, 1623, -4464, 769, 4706, -3102, -3349, 4265, 455, -4358, 2723, 3466, -4589, -1391, 4497, -1576, -2880, 4213, 281, -5309, 2253, 4570, -3934, -2289, 4369, -1133, -3478, 3850, 1741, -5120, 833, 3938, -3365, -1660, 5097, -1149, -4979, 3486, 3187, -4120, -313, 3588, -2835, -1991, 4783, -86, -4768]
2646d768P051O74o960L737M746o786j094O844k121m552M910L27o008L409N473
2661D882n904k674O400j202n100M662K124o004J037N120l490k658N180r27n331
2676c885L944L957n309j193N006k251l110M827M51n781K228M483m168j621N428
2691C006j907n363M495L360n301k6M578l621k076N653o91n982L387L911n032j45
2707a754N493l742m127N844J077n902K711L713n497m83O642k847n094M813J554
2722B401n248K537M294n548j583O177j808m561M683J087n804K252N127m529k449
2737b972N053j468l955M666J868n842R81M728l411j856M532j223m342L511K647
2752B917m138L2L331k590j860M053L6m198J782K530k785j87L235j974k637K699
$$ y = [-4768, 2283, 2957, -4003, -266, 4480, -2306, -3400, 3444, 1323, -3229, 1681, 2008, -4000, -591, 4882, -1022, -3696, 2704, 1502, -3598, 1064, 3188, -2816, -1779, 3341, -149, -2807, 2373, 1446, -3885, 59, 4016, -1293, -2486, 2520, 269, -2841, 1986, 2437, -3344, -1116, 3367, -801, -2422, 3006, 1099, -4264, 231, 3591, -1710, -1736, 2842, -779, -2855, 2798, 2107, -3875, -488, 3423, -1609, -1754, 3739, -3, -4130, 1714, 2791, -3111, -400, 3313, -2184, -2667, 3975, 1128, -3966, 847, 2401, -2847, -310, 3984, -1564, -3147, 3030, 1222, -3339, 1344, 2431, -3373, -1121, 4006, -523, -2972, 2081, 613, -3342, 1324, 3192, -2650, -1669, 3059, -352, -2208, 2324, 1101, -3241, 270, 2917, -1221, -1189, 2142, -448, -2308, 1745, 1781, -2417, -635, 1895, -890, -1077, 2158, 184, -2453, 246]
2768B46J616k854M09K083k151j084L253j5l115R66J814j899P8K419j571k421K267
2785D1J727k508K69K080k227j374L568J12l469J227K168k634J15L229j862l010
2801b548K916J356l107J137K225l368o27M188j300l005K529R30l240J661K991
2816B738l473j457L487n58k407K732P02l931J073L212k212j167K480j208j977
2831a966K850Q55k731K45J859j605k50K387j358k057J773R78j321L91O38j551
2847h63j50J745j97q49K24L2m67P01O24p77n82L45K56M74J5o07j79r0K03O73o0
2868D71j006l8Q23q5o5N59p55r96R72R57q84j55P10j052j62J869o12j470P31O45
2888D57j022P45R20j559p71J603L13j216Q63J11j434N86J599r37j003R52p5n69
$$ y = [246, 1862, -992, -583, 1500, -651, -1735, 1518, 1503, -1612, -646, 1168, -731, -653, 1766, 195, -2226, 41, 1768, -740, -471, 1609, -618, -1992, 1576, 1688, -1781, -554, 1614, -1020, -905, 2324, 462, -2548, 368, 1724, -1383, -246, 1979, -1389, -2016, 2172, 872, -2133, 396, 1326, -1914, -253, 2738, -735, -2192, 1295, 737, -1670, 1062, 1764, -2167, -1094, 2118, -94, -1261, 1219, 11, -1966, 884, 1739, -992, -747, 1112, -493, -743, 1644, 286, -1771, 2, 980, -341, 50, 688, -863, -1013, 732, 535, -314, -90, -58, -525, 176, 800, 23, -559, -214, 42, 516, 531, -76, -255, -345, -142, 531, 471, -535, -573, 250, 165, 100, 659, -96, -1092, -120, 837, -47, -202, 508, -544, -706, 1163, 551, -919, -188, 457, -565, 180, 1100, -459, -1230, 373, 686, -530, 333, 444, -990, -404, 1195, 258, -745, 207, 132, -437]
2906d37P95O44j311n88J114l1m94N21O0j189N95J179n64o31J30J95k20L97P47
2925I12r25q75Q65N95p19K49L56j141r0J541l8j364L75N28p67J83J621j228j491
2944a413J531O56j342Q04P59k028JK330n01j692J131L92j973J188K096k208j316
2961a585K481m78j560J877N01k788N56K765j573j337K103n75k265K373J433k850
2977i22k31K442j502j095K836m83l195J557K306k254n64K657j545k094L036Q75
2993A824l216R09K055k558l41L177j003l012K365J432k728N59K598k741j627L797
3009A490p7l203J877J506l190N86L450j985k719L069M94l069J832K117l559n47
3025a928M031j476k659K987M34l633J707L232l089j721L620r16k867L219J425
$$ y = [-437, 358, 1002, -309, -897, 217, 186, -308, 213, 273, -916, -321, 858, 294, -337, -207, -12, -232, 165, 912, -13, -888, -23, 572, -147, 102, 458, -683, -773, 768, 730, -634, -259, 269, -498, -315, 1306, 78, -1413, 118, 774, -568, 236, 995, -1033, -1032, 1298, 797, -895, 236, 628, -1345, -157, 1939, -269, -1585, 896, 418, -1142, 735, 1236, -1552, -996, 1769, 196, -1141, 962, 387, -1878, 495, 1928, -922, -1153, 1289, -213, -1308, 1528, 1045, -2150, -593, 1713, -541, -1105, 1552, 7, -2087, 949, 1824, -1392, -483, 1572, -986, -1327, 1850, 847, -2165, 200, 1632, -1096, -537, 2061, -680, -2307, 1490, 1413, -1790, 87, 1593, -1597, -1011, 2439, 454, -2265, 804, 1298, -1771, 61, 2178, -1381, -1928, 2103, 627, -2032, 955, 1389, -2244, -537, 2695, -394, -2115, 1505, 589, -2278, 941, 2366]
3040B366m408O76L727k338j929L477o33l510K619K497l619m92L470k089k179L945
3056A580M28m469J451L310k831q49L534j766l171L417J793m147N75L465k929j750
3072b359M275k47m179K363K220l524K52L877k755l141M434J197m660J568L176
3087B497l769r40M738j557l837L594J509m702J712M165m084k576N270j50m317
3102b447K971J958m921J033M774l409l089M941k0m764L004L233m875o81M676k056
3118C28k764M337l2n144K716L759m117j286M329j610l216L758J362m407R87L360
3134B360l074j205M302j216m143K774K684l543k51L072j885k110L620N75m012
3149b052J292L017l119r31L991j096l635K508K092l205L29K829k560j932M041
$$ y = [2366, -2042, -1366, 2361, 23, -1906, 1571, 938, -2572, 47, 2544, -1075, -1567, 1903, -186, -2365, 1580, 2008, -2461, -1010, 2300, -531, -1380, 2154, 388, -2783, 634, 2427, -1720, -1145, 2320, -609, -2359, 1916, 1669, -2510, -147, 2073, -1451, -1199, 2678, -77, -3218, 1216, 2413, -2247, -679, 2497, -1272, -2212, 2526, 969, -2868, 726, 2235, -2467, -755, 3410, -674, -3250, 2020, 1870, -2447, 524, 2482, -2439, -1406, 3368, -41, -3130, 1811, 1791, -2973, 31, 3264, -1611, -2292, 2384, 328, -2436, 1901, 1869, -3275, -559, 3200, -917, -2203, 2126, 516, -2700, 1058, 2420, -1987, -1000, 2360, -714, -1919, 2383, 1167, -2976, -202, 2482, -1061, -1312, 1760, -125, -2235, 1385, 1960, -2052, -760, 2257, -862, -1793, 2198, 1102, -2533, -25, 2067, -1138, -809, 2020, -540, -2472, 1569]
3164A569L20m279J946K896l597n74M124j786l401L367J363l946J607L305m153
3179a239j378M977q33m295L178J836m432J238L954l645k011M485n38l998L445
3194G44K039m900L28M605k790k304M060p96l813L335K257m532K14L851k451k157
3210b310M157k42m052K151K555l371n6L377k344k208L552N84l476J149K119k506
3226i21j31L025j361k575K198R48k371Q25K033k258j048K768K8k338J061J095
3242I78j826l8K474j066k096J779Q14k006P42J681j983j173K579J97k161J319
3258B14R56k354J99K814j499j998K390L64k489J444J727k745o18L100r21k149
3274a565K377L36k866J254K514k611p98K504q16j973K704M13k985O87K447k040
$$ y = [1569, 1889, -2390, -444, 2452, -1145, -1719, 2405, 619, -2782, 585, 1948, -1998, -391, 2914, -1239, -2617, 2360, 1527, -2768, 410, 2246, -2186, -948, 3006, -639, -2650, 1835, 1297, -2701, 744, 2783, -2117, -1789, 2816, 26, -2278, 1782, 986, -2827, 508, 2765, -1767, -1553, 2298, -153, -2310, 1847, 1605, -2447, -296, 2259, -1112, -1168, 2209, -135, -2343, 1209, 1793, -1683, -534, 1585, -921, -1052, 1973, 612, -1963, 235, 1183, -1188, -363, 1670, -588, -1636, 1132, 1160, -1178, -117, 978, -848, -886, 1588, 522, -1574, 205, 1019, -987, -245, 1436, -547, -1720, 859, 1056, -1105, 214, 1170, -1184, -985, 1829, 330, -1668, 722, 1086, -1403, 41, 1768, -977, -1595, 1505, 584, -1565, 812, 1148, -1718, -464, 2050, -561, -1359, 1145, 329, -1644, 1060, 1473, -1512, -825, 1622, -418]
3290d18q18K788j224k310K458J035k616N92J894j988n86K623p77k168J605R51
3306A041j967O83J788j928j097K380j22j646J135N85j847L84J902j059j194J287
3322C25m8j095R39Q08j420l43J317k10p47Q42m6j152O17J017o45o77P07p4p30
3341f15P87N68r87l28Q61j62l06M53q7q16K31J028m49n09M32P8o83O09N19r21
3361b97k79P49n3k30M87j61p51J08R88m64l08M65j20n79P40K47p50j86M59Kj00
3382c3M03k05o80K54N92k78j13K29l39k47O05J75m61q6J94j40J93K84j91l55l2
3403b31L64K4r6j45j65J28L5K33J18m57k86N01L1j40L09j80m47L05O17m82l23
3424b87N05k20m15O91L24j047q7Q11l61k63Q83m19r15Q58O45q92m4O84o64n69
$$ y = [-418, -1236, 1552, 328, -1982, 476, 1511, -1105, -513, 1381, -607, -1193, 1430, 653, -1515, 90, 1041, -926, -243, 1545, -383, -1480, 900, 778, -868, 267, 852, -995, -611, 1291, 232, -962, 325, 277, -818, 121, 929, -491, -834, 483, 273, -474, 368, 322, -830, -213, 804, 159, -518, 189, 115, -615, 172, 740, -247, -575, 286, 124, -182, 271, 184, -632, -401, 627, 178, -331, 101, 179, -504, 105, 624, -297, -576, 173, 120, -110, 377, 216, -535, -427, 561, 97, -211, 254, 134, -445, 295, 542, -208, -394, 65, 67, -33, 370, 165, -515, -261, 331, 53, -60, 169, -170, -417, 188, 363, -98, -184, 10, -130, 63, 347, 156, -199, -231, 133, 157, 61, -84, -249, -121, -86, 147, 265, -192, -478, 23, 54, -86, 223, 43, -404, -99, 518, 36, -287, 218, -2, -417, 274, 598, -449, -536, 275, -86, -349, 534, 115, -800, 58, 703, -189, -233, 451, -213, -782]
3444g82J342J87j430M85P42r04J04J112q46r74J225L97j174M53P43j170j28J514
3462H96n13j201R21M48j326O04J072j086q04J460K6j089Q27M94j554K09J557p38
3480B03q87J113q2j228R90R07j344n29J420l11r02J092K89j674M52J586j152p61
3498h18J395k20j385J207R61j681k72J679p90q64J564p1j908R12J483j662j39
3515f09J511r05j249J732N54j873L07J418j369m46K076n83j967J531R76j803K02
3532d97J711j426j097K167P0k011J000J106j762O1K001j268j577J993N01k018
3548a046R63J393j975m86K335n56j746J439N87k174P50K190j943j081K302m22
3564E30j791J537R53k424L37K403j459j449K339k59k381J610J685k387k23K226
$$ y = [-782, 560, 747, -683, -198, 544, -360, -256, 856, 10, -964, 261, 658, -516, -63, 680, -490, -618, 896, 383, -818, 103, 551, -775, -171, 901, -185, -989, 471, 497, -592, 235, 729, -825, -616, 941, 203, -684, 429, 347, -881, 109, 1016, -328, -857, 563, 252, -650, 442, 731, -943, -491, 1095, -57, -818, 577, 357, -1028, 179, 1140, -541, -813, 866, 76, -788, 776, 705, -1203, -291, 1192, -470, -609, 902, -3, -1252, 480, 1034, -839, -532, 886, -483, -929, 1147, 564, -1403, 128, 1104, -699, -497, 1214, -212, -1309, 858, 928, -1083, -83, 1023, -739, -678, 1323, 55, -1522, 471, 972, -1046, -83, 1310, -665, -1151, 1184, 628, -1118, 321, 908, -1266, -516, 1674, -269, -1350, 952, 530, -1261, 276, 1229, -1195, -858, 1545, 86, -1363, 976, 717, -1664, -54, 1631, -756, -979, 1247]
3580A247j097j543K342J96k737R99K147j962p61K498j001k035K310Q73k694P40
3596d78K032k037q27K708n16k566J712J533k564K11K289j676j459K585J40k589
3612a502J427J518k333k77K781j124k096K012Q16k420J038J815k261q70K778n19
3628G83k374J823J118k511L62K432j615j464K358m1k452J671J621k614m03K796
3644A490j018j906K217K36k428J034K114k194j079K748p03k253K205J220l021
3659a338K79K585j511j487K607k51k632J719J910k772k65K664j420j910K761M35
3675A374k916J124J973k281n01K851j252k469K661J009k792P09K131k150r79K809
3691A301o05k354J887J097k538M44K508j932j596K731K6k316J427J366k517K8
$$ y = [1247, 150, -1393, 949, 1145, -1592, -593, 1554, -408, -1169, 1329, 328, -1707, 603, 1476, -1218, -478, 1554, -483, -1310, 1398, 882, -1684, 28, 1561, -1003, -792, 1497, -179, -1638, 947, 1087, -1502, -75, 1443, -890, -1167, 1614, 490, -1606, 406, 1222, -1198, -160, 1655, -606, -1476, 1302, 783, -1591, 232, 1350, -1161, -799, 1633, 18, -1446, 912, 871, -1581, 90, 1711, -903, -1306, 1490, 472, -1434, 783, 1019, -1409, -375, 1739, -455, -1534, 1214, 511, -1742, 463, 1683, -1338, -1059, 1526, 15, -1472, 1135, 884, -1748, -29, 1881, -891, -1156, 1508, 88, -1822, 939, 1374, -1542, -418, 1555, -726, -1227, 1624, 372, -2097, 564, 1573, -1219, -510, 1621, -529, -1508, 1301, 696, -1658, 229, 1326, -1212, -768, 1740, -192, -1788, 943, 969, -1347, 80, 1446, -1071, -1043]
3707a043K714j514j567K053K81k186J002J859k149o69K159n99j648J708O63k225
3723a161N75J900j316j104J921k55j849J451J173k021j37J897r55j144J682K01
3739H58j955O94J459j232p04J674m71j424J363Q88j821J13J577j021r67J781j55
3756F57j759R30J232j555j58J773j022j305J693L39j725N86J354j469k42J640
3772I69o37j538J419N98j490M23J265j327p44J862m47j369J226N58j541M25J399
3789A051j173p47J396r0j216R88P11j563J59J414q93p94J277k00j112Q08P33j138
3807c89k30J142m13q14J044O8j123O52P69q24l10Q83l30p18P50M44q88N4O42n01
3827i2k61P26j00o98L12N90p81JP37l58o27P07K61o68k2P05n94k27Q76k37p29
$$ y = [-1043, 1671, 157, -1410, 643, 924, -1262, -260, 1599, -550, -1219, 940, 341, -1307, 401, 1064, -1161, -586, 1314, -2, -1106, 815, 560, -1289, 162, 1335, -686, -823, 1074, 119, -1025, 657, 858, -1097, -403, 1056, -176, -880, 794, 323, -1101, 262, 1150, -671, -558, 1019, -2, -969, 812, 657, -1102, -172, 1060, -495, -653, 1120, 98, -1207, 486, 825, -900, -314, 1040, -429, -671, 969, 332, -1206, 213, 811, -679, -256, 1009, -318, -1062, 800, 353, -1016, 210, 768, -773, -348, 1051, -122, -869, 527, 437, -779, 209, 920, -643, -484, 930, 37, -757, 520, 320, -792, 16, 749, -389, -619, 523, 110, -704, 340, 408, -715, -63, 706, -118, -428, 455, 125, -593, 157, 601, -287, -233, 409, -92, -353, 373, 273, -425, -113, 477, -304, -303, 434, 76, -551, 156, 417, -251, -273, 432, -162, -389, 487, 250, -479]
3848d79M89M17o89J47N33n13m87P78J73o54K84M23p52jP49l31m48N37J06o77K55
3869a40M74m47k17O55j05n30M67O4o05K77M03l00k28L30j82k30M50L8l90O0K69
3890A13r8j18K64Ql30J83O8j86J09K2j85N1K05p0q1Q5k0J34j04n6j01J27o0L5
3914eJ96j18k89J62J04j67J24J71k88J5L77l49r0K38J15m17K68K69m36p7L79j65
3936A7k92M69J0o73K98N20l68j78M94j87l87L23M26p63Q2N29l44k98O10m9n31
3957b92J25N42m56j71O28k26n41M60K82n79J6N78l77l90P87j64o07K74O29o55
3977a37j43O64l14p31P54L53p91J44P41p23k37Q04k16p56N12O08q06KQ68p93m95
3998f92J017J42j053N40O58r69l1R82m48q12Q45L45j185M90P81q66l83J251l05
$$ y = [-479, 10, 427, -262, -115, 418, -95, -582, 196, 369, -285, -1, 422, -330, -331, 418, 87, -361, 176, 282, -395, -140, 334, -113, -330, 325, 220, -310, 157, 221, -384, -107, 296, -4, -232, 98, -84, -314, 136, 174, -216, -156, 113, 15, -103, 161, 169, -161, 22, 90, -96, 13, 35, -150, -99, 106, 36, -45, 40, 20, 154, 50, -6, -107, 20, -40, -5, 191, 73, -216, -54, 50, -117, 7, 178, -110, -95, 282, -67, -157, 81, 196, -221, 47, 316, -120, -197, 182, 17, -275, 194, 204, -469, -171, 349, -19, -197, 297, 110, -277, 46, 472, -291, -209, 320, -24, -322, 288, 239, -292, -167, 375, -81, -252, 376, 150, -391, 69, 351, -228, -212, 366, -11, -401, 386, 222, -385, -111, 518, -137, -280, 384, 70, -661, 93, 446, -345, -201, 540, -183, -420, 384, 168, -588, -76, 532, -274, -272, 596, -197, -692, 325, 467, -586, -46, 612, -357, -388, 594, 146, -666, 179, 524, -661, -171, 610, -256, -639, 612, 307]
4017C07r85P89M47j175L69J074r06o14J131j51j091Q84Q35j394j9J228o28r24
4035h23J298J7j339O51R40j065l33J335n17j181J309M37j441M06J165j042n47
4052g30J369l61j223J045O92j392J84J222r30q55J546k5j416Q36R26j423QJ425
4070H98r31r73J357L31j475N69J203j581j03J449l85j317J307L51j418N43J125
4087I50j115p13J596k70j429J208O48j610K58J451j010p43J305m7j402Q96R43
4104I16j446r4J453o68j117J326K35j395N41J223j224m73J390k94j317J196P32
4121I84j825K96J515j136o93J640l08j465J033Q47j481m1J610r45j075J588K09
4138G53j657P80J211j552l49J793o66j446J467N66j773M54J477j319p08J772l86
$$ y = [307, -678, 111, 558, -617, -248, 826, -80, -694, 437, 286, -805, 79, 914, -480, -499, 729, 101, -823, 475, 492, -847, -196, 744, -321, -654, 681, 164, -1017, 292, 729, -712, -306, 859, -183, -730, 639, 278, -945, 100, 792, -600, -416, 806, -124, -979, 567, 542, -874, -38, 888, -535, -527, 898, -33, -1006, 351, 682, -793, -224, 979, -602, -705, 744, 359, -958, 349, 700, -718, -175, 950, -165, -878, 718, 448, -981, 227, 875, -735, -477, 974, -36, -779, 526, 479, -923, -27, 916, -530, -624, 829, 161, -956, 370, 605, -790, -249, 974, -250, -723, 667, 373, -944, 252, 984, -841, -545, 970, -166, -859, 781, 473, -992, 41, 888, -593, -634, 976, 31, -1044, 544, 753, -904, -124, 1087, -465, -814, 979, 313, -1133, 334, 900, -873, -419, 1058, -261, -969, 803, 417]
4155D17j593J241R72j846L18J571j305q24J751j06j777J230J042j705j15J912
4171A183j106j146J574L76j832P83J280j596l48J655n35j291J204O68j641M11
4187c61J402j396o01J773m08j366J111O98j511J98J372q52r78J342K30j529P23
4204a53J108j331k40J495p62j008J133M19j350L63J230j070o90J447j69j219Q05
4221HQ83j470l1J538r71q78J431R4j632Q68J154j369l31J437m25j361J401M40
4239G86j644N88J379j453n37J600k70j414J059P73j493K50J317j036p86J539k50
4256D08j277Q45Q34j312oJ277p03q72J286J39j363P23Q04j227k3J065m28q47R04
4275B27K35r88K69Q33p39l86J000k15q52P34L84r13l1R46m82m95P99O2q40L68
$$ y = [417, -1176, 65, 1037, -809, -491, 1080, -225, -1049, 702, 596, -1181, 49, 1091, -614, -729, 1183, 77, -1069, 505, 881, -951, -168, 1112, -484, -832, 823, 288, -1003, 201, 869, -772, -361, 1041, -355, -956, 817, 409, -957, 154, 852, -659, -461, 911, 59, -919, 423, 653, -876, -153, 955, -376, -616, 879, 117, -891, 242, 661, -689, -326, 904, -166, -856, 591, 422, -797, 8, 891, -579, -610, 928, -43, -921, 510, 604, -1028, -160, 994, -375, -706, 731, 306, -1055, 346, 786, -858, -270, 1109, -344, -881, 719, 449, -965, 94, 867, -626, -376, 941, -95, -881, 658, 408, -869, -24, 810, -502, -508, 769, 66, -806, 480, 619, -744, -21, 783, -444, -467, 598, 170, -677, 227, 462, -526, -257, 576, -163, -549, 451, 236, -616, 118, 502, -411, -442, 504, 22, -473, 326, 388, -452, -84]
4295h4O75p85k71Q89k69o56O76K42p70J16P34m61m43O86L2q53N32N43p35k58R13
4316D53l84o10P66J30q52L01O48o11l30Q03j95p21P44L02q52K15O78n63l07P91
4336D06j42p50M52M09o65N2P20o12k86P44o9p31M61L50n91M3O22m70l25O02k13
4357Gk95L86K54n35nM45k15k45K77J12m76K06K41k33k3K68j68j19J97K2k41N8
4379h2K48k85M1K58o5k01Q5K09k06j26K57j20o0J55J9j90k5J62J3j19L9k2K2r5
4403h8J39l3j77J58R3j45J25K3j08j45J04J02j55J29jn2l6K36r9k18K73m1o4m4
4427b4J92j63r1R3J64j51n5J38q1j26K55rk98J93J23j49rJ04p5k25J67K48k44
4450b3n1J74j21j61K67N3k89Q0J27p7m5L37j65k83N6L54k96j22L60j30k18L85
$$ y = [-84, 591, -194, -465, 424, 155, -501, 175, 417, -353, -237, 497, 36, -407, 279, 311, -542, -10, 533, -202, -460, 453, 69, -541, 225, 355, -497, -196, 452, -159, -489, 314, 119, -602, 142, 444, -408, -193, 485, -78, -385, 406, 264, -486, -34, 375, -290, -238, 482, -130, -416, 328, 259, -472, -11, 339, -252, -209, 413, -57, -382, 220, 7, -288, 98, 352, -183, -188, 257, 42, -203, 74, 186, -290, -84, 157, -76, -99, 169, 1, -118, 79, 101, -140, -82, 166, -119, -78, 180, 115, -86, -1, 208, 2, -124, 133, 13, -47, 108, 127, -63, -88, 74, 87, -32, 7, -15, 7, -88, 51, 18, -159, -1, 92, -53, 72, 95, -13, -158, -54, 48, -107, 22, 21, -31, -67, 169, 70, -148, 125, 84, 20, -24, 168, 5, -86, 7, 171, 20, -35, 103, 22, -104, 151, 142, -156, 37, 160, 11, 2, 106, 31, -194, -27, 221, -23, -74, 100, -21, -182, 85, 138, -151, -71, 56, -21, -66, 271, 106, -177, -121, 233, -63, -185, 175, 45, -173, 212]
4472B12J01n30J05K40l06O6M02j97m32M03K35m78K8M95m08l04P08j69m82L41K75
4493C05n57Q4N52l51m23O65L6o72L87L66o40j31P56k68m79N16K06o38J25O96o63
4514a28k62P45j66n88N40K28p30J23O31l94l47N32J41r24O28M96q61mO65k52n38
$$ y = [212, 313, -217, -112, 128, -178, -112, 290, 93, -339, 64, 299, -179, -151, 344, -64, -368, 340, 171, -311, 30, 305, -252, -168, 384, 33, -390, 275, 311, -361, 26, 392, -248, -379, 377, 109, -370, 146, 352, -286, -161, 535, -128, -390, 355, 189, -399, 141, 369, -361, -238, 393, -1, -348, 184, 325, -599, 29, 525, -336, -340, 325, 73, -465]
$$ [...]
8191B5
##END NTUPLES=NMR FID
##END=
