##TITLE=1H_IABPA2804-1
 CDCl3, 8 sc, 
 28.04.2021
##JCAMPDX= 6.0         $$ Bruker NMR JCAMP-DX V2.0
##DATA TYPE= NMR FID
##DATA CLASS= NTUPLES
##ORIGIN= UXNMR, Bruker Analytische Messtechnik GmbH
##OWNER= root
$$ XWIN-NMR		Version 3.5
$$ Wed Apr 28 11:45:03 2021 Russian Standard Time (UT+4h)  she@DPX200
##.OBSERVE FREQUENCY= 200.131506
##.OBSERVE NUCLEUS= ^1H
##.DELAY= (6, 6)
##.ACQUISITION MODE= SIMULTANEOUS
##.ACQUISITION SCHEME= undefined
##.AVERAGES= 8
##.DIGITISER RES= 18
##SPECTROMETER/DATA SYSTEM= spect
##.PULSE SEQUENCE= zg30
##.SOLVENT NAME= CDCl3
##.SHIFT REFERENCE= (INTERNAL, CDCl3, 0, 15.7039)
##AUDIT TRAIL= $$ (NUMBER, WHEN, WHO, WHERE, WHAT)
$$ ##TITLE= Audit trail, XWIN-NMR		Version 3.5
$$ ##JCAMPDX= 5.01
$$ ##ORIGIN= Bruker BioSpin GmbH
$$ ##OWNER= she
$$ F:/spectra/data/she/nmr/H-F/1/audita.txt
$$ ##AUDIT TRAIL=  $$ (NUMBER, WHEN, WHO, WHERE, WHAT)
(   1,<2021-04-28 11:43:20.21 +0400>,<she>,<DPX200>,
      <created by zg, POWCHK disabled, PULCHK disabled
       configuration hash MD5:
       00 E9 B6 7A A2 85 ED C7 34 08 36 98 17 FE 4E 26
       data hash MD5: 16K
       5F BE BF C2 E9 F7 C9 0B EA DA 37 3D A5 F8 83 92>)
$$ ##END=
$$ 
$$ hash MD5
$$ 77 A5 F1 9A 98 DB A9 00 2A DE 5D 35 10 4F 0A 69
##$RELAX= 
##$RELAX= 
##$RELAX= 
##$RELAX= 
##$RELAX= 
##$RELAX= 
$$ Bruker specific parameters
$$ --------------------------
##$DU= <F:/spectra>
##$EXPNO= 1
##$NAME= <H-F>
##$PROCNO= 1
##$TYPE= <nmr>
##$USER= <she>
##$AMP= (0..31)
100 100 100 100 100 100 100 100 100 100 100 100 100 100 100 100 100 100 
100 100 100 100 100 100 100 100 100 100 100 100 100 100 
##$AQSEQ= 0
##$AQ_mod= 1
##$AUNM= <au_zg>
##$AUTOPOS= <>
##$BF1= 200.13
##$BF2= 200.13
##$BF3= 200.13
##$BF4= 200.13
##$BF5= 200.13
##$BF6= 200.13
##$BF7= 200.13
##$BF8= 200.13
##$BYTORDA= 1
##$CFDGTYP= 0
##$CFRGTYP= 5
##$CHEMSTR= <none>
##$CNST= (0..31)
1 1 145 1 1 1 1 1 1 1 1 1 1 1 1 1 1 1 1 1 1 1 1 1 1 1 1 1 1 1 1 1 
##$CPDPRG= <>
##$CPDPRG1= <>
##$CPDPRG2= <>
##$CPDPRG3= <>
##$CPDPRG4= <mlev>
##$CPDPRG5= <mlev>
##$CPDPRG6= <mlev>
##$CPDPRG7= <mlev>
##$CPDPRG8= <mlev>
##$CPDPRGB= <>
##$CPDPRGT= <>
##$D= (0..31)
0 1.2 0 0 0 0 0 0 0 0.06 0 0.03 0 0 0 0 0.0002 0 0 0 0 0 0 0 0 0 0 0 0 
0 0 0 
##$DATE= 1619595799
##$DBL= (0..7)
120 120 120 120 120 120 120 120 
##$DBP= (0..7)
150 150 150 150 150 150 150 150 
##$DBP07= 0
##$DBPNAM0= <>
##$DBPNAM1= <>
##$DBPNAM2= <>
##$DBPNAM3= <>
##$DBPNAM4= <>
##$DBPNAM5= <>
##$DBPNAM6= <>
##$DBPNAM7= <>
##$DBPOAL= (0..7)
0.5 0.5 0.5 0.5 0.5 0.5 0.5 0.5 
##$DBPOFFS= (0..7)
0 0 0 0 0 0 0 0 
##$DE= 6
##$DECBNUC= <off>
##$DECIM= 32
##$DECNUC= <off>
##$DECSTAT= 4
##$DIGMOD= 1
##$DIGTYP= 9
##$DL= (0..7)
0 120 120 120 120 120 120 120 
##$DP= (0..7)
150 150 150 150 150 150 150 150 
##$DP07= 0
##$DPNAME0= <>
##$DPNAME1= <>
##$DPNAME2= <>
##$DPNAME3= <>
##$DPNAME4= <>
##$DPNAME5= <>
##$DPNAME6= <>
##$DPNAME7= <>
##$DPOAL= (0..7)
0.5 0.5 0.5 0.5 0.5 0.5 0.5 0.5 
##$DPOFFS= (0..7)
0 0 0 0 0 0 0 0 
##$DQDMODE= 0
##$DR= 18
##$DS= 0
##$DSLIST= <SSSSSSSSSSSSSSS>
$$ [...]
##$SUBNAM2= <"">
##$SUBNAM3= <"">
##$SUBNAM4= <"">
##$SUBNAM5= <"">
##$SUBNAM6= <"">
##$SUBNAM7= <"">
##$SUBNAM8= <"">
##$SUBNAM9= <"">
##$SW= 16.9725357007746
##$SWIBOX= (0..15)
0 0 2 0 0 0 0 0 0 0 0 0 0 0 0 0 
##$SW_h= 3396.73913043478
##$TD= 16384
##$TD0= 1
##$TE= 0
##$TE2= 300
##$TE3= 300
##$TEG= 300
##$TL= (0..7)
0 120 120 120 120 120 120 120 
##$TP= (0..7)
150 150 150 150 150 150 150 150 
##$TP07= 0
##$TPNAME0= <>
##$TPNAME1= <>
##$TPNAME2= <>
##$TPNAME3= <>
##$TPNAME4= <>
##$TPNAME5= <>
##$TPNAME6= <>
##$TPNAME7= <>
##$TPOAL= (0..7)
0.5 0.5 0.5 0.5 0.5 0.5 0.5 0.5 
##$TPOFFS= (0..7)
0 0 0 0 0 0 0 0 
##$TUNHIN= 0
##$TUNHOUT= 0
##$TUNXOUT= 0
##$USERA1= <user>
##$USERA2= <user>
##$USERA3= <user>
##$USERA4= <user>
##$USERA5= <user>
##$V9= 5
##$VALIST= <valist>
##$VCLIST= <CCCCCCCCCCCCCCC>
##$VD= 0
##$VDLIST= <DDDDDDDDDDDDDDD>
##$VPLIST= <PPPPPPPPPPPPPPP>
##$VTLIST= <TTTTTTTTTTTTTTT>
##$WBST= 1024
##$WBSW= 4
##$XGAIN= (0..3)
0 0 0 0 
##$XL= 0
##$YL= 0
##$YMAX_a= 417067
##$YMIN_a= -509693
##$ZGOPTNS= <>
##$ZL1= 120
##$ZL2= 120
##$ZL3= 120
##$ZL4= 120
##$ABSF1= 10
##$ABSF2= 0
##$ABSG= 5
##$ABSL= 3
##$ALPHA= 0
##$AQORDER= 0
##$ASSFAC= 0
##$ASSFACI= 0
##$ASSFACX= 0
##$ASSWID= 0
##$AUNMP= <proc_1d>
##$AZFE= 0.1
##$AZFW= 0.1
##$BCFW= 1
##$BC_mod= 2
##$BYTORDP= 1
##$COROFFS= 0
##$CY= 11.3945322036743
##$DATMOD= 1
##$DC= 2
##$DFILT= <>
##$DTYPP= 0
##$F1P= 15.9154993809931
##$F2P= -4.1035820241983
##$FCOR= 0.5
##$FTSIZE= 0
##$FT_mod= 4
##$GAMMA= 1
##$GB= 0.15
##$INTBC= 1
##$INTSCL= 1
##$ISEN= 128
##$LB= 0.24
##$LEV0= 0
##$LPBIN= 0
##$MAXI= 10000
##$MC2= 0
##$MEAN= 0
##$ME_mod= 0
##$MI= 1.114404
##$NCOEF= 0
##$NC_proc= 0
##$NLEV= 6
##$NOISF1= 3.799351
##$NOISF2= 2.8
##$NSP= 1
##$NTH_PI= 0
##$NZP= 0
##$OFFSET= 15.70392
##$PC= 1
##$PHC0= -11131.94
##$PHC1= 25.80102
##$PH_mod= 1
##$PKNL= yes
##$PPARMOD= 0
##$PSCAL= 0
##$PSIGN= 0
##$REVERSE= no
##$SF= 200.130013532006
##$SI= 16384
##$SIGF1= 3
##$SIGF2= 2
##$SINO= 400
##$SIOLD= 16384
##$SREGLST= <1H.CDCl3>
##$SSB= 0
##$STSI= 0
##$STSR= 0
##$SW_p= 3612.71676300578
##$SYMM= 0
##$S_DEV= 0
##$TDeff= 0
##$TDoff= 0
##$TI= <>
##$TILT= no
##$TM1= 0
##$TM2= 0
##$TOPLEV= 0
##$USERP1= <user>
##$USERP2= <user>
##$USERP3= <user>
##$USERP4= <user>
##$USERP5= <user>
##$WDW= 1
##$XDIM= 8192
##$YMAX_p= 0
##$YMIN_p= 0
$$ End of Bruker specific parameters
$$ ---------------------------------
##NTUPLES= NMR FID
##VAR_NAME=  TIME,          FID/REAL,        FID/IMAG
##SYMBOL=    X,             R,               I
##VAR_TYPE=  INDEPENDENT,   DEPENDENT,       DEPENDENT
##VAR_FORM=  AFFN,          ASDF,            ASDF
##VAR_DIM=   8192,          8192,            8192
##UNITS=     SECONDS,       ARBITRARY UNITS, ARBITRARY UNITS
##FACTOR=    0.0002944,     1,               1
##FIRST=     0,             0,               0
##LAST=      2.4114304,     0,               0
##MIN=       0,             -509693,         0
##MAX=       2.4114304,     417067,          0
$$ Real data points
##PAGE= N=1
##DATA TABLE= (X++(R..R)), XYDATA
$$ plain form
0 0 0 0 0 0 0 0 0 8 -8 8 -8 8 -16 16 -24 32 -32 40 -48 64 -74 88 -104 124 -144 168 -193 224 -260 295 -335
31 -335 381 -433 489 -551 619 -695 775 -865 962 -1070 1186 -1314 1455 -1607 1774 -1954
47 -1954 2154 -2371 2613 -2878 3169 -3495 3859 -4267 4733 -5265 5879 -6597 7455 -8494
61 -8494 9786 -11436 13624 -16661 21162 -28473 42221 -76336 317978 324583 -509693 342174
73 342174 -45983 -316190 417067 -161081 -162898 377110 -250240 41744 172276 -313732
83 -313732 244223 76332 -291357 298042 -108911 -162637 347588 -232550 -32782 308760
93 308760 -344576 90422 223045 -344961 202957 113673 -294291 241015 -34889 -182579
103 -182579 246428 -159191 -40881 222127 -235366 63485 114895 -238437 199769 5906
$$ packed form
0@%%%%%%%Qj6J6j6J6k4L2m0N6o4P2q8J12j38J62j92K28k68L12l61M17m84N55o30
31c35P16q14R22j040J170j314J470j640J827k032K256k500K769l062L381l728
47a954M108m525M984n491O047o664P354q126R000r998J1144j2476J4052j5949
61h494J8280k1222K5060l0285L7823m9635P0694j18557L94314O605q34276Q51867
73C42174l88157k70207P33257n78148j817N40008o27350K91984J30532m86008
83c13732N57955j67891l67689N89399m06953n3726N10225n80138J99768L41542
93C08760o53336M34998J32623n68006N47918q9284m07964N35306k75904j47690
103a82579M29007m05619J18310K63008m57493K98851N1410l53332M38206j93863
$$ plain form
113 5906 -252955 246651 -61342 -145529 222918 -193403 -10811 232302 -265757 43253
123 43253 145269 -229965 168578 15703 -230884 238762 -55301 -153229 213964 -151778
133 -151778 -26337 196286 -212131 56793 125727 -205720 142467 23806 -171835 191076
143 191076 -65997 -90564 196377 -152974 1636 172471 -207987 89157 112840 -216484
153 -216484 169591 32006 -195398 213328 -39446 -141301 202692 -98013 -42984 161318
163 161318 -154199 45149 107674 -151406 101026 3638 -109948 169046 -88132 -74815
173 -74815 183358 -140810 2447 141173 -197552 85185 107137 -203455 123931 36115
183 36115 -160421 153476 -46114 -101951 152797 -100266 -21091 110961 -138452 55160
$$ packed form
113E906k58861M99606l07993q4187L68447m16321J82592K43113m98059L09010
123D3253J02016l75234L98543j52875k46587M69646k94063r7928L67193l65742
133a51778J25441K22623m08417K68924O8934l31447L48187j18661j95641L62911
143A91076k57073k4567K86941l49351J54610J70835l80458K97144K3683l29324
153b16484L86075j37585k27404M08726k52774j01855L43993l00705N5029K04302
163A61318l15517J99348O2525k59080K52432r7388j13586K78994k57178J3317
173g4815K58173l24168J43257J38726l38725K82737K1952l10592L27386q7816
183C6115j96536L13897j99590n5837K54748k53063P9175J32052k49413J93612
$$ plain form
193 55160 54492 -140017 116347 -17998 -115959 153399 -81057 -68498 150071 -125207 -793
204 -793 117794 -155219 59441 72916 -148227 103595 8707 -108558 128909 -60954 -56529
215 -56529 132610 -102131 832 99266 -120839 66727 45226 -124841 114367 -3696
225 -3696 -91218 125679 -63160 -34015 124015 -110460 20771 97111 -127374 76178 43290
236 43290 -123225 119429 -10910 -95841 136166 -60512 -52991 126905 -94425 818 90487
247 90487 -108034 52143 40441 -97268 84016 -16707 -61962 100755 -72725 -16203 95306
258 95306 -112250 34770 70005 -129663 76002 31978 -121785 103266 -13957 -94944 114077
269 114077 -50262 -53151 92911 -75936 3308 56650 -89658 49920 15897 -78729 81499
$$ packed form
193E5160o68j94509K56364j34345r7961K69358k34456J2559K18569k75278J24414
204g93J18587k73013K14660J3475k21143K51822r4888j17265K37467j89863M425
215e6529J89139k34741J02963R8434k20105J87566k1501j70067K39208j18063
225c696q7522K16897j88839K9145J58030k34475J31231P6340k24485K03552l2888
236D3290j66515K42654j30339q4931K32007j96678P521J79896k21330R5243Q9669
247I0487j98521J60177j1702j37709J81284j00723m5255J62717j73480N6522J11509
258I5306k07556J47020L5235j99668K05665m4024j53763K25051j17223q0987K09021
269A14077j64339k889J46062j68847P9244N3342j46308J39578l4023r4626J60228
$$ plain form
280 81499 -37041 -48605 102276 -82907 -14674 99117 -104021 24305 70374 -111550 65276
291 65276 35444 -101747 84894 -4220 -63908 88205 -46772 -20957 80516 -71202 20339
302 20339 48878 -79036 65800 11190 -74868 89120 -24051 -46202 91910 -63595 -9794
313 -9794 88035 -83531 22963 55692 -84480 62185 13930 -78868 84012 -17856 -50687
324 -50687 82089 -56316 -10317 75608 -81367 19900 48673 -77536 51645 5678 -67995
335 -67995 74492 -26843 -43932 70723 -58677 -243 58422 -84660 33560 37505 -84077
346 -84077 59438 -863 -73082 83175 -29950 -54065 79313 -49480 -16260 60322 -67825
357 -67825 16223 39921 -62981 39085 611 -44386 63606 -35877 -25355 66597 -57407
$$ packed form
280H1499j18540j1564J50881j85183O8233J13791k03138J28326M6069j81924J76826
291F5276k9832j37191J86641q9114n9688J52113j34977K5815J01473j51718R1541
302B0339K8539j27914J44836n4610q6058J63988j13171k2151J38112j55505N3801
313i794R7829j71566J06494L2729j40172J46665m8255r2798J62880j01868l2831
324e0687J32776j38405M5999Q5925j56975J01267K8773j26209J29181m5967p3673
335f7995J42487j01335j7089J14655j29400N8434N8665j43082J18220L945j21582
346h4077J43515o0301p2219J56257j13125k4115J33378j28793L3220P6582j28147
357f7825Q4048K3698j02902J02066l8474m4997J07992r9483J0522R1952j24004
$$ plain form
368 -57407 8985 54531 -79204 39800 42063 -81803 55844 13601 -62973 71029 -16494
379 -16494 -43219 69232 -32211 -10670 47226 -49681 28550 26278 -55982 50046 -2473 -39499
391 -39499 66364 -37610 -23338 73911 -56082 -1374 57330 -65978 29820 34279 -69768
402 -69768 46556 10103 -51790 54042 -22585 -27651 57008 -44842 -3185 39727 -55010 28262
414 28262 17606 -59607 46774 -3243 -45171 53812 -32916 -22901 57398 -50636 -2192 40722
426 40722 -55163 27542 16727 -59237 47955 -2322 -45678 52785 -28404 -20417 54799 -47713
438 -47713 -1913 43997 -49098 21158 19135 -46862 42718 -2538 -34889 46826 -24458 -9592
450 -9592 45239 -45439 12456 38248 -51904 32509 17049 -50271 51629 -1727 -42973 54182
$$ packed form
368e7407O6392M5546j33735J19004K263j23866J37647m2243p6574J34002q7523
379a6494k6725J12451j01443K1541N7896r6907P8231k272q2260J06028n2519l7026
391c9499J05863j03974J4272R7249j29993N4708N8704j23308R5798M459j04047
402f9768J16324l6453o1893J05832p6627n066Q4659j01850M1657M2912r4737Q3272
414B8262j0656p7213J06381n0017m1928R8983q6728J0015Q0299j08034M8444M2914
426D0722r5885Q2705j0815p5964J07192n0277m3356R8463q1189P987P5216j02512
438d7713M5800M5910r3095P0256k023o5997Q9580m5256l2351Q1715p1284J4866
450i592N4831r0678N7895K5792r0152Q4413j5460o7320J01900n3356m1246R7155
$$ plain form
462 54182 -16212 -21591 47735 -33145 -970 36778 -35744 16987 11517 -30092 37529 -12139
474 -12139 -24949 44710 -28758 -7274 41748 -47769 11411 37016 -53590 22540 19894 -46707
486 -46707 35313 -677 -38621 39429 -14703 -19257 31083 -30336 4540 20746 -38531 21218
498 21218 5204 -35116 35800 -14619 -27698 44226 -28950 -14315 39077 -37572 5006 28330
510 28330 -42673 20032 14369 -36924 30697 -5588 -23793 37390 -21758 -8993 33132 -30949
522 -30949 10067 23018 -36834 25292 10662 -31531 33214 -7169 -18981 37792 -21139 -6806
534 -6806 32744 -28215 10814 20149 -33710 26698 8163 -30679 33050 -6849 -19183 36451
546 36451 -20878 -8059 32840 -27944 4931 20441 -28418 17859 4703 -23683 25947 -10388
$$ packed form
462E4182p0394n379O9326q0880L2175L7748p2522N2731n470m1609O7621m9668
474a2139j2810O9659p3468K1484M9022q9517N9180K5605r0606P6130k646o6601
486d6707Q2020l5990l7944P8050n4132m554N0340o1419L4876J6206n9277N9749
498B1218j6014m0320P0916n0419j3079P1924p3176J4635N3392p6649M2578K3324
510B8330p1003O2705n663n1293O7621l6285j8205O1183n9148J2765M2125o4081
522c0949M1016J2951n9852O2126j4630m2193O4745m0383j1812N6773n8931J4333
534f806L9550o0959L9029R335n3859O0408j8535l8842O3729l9899j2334N5634
546C6451n7329J2819M0899o0784L2875J5510m8859M6277j3156k8386M9630l6335
$$ plain form
558 -10388 -14467 27974 -23909 -746 24532 -34755 12650 17839 -37724 21473 6722 -33122
570 -33122 28043 -5734 -24633 28187 -15408 -10680 21050 -21712 4496 9954 -23146 17444
582 17444 -3470 -19754 27096 -16526 -11306 29443 -26645 -149 26720 -31682 9145 18983
594 18983 -30231 18083 7367 -23559 22578 -4744 -11657 22245 -14849 1040 18109 -20783
606 -20783 13735 8856 -22692 24556 -289 -19153 27874 -10402 -9740 27843 -18750 -1169 23182
619 23182 -21587 9013 12464 -21559 17558 2277 -16418 20516 -9240 -8026 21841 -18692
631 -18692 310 17074 -22263 10343 7938 -23022 17222 -423 -18087 19313 -10881 -8736
643 -8736 19165 -19952 952 14396 -23291 10483 5961 -23031 18422 -2231 -20283 21942
$$ packed form
558a0388m079M2441n1883K3163K5278n9287M7405N189n5563N9197j4751l9844
570c3122O1165l3777j8899N2820m3595M728L1730m2762K6208N458l3100M0590
582A7444k0914j6284M6850m3622N220M0749n6088K6496K6869n8402M0827R838
594A8983m9214M8314j0716l0926M6137k7322o913L3902l7094J5889J7069l8892
606b0783L4518m879l1548M7248k4845j8864M7027l8276O62L7583m6593J7581K4351
619B3182m4769L0600L451l4023L9117j5281j8695L6934k9756J214K9867m0533
631a8692J9002J6764l9337L2606k405l0960M0244j7645j7664L7400l0194K145
643h736K7901l9117K0904J3444l7687L3774m522k8992M1453k0653j8052M2225
$$ plain form
655 21942 -9685 -12469 19801 -15844 -2671 15303 -17998 4926 6852 -15076 13324 -4312
667 -4312 -11052 18998 -12153 -3394 18139 -19634 6016 16968 -23646 11427 11879 -21105 16866
680 16866 3329 -16848 18594 -1650 -8527 14689 -8393 2264 10667 -12536 10513 2453 -11876
693 -11876 18246 -6676 -10126 22219 -12464 -5487 21031 -17666 1869 16936 -19903 7001
705 7001 9856 -16129 10067 484 -10926 12887 -7499 -5004 11223 -12637 3860 5993 -17060
718 -17060 11079 1826 -16958 14111 -4736 -12581 17296 -11503 -8332 15670 -13443 -1029 9764
731 9764 -15552 6032 5531 -14373 9848 -2006 -9149 13615 -9220 -5061 13727 -11218 1261
744 1261 9402 -13769 8538 5562 -13500 11451 -279 -7465 13432 -7671 -2061 14100 -11432
$$ packed form
655B1942l1627k784L2270l5645J3173J7974l3301K2924J926k1928K8400j7636
667d312o740L0050l1151Q759K1533l7773K5650J0952m0614L5073M52l2984L7971
680A6866j3537k0177L5442k0244o877K3216k3082J0657Q403k3203K3049q060j4329
693a1876L0122k4922l450L2345l4683O977K6518l8697J9535J5067l6839K6904
705G001K855k5985K6196r583j1410K3813k0386K495J6227k3860J6497K133k3053
718a7060K8139r253j8784L1069j8847p845K9877k8799L171K4002k9113J2414J0793
731I764k5316K1584n01j9904K4221j1854p143K2764k2835M159J8788k4945J2479
744A261Q141k3171K2307k976j9062K4951j1730p186K0897k1103N610J6161k5532
$$ plain form
757 -11432 3230 10596 -13506 10440 5665 -14070 14482 1854 -10809 13960 -3159 -5166 12798
770 12798 -6904 10 8200 -7471 6154 1094 -7250 10989 -4726 -5385 13087 -10295 -1645
783 -1645 14141 -14958 954 11768 -14906 4379 6907 -14023 6838 3049 -10962 6059 -2257
796 -2257 -4117 4731 -7330 1360 2576 -9242 6516 -2043 -9979 11815 -5860 -9367 13520 -8709
810 -8709 -5769 12576 -10923 -1821 10553 -10996 1446 6093 -8828 5317 708 -5476 7002
823 7002 -3434 -1159 6683 -7153 3830 6097 -9060 7613 3037 -8530 10189 -362 -6635
836 -6635 11479 -3286 -3554 10513 -6183 708 8213 -7282 4460 4372 -6810 7066 145 -5602
850 -5602 8649 -3282 -3194 8110 -5838 135 5751 -6802 2971 2314 -5893 5422 -2137 -4543
$$ packed form
757a1432J4662P366k4102K3946m775j9735K8552j2628j2663K4769j7119k007J7964
770A2798j9702O914Q190j5671J3625n060q344J8239j5715o59J8472k3382Q650
783a645J5786k9099J5912J0814k6674J9285K528k0930K0861l789j4011J7021q316
796b257j860Q848j2061Q690J216j1818J5758q559p936K1794j7675l507K2887k2229
810h709K940J8345k3499R102J2374k1549J2442M647j4921J4145m609o184J2478
823G002j0436K275P842j3836J0983K267j5157J6673m576j1567J8719j0551o273
836f635J8114j4765k68J4067j6696O891P505j5495J1742q8j1182J3876o921n747
850e602J4251j1931Q8J1304j3948N973N616j2553R773o57q207J1315p559k406
$$ plain form
864 -4543 7136 -6264 -1944 7215 -8960 743 5871 -10507 2834 4272 -10495 4120 1704
877 1704 -8486 4499 -661 -4955 3152 -2640 -1181 1102 -3798 3117 -1760 -4276 6741 -4696
891 -4696 -3898 9144 -6751 -2939 9902 -7564 -1183 9526 -7833 304 7365 -6211 1897 3788
905 3788 -3226 2744 703 -505 2838 -2011 3307 1857 -4494 6816 462 -5362 8619 -1481
919 -1481 -4969 9600 -3179 -3811 8939 -4550 -1533 7016 -4839 469 4311 -3973 1905 933
933 933 -2556 3480 -2621 -690 3441 -4802 1508 2144 -6326 3170 891 -6623 4405 -1144 -5608
948 -5608 5061 -3547 -3424 4722 -4964 -1387 3220 -5868 1240 1965 -5642 2618 -156 -4237 3354
963 3354 -1716 -2486 3445 -2543 -622 1769 -2740 2494 -275 -2394 4285 -2272 -1215 5589 -4149
$$ packed form
864d543J1679j3400M320R159j6175R703N128j6378J3341J438j4767J4615k416
877A704j0190J2985n160m294Q107n792J459K283m900O915m877k516J1017j1437
891d696P98J3042j5895L812J2841j7466O381J0709j7359Q137P061j3576Q108J891
905C788p014N970k041j208L343m849N318j450o351J1310o354n824J3981j0100
919a481l488J4569j2779o32J2750j3489L017Q549j1855N308L842q284N878r72
933I33l489O036o101J931M131q243O310O36q470R496k279p514J1028n549m464
948e608J0669q608J23Q146r686L577M607r088P108P25p607Q260k774m081P591
963C354n070p70N931n988J921K391m509N234k769k119O679o557J057O804r738
$$ plain form
978 -4149 -64 6660 -5326 758 6593 -5543 1690 5633 -4384 1960 4201 -3081 1869 2505 -1010
993 -1010 1357 405 1704 -4 -1019 3610 -1225 -1897 5569 -1935 -2939 6621 -3172 -2920 6662 -3897
1009 -3897 -2152 5773 -3649 -1850 4190 -3683 -976 1836 -2407 -154 -379 -702 177 -2635 1076 78
1025 78 -3907 2532 -519 -5608 3983 -1074 -5357 4236 -2063 -4192 4679 -2808 -3199 4516 -2913 -1234
1041 -1234 2391 -3128 587 1054 -2280 1934 -258 -1352 2718 -2103 415 2953 -2845 2261 2018
1056 2018 -3167 3254 896 -2779 4691 -612 -2095 5254 -2141 -381 5229 -3424 919 4747 -3751
1071 -3751 1816 3473 -3841 2918 2150 -2809 2501 772 -1056 1427 -1206 1202 698 -2143 2885
1086 2885 -1435 -2734 4694 -2883 -2660 5256 -4045 -2624 5244 -4495 -1877 4621 -4350 -711 2743
$$ packed form
978d149M085O724j1986O084N835j2136P233L943j0017O344K241p282M950O36l515
993a010K367r52J299j708j015M629m835o72P466p504j004R560r793K52R582j0559
1009c897J745P925r422J799O040p873K707K812m243K253k25l23Q79k812L711r98
1025G8l985O439l051n089R591n057m283R593o299k129Q871p487l91P715p429J679
1041a234L625n519L715M67l334M214k192j094M070m821K518K538n798N106k43
1056B018n185O421k358l675P470n303j483P349p395J760N610q653M343L828q498
1071c751N567J657p314O759p68m959N310j729j828K483k633K408n04k841N028
1086B885m320j299P428p577K23P916r301J421P868r739K618O498q971L639L454
$$ plain form
1101 2743 -3622 -358 738 -2018 -97 -1161 -291 366 -3219 1864 13 -4130 3700 -970 -4605
1116 -4605 4824 -1320 -4454 5783 -2130 -3656 5185 -2228 -1804 4091 -2407 -439 3283 -1693 692
1131 692 855 -764 2434 -939 611 2733 -2219 2027 2274 -3608 3620 1994 -3945 4756 540 -3466
1147 -3466 4988 -802 -2350 4633 -2019 -1310 4020 -2723 328 2509 -2986 1860 1037 -3018 2022
1162 2022 -418 -1857 2300 -2152 -812 2189 -3070 640 457 -3710 2696 -911 -3864 3787 -2514
1177 -2514 -3135 4504 -3964 -1902 4427 -4581 -939 3610 -4368 298 2000 -3549 1031 347 -1888
1192 -1888 1396 -1600 335 1030 -3060 2374 621 -3950 4241 5 -3809 5653 -1044 -3613 5880
1207 5880 -1587 -2284 5308 -2005 -1268 4303 -1953 335 2380 -937 1881 159 -209 2195 -1545 1482
$$ packed form
1101B743o365L264J096k756J921j064Q70O57l585N083j851m143P830m670l635
1116d605R429o144l134J0237p913j526Q841p413M24N895o498J968L722m976K385
1131F92J63j619L198l373J550K122m952M246K47n882P228j626n939Q701m216m006
1147c466Q454n790j548O983o652P09N330o743L051K181n495M846q23m055N040
1162B022k440j439M157m452J340L001n259L710j83m167O406l607k953P651o301
1177b514o21P639q468K062O329r008L642M549p978M666J702n549M580o84k235
1192a888L284k996J935O95m090N434j753m571Q191m236l814R462o697k569R493
1207E880p467o97P592p313P37N571o256K288K045l317K818j722l68K404l740L027
$$ plain form
1223 1482 2294 -3196 2833 1907 -4388 3775 880 -4150 4628 -99 -3628 4709 -1392 -2733 4068
1238 4068 -2210 -1049 2572 -3097 518 853 -2768 1976 -761 -2047 2546 -2928 -1154 2514 -3885
1253 -3885 668 1611 -4703 1777 760 -4427 2917 -942 -3335 3866 -2469 -2143 3440 -3184 -415
1268 -415 2986 -3756 1036 2028 -3617 1869 702 -2251 2475 -827 -610 2393 -2008 1100 1625 -2663
1284 -2663 3187 359 -3277 4596 -590 -2996 5380 -1485 -2118 5181 -2162 -912 4071 -2238 568
1299 568 2523 -1802 1140 708 -786 1725 -1058 776 2243 -3009 1970 1609 -4036 3365 636 -4445
1315 -4445 3829 -114 -4085 4253 -1366 -2657 3586 -2383 -1873 2212 -2667 -390 868 -2613 1436
1330 1436 -806 -1733 1960 -2725 -411 2410 -3952 681 1823 -4489 2008 1052 -4156 3317 31
$$ packed form
1223A482Q12n490O029r26o295Q163k895n030Q778m727l529Q337o101j341O801
1238D068o278J161L621n669L615L35l621M744k737j286M593n474J774L668o399
1253c885M553R43o314O480j017n187P344l859k393P201o335L26N583o624K769
1268d15L401o742M792R92n645N486j167k953M726l302K17L003m401L108N25m288
1284b663N850k828l636P873n186k406Q376o865o33P299p343J250M983o309K806
1299E68J955m325K942m32j494K511k783J834J467n252M979l61n645P401k729n081
1315d445Q274l943l971Q338n619j291O243n969N10M085m879K277J258l481M049
1330A436k242r27L693m685K314K821o362M633J142o312O497r56n208P473l286
$$ plain form
1345 31 -3306 3201 -1423 -1902 3248 -2134 -279 2728 -2638 1329 1231 -2449 2730 -65 -2000 3128
1361 3128 -1150 -456 3303 -2328 988 2652 -2764 2311 1032 -2573 3628 -403 -2444 4239 -1379
1376 -1379 -1281 4012 -2951 164 3770 -3123 855 2123 -2436 1517 428 -1884 2538 -1321 -573 1706
1392 1706 -2727 1243 955 -3828 2703 207 -4172 3530 -1220 -3513 4277 -1956 -2804 3547 -2498
1407 -2498 -1209 2519 -2704 355 1002 -2431 1317 -872 -1144 2125 -2561 -74 2363 -3466 1459
1422 1459 1780 -4339 2963 1221 -4048 3514 107 -2868 3857 -1086 -1576 3708 -1631 -87 2291
1437 2291 -2070 1879 703 -1947 2778 -747 -1145 3506 -2084 109 3612 -3277 1071 2867 -3464
1452 -3464 2329 1483 -3052 3197 162 -2509 3316 -1527 -680 3012 -2882 461 2024 -3165 1630
$$ packed form
1345C1l337O507m624m79N150n382J855L007n366L967r8l680N179k795j935N128
1361C128m278O94L759n631L316J664n416N075j279l605O201m031k041O683n618
1376a379R8N293o963L115L606o893L978J268m559L953j089k312M422l859P48K279
1392A706m433L970k88m783O531k496m379P702m750k293P790o233q48O351o045
1407b498J289L728n223L059O47l433L748k189k72L269m686K487K437n829M925
1422A459L21o119P302j742n269P562l407k975O725m943m90N284n339J544K378
1437B291m361L949j176k650M725l525l98M651n590K193L503o889M348J796o331
1452c464N793q46m535O249l035k671N825m843Q47L692n894L343J563n189M795
$$ plain form
1467 1630 505 -3112 2832 -704 -2370 2692 -1963 -571 2302 -3296 774 1389 -3542 2154 -8
1482 -8 -3571 3405 -1524 -2651 3554 -2693 -1404 3251 -3393 -136 2480 -3196 1077 905 -2572 2113
1498 2113 -706 -1300 2461 -1955 43 2386 -3265 1851 1814 -3746 3297 582 -3436 3963 -397 -2755
1514 -2755 4313 -1134 -1432 3340 -2025 245 2317 -2030 1926 468 -1620 2715 -928 -649 3417
1529 3417 -2318 331 2999 -3577 1722 2094 -3889 2318 1268 -3672 3069 -48 -2345 3161 -1570
1544 -1570 -1148 2193 -2188 716 1290 -2892 1712 -86 -2847 2830 -1573 -1902 3086 -2685 -745 2654
1560 2654 -3330 455 1750 -3385 1769 642 -3065 2539 -879 -2052 2854 -2196 -855 2675 -2831
1575 -2831 734 2013 -3268 2054 931 -2765 2577 -414 -1574 2803 -1405 -143 2403 -2537 1441
$$ packed form
1467A630j125l617N944l536j666N062m655J392K873n598M070O15m931N696k162
1482hl563O976m929j127O205o247J289M655o644L257K616n676M273j72l477M685
1498B113k819n94L761m416J998K343n651N116l7n560P043k715m018P399m360k358
1514b755P068n447k98M772n365K270K072m347L956j458k088M335l643K79M066
1529C417n735K649K668o576N299L72n983O207j050m940O741l117k297N506m731
1544a570M22L341m381K904N74m182M604j798k761N677m403l29M988n771J940L399
1560B654n984L785J295n135N154j127l707N604l418j173M906n050J341L530n506
1575b831L565J279n281N322j123l696N342k991j160M377m208J262K546m940L978
$$ plain form
1590 1441 1477 -2637 2685 426 -2401 3497 -513 -1758 3727 -1666 -827 3256 -2281 391 2170 -2430
1606 -2430 1401 696 -1658 2221 -776 -893 2379 -2289 290 2273 -3162 1429 1775 -3751 2133 548
1622 548 -3143 2904 -589 -2441 2601 -1447 -1340 1981 -2082 154 937 -2309 1385 -327 -2085 2306
1638 2306 -1836 -1178 2741 -2797 -365 2350 -3282 1045 1588 -3340 1864 1081 -2523 2061 -164 -1641
1654 -1641 2136 -1546 -431 1937 -1759 1226 954 -2062 2341 116 -2050 2669 -812 -910 2998 -1948
1670 -1948 -252 2448 -2103 637 1482 -2283 1945 500 -1949 2317 -524 -1075 2452 -1930 -29
1685 -29 2271 -2350 832 1405 -2334 1672 128 -1941 2120 -842 -977 2058 -1957 17 1598 -2434
1701 -2434 724 692 -2410 2010 -270 -2609 2633 -904 -1913 2049 -1519 -686 1837 -2133 284 706
$$ packed form
1590A441L6m114N322k259k827N898m010j245N485n393Q39M083n537K672J779m600
1606b430L831p05k354L879k997j17L272m668K579J983n435M591L46n526N884j585
1622E48l691O047l493j852N042m048J07L321m063K236P83l246L694j712j758M391
1638B306m142O58L919n538K432K715n632M327N43m928N204p83l604M584k225j477
1654a641L777l682J115K368l696K985k72l016M403k225k166M719l481r8L908m946
1670a948J696K700m551K740Q45l765M228j445k449M266k841n51L527m382J901
1685b9K300m621L182N73l739M006j544k069M061k962j35L035m015J974J581m032
1701b434L158l2l102M420k280k339N242l537j009L962l568Q33K523l970K417M22
$$ plain form
1717 706 -1562 1105 -602 -1373 1768 -1331 -808 2129 -2193 479 1720 -2750 1333 1412 -2632 1950
1733 1950 253 -2264 2344 -383 -1275 2041 -839 112 1407 -1465 1026 667 -1369 1816 -163 -897
1749 -897 2546 -1366 -602 2433 -1736 262 2030 -2318 1043 1395 -2237 1406 294 -1448 1724 -682
1765 -682 -740 1762 -1422 228 1083 -1942 1237 418 -2330 1894 -560 -1604 1968 -1255 -930 1853
1781 1853 -1657 -277 1411 -2194 752 425 -2145 1552 -312 -1355 1715 -1251 -766 1856 -1834
1796 -1834 7 1266 -1838 960 545 -1685 1337 -276 -914 1767 -1361 -38 1993 -1892 548
1811 548 1307 -1946 1695 659 -1854 1969 262 -1617 1943 -731 -602 1773 -1111 221 1342 -1269
1827 -1269 1021 361 -1146 1760 -663 -771 2108 -1432 -248 1840 -1935 640 1479 -2345 831 778
$$ packed form
1717G06k268K667j707p71L141l099N23K937m322K672J241m470M083P9m044M582
1733A950j697k517M608k727q92L316k880R51J295k872K491l59k036L185j979p34
1749h97L443l912P64L035m169J998J768m348L361L52l632L643j112j742L172k406
1765f82n8K502l184J650Q55l025L179q19k748M224k454j044L572l223L25K783
1781A853l510J380J688l605K946l27k570L697j864j043L070k966M85K622l690
1796a834J841J259l104K798m15k230L022j613o38K681l128J323K031l885K440
1811E48P59l253L641j036k513L823j707j879L560k674J29K375k884J332J121k611
1827a269K290o60j507K906k423j08K879l540J184K088l775K575Q39l824L176n3
$$ plain form
1843 778 -2006 1479 134 -1678 1271 -689 -478 1074 -1258 270 718 -1517 1157 -48 -1569 1633
1859 1633 -1003 -1232 1995 -1471 -819 1659 -1808 -29 1329 -2019 753 443 -1658 1055 -247 -890
1875 -890 1557 -882 -464 1132 -1623 559 980 -1567 1045 563 -1289 1424 -381 -977 1890 -916
1891 -916 -219 1492 -1352 401 1111 -1616 1062 558 -1424 1521 27 -963 1797 -841 -375 1395
1907 1395 -1297 328 978 -1237 713 153 -1092 1280 -498 -854 1378 -1013 -138 1611 -1684 444
1923 444 961 -1941 947 488 -1703 1464 -104 -1233 1306 -575 -610 950 -1295 -167 588 -1263
1939 -1263 840 -171 -1044 1439 -697 -720 1650 -1307 -178 1456 -1627 297 1050 -1595 500 763
1955 763 -1407 1021 5 -856 1063 -588 -177 813 -921 648 377 -1189 1047 220 -800 1445
$$ packed form
1843G78k784L485j345j812K949j960K11J552k332J528M48k235K674j205j521L202
1859A633k636k29L227l466O52K478l467J779J358l348K772l10k101K713j302o43
1875h90K447k439M18J596k755K182M21k547K612m82j852K713j805n96K867k806
1891i16O97J711k844J753P10k727K678n04j982K945j494r90K760k638M66J770
1907A395k692J625O50k215J950n60j245K372j778l56K232k391Q75J749l295K128
1923D44N17k902K888m59k191L167j568j129K539j881l5J560k245J128P55j851
1939a263K103j011q73K483k136k3K370k957J129J634l083J924P53k645K095K63
1955G63k170K428j016q61J919j651M11R90j734J569k71j566K236q27j020K245
$$ plain form
1971 1445 -465 -579 1797 -953 -357 1332 -1135 134 1165 -1150 798 640 -819 1024 -117 -659
1987 -659 1149 -601 -105 894 -838 318 505 -1290 676 116 -1147 1079 -499 -732 1063 -1025
2003 -1025 -247 1009 -991 240 635 -1296 675 322 -1097 824 -256 -854 1113 -660 -501 889
2019 889 -830 8 295 -1040 542 52 -910 987 -523 -467 992 -917 124 1238 -1113 266 906
2036 906 -1188 637 606 -1086 1077 182 -596 780 -250 -199 570 -802 337 374 -816 822 -36 -658
2054 -658 1080 -427 -485 1200 -878 -106 926 -1038 -73 837 -787 374 456 -645 464 67 -503
2071 -503 343 -556 -124 588 -813 212 392 -1046 623 10 -1080 874 -194 -569 978 -680 -412
2088 -412 807 -705 103 602 -748 337 137 -716 696 -218 -714 644 -681 -222 653 -578 333
$$ packed form
1971A445j910j14K376k750N96J689k467J269J031k315J948j58j459J843j141n42
1987f59J808j750M96R99j732J156J87j795J966n60j263K226j578k33J795k088
2003a025P78J256k000J231L95j931J971l53j419J921j080n98J967j773J59J390
2019H89j719Q38K87j335J582m90r62J897j510N6J459j909J041J114k351J379O40
2036I06k094J825l1j692K163q95p78J376j030N1P69j372J139L7j190J638q58o22
2054f58J738j507n8J685k078P72J032j964R65R10j624J161Q2j101J109l97n70
2071e03Q46q99M32P12j401J025J80j438J669o13j090J954j068l75J547j658K68
2088d12J219j512Q08M99j350J085k00q53J412r14m96J358j325M59Q75j231R11
$$ plain form
2105 333 445 -880 448 75 -732 869 -183 -454 817 -437 -17 721 -691 308 758 -858 262
2122 262 194 -573 543 -30 -377 545 -13 -122 489 -388 -7 364 -661 512 1 -575 996 -395 -365
2141 -365 1033 -730 -299 847 -656 57 896 -817 239 301 -790 284 -195 -308 437 -252 -166 468
2159 468 -743 244 164 -805 618 -111 -695 537 -213 -666 763 -479 -367 759 -635 -142 405 -477
2177 -477 113 195 -357 408 -152 -195 581 -381 56 500 -586 316 128 -656 396 149 -590 655 76 -296
2197 -296 587 -398 -61 728 -515 112 292 -437 405 306 -439 415 -23 -225 626 -368 -21 646 -435 -87
2217 -87 551 -461 415 -51 -572 542 -161 -378 552 -254 -214 563 -590 -132 510 -636 91 256 -715
2236 -715 246 197 -353 492 -259 -141 321 -266 -43 163 -496 302 16 -622 537 -186 -379 744 -160 -348
$$ packed form
2105C33J12j325J328l73q07J601j052k71J271j254M20P38j412R99M50j616J120
2122B62o8p67J116n73l47R22n58j09O11q77L81L71j025J173n11n76J571j391L0
2141c65J398j763M31J146j503P13Q39j713J056O2j091J074m79j13P45o89Q6O34
2159D68j211R87q0r69J423p29n84J232p50m53J429j242J12J126j394M93N47q82
2177d77N90Q2n52P65n60m3P76r62M37M44j086R02j88p84J052k47p39J245n79l72
2197b96Q83r85L37P89j243O27J80p29Q42r9p45Q54m38k02Q51r94L47O67j081L48
2217h7O38j012Q76m66n21J114p03k17R30q06M0P77j153M58O42j146P27J65r71
2236g15R61m9n50Q45p51J18M62n87K23K06o59P98k86o38J159p23j93J123r04j88
$$ plain form
2256 -348 761 -402 -190 617 -545 211 320 -339 187 -10 -72 448 -358 131 424 -445 53 210 -509
2275 -509 513 262 -566 331 44 -370 438 90 -305 488 -122 -257 437 -307 149 197 -417 310 -87 -143
2295 -143 194 -439 -89 476 -432 3 447 -351 388 129 -567 482 70 -438 405 -257 -332 652 -361 74
2315 74 340 -359 147 364 -474 34 88 -173 365 -125 -192 613 -132 -18 57 -402 412 84 -620 534 42
2336 42 -531 666 -206 -241 842 -309 -161 422 -266 -217 319 -259 248 -45 -337 232 77 -21 562 -187
2356 -187 86 340 -578 140 220 -523 364 -28 -623 350 107 -239 480 -48 -314 342 -174 -160 167 -249 208
2377 208 -122 -286 282 -277 16 398 -370 -24 304 -552 97 97 -448 425 267 -211 194 104 -176 423 -63
2398 -63 -132 107 -402 65 31 -336 250 119 -386 492 26 -159 278 -354 -159 342 -324 -45 146 -468 90
$$ packed form
2256c48J109j163K12Q07j162P56J09o59N26j97o2N20q06M89K93q69M98J57p19
2275e09J022k51q28Q97k87m14Q08l48l95P93o10j35O94p44M56M8o14P27l97n6
2295a43L37o33L50N65r08M35M44p98P39k59o96J049m12n08Q43o62p5R84j013M35
2315G4K66o99N06K17q38N08N4k61N38m90o7Q05p45J14P5m59Q14l28p04J154m92
2336D2n73J197q72l5J083j151J48N83o88M9N36n78N07k93k92N69j55r8N83p49
2356a87K73K54r18P18Q0p43Q87l92n95R73k43l46P19n28k66O56n16J4L27m16M57
2377B08l30j64N68n59K93L82p68L46L28q56O49%n45Q73j58m78M05r0k80N99m86
2398f3o9K39n09M67l4l67N86j31n05Q78m66j85M37o32J95N01o66K79J91o14N58
$$ plain form
2419 90 266 -536 390 -108 -513 159 -136 -155 230 -202 -215 120 -423 -59 381 -135 112 -33 -193 280 -91
2440 -91 -54 257 -232 254 124 -385 43 250 -410 244 206 -358 432 -46 -291 283 3 -145 417 -76 20
2461 20 159 -219 429 -68 -25 244 -257 -77 299 -471 -101 564 -398 154 135 -445 257 211 -273 362 -24
2482 -24 -74 182 -142 -128 224 -229 133 59 -166 268 -252 -293 266 -159 -214 279 -324 -129 470 -343 152 166
2504 166 -304 426 69 -397 291 -43 -458 360 -244 -184 299 -360 50 157 -259 167 -109 -156 285 -46 -199
2525 -199 306 -254 93 239 -219 82 79 -479 269 39 -243 517 -186 -350 363 -88 -127 306 -66 133 357
2546 357 -310 180 40 100 304 -249 -100 218 -351 -20 350 -367 288 403 -438 197 263 -447 211 228 -334
2567 -334 326 -63 -105 94 -386 58 -33 -328 352 95 -466 505 -180 -195 427 -209 -186 443 -414 -60 559
$$ packed form
2419I0J76q02R26m98m05O72k95j9L85m32j3L35n43L64M40n16K47j45j60M73l71
2440i1L7L11m89M86j30n09M28K07o60O54l8n64P90m78k45N74k80j48N62m93R6
2461B0J39l78O48m97M3K69n01J80L76p70L70O65r62N52j9n80P02m6m84O35l86
2482b4n0K56l24J4L52m53L62p4k25M34n20m1N59m25n5M93o03J95N99q13M95J4
2504A66m70P30l57m66O88l34m15Q18o04O0M83o59M10J07m16M26k76m7M41l31j53
2525a99N05n60L47J46m58L01ln58P48k30k82P60p03j64P13m51l9M33l72J99K24
2546C57o67M90j40O0K04n53J49L18n69L31L70p17O55J15q41O35O6p10O58J7n62
2567c34O60l89m2J99m80M44r1k95O80k57n61R71o85j5O22o36K3O29q57L54O19
$$ plain form
2588 559 -217 -25 262 -331 112 -91 -170 397 -259 66 188 -361 281 183 -439 239 198 -307 300 -32 -222
2609 -222 324 -283 -64 224 -418 41 371 -417 30 175 -296 279 -114 -340 274 -56 49 329 -274 271
2629 271 91 -287 196 -164 -19 263 168 -179 234 -260 -99 214 -632 26 318 -555 358 390 -449 305 76
2650 76 -316 294 -151 -185 317 -68 -7 148 -153 173 185 -222 113 -121 -218 484 -344 -159 426 -670 21
2671 21 450 -356 251 221 -502 227 241 -294 139 105 -19 212 -235 -92 126 -213 276 6 -426 648 155
2692 155 -389 400 20 -118 532 -405 36 158 -280 -45 259 -452 211 49 -342 206 -120 -112 147 -124 -54
2713 -54 287 -354 90 156 -230 361 -146 -159 195 -291 -148 326 -286 -72 204 -242 51 25 -191 220 89
2734 89 -328 260 -83 -19 230 -331 -82 25 -92 -128 -9 -300 178 -79 -182 314 -184 -27 159 -474 197
$$ packed form
2588E59p76J92K87n93M43k03p9N67o56L25J22n49O42r8o22O78m1n05O07l32j90
2609b22N46o07K19K88o42M59L30p88M47J45m71N75l93k26O14l30J05K80o03N45
2629B71j80l78M83l60J45K82r5l47M13m94J61L13q46O58K92q73R13L2q39P54k29
2650G6l92O10m45l4N02l85O1J55l01L26J2m07L35k34r7P02q28J85N85j096O91
2671B1M29q06O07l0p23P29J4n35M33l4j24K31m47J43K18l39M89k70m32J074m93
2692A55n44P89l80j38O50r37M41J22m38K35L04p11O63j62l91N48l26QK59k71P0
2713e4L41o41M44O6l86N91n07j3L54m86J43M74o12K14K76m46K93k6k16M11j31
2734H9m17N88l43O4K49n61K49J07j17l6J19k91M78k57j03M96m98J57J86o33O71
$$ plain form
2755 197 290 -191 14 200 -495 286 129 -239 372 175 -131 111 -216 185 141 -308 309 -75 -238 423 -146
2776 -146 -147 362 -165 -45 433 -138 -96 232 -166 -140 298 -279 142 -16 -144 -78 -26 143 212 36 -81 109
2798 109 -480 262 137 -267 270 -89 -395 292 -84 56 463 -181 -234 251 -304 -34 93 -171 114 -80
2818 -80 -361 195 -118 -8 189 -250 54 305 -25 22 115 -106 213 -41 -136 152 -62 -1 70 -217 -143 273
2840 273 -306 -116 240 -263 96 196 -211 144 47 -61 256 57 -203 132 -110 17 107 -158 113 23 -88
2861 -88 429 -73 -219 592 -83 -64 175 -164 110 268 -438 42 183 -151 -162 0 64 -5 -136 -35 119 -287
2883 -287 93 84 -300 260 -49 -358 172 -144 -72 359 -63 -100 293 -121 -38 -42 38 146 90 -218 179 104 -240
2906 -240 171 20 -31 179 -271 7 199 -227 279 -74 -249 314 -16 -60 198 -35 -47 308 -44 49 -2 -273
$$ packed form
2755A97R3m81K05J86o95P81j57l68O11j97l06K42l27M01m4m49O17l84j63O61n69
2776a46jN09n27J20M78n71M2L28l98K6M38n77M21j58j28O6N2J69O9j76j17J90
2798A09n89P42j25m04N37l59l06O87l76J40M07o44n3M85n55K70J27k64K85j94
2818h0k81N56l13J10J97m39L04K51l30M7R3k21L19k54r5K88k14O1P1k87P4M16
2840B73n79J90L56n03L59J00m07L55r7j08L17j99k60L35k42J27R0k65K71r0j11
2861h8N17n02j46Q11o75J9K39l39K74J58p06M80J41l34j1J62O4o9j31J01J54m06
2883b87L80rl84N60l09l09N30l16P2M31m22l7L93m14Q3mQ0J08n6l08L97p5l44
2906b40M11j51n1K10m50K78J92m26N06l53j75N63l30m4K58k33j2L55l52R3n1k71
$$ plain form
2928 -273 41 44 -298 75 -136 -165 257 -142 115 93 -218 167 220 -124 60 23 -245 233 -39 -164 207 -183
2950 -183 -58 329 -170 110 294 -284 171 308 -468 10 -75 -135 89 -338 -136 94 -188 159 3 -86 415
2971 415 120 -253 174 -25 -238 239 12 82 319 -194 -22 75 -82 266 225 53 187 -131 202 219 -9
2992 -9 119 92 -196 4 167 -243 319 50 -165 320 68 -141 383 -89 -173 173 44 -31 77 -208 250 -40
3014 -40 41 232 127 -2 81 -27 18 218 -260 -2 54 -64 86 82 -52 177 -256 -146 -26 -243 -134 145
3036 145 -163 67 119 -498 116 -76 -165 91 -93 -128 60 -289 6 123 -94 -28 -114 -80 0 -55 -154 85 -44
3059 -44 -25 335 -213 -94 253 23 -96 236 -158 206 20 -124 -18 -222 122 144 -149 82 -85 -127 224
3080 224 -85 -233 291 175 -31 196 -85 -173 256 -18 -8 191 -187 69 170 -181 -160 113 -96 218 142
$$ packed form
2928b73L14Ll42L73k11k9M22l99K57k2l11L85N3l44J84l7k68M78k72j25L71l90
2950a83J25L87m99K80J84n78M55J37p76M78q5o0K24m27K02K30k82L47j56q9N01
2971D15k95l73M27j99k13M77k27P0K37n13J72R7j57L48m1j72J34l18L33J7k28
2992iJ28k7k88K00J63m10N62k69k15M85k52k09N24m72q4L46j29p5J08k85M58k90
3014d0Q1J91j05j29Q3j08M5K00m78K58N6j18J50mj34K29m33J10J20k17J09K79
3036A45l08K30N2o17O14j92q9K56j84l5J88l49K95J17k17O6q6L4Q0n5r9K39j29
3059d4J9L60n48J19L47k30j19L32l94L64j86j44J06k04L44K2k93K31j67m2L51
3080B24l09j48N24j16k06K27k81q8M29k74J0J99l78K56J01l51K1K73k09L14p6
$$ plain form
3101 142 -30 71 -84 171 150 -361 93 -37 -214 108 85 -106 101 68 -155 46 -88 -104 165 -91 14
3122 14 13 -1 114 27 -228 219 -60 47 126 -162 -26 156 -96 10 182 -42 270 103 -22 234 -114 -24
3144 -24 8 -40 -8 108 50 -142 82 -81 -96 107 38 62 100 -71 212 -146 -54 68 -208 72 -58 -76 171 -107
3168 -107 -356 -45 -5 -115 83 -47 -105 153 -219 -56 57 -123 42 48 -86 124 155 -44 -67 33 212 134
3190 134 -250 152 -110 -272 162 -60 -182 42 -10 -35 -38 46 16 61 31 -95 54 15 34 11 -108 218 -73 -79
3214 -79 152 -107 117 7 -141 80 72 -221 7 -158 18 14 21 -125 228 -4 82 206 92 187 -68 -64 -20 3
3238 3 -163 -20 95 -259 -6 -94 -28 -125 -90 153 -47 -106 -51 -217 12 198 -194 -220 226 19 38 190 36
3261 36 -84 133 -25 -11 141 148 66 -81 -310 108 -88 -2 79 -117 258 42 -206 210 -94 -49 111 2 -115
$$ packed form
3101A42j72J01j55K55k1n11M54j30j77L22k3j91K07l3k23K01j34j6K69k56J05
3122A4jj4J15q7k55M47k79J07P9k88J36J82k52J06J72k24L12j67j25K56l48R0
3144b4L2m8L2J16n8j92K24j63j5K03o9K4L8j71K83l58R2J22k76K80j30j8K47k78
3168a07k49L11M0j10J98j30n8K58l72J63J13j80J65Oj34K10L1j99k3J00J79p8
3190A34l84M02k62j62M34k22j22K24n2k5lQ4l0M5l0j26J49l9J9k3j19L26k91o
3214g9K31k59K24j10j48K21qk93K28j65J76mPj46L53k32Q6J24j14R5k55MM4K3
3238Cj66J43J15l54K53q8O6r7L5K43k00n9N5j66K29J86l92k6M46k07J9J52j54
3261C6j20K17j58J4J52Pq2j47k29M18j96Q6Q1j96L75k16k48M16l04M5J60j09j17
$$ plain form
3284 -115 131 -146 -179 -87 -57 151 241 -78 50 -27 84 229 -45 16 74 -84 129 -231 -107 216 -23 113
3306 113 249 8 -22 105 -142 -78 105 41 189 46 -39 223 -62 151 50 -116 -157 23 -50 38 -52 -93 -127
3329 -127 -77 -221 104 103 -274 179 -166 -107 184 -126 -73 42 -115 -63 -72 -61 84 39 -149 103 42 36 135 -16 39
3354 39 6 129 69 4 -49 -9 -106 -120 77 -62 43 100 -31 109 171 -123 -81 73 -68 127 176 -92 89 16
3378 16 106 43 114 14 -106 -123 -6 -91 -108 9 54 -133 81 164 116 132 41 28 83 -69 77 -105 -66 65 117
3403 117 -76 -48 -78 -130 76 -270 139 3 -226 117 -47 -137 205 8 -18 -74 -121 -73 89 -91 63 100 -77
3426 -77 -39 93 3 79 -55 -54 213 42 175 -169 -45 234 -92 82 15 -111 -25 201 -58 86 172 -301 45
3449 45 106 74 55 210 -35 152 45 -6 211 -109 97 12 -70 -112 10 -97 -116 -15 32 221 7 63 216 -82
$$ packed form
3284a15K46k77l3R2L0K08R0l19J28p7J11J45k74O1N8j58K13l60J24L23k39J36
3306A13J36k41l0J27k47O4J83o4J48j43q5K62k85K13j01j66m1J80p3Q8r0m1l4
3329a27N0j44L25jl77M53l45N9K91l10N3J15j57N2rJ1J45m5j88K52o1oR9j51N5
3354C9l3J23o0o5n3M0r7j4J97j39J05N7j31J40O2k94M2J54j41J95M9k68J81p3
3378A6R0o3P1j00j20j7J17q5j7J17M5j87K14Q3m8J6r1j3N5j52J46j82L9J31N2
3403A17j93K8l0n2K06l46M09j36k29L43j64r0L42j97k6n6m7M8J62j80J54L7j77
3426g7L8J32r0P6j34JK67j71J33l44J24K79l26J74o7j26Q6K26k59J44Q6m73L46
3449D5O1l2j9J55k45J87j07n1K17l20K06q5q2m2J22j07j9J01M7J89k14N6J53k98
$$ plain form
3473 -82 35 69 -121 55 129 -124 148 140 -123 -62 48 -25 8 -132 94 82 3 8 22 99 -109 -148 -52 -15 30 -25
3499 -25 158 -79 50 70 -49 -34 169 -191 -135 -14 10 263 -4 -144 -52 -33 -10 -14 -288 -45 69 -102 -53 -180
3523 -180 -183 106 38 5 178 -60 -29 69 -130 216 25 -6 0 53 -14 71 0 43 72 -44 -188 146 -122 -104 23
3548 23 -10 96 28 -36 124 16 41 95 -95 74 27 -130 -26 92 32 114 -111 -129 -48 113 -11 235 -261 -83
3572 -83 42 64 273 53 -78 9 -131 154 -91 101 12 142 108 -27 194 -106 182 53 21 153 178 163 77
3595 77 66 -79 173 102 -71 87 59 127 157 -129 -49 147 -70 212 42 -198 43 -324 -156 92 105 53 126
3618 126 -161 112 -132 -163 66 -42 -16 -74 -107 -45 148 -234 -81 2 30 218 -9 -14 270 -62 14 8 -161 -71
3642 -71 189 -70 241 66 117 155 -193 18 -22 -73 -48 42 -103 52 -105 -9 10 170 -125 71 43 15 276 -117
$$ packed form
3473h2J17L4j90J76P4k53K72qk63O1J10p3L3j40K26j2p9NJ4P7k08l9R6L7M5n5
3499b5J83k37J29K0j19J5K03l60N6J21K4K53k67j40R2J9K3mk74K43J14j71M9j27
3523a80lK89o8l3J73k38L1R8j99L46j91l1ON3o7Q5p1M3K9j16j44L34k68J8J27
3548B3l3J06o8o4J60j08K5N4j90J69m7j57J04J18o0Q2k25j8Q1J61j24K46m96J78
3572h3J25K2K09k20j31Q7j40K85k45J92q9J30l4j35K21l00K88j29l2J32K5j5q6
3595G7j1j45K52p1j73J58k8O8L0k86Q0J96k17K82j70k40K41l67J68K48J3n2P3
3618A26k87K73k44l1K29j08K6n8l3O2J93l82J53Q3K8J88k27nK84l32P6oj69R0
3642g1K60k59L11j75N1L8l48K11m0n1K5R0j45J55j57R6J9J60k95J96k8k8K61l93
$$ plain form
3666 -117 -89 21 -63 232 110 -2 33 157 -63 72 -71 -142 73 92 -31 -61 -1 83 175 17 -2 -186 -183 89
3690 89 -12 -32 182 123 -52 115 -69 -92 151 -234 -158 -93 -6 237 33 100 128 34 -58 59 -165 69 67 -113
3714 -113 126 68 -26 156 -14 30 128 -101 282 97 -67 -145 -65 18 95 7 -89 90 -76 -95 140 -53 69 116
3738 116 -222 151 129 -110 123 -198 -78 -67 96 2 -45 -149 41 71 -183 190 33 58 131 -107 -206 191 -214
3761 -214 -222 225 -92 -100 236 -197 41 -200 -68 119 -56 -7 32 -192 -199 95 -352 53 213 -225 169 87 -175
3784 -175 -151 -59 -238 36 29 110 112 -110 -80 -13 -131 239 -90 4 150 132 -30 189 -112 -68 8 -135 -90 118 -111
3809 -111 2 86 -318 7 -22 -20 182 47 -118 91 -126 -115 103 42 55 -43 49 234 136 -147 162 -112 -57 -58
3833 -58 -61 -69 198 12 85 -50 -35 65 130 -127 108 -28 -99 -43 -98 10 87 -401 124 -37 -211 -33 74 -120
$$ packed form
3666a17K8J10q4K95j22j12L5J24k20J35j43p1K15J9j23l0O0Q4R2j58j9j84LK72
3690H9j01k0K14n9j75J67j84k3K43l85P6O5Q7K43k04O7K8r4r2J17k24K34kj80
3714a13K39n8r4J82j70M4R8k29L83j85j64p8Q0Q3P7q8r6J79j66j9K35j93J22M7
3738A16l38L73k2k39K33l21J20J1J63r4m7j04J90L0k54L73j57K5P3k38r9L97m05
3761b14qM47l17qL36m33K38k41J32J87j75M9L9k24pK94m47M05J60m38L94q2k62
3784a75K4R2j79K74pQ1Kk22L0O7j18L70l29R4J46j8j62K19l01M4P6j43M5K08k29
3809a11J13Q4m04L25k9KK02j35j65K09k17J1K18o1J3r8R2J85r8k83L09k74N5j
3833e8lqK67j86P3j35J5J00O5k57K35j36p1N6n5J08P7m88N25j61j74J78J07j94
$$ plain form
3857 -120 8 -120 117 -7 6 -132 123 -44 252 137 -22 115 31 53 191 119 -263 119 -164 52 241
3878 241 193 -142 86 33 212 206 16 166 -8 59 91 -113 10 151 -157 279 74 -83 110 52 -118 96
3900 96 29 -47 76 38 17 -17 -217 -116 -139 -121 -81 -17 -28 -17 -90 -128 22 -271 -27 91 -210 -60 122 -51 116
3925 116 100 -78 -74 -48 65 100 -141 -15 41 -31 81 -74 -102 92 -44 -172 163 16 46 69 -183 39 51 -31
3949 -31 13 161 90 19 -56 20 173 -89 108 162 108 29 11 -240 50 -176 7 -4 12 -147 156 -101 123 294
3973 294 -169 147 125 -24 -10 -138 -266 152 265 -261 223 -72 15 20 -66 59 -38 55 97 39 40 186 -110 21
3997 21 339 -153 55 40 -178 -4 119 -64 -7 -12 -268 -5 13 -163 -242 11 66 13 -118 -170 -55 -12 124 45
4021 45 -64 107 23 -117 0 132 28 91 73 221 -79 -116 168 -5 -73 14 -88 -107 -35 -296 -48 34 -108
$$ packed form
3857a20J28j28K37j24J3j38K55j67K96j15j59J37q4K2J38p2l82L82k83K16J89
3878B41m8l35K28n3J79oj90J50j74O7L2k04J23J41l08M36k05j57J93n8j70K14
3900I6o7p6J23l8k1l4k00J01k3J8M0O4j1J1p3l8J50k93K44J18l01J50J82j73J67
3925A16j6j78MK6J13L5k41J26N6p2J12j55k8J94j36j28L35j47L0K3k52K22J2q2
3949c1M4J48p1p1p5P6J53k62J97N4n4p9j8k51K90k26J83j1J6j59L03k57K24J71
3973B94m63L16k2j49J4j28j28M18J13n26M84k95Q7Nq6J25r7R3M2n8JJ46k96J31
3997B1L18m92K08j5k18J74J23j83N7nk56K63J8j76p9K53N5n3j31n2J15M3J36p9
4021D5j09J71q4j40J17J32j04O3j8J48l00l7K84j73o8Q7j02j9P2k61K48Q2j42
$$ plain form
4044 -108 152 206 -34 143 -100 -95 446 -98 -130 264 -187 4 77 -15 4 -46 -44 115 -168 -156 -55 -182 70 250
4068 250 -121 32 285 -118 208 37 -23 192 -105 -307 142 -33 -82 -76 -54 15 -113 -144 -33 107 -6 -20 152
4091 152 -88 208 -36 20 -66 -209 -18 115 99 212 -332 -19 472 38 122 349 -221 4 258 -241 211
4112 211 87 -77 108 243 -105 120 146 -127 166 78 7 28 -102 112 240 21 21 102 -144 188 -116 1
4134 1 256 -102 34 166 -133 -45 -85 -114 -56 -25 -112 58 -262 -75 81 -111 -93 219 -213 156 130 -113 43
4157 43 206 -114 77 88 -84 -33 -245 -51 -54 1 -19 77 -199 -55 -4 -148 17 -103 -45 345 -53 -197 75
4180 75 -151 -39 93 50 -2 -183 -193 232 85 27 -89 -292 253 188 -135 117 9 -208 -25 88 -145 14
4202 14 25 -22 109 -181 -102 118 115 24 159 -4 212 -103 -144 -75 -157 30 84 -234 110 140 -16 -103 120 -131
$$ packed form
4044a08K60N4k40J77k43NN41n44l2L94m51J91P3r2J9n0KJ59k83J2J01j27K52J80
4068B50l71J53K53m03L26j71o0K15k97k02M49j75m9OK2O9j28l1J11J40j13j4J72
4091A52k40K96k44N6q6j43J91J33j6J13n44L13M91m34Q4K27n70K25K54m99M52
4112B11j24j64J85J35l48K25K6k73K93q8p1K1j30K14J28k19%Q1k46L32l04J17
4134AK55l58J36J32k99Q8m0k9N8L1q7J70l20J87J56j92J8L12m32L69k6k43J56
4157D3J63l20J91J1j72N1k12J94lN5k0R6k76J44N1j44J65j20N8L90l98j44K72
4180G5k26J12J32m3n2j81j0M25j47n8j16k03N45o5l23K52j08k17J83J13k33J59
4202A4J1m7J31k90P9K20lr1J35j63K16l15m1O9q2J87N4l18L44L0j56q7K23k51
$$ plain form
4226 -131 86 -8 -105 195 152 -7 -115 84 -267 118 -60 259 70 -295 140 -14 -216 295 -63 -248 56
4247 56 71 -97 271 81 144 104 -31 76 91 -93 10 -149 -104 78 -76 67 78 3 -13 186 -7 -45 -63 -148
4271 -148 111 -136 -156 126 -295 -106 22 -180 -97 -10 1 178 -48 -218 320 -16 -1 27 -258 -142 147 -54
4293 -54 8 -26 -162 99 -166 25 120 -272 -27 169 70 123 -19 -110 -61 55 -224 192 -11 -160 -191 130 -195
4316 -195 -32 -71 181 56 -104 244 -3 114 88 -168 58 182 46 -49 207 52 -186 288 -156 57 127
4337 127 146 136 36 -17 -15 23 19 196 -106 11 65 -337 142 111 -224 71 29 -134 49 -124 -34 106 -158 -150 -18
4362 -18 -167 251 44 -255 8 6 2 159 -141 -82 3 -111 -105 -119 -239 -10 198 -277 210 -12 24 182 -109 99
4386 99 161 -51 224 160 16 106 95 -191 30 -88 -114 30 -34 29 127 33 169 163 -70 202 -236 -71 163 180
$$ packed form
4226a31K17r4r7L00m3j59j08J99l51L85j78L19j89l65M35j54k02N11l58j85L04
4247E6J5j68L68j90O3m0j35J07J5j84J03j59M5J82j54J43J1p5j6J99j93l8j8q5
4271a48K59k47k0K82m21J89J28k02Q3Q7J1J77k26j70N38l36J5K8k85J16K89k01
4293e4O2l4j36K61k65J91R5l92K45J96r9N3j42r1M9J16k79M16k03j49l1L21l25
4316a95J63l9K52j25j60L48k47J17k6k56K26J24j36r5K56j55k38M74m44K13P0
4337A27J9j0j00n3KL8mJ77l02J17N4m02M79l1l35K95m2j63J83j73R0J40k64QJ32
4362a8j49M18k07k99K63kmJ57l00N9Q5j14Oj4j20K29K08m75M87k22L6J58k91K08
4386I9O2k12K75o4j44R0j1k86K21j18k6J44o4O3R8r4J36ok33K72m38J65K34J7
$$ plain form
4410 180 31 281 -121 27 166 -237 118 195 -246 71 88 -39 154 74 -17 -125 -5 -144 16 -76 34 -12
4432 -12 27 156 -62 -48 43 -279 -62 184 32 -33 150 -9 -169 180 -66 20 -37 -266 255 -47 66 -49
4454 -49 -315 9 91 -5 114 -36 -22 115 69 -78 66 -159 -91 120 96 -57 181 -171 89 18 -146 134 18
4477 18 -131 141 -180 -194 201 -237 7 263 -265 -40 -1 -148 -114 -36 -90 171 -226 34 385 47 37 181
4499 181 -207 134 103 -125 196 -16 18 141 -97 -30 195 -154 -40 131 -128 -77 157 -160 66 -122 -100 23
4521 23 -42 -79 327 -95 15 163 -109 132 91 -118 92 -47 96 12 -94 151 -35 -210 -34 56 -2 140
4543 140 -78 -234 235 2 -265 296 -210 -188 124 23 -15 159 -89 106 -4 -124 168 47 -79 77 240
4564 240 -93 390 -131 -76 147 -94 115 44 -94 119 225 -121 90 -59 177 72 -237 27 45 -204 216
$$ packed form
4410A80j49K50m02J48J39m03L55P7m41L17J7j27J93q0r1j08J20j39J60r2J10m6
4432a2L9J29k18J4R1l22K17K46j52o5J83j59j60L49k46Q6n7k29N21l02J13j15
4454d9k66L24Q2r6J19j50J4J37m6j47J44k25O8K11k4j53K38l52K60p1j64K80j16
4477A8j49K72l21j4L95m38K44K56n28K25L9j47L4P8n4K61l97K60L51l38j0J44
4499A81l88L41l1k28L21k12L4J23k38O7K25l49J14J71k59N1K34l17K26j88K2J23
4521B3o5l7M06m22J10J48k72K41m1k09K10j39J43q4j06K45j86j75J76R0n8J42
4543A40k18j56M69k33k67N61n06K2L12j01l8J74k48J95j10j20K92j21j26J56J63
4564B40l33M83n21N5K23k41K09p1j38K13J06l46K11j49K36j05l09K64J8k49M20
$$ plain form
4585 216 162 -196 102 128 8 298 -136 -76 153 -51 46 37 -204 -77 197 -65 92 -36 57 139 -81 -2 146
4608 146 -265 138 68 -145 103 362 -299 92 94 91 134 -31 -55 188 -70 15 -21 -143 95 52 -179 4 -52 -158
4632 -158 239 79 -35 307 -92 -32 309 -216 -307 15 -185 146 -80 -92 156 -6 51 37 -188 105 98 -132
4654 -132 235 26 -47 126 25 -23 225 -69 -55 -60 -37 -37 86 159 -10 -166 -17 152 41 -241 120 -185 -31
4677 -31 104 -13 -136 46 -146 -27 32 -59 -15 -151 84 -43 -281 -77 129 30 161 135 -84 162 -10 -106
4699 -106 120 -44 -57 -41 90 -20 54 -72 221 196 -108 85 -81 16 123 -16 -74 256 317 103 107 -65 -102
4722 -102 69 -271 38 109 89 13 -43 -201 41 115 -125 45 16 121 84 -232 -31 -97 -312 207 5 -162 68
4745 68 -34 -116 74 -356 -101 -149 -55 6 15 89 -18 -14 87 -45 -28 -157 -85 -151 87 -6 -72 23 15 -265 172 -77
$$ packed form
4585B16n4l58K98K6j20K90m34O0K29k04R7rk41J27K74k62J57j28R3Q2k20P9J48
4608A46m11M03p0k13K48K59o61L91KlM3j65k4K43k58Q5l6j22K38m3k31J83n6j06
4632a58L97j60j14L42l99O0L41n25r1L22k00L31k26j2K48j62N7j4k25K93pk30
4654a32L67k09p3J73j01m8K48k94J4nK3%J23P3j69j56J49J69j11k82L61l05J54
4677c1J35j17j23J82j92J19N9r1M4j36K35j27k38K04K06r9J31k6k19K46j72r6
4699a06K26j64j3J6J31j10P4j26K93k5l04J93j66R7J07j39n8L30O1k14Mj72l7
4722a02J71l40L09P1k0p6n6j58K42P4k40J70k9J05l7l16K01o6k15N19k02j67K30
4745F8j02q2J90m30K55m8R4O1RP4j07MJ01j32J7j29P2o6K38r3o6R5qk80M37k49
$$ plain form
4771 -77 -129 29 -115 -164 116 -140 -9 165 -65 -2 -97 -185 244 84 -23 45 -39 142 142 -41 -102 -69 -170 168
4795 168 12 -8 66 -198 -115 -3 -126 33 304 -173 -2 130 -180 -8 96 -157 126 -246 19 201 -56
4816 -56 19 153 148 -29 121 -140 -161 -318 42 15 -313 12 76 111 -7 40 -115 -105 333 47 85 204 -22 171
4840 171 -157 196 134 -47 -17 45 -331 100 86 -127 83 76 -116 229 -219 -200 289 -71 26 52 183 -124 196
4863 196 -185 69 0 -59 128 3 24 -120 -152 -49 156 -142 -33 11 -146 96 22 -71 64 128 -140 96 -99
4886 -99 -71 170 -61 190 -67 -294 28 116 -113 218 -70 -171 -120 104 -23 -194 -153 12 95 -143 135 58
4908 58 -149 413 -88 -140 6 -188 -12 170 -227 101 -47 -167 -2 -36 74 -7 55 -58 30 -237 51 13
4930 13 104 48 79 5 61 -67 -48 230 44 -52 137 -165 170 327 -139 199 165 -207 90 48 -57 -4 0 93 123
$$ packed form
4771g7n2J58j44m9K80k56J31J74k30O3r5q8M29j60j07O8q4J81%j83o1L3j01L38
4795A68j56k0P4k64Q3J12j23J59K71m77J71J32l10J72J04k53K83l72K65J82k57
4816e6P5J34nj77J50k61k1j57L60k7l28L25O4L5j18M7j55J0M38k86L8J19k26J93
4840A71l28L53o2j81L0O2l76M31j4k13K10pj92L45m48J9M89l60R7K6J31l07L20
4863A96l81K54o9n9J87j25K1j44l2J03K05k98J09M4j57K42p4r3J35O4k68K36j95
4886i9K8K41k31K51k57k27L22Q8k29L31k88j01N1K24j27j71M1J65Q3k38K78p7
4908E8k07N62n01n2J46j94J76J82l97L28j48j20J65l4J10q1O2j13Q8k67K88l8
4930A3R1n6L1p4N6j28J9K78j86r6J89l02L35J57m66L38l4l72K97m2j05N3MR3L0
$$ plain form
4955 123 -104 -7 23 -54 -100 47 -311 104 -118 -119 83 -146 -242 -39 10 -264 54 -182 106 82 -229 -133 -13
4978 -13 11 -57 -124 -75 109 -22 55 52 -311 17 -19 -118 128 71 -184 129 65 -170 202 -102 68 88 -262 266
5002 266 66 -40 32 -44 -99 -54 -87 1 97 39 2 82 -227 73 -102 -163 54 -37 -31 80 -1 -23 230 -178 102
5027 102 249 -130 -75 157 -109 32 -83 -138 -60 231 92 181 -150 22 71 -85 217 40 -96 120 84 -120
5049 -120 97 -66 -140 226 -207 -118 115 73 205 -62 -27 -18 49 31 10 -55 13 187 -88 39 -27 -93 -83 20 -92
5074 -92 69 -119 -186 121 197 1 88 -170 141 27 -125 156 105 39 -40 -24 -112 -3 -219 204 156 -68 51
5097 51 23 49 -71 63 -81 17 -161 107 12 -147 -142 174 24 113 212 -86 -20 -64 85 -113 -42 -157 142 -39
5121 -39 -151 -117 -233 41 -4 -24 2 -113 -132 144 -159 -72 14 -14 -46 -20 -275 -160 3 -272 1 -89 -73 -54 -91
$$ packed form
4955A23k27R7L0p7m6J47l58M15k22jK02k29r6K03M9k74L18k36K88k4l11R6J20
4978a3K4o8o7M9J84j31P7ll63L28l6r9K46n7k55L13o4k35L72l04J70K0l50N28
5002B66k00j06P2p6n5M5l3Q8R6n8l7Q0l09L00j75o1K17r1OJ11q1k2K53m08K80
5027A02J47l79N5K32k66J41j15n5P8K91j39Q9l31J72M9j56L02j77j36K16l6k04
5049a20K17j63p4L66m33Q9K33m2J32k67L5RO7j8k1o5O8J74k75J27o6o6J0J03j12
5074i2J61j88o7L07P6j96Q7k58L11j14j52K81n1o6p9J6q8J09k16M23m8k24J19
5097E1k8K6j20J34j44R8j78K68r5j59NL16j50Q9R9k98O6m4J49j98P1j15K99j81
5121c9j12L4j16K74m5k0K6j15j9K76l03Q7Q6k8l2K6k55J15J63k75K73r0J6J9l7
$$ plain form
5146 -91 84 223 -118 -22 223 -36 92 -48 -76 43 -39 24 259 -64 -116 198 14 80 -56 -142 -90 -137 -294
5169 -294 140 54 58 49 -92 34 180 104 -8 23 13 49 102 -120 55 111 -93 -131 -91 19 209 18 4 243 -14
5194 -14 43 -82 -97 198 -71 -10 -60 -115 -19 127 16 -119 10 -164 191 -103 -278 102 -73 -121 115 78 -164
5217 -164 9 -154 6 201 -221 -115 114 -263 -53 109 -97 -23 -16 -127 94 96 -2 166 -68 206 91 -198
5239 -198 -67 -190 -206 86 -51 -90 266 -116 -74 165 -102 -262 80 -90 -35 125 -189 116 120 -93 -9 33 52
5262 52 2 -1 123 -111 -201 101 83 -204 -8 243 53 274 -32 -13 127 -47 155 67 -3 -97 -61 -148 227 -108
5286 -108 -68 80 -275 -174 34 -104 -43 -117 -110 235 -156 -218 15 -82 -17 95 3 55 4 -178 184 -58 12 -4
5310 -4 41 12 184 -70 -22 215 -79 -30 -171 11 150 -117 -103 281 -44 -158 19 -29 -164 158 -97 60 180
$$ packed form
5146i1J75J39l41R6K45k59J28j40k8J19q2O3K35l23n2L14j84O6j36q6N2m7j57
5169b94M34q6Mrj41J26J46p6j12L1j0L6N3k22J75N6k04l8M0J10J90j91j4K39k57
5194a4N7j25j5K95k69O1n0n5R6J46j11j35J29j74L55k94j75L80j75m8K36l7k42
5217a64J73j63J60J95m22J06K29l77K10J62k06P4Pj11K21Kr8J68k34K74j15k89
5239a98J31j23j6K92j37l9L56l82M2K39k67j60L42j70N5J60l14L05Mk13Q4M2J9
5262E2n0lJ24k34r0L02j8k87J96K51j90K21l06J9J40j74K02q8p0r4L6q7L75l35
5286a08M0J48l55J01K08j38O1p4PL45l91o2K33r7O5J12r2N2n1j82L62k42P0j6
5310dM5k9J72k54M8K37k94M9j41J82J39k67J4L84l25j14J77m8j35L22k55J57J20
$$ plain form
5333 180 43 5 119 -31 -116 147 -79 -9 121 42 86 -122 74 -67 -32 -38 -8 -146 33 10 -120 -65 -92 -102
5357 -102 114 64 2 -1 -109 -106 -126 -4 -68 48 -30 6 -342 -81 27 -149 62 -241 -102 -66 36 -14 193 -3
5381 -3 -150 -66 122 190 109 -188 136 158 -43 -36 206 15 109 66 -133 -80 -20 58 21 -23 -9 6 -195 80 -13 59
5407 59 -40 -31 -103 37 -70 -107 47 -51 254 -84 22 -34 38 21 -85 213 -46 34 -48 -65 -35 -113 -19 57 -127 35
5433 35 177 -43 241 -79 -69 47 -24 -46 88 -74 128 208 24 -59 -6 -81 51 -102 -29 227 -183 18 -63
5456 -63 -107 159 7 113 82 112 27 11 139 39 50 3 -82 -172 64 85 82 -152 131 44 77 -77 -74 90 -36 -114
5482 -114 96 -9 -113 184 -83 3 -39 68 -42 76 9 31 -44 48 -165 -31 -58 42 69 -10 -45 102 -58
5505 -58 -73 61 0 76 2 52 9 -125 76 60 -74 81 114 -137 111 19 -121 93 159 138 14 175 -7 -41
$$ packed form
5333A80j37l8J14j50q5K63k26P0J30p9M4k08J96j41L5oL0j38J79k3j30N5k7j0
5357a02K16n0o2lj08Lk0J22o4J16p8L6l48K61J08j76K11l03J39L6J02n0K07j96
5381cj47Q4J88O8q1k97L24K2k01PK42j91R4m3j99N3O0P8l7m4J4J5k01K75r3P2
5407E9r9Rp2J40j07l7J54r8L05l38J06n6P2j7j06K98k59Q0q2j7L0p8R4P6j84J62
5433C5J42k20K84l20J0J16p1k2J34j62K02Q0j84q3N3p5J32j53P3K56m10K01q1
5456f3m4K66j52J06l1L0q5j6J28j00J1m7q5r0K36K1lk34K83q7L3j54LJ64j26p8
5482a14K10j05j04K97k67Q6m2J07j10J18o7K2p5R2k13J34k7J00K7p9l5J47j60
5505e8j5J34o1P6p4N0m3j34K01j6j34J55L3k51K48r2j40K14O6k1j24J61j82l4
$$ plain form
5529 -41 -146 85 189 35 43 77 21 78 -86 -67 137 -155 232 198 -12 67 74 -62 148 -46 -186 58 -255 -14
5553 -14 -218 -179 -128 24 173 -79 -53 -141 -2 116 140 -25 -85 61 151 -23 -62 4 -40 1 -22 -207 153 -122
5577 -122 -65 -82 68 -6 197 124 53 79 -280 -27 -100 -10 137 -49 -17 -133 -36 94 26 -78 34 -205 5 64
5601 64 149 12 124 117 41 148 141 35 42 -55 124 -22 -12 -51 2 -81 91 -16 3 26 -13 -39 150 -145 -34 -110
5627 -110 -200 8 -76 -184 -97 -6 24 253 -83 -7 126 -10 -218 45 -62 -180 -116 -158 -56 0 5 -46 30 -24 -31
5652 -31 -1 -242 -18 87 118 55 -128 111 13 -74 -3 -144 -131 166 -96 -133 163 -179 -262 -117 -71 -112 -6 -155
5676 -155 -63 -68 -81 25 -47 38 104 -56 140 -87 26 92 -70 58 100 -12 -223 -25 -152 -142 -136 -76 67 35 71
5701 71 82 -140 -95 30 -66 186 153 -97 -30 -98 -71 155 -122 236 124 12 -52 45 -79 136 139 -231 18 -18
$$ packed form
5529d1j05K31J04j54QL4n6N7j64J9K04k92L87l4k10P9Pj36K10j94j40K44l13K41
5553a4k04L9N1J52J49k52K6q8J39J18K4j65o0J46R0j74l9O6m4M1k3j85L60k75
5577a22N7j7J50p4K03p3p1K6l59K53p3R0J47j86L2j16R7J30o8j04J12k39K10N9
5601F4Q5j37J12pp6J07pj06Pr7J79j46J0l9N3q3J72j07J9K3l9k6J89k95J11p6
5627a10r0K08q4j08Q7R1L0K29l36P6J33j36k08K63j07j18O4m2J02N6Nn1P6n4p
5652c1L0k41K24J05L1o3j83K39r8q7P1j41J3K97k62l7K96l42q3J45M6m1J06j49
5676a55R2nj3J06p2Q5O6j60J96k27J13O6j62J28M2j12k11J98j27J0OO0J43l2L6
5701G1J1k22M5J25r6K52l3k50O7o8K7K26k77L58j12j12o4R7j24K15Ll70K49l6
$$ plain form
5725 -18 -29 -102 87 -111 21 -124 10 137 73 67 116 -261 37 -39 71 229 -153 -155 99 -82 187 186 -52 36
5749 36 133 -82 28 95 -140 68 -90 38 133 -170 57 -53 -10 186 -131 -11 40 -36 -183 176 -35 -44 5
5772 5 -202 -96 144 -88 142 -162 29 23 150 -72 88 -178 97 -141 -77 108 82 -64 -13 2 -29 -93 7
5795 7 -166 64 9 0 -61 -189 21 -45 -20 -15 6 -30 100 130 -11 32 50 -109 -34 -73 91 135 9 -164 7 -31
5821 -31 140 -40 -24 11 -48 3 135 -27 63 12 108 86 -173 39 62 -193 -59 106 115 -46 89 -308 -24 73
5845 73 -71 66 48 67 94 -123 -107 -86 16 -62 117 26 -147 147 -77 111 -22 -48 -117 -8 -48 79 -293 163
5869 163 70 -276 50 -201 -72 22 40 -150 23 -29 -134 -52 -81 -132 38 19 16 80 -116 96 -18 30 -104 -135
5893 -135 191 -76 -118 -5 24 -239 77 -13 -55 65 9 -93 102 -16 -67 188 118 35 38 -102 72 36 -93 129
$$ packed form
5725a8j1p3J89j98J32j45J34J27o4oM9l77K98p6J10J58l82kK54j81K69jk38Q8
5749C6R7k15J10O7k35K08j58J28R5l03K27j10M3J96l17J20N1p6j47L59k11rM9
5772Ek07J06K40k32K30l04J91oJ27k22J60k66K75k38O4J85k6j46N1J5l1o4J00
5795Gj73K30n5ro1j28K10o6K5NK1l6J30L0j41M3J8j59P5l9J64M4j26j73J71l8
5821c1J71j80J6L5n9N1J32j62R0n1R6k2k59K12K3k55J34J65Rj61J35l97K84R7
5845G3j44J37j8J9K7k17J6K1J02p8J79r1j73K94k24J88j33k6o9J09m0J27l72M56
5869A63r3l46L26k51J29R4J8j90J73n2j05Q2k9n1J70j9lO4j96K12j14M8j34l1
5893a35L26k67m2J13K9k63L16r0m2J20n6j02J95j18n1K55p0q3Lj40J74l6j29K22
$$ plain form
5917 129 122 100 177 -7 41 68 21 53 30 66 57 16 -73 151 22 -138 175 -123 -123 97 -89 -62 196 -309 -28 15
5943 15 -146 59 74 24 -107 -181 -50 -64 -221 4 54 -60 -48 -24 -9 138 -76 -49 97 -42 -51 327 -86 -48
5967 -48 166 -269 -86 -40 -166 -19 -43 -103 -93 -124 -82 72 -164 73 51 -62 47 -123 35 69 -189 -83 258
5990 258 9 -146 44 -38 -147 149 -136 -199 93 -164 -86 45 22 -48 -104 84 135 -134 71 130 -201 22 -24
6013 -24 -90 21 137 -181 141 -62 -68 78 -128 6 -37 -36 -141 -103 96 -167 -180 26 71 -185 50 88 145 45
6037 45 -172 -32 -39 17 -156 20 -21 -2 76 -148 127 67 30 127 107 -74 1 13 152 214 -40 -66 41 -22 -8 -6
6063 -6 0 -44 -6 -215 250 -73 51 250 17 -33 -7 -9 82 172 -25 0 170 -37 -91 50 -311 -94 -99 98 74 79
6089 79 -24 -69 -53 104 -125 -84 -45 -15 -353 -66 -97 42 163 -131 -152 -96 -130 -180 -28 31 -69 14 86 -34 -236
$$ packed form
5917A29pk2P7j84M8K7m7L2k3L6rm1q9K24j29j60L13k98%K20j86K7K58n05K81M3
5943A5j61K05J5n0j31p4J31j4j57K25N0j14J2K4J5J47k14K7J46j39rL78m13L8
5967d8K14m35J83M6j26J47k4o0J0l1M2J54k36K37k2j13J09j70J58L4k58J06L41
5990B58k49j55J90q2j09K96k85o3K92k57P8J31k3p0n6J88N1k69K05N9l31K23m6
6013b4o6J11J16l18L22k03oJ46k06J34m3Jj05L8J99k63j3K06M5k56K35L8N7j00
6037D5k17J40pN6j73J76m1J9P8k24K75o0l7R7k0j81P5J2J39O2k54k6J07o3J4K
6063fOm4L8k09M65l23J24J99k33n0K6kR1R0j97K5J70k07n4J41l61K17nJ97k4N
6089G9j03m5J6J57k29M1L9L0l38K87l1J39J21k94k1N6l4n0J52N9j00Q3P2j20k02
$$ plain form
6114 -236 -110 26 137 133 -62 -122 22 171 -239 -23 -104 -51 32 84 -37 -11 -115 52 209 -59 54 57 38 126
6138 126 -9 6 55 -97 -217 135 126 24 141 172 -10 35 -77 32 -58 -195 -61 -119 -108 134 -96 -27 -18 -31
6162 -31 195 2 22 17 -108 -21 42 -53 -107 42 -186 -11 82 0 -154 10 6 73 -60 -21 39 -27 -35 30 -76 147
6188 147 213 -31 -1 -76 55 82 -54 -165 124 -11 109 183 -135 79 -102 176 -142 -29 -157 39 93 -93
6210 -93 52 81 25 47 -58 -113 4 -96 -23 -31 35 28 -9 -325 -6 21 -104 37 48 107 166 -59 201 74 -17 10
6236 10 -41 5 -160 109 11 23 -104 2 92 -200 66 -50 49 -59 16 -31 192 61 51 -91 -75 63 57 -102
6260 -102 67 -77 -30 138 -113 -51 116 -2 61 114 -39 82 -81 19 -2 -54 -54 215 126 -23 -53 -148 26 -31
6284 -31 29 -4 -161 3 99 28 -49 -150 75 -125 342 -43 -166 125 -108 -9 4 -307 -11 151 -78 138 -29
$$ packed form
6114b36J26J36J11mj95o0J44J49m10K16q1N3Q3N2j21K6j04J67J57k68J13Lj9Q8
6138A26j35J5M9j52j20L52rj02J17L1j82M5j12J09r0j37J34n8J1K42k30O9Rj3
6162c1K26j93K0nj25Q7O3r5n4J49k28J75R3q2j54J64mO7j33L9O0o6qO5j06K23
6188A47O6k44L0p5J31K7j36j11K89j35J20P4l18K14j81K78l18J13j28J96N4j86
6210i3J45K9n6K2j05n5J17j00P3qO6pl7l16L19K7j25J41J1N9N9k25K60j27r1K7
6236A0n1M6j65K69r8J2j27J06R0k92K66j16R9j08P5m7K23j31j0j42J6J38oj59
6260a02J69j44M7J68k51O2J67j18O3N3j53J21j63J00k1n2%K69q9j49l0r5J74n7
6284c1O0l3j57J64R6p1p7j01K25k00M67l85j23K91k33R9J3l11K96J62k29K16j67
$$ plain form
6307 -29 -18 -91 -25 -17 -68 -103 67 283 -167 147 150 -109 1 -90 -47 38 -198 47 -108 -46 133 -76 -55 92 -77
6332 -77 -51 12 -6 -94 56 -68 21 161 40 103 237 -171 139 6 -176 92 -11 75 284 1 28 137 -39
6355 -39 97 -4 24 30 87 137 161 -184 16 -16 166 -137 163 207 -10 85 -139 98 -71 -32 57 -90 26 106
6379 106 -6 11 -76 20 284 68 -107 -4 25 -85 7 120 78 -19 -216 50 60 26 205 -42 -76 66 -143
6402 -143 -192 225 -141 -49 118 -3 92 -55 2 -23 27 -63 88 -132 -59 77 -117 67 45 -206 -97 11 -234
6425 -234 32 -36 -147 -57 -36 76 -73 96 -162 30 97 42 50 129 -64 9 124 14 48 -143 111 -28 -174
6448 -174 -38 -118 -163 122 -132 244 71 -33 -6 -68 -101 -18 -86 -149 150 -99 -2 73 -36 -43 -99 -134 119 -128 -144
6473 -144 125 -13 -110 -32 131 35 76 -9 -199 32 55 127 -92 107 39 -93 2 68 144 -41 -31 -292 32 178
$$ packed form
6307b9J1p3O6Qn1l5J70K16m50L14Lk59J10r1M3Q5k36K45j55O2J79k09K1J47j69
6332g7K6O3j8q8J50j24Q9J40j21O3J34m08L10j33j82K68j03Q6K09k83K7J09j76
6355c9J36j01K8ON7N0K4l45K00l2J82l03L00M4k17R5k24K37j69L9Q9j47J16Q0
6379A06j12J7q7R6K64k16j75J03K9j10R2J13m2r7j97K66J0l4J79k47l4J42k09
6402a43m9M17l66R2J67j21R5j47N7k5N0r0J51k20P3J36j94J84k2k51J09J08k45
6425b34K66o8j11R0K1J12j49J69k58J92O7n5QP9j93P3J15j10L4j91K54j39j46
6448a74J36q0m5K85k54L76j73j04K7o2l3Q3o8o3K99k49R7P5j09pn6l5K53k47j6
6473a44K69j38r7P8J63r6M1q5j90K31K3P2k19J99o8j32R5O6P6j85J0k61L24J46
$$ plain form
6497 178 38 -147 -20 -84 92 49 68 29 -1 12 -50 78 -4 74 25 97 -119 44 14 26 -22 167 42 -122 -18
6522 -18 -70 29 -162 -95 121 102 170 77 -48 -78 -164 49 87 17 -85 84 99 -61 120 102 -113 52 -201 -48
6546 -48 138 135 -5 -48 -109 -110 42 -52 21 -117 -150 13 83 -209 -30 16 167 -22 -57 37 81 -14 1 88 4 -107
6572 -107 -217 127 113 -84 60 118 -154 74 88 106 180 62 -145 70 -105 10 63 -104 74 -63 94 0
6594 0 -68 -48 110 60 -251 188 -84 48 -22 -56 246 -66 41 -103 29 -56 -16 -35 -176 109 -29 41 175 -70
6618 -70 -21 -51 28 -45 -64 -73 65 101 93 -33 88 49 59 -152 19 -49 -21 -34 79 -77 25 0 -70 79 -88 115
6644 115 178 -117 -26 210 81 -140 -134 63 75 16 -12 157 -73 -4 20 -56 -164 120 -77 320 -72 -102 153 -266
6668 -266 18 117 -159 -12 168 -85 57 32 -137 203 -131 99 -70 -106 -134 -132 99 22 74 77 -24 -101 101 -68
$$ packed form
6497A78j40j85J27o4J76m3J9l9l0J3o2J28q2P8m9P2k16J63l0J2m8J89j25j64J04
6522a8n2R9j91O7K16j9O8r3j25l0q6K13L8p0j02J69J5j60J81j8k15J65k53J53
6546d8J86lj40m3o1jJ52r4P3j38l3J63P0k92J79M6J51j89l5R4M4r5J5Q7q4j11
6572a07j10L44j4j97J44N8k72K28J4J8P4j18k07K15j75J15N3j67J78j37J57r4
6594@o8K0J58n0l11M39k72J32p0l4L02l12J07j44J32q5M0j9j41K85j38P0J34k45
6618g0M9l0P9p3j9rJ38L6qj26J21l9J0k11J71o8K8j3J13j56J02k5p0J49j67K03
6644A15O3k95R1K36j29k21OJ97J2n9k8J69k30O9K4p6j08K84j97L97l92l0K55m19
6668b66K84R9k76J47J80k53J42k5j69L40l34K30j69l6k8KK31p7N2Lj01p7K02j69
$$ plain form
6692 -68 31 -121 160 -57 -68 208 -137 -215 -23 -62 111 13 0 23 -50 -184 298 -182 -143 83 -85 4 77 -131
6716 -131 -76 13 -26 -10 19 -129 130 177 -201 85 -64 -53 -57 -238 -47 166 -29 -28 -14 38 -4 -69 79 7 49 -144
6742 -144 0 7 -18 80 213 114 -50 -146 93 -139 -61 51 -118 9 127 -126 -28 -138 -71 -10 -209 -30 82
6765 82 -58 -99 -105 53 -94 -33 15 74 -33 -133 22 -41 -164 67 78 -123 -41 -23 -24 -46 -94 -12 -6 -211 201 -156
6791 -156 -165 162 15 -28 83 -102 69 197 27 157 212 -7 -81 139 -127 10 132 75 -16 176 -38 231
6813 231 39 131 103 -134 160 36 -38 181 -125 29 8 -33 70 106 -298 89 104 -47 -54 -123 -140 -204 9 32
6837 32 285 -94 -168 273 112 -194 -16 -48 212 160 -109 -37 -120 -97 46 -222 -42 60 -30 -109 -120 -261 -94
6860 -94 -192 100 299 -20 44 -67 137 -165 132 -86 136 0 -136 38 41 -114 -62 -111 -79 -6 97 22 44 -2
$$ packed form
6692f8R9j52K81k17j1K76l45p8J92l9J73r8j3K3p3j34M82m80L9K26j68Q9P3k08
6716a31N5Q9l9J6K9j48K59M7l78K86j49J1mj81J91K13j95JJ4N2m2o5J48p2M2j93
6742a44J44Pk5R8J33r9j64r6K39k32P8J12j69J27J18k53R8j10O7O1j99J79J12
6765H2j40m1oJ58j47O1M8N9j07j00J55o3j23K31J1k01Q2J8jk2m8Q2Ok05M12l57
6791a56rL27j47m3J11j85J71J28j70J30N5k19p4K20k66J37J22n7r1J92k14K69
6813B31j92R2k8k37K94j24p4K19l06J54k1m1J03L6m04L87J5j51po9j7o4K13K3
6837C2K53l79p4M41j61l06J78l2K60n2k69P2q3K3J43k68J80J02r0p9j1j41J67
6860i4r8K92J99l19O4j11K04l02K97k18K22j36j36J74Lj55N2m9L2P3J03p5K2m6
$$ plain form
6884 -2 98 50 -248 53 19 -262 110 25 -93 236 -21 -101 73 -178 102 125 -82 38 27 -40 151 -177 -110
6907 -110 -23 30 -163 30 37 -81 -12 127 -4 66 29 44 46 130 131 16 24 41 -146 -71 35 -101 -40 -46 34 213 -33
6934 -33 37 56 -95 -150 -86 -84 -12 -38 78 136 159 -31 -44 -61 -71 9 -146 -12 -71 -37 -110 116 -17 -69 -2 -38 194
6961 194 -38 40 -112 -38 84 116 -56 -16 54 -146 -30 -10 -13 108 -43 -153 53 -103 118 -240 -70 87 32
6984 32 -152 190 -174 -135 184 125 140 12 -86 61 -71 100 -61 -37 -94 53 28 81 -203 73 -131 -48 -8 0
7008 0 60 -199 26 78 -131 10 -223 -158 92 56 128 -28 79 -34 129 -24 -124 36 14 134 -99 77 33
7031 33 -104 93 75 154 -55 107 34 176 -38 36 -31 -54 82 12 111 87 -102 -99 -86 64 -74 -5 24 -65 78
7056 78 74 -55 31 9 51 187 -145 -6 218 -128 56 197 -141 18 -44 -165 -10 -148 30 -98 -13 93 -58
$$ packed form
6884bJ00m8k98L01l4k81L72q5j18L29k57q0J74k51K80K3k07J20j1o7J91l28O7
6907a10Q7N3j93J93Pj18O9J39j31P0l7J5KQ4Jj15QJ7j87P5J06j36O1oQ0J79k46
6934c3P0J9j51n5O4KP2k6J16N8K3j90j3j7j0Q0j55J34n9L4p3K26j33n2O7l6K32
6961A94k32P8j52P4J22L2j72M0P0k00J16K0lJ21j51j10K06j56K21l58J70J57n5
6984C2j84L42l64L9L19n9J5j28r8J47j32J71j61K4n7J47k5N3k84K76k04Q3M0Q
7008@O0k59K25N2k09J41k33O5K50l6P2j56J07j13J63j53j00J60k2J20k33J76m4
7031C3j37J97j8P9k09J62p3J42k14P4o7k3J36p0R9k4j89LJ3J50j38O9K9q9J43
7056G8mj29Q6k2M2J36l32J39K24l46J84J41l38J59o2j21J55j38J78j28Q5J06j51
$$ plain form
7079 -58 34 99 -150 -15 34 -142 -53 57 -24 -203 -43 -69 -155 75 -98 -106 -198 -112 -54 -62 31 -67 41 114 -61 117
7105 117 99 15 199 70 -35 184 91 -5 127 34 -79 -45 72 -202 44 43 0 85 78 5 -2 149 -9 148 -29
7130 -29 53 66 -123 -104 94 45 -38 16 48 105 -123 112 13 -85 -1 -10 -61 -145 -26 -298 -52 62 -129 33 79 40
7156 40 258 94 -62 -50 59 -5 39 -66 42 130 87 62 -94 110 -30 11 53 76 -81 -121 -28 -109 22 -11 -73
7181 -73 8 -3 143 -119 -53 -129 -12 -5 62 -48 -114 144 326 86 56 -88 -112 -133 33 145 -244 -120 -178 21
7205 21 -96 197 -27 -69 37 -172 155 74 76 85 232 65 9 67 -99 -69 -71 -48 -20 -26 110 5 -141 44 190
7230 190 -4 -40 -3 102 35 68 -15 -93 -15 73 170 -94 -150 -73 35 -75 -81 245 -6 252 -3 -21 -134 -38 -73
7255 -73 -27 -79 -56 7 114 117 72 123 114 -129 67 -13 26 221 -28 153 169 13 145 73 141 47 59 -46 85 -113
$$ packed form
7079e8R2O5k49J35M9j76Q9J10q1j79J60k6q6K30j73qr2Q6N8qR3r8J08P3j75J78
7105A17j8q4J84j29j05K19r3r6J32r3j13L4J17k74K46jm3Q5pp3pJ51j58J57j77
7130b9Q2J3j89J9J98m9q3N4L2N7k28K35r9r8Q4rn1q4J19k72K46J14j91J62M6l9
7156D0K18j64j56J2J09o4M4j05J08Q8m3k5j56K04j40M1M2K3j57m0R3q1J31l3o2
7181g3Q1j1J46k62O6p6J17PO7j10o6K58J82k40l0j44k4k1J66J12l89J24n8J99
7205B1j17K93k24m2J06k09L27q1KRJ47j67n6N8j66L0kK3K8oJ36j05j46J85J46
7230A90j94l6L7J05o7L3q3p8P8Q8R7k64n6P7J08j10oL26k51K58k55j8j13R6l5
7255g3M6n2K3O3J07Lm5N1rk43J96q0L9J95k49J81J6j56J32p2O8r4J2j05J31j98
$$ plain form
7281 -113 9 77 24 16 72 6 -26 -63 -38 -149 -12 126 175 25 -81 -56 60 -121 70 -84 103 -8 -159 -64
7305 -64 -26 97 -34 77 46 -79 -27 167 17 -58 268 7 -157 318 125 -84 -9 -104 22 -36 -48 -56 -55 -42 56
7330 56 116 -83 47 -24 36 -132 120 13 4 -171 -21 47 -171 225 -33 79 126 -5 -149 -326 -138 20 82
7353 82 -104 -72 -177 -34 38 0 6 -7 189 237 -18 -99 -53 11 -12 -102 82 115 -22 -53 -151 2 -26 -22 37 228 -33
7380 -33 115 28 -47 175 -177 34 112 20 139 -91 -1 -144 9 10 56 -12 382 105 12 -150 97 35 -78 -272
7404 -272 -114 18 109 -93 -131 -201 5 -77 150 123 130 -93 103 -160 -45 -57 -62 34 -8 80 -69 17 -102 -3 42
7429 42 137 -136 -37 -190 23 96 -94 -40 -47 -172 104 -90 24 -110 -30 -4 50 2 18 7 119 146 226 56 104
7454 104 -9 97 84 -80 76 -39 -34 -54 -73 33 43 79 -38 50 -40 -58 -114 -68 37 -64 -26 20 -221 42 58
$$ packed form
7281a13J22O8n3qN6o6l2l7K5j11J37J38M9j50j06K5J16j81J91j54J87j11j51R5
7305f4L8J23j31J11l1j25N2J94j50p5L26k61j64M75j93k09P5r5J26n8j2qJJ3R8
7330E6O0j99J30p1O0j68K52j07rj75J50O8k18L96k58J12M7j31j44j77J88J58O2
7353H2j86L2j05J43P2l8Oj3J96M8k55q1M6O4k3r0J84L3j37l1r8J53k8MN9J91k61
7380c3J48q7p5K22l52K11P8r2J19k30R0j43J53JM6o8L94k77r3j62K47o2j13j94
7404b72J58J32R1k02l8p0K06q2K27k7Pk23J96k63J15j2nR6m2Q8j49Q6j19R9M5
7429D2R5k73R9j53K13P3j90N4pj25K76j94J14j34Q0K6N4m8J6j1J12K7Q0j70M8
7454A04j13J06j3j64J56j15Nk0j9J06J0L6j17Q8r0j8n6M6J05j01L8M6k41K63J6
$$ plain form
7479 58 47 78 -125 4 -23 -68 76 159 26 -166 159 -126 11 -179 -2 150 -75 -28 56 -70 98 -143 25
7502 25 -157 1 215 -85 49 -108 213 -191 -179 -99 -13 -107 146 95 -48 0 -42 127 -39 163 79 28 24 -41
7526 -41 87 -127 -153 -153 -117 52 10 -45 -132 83 76 44 -19 -197 37 -187 -48 -44 -185 -39 -244 172 69 62 -24 -196
7552 -196 -143 100 144 92 50 -141 -60 -23 -123 20 122 -114 -103 179 -99 -10 125 6 92 205 -136 122 48
7575 48 -43 65 116 175 -19 10 5 68 -101 -71 -58 40 -18 -121 -17 -41 93 -144 -3 -76 -35 166 5 -128 -66
7600 -66 -23 -47 -118 -87 85 -79 14 85 3 -53 208 -37 -119 -94 -73 -269 -10 115 19 -58 147 -6 -29 41 11 -30
7626 -30 -121 23 7 24 96 -135 -3 62 -101 50 -60 84 40 -75 57 113 -333 55 -22 -27 -98 -5 -22 47 -5
7651 -5 -97 34 154 -156 12 90 -9 -31 -41 88 17 -160 -71 188 -77 207 -66 44 -151 -19 124 -52 -49 80
$$ packed form
7479E8j1L1k03J29k7m5J44Q3j33j92L25k85J37j90J77J52k25M7Q4j26J68k41J68
7502B5j82J58K14l00J34j57L21m04J2Q0Q6r4K53n1j43M8m2J69j66K02q4n1mo5
7526d1J28k14k6%L6J69m2n5q7K15pl2o3j78K34k24J39Mj41J46k05M16j03pq6j72
7552a96N3K43M4n2m2j91Q1L7j00J43J02k36J1K82k78Q9J35j19Q6J13l41K58p4
7575D8r1J08N1N9j94K9nO3j69L0J3R8n8j03J04k4J34k37J41p3M1K01j61j33O2
7600f6M3k4p1L1J72j64R3P1q2n6K61k45q2K5K1j96K59J25r6p7K05j53k3P0l0m1
7626c0r1J44j6J7P2k31J32O5j63J51j10J44m4j15J32N6m46L88p7np1R3j7O9n2
7651er2J31J20l10J68P8r9k2j0J29p1j77Q9K59k65K84k73J10j95J32J43j76LJ29
$$ plain form
7675 80 -75 -157 9 -118 -117 134 164 13 -46 -70 -107 7 -194 -266 -75 105 -57 90 28 -129 -55 194 -256 -62
7699 -62 108 -143 11 -145 1 251 -83 -111 -166 -244 -89 -16 -93 -18 1 93 -112 61 60 -81 -10 -138 -45 83
7723 83 -23 -36 -161 -90 26 128 94 -87 106 112 390 -228 48 44 -56 -127 131 -62 28 68 -135 -10 43 -234
7747 -234 -63 -37 -72 -7 111 -46 8 33 17 126 -56 -127 15 -89 123 74 11 2 -42 74 -69 7 -176 -57
7771 -57 -169 -23 60 -54 -40 -54 9 217 -92 -13 45 120 140 174 96 83 -103 -62 -15 -63 -77 -134 -113 -2 2 -127 227
7798 227 -32 109 54 35 -29 77 -20 -77 82 18 279 -84 0 -74 140 26 133 -64 -56 20 -10 -128 49 170
7822 170 -53 -167 -58 30 -7 193 66 -38 -59 -84 137 -25 10 -192 -277 44 42 132 -101 -141 17 12 53 -96
7846 -96 -32 1 40 69 99 -16 145 -25 -296 -74 -80 -107 -116 -124 -24 11 -48 -53 49 69 24 15 18 -38 170 136 -184 193
$$ packed form
7675H0j55q2J66j27JK51L0j51n9k4l7J14k01p2J91J80j62J47o2j57P4K49m50J94
7699f2J70k51J54j56J46K50l34k8n5p8J55P3p7P5J9R2k05J73jj41P1j28R3J28
7723H3j06j3j25P1J16J02l4j81J93OK78o18K76mj00p1K58j93R0M0k03J25N3k77
7747b34J71K6l5O5J18j57N4K5j6J09j82p1J42j04K12m9o3rm4J16j43P6j83J19
7771e7j12J46Q3j14J4j4O3K08l09P9N8P5K0L4p8j3j86M1M7m8j4n7K1J11Mj29L54
7798B27k59J41n5j9o4J06r7n7J59o4K61l63Q4p4K14j14J07j97QP6l0j18J77J21
7822A70k23j14J09Q8l7K00j27j04k1k5K21j62L5k02q5L21kR0k33m0J58nM1j49
7846i6O4L3L9K9L0j15J61j70k71K22ok7rqJ00L5n9nJ02K0m5rLn6K08l4l20L77
$$ plain form
7874 193 -123 0 9 -18 28 64 -79 110 -6 -2 62 -188 -9 11 -180 101 52 -132 10 68 -124 94 29 12
7898 12 -174 59 -97 116 62 -29 -179 -153 -84 -75 -59 -92 -32 84 79 -99 -137 147 -72 145 16 -17 254 -13 -161
7923 -161 81 -122 -46 159 34 -104 -148 122 65 73 50 72 0 76 20 22 -78 104 67 64 78 -66 -59 -21 -223 195
7949 195 0 31 185 -160 -46 73 4 17 1 207 148 97 23 0 -83 -111 44 45 13 -153 -28 132 2 -170
7973 -170 -20 -142 -61 -106 -71 -232 170 82 91 60 113 117 -17 53 10 56 21 -138 -17 52 91 73 212 71 54 112
7999 112 3 -166 -25 89 -18 14 20 -129 5 35 78 81 -24 -141 116 -71 134 -33 -37 -6 88 -128 76 -37
8023 -37 74 32 35 135 3 -114 -96 21 -240 -39 -30 -62 -127 -135 -49 -26 155 31 54 73 -142 -57 31 -169 89 91
8049 91 90 -212 -91 -33 -127 59 14 -137 -1 264 77 -96 157 -122 -82 -44 60 15 -69 84 89 -100 55 114
$$ packed form
7874A93l16J23Rk7M6L6j43J89j16MO4k50J79K0j91K81m9j84J42N8j92K18o5j7
7898A2j86K33j56K13n4r1j50K6O9RJ6l3O0J16nj78l8K84k19K17j29l3K71k67j48
7923a61K42k03P6K05j25j38m4K70n7Qk3K2p2P6n6Kj00J82l7lJ4j44PL8k02M18
7949A95j95L1J54l45J14J19o9J3j6K06n9n1p4k3q3k8J55Jl2j66J25J60j30j72
7973a70J50j22Q1m5L5j61M02q8Rl1N3Mj34P0m3M6l5j59J21O9L9j8J39j41j7N8
7999A12j09j69J41J14j07L2Oj49J34L0M3Lj05j17K57j87K05j67mL1R4k16K04j13
8023c7J11m2LJ00j32j17J8J17k61K01Rl2o5qQ6K3J81j24K3J9k15Q5Q8k00K58K
8049I1jl02J21N8r4J86m5j51J36K65j87j73K53k79M0L8J04m5q4J53Nj89J55N9
$$ plain form
8073 114 -95 -59 -102 34 -117 -65 -68 69 17 -33 -116 -38 18 83 -187 -62 13 97 -83 -150 18 127 103 -294 -44
8098 -44 -45 -98 81 -60 151 69 -58 193 -121 184 163 -89 18 13 -93 61 224 34 -36 -81 120 -35 97
8121 97 -102 83 31 65 -62 -48 -61 -40 23 33 -103 -107 -29 120 35 22 57 139 -49 -19 -136 -171 -90 -15 163 -124
8147 -124 86 17 -183 -36 -38 86 137 -14 98 -97 -124 -17 60 -94 183 179 -48 62 -235 24 -32 -60 -47 252
8171 252 45 -173 -64 -168 27 152 8 -231 -23 135 156 79 38 37 149 -11 68 98 75 -50
$$ packed form
8073A14k09L6m3J36j51N2lJ37n2n0q3P8N6O5k70J25P5Q4j80o7J68J09k4l97K50
8098d4jn3J79j41K11q2j27K51l14L05k1k52J07nj06J54J63j90p0m5K01j55J32
8121I7j99J85n2L4j27J4j3K1O3J0j36mP8J49q5j3L5Q2j88L0j17l5Q1P5J78k87
8147a24K10o9k00J47kJ24N1j51J12j95k7J07P7j54K77mk27J10k97K59n6k8J3K99
8171B52k07k18J09j04J95J25j44k39K08J58K1p7m1jJ12j60P9L0k3j25
8191e0
$$ Imaginary data points
##PAGE= N=2
##DATA TABLE= (X++(I..I)), XYDATA
$$ plain form
0 0 0 0 0 0 0 0 0 0 -8 8 -8 8 -11 16 -24 27 -32 40 -52 64 -75 91 -111 129 -152 179 -208 241 -278 323 -371
31 -371 423 -481 545 -617 697 -783 879 -984 1098 -1224 1363 -1513 1675 -1858 2053 -2267
47 -2267 2500 -2753 3033 -3341 3679 -4055 4469 -4931 5451 -6037 6703 -7473 8367 -9422
61 -9422 10695 -12259 14236 -16829 20381 -25594 34064 -50954 159372 -417100 19555 297318
73 297318 -480251 299760 75452 -324903 368039 -50588 -222529 277833 -262460 40602
83 40602 254420 -326422 146574 116227 -315577 282109 -50884 -244139 340536 -193859
93 -193859 -145954 346872 -287337 -12631 276188 -317393 87007 151327 -282494 182490
103 182490 2670 -192292 244491 -129806 -103299 224579 -203387 43515 156259 -285118
$$ packed form
0@%%%%%%%%qJ6j6J6j9K7m0N1n9P2r2J16j39J66k02K40k81L31l87M49n19O01o94
31c71P94r04J026j162J314j480J662j863K082k322K587k876L188l533L911m320
47b267M767n253N786o374P020p734Q524r400J0382j1488J2740j4176J5840j7789
61i422K0117k2954K6495l1065L7210m5975N9658q5018K10326n76472M36655K77763
73B97318p77569P80011k24308m00355O92942m18627j71941N00362n40293L03062
83D0602K13818n80842M72996l0347m31804N97686l32993j93255N84675n34395
93a93859M7905M92826o34209K74706K88819n93581M04400O4320m33821M64984
103A82490j79820j94962M36783l74297K6507L27878m27966K46902J12744m41377
$$ plain form
113 -285118 148569 115168 -249530 189069 -31500 -157631 266904 -156762 -112077 260883
123 260883 -178043 18835 164120 -251887 141609 110710 -241437 183290 628 -151480
133 -151480 227233 -114424 -82074 220134 -164878 19316 151768 -200075 112494 70320
143 70320 -177682 175696 -33924 -124156 209712 -129101 -53828 206376 -189711 37452
153 37452 158978 -227967 113342 92982 -220527 156762 20547 -154766 169152 -77346
163 -77346 -75905 165112 -133055 -1117 100816 -145258 100576 16190 -161843 166192 -43870
174 -43870 -119744 177303 -128813 -43279 185104 -183421 10748 144215 -183449 75651
184 75651 66173 -166282 127660 -5425 -111527 138957 -79196 -36788 125336 -128096 38369
$$ packed form
113b85118M33687l3401l64698M38599k20569j26131M24535m23666M4685L72960
123B60883m38926J96878J45285m16007L93496l0899l52147M24727j82662j52108
133a51480L78713l41657L2350L02208l85012J84194J32452l51843L12569m2174
143G0320k48002L53378k09620r0232L33868l38813P5273K60204l96087K27163
153C7452J21526l86945L41309k0360l13509L77289j36215j75313L23918k46498
163g7346J441K41017k98167J31938J01933k46074K45834q4386j78033L28035k10062
174d3870p5874K97047l06116Q5534K28383l68525J94169J33467l27664K59100
184G5651r478k32455K93942j33085j06102K50484k18153M2408J62124k53432J66465
$$ plain form
195 38369 82166 -147542 109135 25238 -139437 147717 -35410 -93106 157169 -95090 -33366
206 -33366 146122 -130452 24518 101001 -134027 83432 33693 -116165 126689 -27666
216 -27666 -80291 133096 -76455 -17716 111450 -120395 45386 78453 -129314 86947 19669
227 19669 -101746 121314 -47227 -66772 132484 -94401 -13166 109831 -127989 46579
237 46579 69289 -138021 91363 19767 -120432 117134 -31393 -81555 115376 -75668 -24955
248 -24955 92677 -100504 27624 48544 -99775 73275 -7837 -80029 106059 -61551 -43531
259 -43531 113200 -104898 919 99749 -124615 44106 65702 -125425 80681 24188 -103992
270 -103992 94141 -18586 -55575 88124 -61741 -3031 70780 -82814 44350 31690 -83992
$$ packed form
195C8369M3797k29708K56677q3897j64675K87154j83127n7696K50275k52259O1724
206c3366J79488k76574J54970P6483k35028K17459m9739j49858K42854j54355
216b7666n2625K13387k09551N8739J29166k31845J65781L3067k07767K16261o7278
227A9669j21415K23060j68541j9545J99256k26885Q1235J22997k37820J74568
237D6579K2710k07310K29384p1596j40199K37566j48527n0162J96931j91044N0713
248b4955J17632j93181J28128K0920j48319J73050q1112p2192J86088j67610J8020
259d3531J56731k18098J05817R8830k24364J68721K1596j91127K06106n6493j28180
270a03992J98133j12727l6989J43699j49865N8710P3811j53594J27164j2660j15682
$$ plain form
281 -83992 90098 -16495 -72707 116577 -52114 -43504 112545 -83046 -428 94399 -102285
292 -102285 36685 61898 -92318 64353 11196 -68604 84493 -31562 -36720 80592 -64129
303 -64129 10429 60103 -89617 49318 32758 -86100 74121 -11003 -66344 94558 -47532
314 -47532 -41133 87618 -71519 2976 61092 -91928 42080 35610 -87255 63008 -6575
325 -6575 -62806 81722 -48135 -37016 80072 -66196 1001 51518 -79999 41262 23907
336 23907 -77749 62331 -11517 -48616 75063 -54147 -17518 77088 -74684 13964 53533
347 53533 -83680 52301 27630 -84468 70860 1696 -57980 72498 -33199 -25701 70138
358 70138 -50360 4168 44091 -54527 42639 9814 -56030 67352 -17531 -35564 73790
$$ packed form
281h3992J74090j06593n6212J89284j68691Q610J56049j95591Q2618R4827j96684
292a02285J38970K5213j54216J56671n3157p9800J53097j16055n158J17312j44721
303f4129P4558M9674j49720J38935j6560j18858J60221q5124n5341J60902j42090
314d7532O399J28751j59137P4495N8116j53020J34008o470j22865J50263o9583
325f575n6231J44528j29857J1119J17088j46268O7197N0517j31517J21261j7355
336B3907j01656J40080p3848l7099J23679j29210L6629R4606j51772Q8648L9569
347E3533j37213J35981k4671j12098J55328o9164n9676J30478j05697P498R5839
358G0138j20498N4528L9923r8618R7166l2825o5844J23382q4883j8033J09354
$$ plain form
369 73790 -51999 -9303 77348 -73625 11218 60506 -73818 38847 29242 -70373 56103
380 56103 4769 -49221 54045 -26747 -13104 50513 -54991 14540 34719 -59535 42855
391 42855 2433 -59122 67103 -21635 -48692 69883 -43278 -19128 61303 -65070 6735
402 6735 46956 -64997 27986 16554 -54969 49645 -13159 -40022 53531 -35471 -9078 46213
414 46213 -56853 16960 34761 -59340 36357 7776 -49694 57217 -17782 -36863 58518 -34496
426 -34496 -7670 47689 -54079 20114 37064 -58063 37414 12107 -45547 54885 -15379 -33530
438 -33530 59313 -29545 -11407 46222 -42546 16968 30161 -48083 34120 7827 -35531 46800
450 46800 -20608 -20844 54128 -39552 -3354 44930 -52004 21699 30456 -58789 35477 14632 -47851
$$ packed form
369G3790j25789M2696Q6651j50973Q4843M9288j34324J12665r605r9615J26476
380E6103n1334n3990J03266q0792J3643O3617j05504O9531K0179r4254J02390
391D2855m0422o1555J26225q8738k7057J18575j13161K4150Q0431j26373P1805
402F735M0221j11953R2983j1432p1523J04614o2804k6863R3553q9002K6393N5291
414D6213j03066P3813J7801r4101R5697k8581n7470J06911p4999j9081R5381r3014
426c4496K6826N5359j01768P4193J6950r5127R5477k5307n7654J00432p0264j8151
438c3530R2843q8858J8138N7629q8768N9514J3193p8244Q2203k6293m3358Q2331
450D6800o7408k36P4972r3680L6198M8284r6934P3703Q757q9245R4266k0845o2483
$$ plain form
463 -47851 40910 -9060 -31250 44136 -25056 -12367 30439 -33676 15119 11641 -41910 33961
475 33961 -3384 -35564 43209 -26068 -21819 50761 -41882 -9844 43596 -45308 9622 27193
487 27193 -47812 25030 12241 -38570 30286 -9029 -18177 33696 -28317 -280 28820 -36288
499 -36288 19016 14722 -40018 37257 406 -35739 44059 -14171 -19902 43137 -28803 -3365
511 -3365 37343 -35366 13227 21791 -33938 29575 2732 -27990 36800 -12690 -13471 36397 -28375
524 -28375 2453 31381 -35150 15896 16318 -32810 29411 -582 -27502 34829 -13971 -13880 31608
537 31608 -28802 3505 26330 -36910 15275 13990 -34298 26486 -2094 -29278 32600 -14504
549 -14504 -18404 29648 -24043 -2403 19902 -28802 12249 7316 -28112 23031 -6784 -20617
$$ packed form
463d7851Q8761m9970k2190P5386o9192J2689M2806o4115M8795l478n3551P5871
475C3961l7345l2180P8773o9277M249P2580r2643L2038N3440q8904N4930J7571
487B7193p5005P2842j2789n0811O8856l9315r148N1873o2013K8037K9100o5108
499c6288N5304m294n4740P7275l6851l6145P9798n8230n731O3039p1940K5438
511c365M0708p2709M8593Q564n5729O3513k6843l0722O4790m9490p81M9868o4772
524b8375L0828K8928o6531N1046M22m9128O2221k9993k6920O2331m8800R1M5488
537C1608o0410L2307K2825o3240N2185j285m8288O0784k8580k7184O1878m7104
549a4504l900M8052n3691K1640K2305m8704M1051m933l5428N1143k9815j3833
$$ plain form
561 -20617 29733 -22098 -9081 31749 -32071 1522 26557 -34422 12971 16377 -33099 21977
573 21977 4757 -24258 24262 -7892 -9909 21794 -17922 5458 14629 -23623 19857 4307
585 4307 -23665 30047 -7921 -17479 34657 -18077 -9077 32882 -23542 1476 24566 -25236 12255
598 12255 12419 -21291 19545 -1596 -13112 22785 -13088 -2806 20137 -22874 9612 14791 -27386
611 -27386 17916 5252 -23963 23818 -6069 -18773 25783 -14323 -9466 20924 -21080 2702
623 2702 13692 -23154 11125 3650 -19920 18723 -7706 -15168 21707 -15798 -5498 18323 -22269
636 -22269 4875 13013 -23310 12147 3545 -19134 18892 -7751 -12391 21647 -15985 -2962 18860
649 18860 -21315 7562 13676 -23943 15526 6970 -20768 19532 -1909 -12957 20716 -9260
$$ packed form
561b0617N0350n1831J3017M0830o3820L3593K5035o0979M7393L406m9476N5076
573B1977j7220k9015M8520l2154k017L1703l9716K3380R171l8252M3480j5550
585D307k7972N3712l7968r558N2136n2734R000M1959n6424K5018K3090m9802L7491
598A2255J64l3710M0836k1141j1516L5897l5873J0282K2943m3011L2486N179m2177
611b7386M5302j2664k9215M7781k9887j2704M4556m0106M857L0390m2004K3782
623B702J0990l6846L4279p475k3570L8643k6429p462L6875l7505J0300K3821m0592
636b2269K7144Q138l6323L5457q602k2679L8026k6643m640L4038l7632J3023K1822
649A8860m0175K8877O114l7619L9469q556k7738M0300k1441j1048L3673k9976
$$ plain form
661 -9260 -4891 17044 -12416 5579 8954 -15024 15985 851 -13184 20467 -8474 -7010 23748
674 23748 -17087 -2563 22550 -19748 4307 15732 -20586 10382 8845 -16676 11792 -580
686 -580 -8479 12872 -9869 -691 10285 -15301 9121 3637 -18721 16921 -1924 -18251 19728
699 19728 -8594 -12899 20408 -14625 -6634 17183 -16255 -58 9079 -14982 7289 1006 -12894
712 -12894 11497 -5992 -6000 11809 -13984 2053 11559 -17957 7245 7349 -16974 13312 855
725 855 -15716 17123 -3380 -9718 15441 -8929 -1658 13861 -12517 3938 8966 -11595 11227
738 11227 1167 -11015 15541 -3238 -6826 14287 -8572 403 13560 -12778 4958 9038 -11665
751 -11665 10051 769 -9278 14709 -5360 -6566 14653 -10088 27 12234 -15268 5618
$$ packed form
661i260M369K1935k9460J7995L375k3978L1009j5134j4035L3651k8941J464L0758
674B3748m0835J4524K5113m2298K4055J1425l6318L0968j537k5521K8468j2372
686e80p899K1351k2741R178J0976k5586K4422n484k2358L5642j8845j6327L7979
699A9728k8322m305L3307l5033P991K3817l3438J6197R137k4061K2271o283j3900
712a2894K4391j7489qJ7809k5793J6037R506k9516K5202J04k4323L0286j2457
725H55j6571L2839k0503o338K5159k4370P271J5519k6378J6455N028k0561K2822
738A1227j0060j2182K6556j8779l588K1113k2859Q975J3157k6338J7736M080k0703
751a1665K1716r282j0047K3987k0069j206K1219k4741J0115J2207k7502K0886
$$ plain form
763 5618 9385 -15745 7752 3913 -12414 9816 -2123 -8534 9469 -6482 -2145 5312 -10102
776 -10102 5062 1269 -11817 9748 -3655 -10500 14114 -8985 -8883 15359 -11116 -5058 12448
789 12448 -12378 -401 9828 -11962 2059 4255 -7288 5239 -2713 -2936 6774 -6657 2201
802 2201 5214 -10126 8248 3624 -12662 12204 1135 -11219 13540 -2511 -7800 14068 -4959
815 -4959 -4129 11688 -6103 1049 7158 -6523 5354 2355 -4581 7818 -2907 -1728 9017 -6977
829 -6977 1318 8254 -9451 5067 5237 -10131 7767 2096 -8937 8789 -1676 -6343 8848
842 8848 -5654 -2532 6949 -7806 1287 3571 -8730 4660 751 -8529 6480 -2810 -5655 6789
856 6789 -5513 -2382 4846 -6915 1249 1976 -7213 4972 -1486 -6694 7776 -4826 -4517 8895
$$ packed form
763E618L767k5130K3497l839j6327K2230j1939o411J8003j5951M337P457j5414
776a0102J5164l793j3086K1565j3403o845K4614k3099J02K4242k6475O058J7506
789A2448k4826J1977J0229k1790J4021K196j1543J2527p952k23R710j3431Q858
802B201L013j5340J8374m624j6286K4866j1069j2354K4759j6051n289K1868j9027
815d959Q30J5817j7791P152O109j3681J1877k999o936J2399j0725J179J0745j5994
829f977Q295O936j7705J4518J70j5368J7898n671j1033J7726j0465m667J5191
842H848j4502L122R481j4755R093K284j2301J3390l909r280J5009r290k845J2444
856F789j2302L131P228j1761Q164P27r189J2185o458n208J4470j2602L09J3412
$$ plain form
870 8895 -7424 -2216 8721 -8311 -86 7129 -7971 2180 4393 -5629 3295 1278 -2237 3181
884 3181 -1435 1338 2769 -4141 5667 934 -6024 9196 -441 -6418 10660 -1881 -5846 11264
898 11264 -3335 -4248 10024 -3657 -2031 6578 -2978 464 2871 -1966 2353 -814 -136 3512 -4784
913 -4784 2490 3341 -7362 4293 2141 -8234 6137 724 -8472 7047 -1181 -6866 6345 -2872
927 -2872 -4522 4656 -3707 -1851 2501 -4149 1190 -651 -3798 3247 -3300 -2076 3849 -5553 -151
942 -151 4286 -6399 1649 3022 -6492 3510 949 -5368 5248 -962 -3380 5360 -2757 -1368 5106
957 5106 -4182 982 4065 -3961 2819 1815 -3015 4004 750 -1707 3827 -1016 846 2580 -2530
972 -2530 3621 1250 -2866 5437 -981 -2937 6775 -2374 -2930 7612 -3611 -2518 6787 -3431 -1638
$$ packed form
870H895j6319N208J0937j7032Q225P215j5100J0151K213j0022Q924k017l515N418
884C181m616K773J431o910R808m733o958J5220r637n977J7078j2541l965J7110
898A1264j4599r13J4272j3681J626Q609r556L442K407m837M319l167O78L648q296
913d784P274Q51j0703J1655k152j0375J4371n413r196J5519q228n685J3211r217
927b872j650R178q363J856M352o650N339j841l147P045o547J224N925r402N402
942a51M437j0685Q048J373r514J0002k561o317J0616o210k418Q740q117J389O474
957E106r288N164L083q026O780j004m830P019l254k457N534m843J862J734n110
972b530O151k371m116Q303o418j956R712r149n56J0542j1223J093R305j0218J793
$$ plain form
987 -1638 5049 -2868 -887 3189 -2056 -225 524 -264 87 -2090 1672 -213 -4148 3019 -408 -5526
1003 -5526 4350 -652 -6449 5097 -1312 -6043 5265 -1482 -5174 3957 -1949 -3150 3065 -2590
1017 -2590 -967 770 -1495 707 -1582 -377 1911 -2664 1092 2395 -5026 2629 2837 -5530 3756
1032 3756 2264 -5042 4124 1181 -4355 4779 519 -2779 4429 -612 -219 3310 -1264 1285 2050
1047 2050 -1467 2785 292 -1103 3828 -1447 -51 3880 -2602 1129 2946 -3227 2448 1779 -4055
1062 -4055 3817 267 -3580 4480 -1721 -2973 4991 -3114 -2044 4422 -3895 -923 3038 -4192 234
1077 234 1546 -2785 391 -1104 -1346 804 -2893 693 396 -4441 2907 -449 -5260 4406 -1236 -5195
1093 -5195 5076 -1762 -4425 4851 -2001 -3058 4298 -2164 -1487 2569 -1361 -73 478 -304 1714
$$ packed form
987a638O687p917J981M076n245J831P49p88L51k177L762j885l935P167l427n118
1003e526R876n002n797J1546o409m731J1308o747l692R131n906j201O215n655
1017b590J623J737k265K202k289J205K288m575L756J303p421P655K08q367R286
1032C756j492p306R166k943n536R134m260l298P208n041L93L529m574K549P65
1047B050l517M252k493j395M931n275J396L931o482L731J817o173N675o69n834
1062d055P872l550l847Q060o201j252P964q105J070O466q317K972L961p230M426
1077B34J312m331L176j495k42K150l697L586k97m837P348l356m811R666n642l959
1093e195J0271o838k663R276o852j057P356o462O77M056l930J288N51p82K018
$$ plain form
1108 1714 -1367 637 2381 -3350 2457 2722 -4242 3653 2749 -4946 4603 2167 -4900 5207 1191
1123 1191 -3701 4394 -184 -2009 4124 -564 -821 2398 -943 1118 315 -1235 2845 -1386 -273
1138 -273 3038 -3255 466 3477 -4773 1637 2703 -5120 2316 1285 -4818 2980 -320 -3879 3439
1153 3439 -1638 -2928 2938 -3075 -799 2211 -3617 313 908 -3134 1245 -775 -2673 2514 -1806
1168 -1806 -1213 2042 -3248 939 1551 -4289 2793 923 -4271 4125 -391 -3989 5357 -1313 -3001
1183 -3001 5238 -2072 -1743 4281 -2242 -58 2710 -1779 1561 667 -665 2441 -1528 1109 2982
1198 2982 -3563 2300 2989 -4434 3786 2563 -4991 4538 1523 -4484 4452 268 -3632 4315 -682
1213 -682 -2191 2709 -976 -133 838 -1442 1508 -524 -1171 2199 -2878 -102 3129 -4699 717 2752
$$ packed form
1108A714l081K004J744n731N807K65o964P895r04p695R549k436p067J0107m016
1123A191m892Q095m578j825O133m688k57L219l341K061q03j550M080m231J113
1138b73L311o293L721L011q250O410J066p823P436j031o103P798l300l559P318
1153C439n077j290N866o013K276L010n828L930N95m042M379k020j898N187m320
1168a806N93L255n290M187O12n840P082j870n194Q396m516l598R346o670j688
1183c001Q239p310L29O024o523K184K768m489L340q94j332L106l969K637J873
1198B982o545N863O89p423Q220j223p554R529l015o007Q936m184l900P947m997
1213f82j509M900l685Q43R71k280K950k032o47L370n077K776L231p828N416K035
$$ plain form
1229 2752 -5527 1687 1961 -5306 2295 684 -5061 3030 -642 -3461 2855 -1828 -1314 2267 -3041
1244 -3041 132 1175 -3144 1997 -313 -2449 3257 -1919 -1435 3438 -3188 123 3457 -3840 1489
1259 1489 2212 -4015 3357 939 -3546 4056 -295 -2144 3927 -1576 -595 4132 -2321 602 3063
1274 3063 -2578 1833 1011 -1625 2440 -387 -584 2809 -2162 1173 2533 -3729 2654 1811 -4425 3546
1290 3546 872 -4251 4092 -163 -3438 3907 -1301 -2403 2732 -1674 -841 1630 -2027 399 -597
1305 -597 -1680 1889 -2383 -776 2546 -4082 399 2464 -5032 1509 2130 -5277 2181 1037 -4726
1320 -4726 3001 70 -3448 2726 -739 -1658 2211 -1853 395 1213 -2347 1984 -502 -1649 3158
1335 3158 -2013 -847 3850 -2632 155 3587 -3756 1593 2892 -3491 2782 1541 -2796 3137 44
$$ packed form
1229B752q279P214K74p267P601j611n745Q091l672k819O316m683N14L581n308
1244c041L173J043m319N141k310k136N706n176M84M873o626L311L334p297N329
1259A489P23o227P372k418m485P602m351j849O071n503R81M727o453K923K461
1274C063n641M411q22k636M065k827j97L393m971L335J360o262O383q43o236P971
1290C546k674n123Q343m255l275P345n208j102N135m406Q33K471l657K426r96
1305e97j083L569m272J607L322o628M481K065p496O541O21p407P458j144n763
1320d726P727k931l518O174l465r19L869m064K248Q18l560M331k486j147M807
1335C158n171J166M697o482K787L432p343N349J299o383O273j241m337N933l093
$$ plain form
1350 44 -1773 3687 -1033 -308 2854 -2419 1236 1996 -2649 2457 836 -2164 2899 -1040 -1384 3282
1366 3282 -2161 -212 2497 -3110 1479 1326 -3839 2717 282 -3736 3376 -971 -2758 3415 -2408
1381 -2408 -1916 2971 -2552 -499 1414 -2720 1120 -26 -2201 1616 -1649 -679 2169 -3626 563
1396 563 2219 -4412 1393 1719 -4637 3126 641 -4373 3642 -104 -2974 3183 -1233 -1334 2708 -1676
1412 -1676 508 1228 -1669 2244 -567 -1299 3607 -1731 -340 3700 -3136 831 3768 -4029 1735
1427 1735 2907 -3605 2668 1329 -2999 3333 61 -1950 3026 -1277 -35 2134 -2525 1453 1095
1442 1095 -2772 2646 -748 -2385 3548 -1997 -1929 3541 -3086 -294 2671 -3794 1041 1877 -3755 1997
1458 1997 289 -3103 2697 -1602 -1921 2844 -2665 -642 2104 -3539 1033 1215 -3449 2328 -40
$$ packed form
1350D4j817N460m720P25L162n273L655P60m645N106j621l000N063l939l44M666
1366C282n443J949K709n607M589j53n165O556k435m018P112m347j787O173n823
1381b408M92M887n523K053J913m134L840j146k175L817l265R70K848n795M189
1396E63J656o631N805L26o356P763k485n014Q015l746k870O157m416j01M042m384
1412a676K184P20k897L913k811p32M906n338J391M040o836L967K937p797N764
1427A735J172o512O273j339m328O332l272k011M976m303J242K169m659L978l58
1442A095l867N418l394j637N933n545O8N470o627K792K965o465M835Q36n632N752
1458A997j708l392N800m299l19M765n509K023K746n643M572J82m664N777k368
$$ plain form
1473 -40 -2529 2615 -1754 -1335 2958 -2706 219 1982 -3504 2147 1366 -3706 3193 142 -2935 3883
1489 3883 -1098 -2127 3812 -1650 -542 3209 -1989 970 1578 -1986 2333 -21 -1303 3009 -1747
1504 -1747 -274 3446 -3262 984 2991 -3883 2249 1947 -3976 2911 833 -3188 3287 -522 -2016
1519 -2016 2876 -1745 -272 1667 -2420 1275 234 -2501 2681 -1020 -2174 3562 -2719 -1271 3297
1534 3297 -3623 -237 2691 -3950 750 1611 -3941 1972 247 -2840 2346 -1198 -1361 2236 -2418
1549 -2418 29 1707 -3055 1723 522 -3101 2789 -494 -2222 3429 -1458 -1416 3192 -2528 166
1564 166 2759 -3022 1397 1428 -2680 2677 272 -2282 3493 -1379 -934 3485 -2300 336 2743 -2801
1580 -2801 1383 1636 -2537 2300 117 -1859 2917 -1485 -717 2714 -2530 708 2270 -3270 1902
$$ packed form
1473d0k489N144m369M19M293n664K925J763n486N651p81n072O899l051l077O818
1489C883m981j029N939n462J108L751n198K959O08l564M319k354j282M312m756
1504a747J473L720o708M246K007o874O132l02n923O887k078m021O475l809j494
1519b016M892m621J473J939m087L695j041k735N182l701j154N736o281J448M568
1534C297o920L386K928o641M700Q61n552N913j725l087N186l544j63L597m654
1549b418K447J678m762M778j201l623N890l283j728N651m887M2M608n720K694
1564A66K593n781M419L1m108N357k405k554N775m872M45M419n785K636K407n544
1580b801M184K53m173M837k183j976M776m402P68L431n244L238J562n540N172
$$ plain form
1595 1902 1239 -3287 2753 -62 -2845 2862 -1125 -1717 2571 -1832 -542 1684 -2432 792 346 -2497
1611 -2497 2062 -937 -1717 2569 -2214 -1031 2692 -3128 198 2347 -3495 1165 1512 -3413 2223
1626 2223 405 -2454 1859 -875 -1070 2076 -1888 35 1311 -2125 1680 104 -2254 2838 -750
1641 -750 -1689 3401 -1641 -858 3226 -2577 272 2810 -2729 1197 1492 -2146 1918 379 -1580 2387
1657 2387 -839 -447 2148 -1992 1027 1728 -2572 1684 757 -2276 2622 -403 -2045 2775 -1193 -1188
1673 -1188 2038 -1952 387 1656 -2512 1171 802 -2509 2014 -712 -1830 2433 -1457 -1002 1994
1688 1994 -2062 -18 1489 -2684 1161 726 -2222 1669 -594 -1270 2097 -1752 -488 1923 -2379
1703 -2379 708 1599 -2799 1547 1038 -2596 1769 60 -1595 2042 -1034 -952 1924 -1252 428 924
$$ packed form
1595A902o63m526O040k815k783N707l987n92M288m403J290K226m116L224m46k843
1611b497M559k999p80M286m783J183L723n820L326K149n842M660L47m925N636
1626B223j818k859M313k734j95L146l964J923J276l436L805j576k358N092l588
1641g50r39N090n042P83M084n803K849K538n539L926K95l638M064j539j959L967
1657B387l226L92K595m140L019P01m300M256r27l033M898l025j642M820l968N
1673a188L226l990K339J269m168L683l69l311M523k726j118M263l890M55K996
1688A994m056K044J507m173L845m35k948L891k263o76L367l849J264K411m302
1703b379L087Q91m398M346n09l634M365j709j655L637l076Q2K876l176J680M96
$$ plain form
1719 924 -1551 1686 10 -1364 2135 -718 -659 2559 -1790 -268 2693 -2139 462 1927 -2242 1459
1735 1459 1172 -2154 1650 269 -957 1839 -888 -128 1658 -1541 777 663 -1936 1940 -64 -2098
1751 -2098 2368 -763 -1478 2332 -1733 -876 2121 -2033 -123 1404 -2003 846 162 -1883 1720 -661
1767 -661 -1012 1492 -1549 -148 1378 -2292 635 910 -2372 1420 163 -1971 1997 -455 -1375 1959
1783 1959 -1291 -236 1615 -1892 559 1090 -1897 1335 89 -1602 1943 -427 -1271 2037 -1123
1798 -1123 -255 1545 -1632 533 1120 -1374 1335 252 -1207 2036 -752 -671 2115 -1482 1 1825
1814 1825 -2031 571 1375 -2054 1301 379 -1665 1581 -478 -1176 1645 -962 -130 1013 -1402 939
1830 939 429 -1672 1426 -346 -1540 2048 -1279 -990 1958 -1783 -327 1725 -1964 138 1052 -2065
$$ packed form
1719I24k475L237j676j374L499k853N9L218m349J522K961m832K601J465m169L701
1735A459k87l326L804j381j226K796k727P60J786l199K318j14k599L876k004k034
1751b098M466l131p15L810m065Q57K997m154J910J527l407K849o84k045L603k381
1767f61l51K504l041J401J526l670K927K75l282L792j257k134L968k452r20L334
1783A959l250J055J851l507K451N31k987L232j246j691L545k370q44L308l160
1798a123Q68J800l177K165N87k494K709j083j459L243k788Q1K786l597J483J824
1814A825l856K602Q04l429L355r22k044L246k059o98K821k607Q32J143k415K341
1830I39n10k101L098j772j194L588l327K89K948l741J456K052l689K102R14l117
$$ plain form
1846 -2065 740 436 -1421 1037 -709 -596 1218 -1257 338 987 -1710 1037 374 -1931 1815 -63
1862 -63 -1509 2016 -778 -1017 1941 -1245 -297 1788 -1375 514 963 -1335 1145 220 -970 1531
1878 1531 -619 -502 1441 -1070 480 1396 -1856 882 780 -1672 1294 73 -1114 1774 -948 -847
1894 -847 1692 -1215 147 1196 -1591 708 922 -1532 1275 212 -1405 1422 -419 -866 1247 -1124
1910 -1124 -71 961 -1257 702 483 -1675 1109 -70 -1071 1652 -1033 -785 1656 -1407 -303
1925 -303 1266 -2016 489 780 -1751 886 372 -1233 1143 -430 -616 1260 -795 410 760 -1257
1941 -1257 1125 406 -1170 1541 -215 -1175 1978 -747 -638 1892 -1180 -408 1466 -1116 406 662
1957 662 -1091 919 281 -867 1159 -439 -183 1208 -1168 548 958 -1395 855 442 -1439 1264
$$ packed form
1846b065K805l04j857K458j746J13J814k475J595O49k697K747o63k305L746j878
1862f3j446L525k794k39K958l186R48K085l163J889M49k298K480r25j190K501
1878A531k150J17J943k511J550R16l252K738j02k452K966j221j187K888k722J01
1894h47K539k907J362J049k787K299K14k454K807j063j617K827j841m47K113k371
1910a124J053J032k218J959k19k158K784j179j001K723k685K48K441l063J104
1925c03J569l282K505K91k531K637n14j605K376j573j86J876k055J205L50k017
1941a257K382p19j576K711j756r60L153k725J09K530l072P72J874k582J522K56
1957F62j753K010o38j148K026j598K56J391k376J716M10k353K250m13j881K703
$$ plain form
1973 1264 -209 -1180 1410 -530 -809 1051 -1014 -353 983 -1106 211 354 -969 868 -43 -901
1989 -901 1169 -840 -517 986 -1156 138 998 -1198 591 364 -1275 988 -55 -814 1113 -646
2005 -646 -398 1027 -1211 -120 1201 -1176 461 618 -1088 753 -116 -1017 1026 -129 -302 770
2021 770 -672 319 695 -952 727 271 -851 1170 -121 -842 1474 -730 -605 1401 -746 -113 1245
2038 1245 -1114 320 705 -944 590 179 -554 633 -514 -218 462 -664 121 537 -1073 658 211
2055 211 -1179 976 -319 -1097 1175 -648 -916 914 -517 -339 519 -709 270 281 -871 562 -58
2072 -58 -389 607 -487 -144 693 -545 165 501 -1064 758 464 -989 486 -15 -719 930 -445 -473
2090 -473 987 -614 139 572 -734 513 114 -787 705 133 -477 755 -209 -317 538 -412 175 410
$$ packed form
1973A264j473r71K590j940k79J860k065O61J336k089J317J43j323J837r11q58
1989i01K070k009L23J503k142J294Q60k196J789k27j639K263j043p59J927j759
2005f46K48J425k238J091J321k377J637J57j706J841q69r01K043j155j73J072
2021G70j442R91L76j647J679m56j122K021j291p21K316k204J25K006k147O33J358
2038A245k359J434L85j649J534m11p33J187j147K96O80j126P85M16j610J731m47
2055B11j390K155j295p78K272j823k68J830j431J78Q58j228R79J1j152J433o20
2072e8l31R96j094L43Q37j238P10L36j565J822k94j453J475n01p04J649j375k8
2090d73J460j601P53M33j306J247l99r01J492n72o10J232r64j08Q55r50N87K35
$$ plain form
2108 410 -591 585 257 -809 730 -337 -859 841 -356 -238 1069 -717 -2 725 -575 256 454
2125 454 -714 334 43 -682 444 -318 -123 594 -490 75 241 -706 494 -55 -951 915 -111 -695
2143 -695 788 -378 -517 838 -588 -210 557 -419 -26 316 -435 360 -153 -365 668 -269 -97 313
2161 313 -533 283 423 -699 421 153 -645 592 127 -885 855 -171 -547 571 -483 -179 473
2178 473 -382 183 468 -421 414 15 -367 729 -156 -243 747 -441 118 551 -382 225 157 -788 394 23
2198 23 -540 641 -388 -176 596 -635 -3 399 -559 39 226 -504 520 151 -365 462 -261 -352 417
2217 417 -501 109 370 -807 510 381 -386 711 94 -532 681 -271 -323 729 -394 -193 518 -505
2235 -505 11 456 -170 76 -23 -198 259 -16 -248 362 -454 201 387 -531 473 241 -720 504 248 -730
$$ packed form
2108D10j001J176l28j066J539j067n22J700j197J18J307j786P15P27j300Q31J98
2125D54j168J048k91p25J126p62J95P17j084N65J66r47J200n49q96J866j026n84
2143f95J483j166j39J355j426L78P67r76L93L42p51P95n13k12J033r37J72M10
2161C13q46Q16J40j122J120k68p98J237m65j012J740j026l76J118j054L04O52
2178D73q55N65K85q89Q35l99l82J096q85q7R90j188N59M33r33O07o8r45J182l71
2198B3n63J181j029K12P72j231O32M02r58N98J87p30J024l69n16Q27p23r1P69
2217D17r18O10K61j177J317j29p67J097o17o26J213r52n2J052j123K01P11j023
2235e05N16M45o26K46r9j75M57k75k32O10q16O55J86r18J004k32r61J224k56r78
$$ plain form
2255 -730 609 89 -421 569 -283 -315 477 -260 27 321 -302 289 21 -306 373 -257 -157 512 -522 17
2275 17 410 -731 258 430 -621 197 94 -553 547 37 -384 441 -122 40 403 -439 -10 214 -467
2294 -467 432 -35 -415 336 -251 -334 387 -410 -129 423 -548 278 517 -538 240 266 -484 486 -185 -344
2314 -344 662 -6 -84 351 -364 69 316 -332 274 198 -291 269 -40 -188 367 -139 -49 271 -365 415 345
2335 345 -456 267 69 -509 523 28 -340 558 252 -232 386 -223 113 262 -341 -10 -124 -105 134 -91
2355 -91 -176 197 -352 -109 327 -447 147 395 -676 198 410 -485 222 61 -563 338 -212 -216 306 32 23 68
2377 68 -354 40 49 -317 343 -91 -148 349 -368 -373 472 -270 -55 319 -419 -24 288 -423 132 176 -321 233
2399 233 163 -138 378 -42 -103 356 -197 27 26 -89 334 189 -94 200 -100 -259 479 -317 70 129 -435 318
$$ packed form
2255g30J339n20n10R90q52l2P92p37K87K94o23N91k68l27O79o30J00O69j034N39
2275A7L93j141R89J72j051Q18j03o47J100n10m21Q25n63J62L63q42M29K24o81
2294d67Q99m67l80P51n87q3P21p97K81N52r71Q26K39j055P78K6p50R70o71j59
2314c44J006o68p8M35p15M33K47o48O06p6m89N60l09j48N55n06R0L20o36P80p0
2335C45q01P23j98n78J032m95l68Q98l06m84O18o09L36J49o03L31j14J9K39k25
2355i1q5L73n49K43M36p74N94K48j071Q74K12q95P07j61o24R01n50mN22k74rM5
2377F8m22L94Rl66O60m34n7M97p17nQ45p42K15L74p38L95L12p11N55M4m97N54
2399B33p0l01N16m20o1M59n53K24jj15M23j45k83K94l00j59P38p96L87N9n64P53
$$ plain form
2421 318 66 -619 151 148 -289 360 78 -211 465 -151 -139 228 -388 -104 197 -162 279 57 -236 105 -142
$$ packed form
2421C18k52o85P70lm37O49k82k89O76o16J2L67o16K84L01l59M41k22k93L41k47
$$ [...]
8191c0
##END NTUPLES=NMR FID
##END=
