##TITLE=1H_Glu_AcCl:Ac20
 , 8 sc, 
 23.08.2021
##JCAMPDX= 6.0         $$ Bruker NMR JCAMP-DX V2.0
##DATA TYPE= NMR FID
##DATA CLASS= NTUPLES
##ORIGIN= UXNMR, Bruker Analytische Messtechnik GmbH
##OWNER= root
$$ XWIN-NMR		Version 3.5
$$ Mon Aug 23 13:01:18 2021 Russian Standard Time (UT+4h)  she@DPX200
##.OBSERVE FREQUENCY= 200.131506
##.OBSERVE NUCLEUS= ^1H
##.DELAY= (6, 6)
##.ACQUISITION MODE= SIMULTANEOUS
##.ACQUISITION SCHEME= undefined
##.AVERAGES= 8
##.DIGITISER RES= 18
##SPECTROMETER/DATA SYSTEM= spect
##.PULSE SEQUENCE= zg30
##.SOLVENT NAME= CDCl3
##.SHIFT REFERENCE= (INTERNAL, CDCl3, 0, 15.7039)
##AUDIT TRAIL= $$ (NUMBER, WHEN, WHO, WHERE, WHAT)
$$ ##TITLE= Audit trail, XWIN-NMR		Version 3.5
$$ ##JCAMPDX= 5.01
$$ ##ORIGIN= Bruker BioSpin GmbH
$$ ##OWNER= she
$$ F:/spectra/data/she/nmr/H-F/1/audita.txt
$$ ##AUDIT TRAIL=  $$ (NUMBER, WHEN, WHO, WHERE, WHAT)
(   1,<2021-08-23 12:58:17.92 +0400>,<she>,<DPX200>,
      <created by zg, POWCHK disabled, PULCHK disabled
       configuration hash MD5:
       00 E9 B6 7A A2 85 ED C7 34 08 36 98 17 FE 4E 26
       data hash MD5: 16K
       0A CB 02 68 00 5D 23 0B A0 29 CD 3F 02 2B AC 31>)
$$ ##END=
$$ 
$$ hash MD5
$$ 02 CD 51 43 51 C2 57 A8 62 4B DB C9 17 9C E7 78
##$RELAX= 
##$RELAX= 
##$RELAX= 
##$RELAX= 
##$RELAX= 
##$RELAX= 
$$ Bruker specific parameters
$$ --------------------------
##$DU= <F:/spectra>
##$EXPNO= 1
##$NAME= <H-F>
##$PROCNO= 1
##$TYPE= <nmr>
##$USER= <she>
##$AMP= (0..31)
100 100 100 100 100 100 100 100 100 100 100 100 100 100 100 100 100 100 
100 100 100 100 100 100 100 100 100 100 100 100 100 100 
##$AQSEQ= 0
##$AQ_mod= 1
##$AUNM= <au_zg>
##$AUTOPOS= <>
##$BF1= 200.13
##$BF2= 200.13
##$BF3= 200.13
##$BF4= 200.13
##$BF5= 200.13
##$BF6= 200.13
##$BF7= 200.13
##$BF8= 200.13
##$BYTORDA= 1
##$CFDGTYP= 0
##$CFRGTYP= 5
##$CHEMSTR= <none>
##$CNST= (0..31)
1 1 145 1 1 1 1 1 1 1 1 1 1 1 1 1 1 1 1 1 1 1 1 1 1 1 1 1 1 1 1 1 
##$CPDPRG= <>
##$CPDPRG1= <>
##$CPDPRG2= <>
##$CPDPRG3= <>
##$CPDPRG4= <mlev>
##$CPDPRG5= <mlev>
##$CPDPRG6= <mlev>
##$CPDPRG7= <mlev>
##$CPDPRG8= <mlev>
##$CPDPRGB= <>
##$CPDPRGT= <>
##$D= (0..31)
0 1.2 0 0 0 0 0 0 0 0.06 0 0.03 0 0 0 0 0.0002 0 0 0 0 0 0 0 0 0 0 0 0 
0 0 0 
##$DATE= 1629709097
##$DBL= (0..7)
120 120 120 120 120 120 120 120 
##$DBP= (0..7)
150 150 150 150 150 150 150 150 
##$DBP07= 0
##$DBPNAM0= <>
##$DBPNAM1= <>
##$DBPNAM2= <>
##$DBPNAM3= <>
##$DBPNAM4= <>
##$DBPNAM5= <>
##$DBPNAM6= <>
##$DBPNAM7= <>
##$DBPOAL= (0..7)
0.5 0.5 0.5 0.5 0.5 0.5 0.5 0.5 
##$DBPOFFS= (0..7)
0 0 0 0 0 0 0 0 
##$DE= 6
##$DECBNUC= <off>
##$DECIM= 32
##$DECNUC= <off>
##$DECSTAT= 4
##$DIGMOD= 1
##$DIGTYP= 9
##$DL= (0..7)
0 120 120 120 120 120 120 120 
##$DP= (0..7)
150 150 150 150 150 150 150 150 
##$DP07= 0
##$DPNAME0= <>
##$DPNAME1= <>
##$DPNAME2= <>
##$DPNAME3= <>
##$DPNAME4= <>
##$DPNAME5= <>
##$DPNAME6= <>
##$DPNAME7= <>
##$DPOAL= (0..7)
0.5 0.5 0.5 0.5 0.5 0.5 0.5 0.5 
##$DPOFFS= (0..7)
0 0 0 0 0 0 0 0 
##$DQDMODE= 0
##$DR= 18
##$DS= 0
##$DSLIST= <SSSSSSSSSSSSSSS>
$$ [...]
##$SUBNAM2= <"">
##$SUBNAM3= <"">
##$SUBNAM4= <"">
##$SUBNAM5= <"">
##$SUBNAM6= <"">
##$SUBNAM7= <"">
##$SUBNAM8= <"">
##$SUBNAM9= <"">
##$SW= 20.0188882624521
##$SWIBOX= (0..15)
0 0 2 0 0 0 0 0 0 0 0 0 0 0 0 0 
##$SW_h= 4006.41025641026
##$TD= 16384
##$TD0= 1
##$TE= 0
##$TE2= 300
##$TE3= 300
##$TEG= 300
##$TL= (0..7)
0 120 120 120 120 120 120 120 
##$TP= (0..7)
150 150 150 150 150 150 150 150 
##$TP07= 0
##$TPNAME0= <>
##$TPNAME1= <>
##$TPNAME2= <>
##$TPNAME3= <>
##$TPNAME4= <>
##$TPNAME5= <>
##$TPNAME6= <>
##$TPNAME7= <>
##$TPOAL= (0..7)
0.5 0.5 0.5 0.5 0.5 0.5 0.5 0.5 
##$TPOFFS= (0..7)
0 0 0 0 0 0 0 0 
##$TUNHIN= 0
##$TUNHOUT= 0
##$TUNXOUT= 0
##$USERA1= <user>
##$USERA2= <user>
##$USERA3= <user>
##$USERA4= <user>
##$USERA5= <user>
##$V9= 5
##$VALIST= <valist>
##$VCLIST= <CCCCCCCCCCCCCCC>
##$VD= 0
##$VDLIST= <DDDDDDDDDDDDDDD>
##$VPLIST= <PPPPPPPPPPPPPPP>
##$VTLIST= <TTTTTTTTTTTTTTT>
##$WBST= 1024
##$WBSW= 4
##$XGAIN= (0..3)
0 0 0 0 
##$XL= 0
##$YL= 0
##$YMAX_a= 666720
##$YMIN_a= -764237
##$ZGOPTNS= <>
##$ZL1= 120
##$ZL2= 120
##$ZL3= 120
##$ZL4= 120
##$ABSF1= 10
##$ABSF2= 0
##$ABSG= 5
##$ABSL= 3
##$ALPHA= 0
##$AQORDER= 0
##$ASSFAC= 0
##$ASSFACI= 0
##$ASSFACX= 0
##$ASSWID= 0
##$AUNMP= <proc_1d>
##$AZFE= 0.1
##$AZFW= 0.1
##$BCFW= 1
##$BC_mod= 2
##$BYTORDP= 1
##$COROFFS= 0
##$CY= 11.3945322036743
##$DATMOD= 1
##$DC= 2
##$DFILT= <>
##$DTYPP= 0
##$F1P= 2.36226072786647
##$F2P= -0.459571619588291
##$FCOR= 0.5
##$FTSIZE= 0
##$FT_mod= 4
##$GAMMA= 1
##$GB= 0.15
##$INTBC= 1
##$INTSCL= 1
##$ISEN= 128
##$LB= 0.24
##$LEV0= 0
##$LPBIN= 0
##$MAXI= 10000
##$MC2= 0
##$MEAN= 0
##$ME_mod= 0
##$MI= 1.114404
##$NCOEF= 0
##$NC_proc= 0
##$NLEV= 6
##$NOISF1= 3.799351
##$NOISF2= 2.8
##$NSP= 1
##$NTH_PI= 0
##$NZP= 0
##$OFFSET= 15.70392
##$PC= 1
##$PHC0= -13265.86
##$PHC1= 9.401001
##$PH_mod= 1
##$PKNL= yes
##$PPARMOD= 0
##$PSCAL= 0
##$PSIGN= 0
##$REVERSE= no
##$SF= 200.130013532006
##$SI= 16384
##$SIGF1= 3
##$SIGF2= 2
##$SINO= 400
##$SIOLD= 16384
##$SREGLST= <1H.CDCl3>
##$SSB= 0
##$STSI= 0
##$STSR= 0
##$SW_p= 3612.71676300578
##$SYMM= 0
##$S_DEV= 0
##$TDeff= 0
##$TDoff= 0
##$TI= <>
##$TILT= no
##$TM1= 0
##$TM2= 0
##$TOPLEV= 0
##$USERP1= <user>
##$USERP2= <user>
##$USERP3= <user>
##$USERP4= <user>
##$USERP5= <user>
##$WDW= 1
##$XDIM= 8192
##$YMAX_p= 0
##$YMIN_p= 0
$$ End of Bruker specific parameters
$$ ---------------------------------
##NTUPLES= NMR FID
##VAR_NAME=  TIME,          FID/REAL,        FID/IMAG
##SYMBOL=    X,             R,               I
##VAR_TYPE=  INDEPENDENT,   DEPENDENT,       DEPENDENT
##VAR_FORM=  AFFN,          ASDF,            ASDF
##VAR_DIM=   8192,          8192,            8192
##UNITS=     SECONDS,       ARBITRARY UNITS, ARBITRARY UNITS
##FACTOR=    0.0002496,     1,               1
##FIRST=     0,             0,               0
##LAST=      2.0444736,     0,               0
##MIN=       0,             -764237,         0
##MAX=       2.0444736,     666720,          0
$$ Real data points
##PAGE= N=1
##DATA TABLE= (X++(R..R)), XYDATA
$$ plain form
0 0 0 0 0 0 0 0 0 8 0 0 -8 8 -16 16 -16 24 -24 32 -40 48 -56 67 -80 93 -109 128 -148 169 -193 223 -254 287
32 287 -325 367 -413 462 -521 581 -645 717 -799 887 -982 1084 -1196 1319 -1457 1605 -1765
49 -1765 1945 -2142 2360 -2604 2877 -3183 3533 -3934 4401 -4951 5607 -6410 7414 -8713
63 -8713 10455 -12914 16630 -22834 34909 -66338 297127 459739 -764237 57170 536729
74 536729 -476623 26045 556870 -448466 -215924 415371 -227565 -121778 420451 -144768
84 -144768 -194722 175240 -175828 -28417 289818 -145461 -8670 160629 -331252 19264
94 19264 326819 -267748 52816 351380 -423233 -147766 449243 -233589 -141541 492142
104 492142 -217547 -385168 395903 -30840 -332876 412738 106851 -443308 151493 143727
$$ packed form
0@%%%%%%%Qq%qJ6k4L2l2M0m8N6p2Q8j04J23j47J73k02K37k76L17l62M16m77N41
32B87o12O92p80Q75r83J102j226J362j516J686j869K066k280K515k776L062l370
49a765L710m087M502m964N481o060O716p467Q335r352J0558j2017J3824j6127
63h713J9168k3369K9544l9464N7743j01247L63465J62612j223976Q21407M79559
74E36729j013352N02668N30825j005336K32542O31295o42936J05787N42229n65219
84a44768m9954L69962l51068J47411L18235m35279J36791J69299m91881L50516
94A9264L07555n94567L20564K98564p74613K75467N97009o82832R2048O33683
104D92142p09689j67621P81071m26743l02036P45614l05887n50159N94801p766
$$ plain form
114 143727 -292598 163839 232894 -220420 -38998 81947 -118075 12546 119825 30915
124 30915 -17577 -98455 -38460 66970 -37805 35809 158391 -115348 -152372 135957 -30801
135 -30801 -116093 235528 54597 -259785 60495 91425 -177476 88516 204442 -132767
145 -132767 -103949 92961 -49646 -88723 147351 116331 -148291 -65905 104741 -88730 -72539
156 -72539 223763 29012 -211307 77692 62003 -213321 102305 239218 -186462 -74326
166 -74326 173700 -168327 -90887 265191 -27298 -133762 124633 -68451 -137216 130808
176 130808 55269 -30062 42255 -70909 -47124 39861 -47738 87164 113576 -171146 -16377
187 -16377 126165 -196477 26088 302310 -196288 -135121 277464 -199188 -190689 399529 -48345
$$ packed form
114A43727m36325M56437O9055m53314J81422J20945k00022J30621J07279q8910
124C0915m8492q0878N9995J05430j04775P3614J22582k73739l7024K88329j66758
135c0801q5292L51621j80931l14382L20280L0930k68901K65992J15926l37209
145a32767K8818J96910j42607l9077K36074l1020k64622Q2386J70646j93471J6191
156g2539K96302j94751k40319K88999j5689k75324L15626J36913m25680J12136
166g4326K48026l42027P7440L56078k92489j06464K58395j93084o8765K68024
176A30808p5539q5331P2317j13164K3785Q6985q7599J34902K6412k84722J54769
187a6377J42542l22642K22565K76222m98598O1167M12585m76652Q499N90218m47874
$$ plain form
198 -48345 -281486 292497 -40213 -348116 286709 142830 -291014 169612 107806 -323195
208 -323195 90587 190185 -173314 80901 115072 -212370 17298 87803 -106380 129481
218 129481 62541 -183817 88656 10054 -194471 212314 107997 -261514 142840 90805
228 90805 -336907 158784 260469 -304546 60054 253282 -354085 -38284 361693 -208365
238 -208365 -89224 319571 -209058 -205246 290553 -52952 -143985 240954 -51005 -202875
248 -202875 129823 -1339 -75809 150663 -19768 -94480 64365 -85500 -23747 171021
258 171021 -72057 -51451 143022 -157317 -102023 244297 -60604 -126024 228112 -85739
268 -85739 -239821 218568 54010 -199124 184303 75268 -271605 65012 147309 -155717
$$ packed form
198d8345k33141N73983l32710l07903O34825j43879m33844M60626o1806m31001
208c23195M13782R9598l63499K54215L4171l27442K29668P0505j94183K35861
218A29481o6940k46358K72473p8602k04525M06785j04317l69511M04354n2035
228I0805m27712M95691J01685n65015L64600J93228o07367L15801L99977n70058
238b08365J19141M08795n28629L812M95799l43505r1033L84939k91959j51870
248b02875L32698j31162p4470K26472j70431p4712J58845j49865O1753J94768
258A71021k43078K0606J94473l00339N5294L46320l04901o5420L54136l13851
268h5739j54082M58389j64558k53134L83427j09035l46873L36617Q2297l03026
$$ plain form
278 -155717 52290 159993 -149071 -76898 103736 -39239 -20941 101730 -577 -72024
288 -72024 -25098 7559 22549 4252 31339 43034 -83022 -64359 81938 -3982 -39583 110760
300 110760 -5203 -142867 40793 60414 -76397 53862 97398 -98330 -69156 67173
310 67173 -9433 -34600 83690 41002 -100988 -40403 70040 -23484 -36279 120922 10184
321 10184 -155316 41307 77621 -120885 56238 157186 -145204 -75266 139894 -88591
331 -88591 -65495 194367 -26143 -142324 94837 -13025 -110692 118174 59032 -88412 25979
342 25979 -11167 -68550 54945 23949 -1057 52582 -78998 -51206 91237 -59310 -13590
353 -13590 167931 -98020 -130005 165254 -60164 -135105 239403 5675 -234362 158781
$$ packed form
278a55717K08007J07703l09064P2173J80634j42975J8298J22671j02307p1447
288g2024M6926L2657J4990j8297K7087J1695j26056J8663J46297q5920l5601J50343
300A10760j15963j37664J83660J9621j36811J30259M3536j95728K9174J36329
310F7173p6606k5167J18290m2688j41990O0585J10443r3524j2795J57201j10738
321A0184j65500J96623L6314j98506J77123J00948l02390O9938K15160k28485
331h8591K3096K59862k20510j16181K37161j07862r7667K28866n9142j47444J14391
342B5979l7146n7383J23495l0996k5006N3639j31580K7792J42443j50547M5720
353a3590J81521k65951l1985K95259k25418p4941L74508k33728k40037L93143
$$ plain form
363 158781 40925 -240446 174764 152810 -241214 60429 132842 -229398 38336 205493
373 205493 -142755 -16673 128548 -150555 -32980 140588 -61765 9511 80098 -121758
383 -121758 -5904 74023 -91683 75687 100654 -166283 21298 103713 -176429 58000
393 58000 201157 -186152 -36192 187849 -189024 -64268 271066 -104872 -133639 211936
403 211936 -95638 -179948 220047 23119 -161753 143874 9965 -186676 95244 76366
413 76366 -95133 71978 31528 -112378 23470 20606 -30688 82254 -7197 -70108 55194
424 55194 -47928 -62207 141126 -3665 -106843 107117 -24566 -153850 136096 76402
434 76402 -146583 81046 69441 -185319 31006 145406 -101942 -4910 119830 -106803
$$ packed form
363A58781j17856k81371M15210k1954l94024L01643P2413l62240K67734J67157
373B05493l48248J26082J45221k79103J17575J73568k02353P1276P0587k01856
383a21758J15854P9927j65706J67370K4967k66937J87581Q2415k80142K34429
393E8000J43157l87309J49960K24041l76873J24756L35334l75938k8767L45575
403B11936l07574q4310L99995j96928j84872L05627j33909j96641K81920j8878
413G6366j71499J67111m0450j43906J35848k864n1294J12942q9451o2911J25302
424E5194j03122j4279K03333j44791j03178K13960j31683j29284K89946n9694
434G6402k22985K27629j1605k54760K16325J14400k47348R7032J24740k26633
$$ plain form
444 -106803 -78298 111099 -3350 -45901 73787 -1274 -84663 1364 41124 1979 1636 27256
456 27256 -3708 -64631 -12104 62163 -5170 -16856 57032 -29019 -85317 44527 44521 -41854 34781
469 34781 41018 -78264 -33089 55661 831 -12420 43851 3992 -66666 -19950 54152 4162
481 4162 -26686 59292 2822 -110509 28356 81407 -76722 19803 109312 -112501 -70826
492 -70826 127683 -41314 -66670 144584 -20907 -141838 86574 26699 -102578 96092
502 96092 60470 -117220 16405 35921 -71225 47121 55369 -47431 13201 -16841 -53656
513 -53656 61538 8630 -34594 80830 -39872 -106642 100923 12364 -101535 130932 29872
524 29872 -183699 83351 81739 -164528 92530 137898 -190427 -24 140712 -149676 -3048
$$ packed form
444a06803K8505J89397j14449m2551J19688p5061q3389Q6027L9760l9145l43K5620
456B7256l0964o0923N2527P4267o7333j1686P3888q6051n6298J29844oq6375P6635
469C4781O237j19282M5175Q8750n4830j3251N6271l9859p0658M6716P4102m9990
481D162l0848Q5978n6470j13331J38865N3051j58129R6525Q9509k21813M1675
492g0826J98509j68997k5356K11254j65491j20931K28412n9875j29277J98670
502I6092l5622j77690J33625J9516j07146J18346Q248j02800O0632l0042l6815
513e3656J15194n2908m3224J15424j20702o6770K07565q8559j13899K32467j01060
524B9872k13571K67050j612k46267K57058M5368l28325J90403J40736k90388J46628
$$ plain form
535 -3048 183806 -107583 -71339 124552 -83858 -61719 141513 -23751 -63380 72169 -54190
546 -54190 -50075 85203 -21936 -5634 69784 -88868 -28994 91272 -75374 5428 134294
557 134294 -111766 -64645 136891 -89675 -64360 189132 -52684 -136399 140813 -25629
567 -25629 -143962 157722 50984 -157653 81353 46923 -152072 65460 102279 -96437
577 -96437 18082 53066 -93866 2277 63630 -24853 18803 14277 -52456 8462 3283 -22215
589 -22215 66355 7250 -73717 39815 4132 -81792 79011 61751 -103024 27757 54866
600 54866 -115178 19714 116674 -70599 -28811 81356 -67125 -58799 94604 11693 -55472
611 -55472 43680 7167 -74942 11670 58331 -13112 -12511 25392 -17549 -47373 16910 49093
$$ packed form
535c048J86854k91389L6244J95891k08410K2139K03232j65264l9629J35549j26359
546e4190M115J35278j07139J6302P5418j58652N9874J20266j66646Q0802J28866
557A34294k46060M7121K01536k26566K5315K53492k41816q3715K77212j66442
567b5629j18333L01684j06738k08637K39006l4430j98995K17532L6819j98716
577i6437J14519L4984j46932R6143O1353q8483M3656m526o6733O0918n179k5498
589b2215Q8570n9105q0967J13532l5683q5924J60803j7260j64775J30781K7109
600E4866j70044J34892R6960j87273M1788J10167j48481Q326J53403q2911o7165
611e5472R9152l6513q2109Q6612M6661p1443O01L7903m2941k9824O4283L2183
$$ plain form
623 49093 -15423 -13832 35628 -34687 -52758 56289 28182 -40333 28942 12937 -64735 1117
635 1117 46504 -7281 -2660 21801 -17188 -38289 3677 36573 6391 -16714 18786 -2404
647 -2404 -60684 17275 66167 -41928 -9466 69502 -71065 -59411 107406 -11605 -69472
658 -69472 98751 -9881 -120482 73291 46533 -88231 61444 55863 -110117 4142 65989
669 65989 -58359 16882 66888 -57173 -19352 27573 -37847 25594 39208 -38870 21293 -2978
681 -2978 -71180 58234 37482 -74206 61953 32227 -128490 44238 86666 -107337 35990
692 35990 107774 -135905 -27060 131395 -89337 -33207 148546 -74875 -92279 114849 -35062
703 -35062 -72973 119278 -4979 -90487 59672 -7031 -59621 68755 14180 -42268 34799
$$ packed form
623D9093o4516J591M9460p0315j8071J09047k8107o8515O9275j6005p7672O5852
635A117M5387n3785M621K4461l8989k1101M1966L2896l0182k3105L5500k1190
647b404n8280P7959M8892j08095L2462P8968j40567J1654J66817j19011n7867
658f9472J68223j08632j10601J93773k6758j34764J49675n581j65980J14259O1847
669F5989j24348P5241N0006j24061L7821M6925o5420O3441J3614p8078O0163k4271
681b978o8202J29414k0752j11688J36159k9726j60717J72728M2428j94003J43327
692C5990P1784k43679J08845J58455k20732N6130J81753k23421j7404K07128j49911
703c5062l7911J92251j24257q5508J50159o6703n2590J28376n4575n6448P7067
$$ plain form
714 34799 -28861 -39178 62080 -12748 -22062 71082 -51685 -63155 90510 -24812 -59040
725 -59040 116583 -20744 -116771 92942 14253 -108025 101687 52754 -132365 40453 63722
736 63722 -108762 33827 99920 -83487 -19612 66362 -63320 -17420 77824 -19666 -23135
747 -23135 26751 -31639 -12459 27132 -3984 20585 5080 -45764 14150 13083 -37986 44285
759 44285 36537 -68640 5425 40820 -62095 10868 81172 -49055 -36683 58175 -36360 -42702
771 -42702 75369 10945 -55764 27133 10600 -53812 16142 51508 -18922 -21495 22647 -12731
783 -12731 -36416 29060 38511 -28638 -10153 27068 -32646 -26678 53918 11567 -38302 22981
795 22981 5226 -51099 16868 42262 -20308 -2758 17220 -26620 -16946 19528 16113 3246
$$ packed form
714C4799o3660j0317J01258p4828r314R3144j22767j1470J53665j15322l4228
725e9040J75623j37327r6027K09713p8689j22278K09712m8933j85119J72818K3269
736F3722j72484J42589O6093j83407O3875Q5974j29682M5900R5244r7490l469
747b3135M9886n8390J9180L9591l1116K4569j5505n0844N9914j067n1069Q2271
759D4285p748j05177P4065L5395j02915P2963P0304j30227J2372R4858r4535o342
771d2702J18071o4424o6709Q2897j6533o4412O9954L5366p0430k573M4142l5378
783a2731k3685O5476R451o7149J8485L7221n9714N968Q0596m2351m9869O1283
795B2981j7755n6325O7967K5394o2570J7550J9978m3840R674L6474l415j2867
$$ plain form
807 3246 -9733 -1628 -290 -29074 11898 48714 -27919 -21152 45355 -39611 -43642 81354 2292
820 2292 -65972 62578 4673 -96317 57387 57051 -81074 32059 56390 -95159 -947
831 -947 78520 -51284 -4819 66509 -53504 -33356 50056 -20587 -4351 44871 -28785 -15163
843 -15163 17902 -34545 20465 42068 -46209 12726 32481 -77448 16472 78238 -68985 -704
855 -704 83252 -89959 -35931 112707 -50598 -48936 112009 -45798 -91972 98456 -628
866 -628 -79096 89043 13643 -98012 46994 27742 -64587 48189 34234 -60058 15042 10404
878 10404 -39381 37704 15910 -32679 31336 -15780 -48493 55617 6146 -47934 62016 -1965
890 -1965 -86262 56676 32882 -77880 55884 48948 -102100 15725 68357 -75134 9869
$$ packed form
807C246j2979Q105J338k8784M0972L6816p6633O767O6507q4966m031J24996p9062
820B292o8264J28550n7905j00990J53704l36j38125J13133K4331j51549R4212
831i47P9467j29804M6465P1328j20013K0148Q3412p0643J6236M9222p3656J3622
843a5163L3065n2447N5010K1603q8277N8935J9755j09929R3920O1766j47223O8281
855g04Q3956j73211N4028J48638j63305J662J60945j57807m6174J90428r9084
866f28p8468J68139p5400j11655J45006j9252r2329J12776j3955r4292P5100m638
878A0404m9785P7085k1794m8589O4015m7116l2713J04110m9471n4080J09950o3981
890a965q4297J42938k3794j10762J33764o936j51048J17825N2632j43491Q5003
$$ plain form
901 9869 85098 -66294 -34897 66871 -36244 -28838 70102 -10039 -44413 27704 -6122 -24741
913 -24741 28561 11755 -9225 -711 -16774 590 11574 -10583 20907 15756 -43220 548
925 548 29602 -33001 7651 51283 -37205 -30269 41994 -18466 -28053 54064 6362 -48464 17320
938 17320 14259 -36653 14166 40540 -21161 -22955 20136 -5936 -25472 27009 28469 -31635 -10876
951 -10876 26335 -24668 -17446 49504 1391 -40078 23469 5100 -42824 25305 35633 -31504
963 -31504 -1852 19506 -29524 -6307 30024 211 -5595 1627 -9807 -3203 -3681 6741 26449
976 26449 -15062 -22236 27077 -16615 -29829 56537 6506 -57358 39210 13527 -72281 42614
988 42614 54095 -70918 12790 54275 -75610 -5434 79122 -44292 -21513 63596 -43168
$$ packed form
901I869P5229j51392L1397J01768j03115P406R8940q0141l4374P2117l3826j8619
913b4741N3302j6806k0980Q514j6063J7364J0984k2157L1490n151n8976M3768
925E48K9054o2603M0652M3632q8488O936P2263o0460r587Q2117m7702n4826O5784
938A7320l061n0912N0819K6374o1701j794M3091k6072j9536N2481J460o0104K0759
951a0876L7211n1003P222O6950m8113m1469O3547j8369m7924O8129J0328o7137
963c1504K9652K1358m9030K3217L6331k9813n806P222j1434O604m78J0422J9708
976B6449m1511p174M9313m3692j3214Q6366n0031o3864R6568k5683q5808J14895
988D2614J1481j25013Q3708M1485j29885P0176Q4556j23414K2779Q5109j06764
$$ plain form
999 -43168 -39255 60081 -10442 -25317 44293 -18032 -33000 28573 -9639 -4227 35816 -24776
1011 -24776 -12693 28108 -38044 287 58900 -39853 -18325 58406 -51773 -33770 86346
1022 86346 -25786 -51702 78838 -23137 -78408 77726 16356 -74485 60891 23609 -88768
1033 -88768 34182 45596 -60777 25462 43645 -59421 -742 34039 -32441 13216 29403
1044 29403 -30817 3725 6275 -30097 28380 16925 -35002 27709 5968 -57407 34556 34228
1056 34228 -55135 28292 39065 -74656 6403 62061 -52970 -2733 67128 -51337 -35300
1067 -35300 61187 -20410 -31434 57265 -6126 -48366 26932 8219 -27936 23246 17496 -22047
1079 -22047 -4480 2097 -3880 5795 3630 8354 66 -24061 3655 17685 -17498 7939 28241
$$ packed form
999d3168L913R9336p0523j4875O9610o2325j4968O1573l8212N412M0043o0592
1011b4776J2083M0801o6152L8331N8613r8753K1528P6731j10179J8003J20116
1022H6346j12132k5916J30540j01975n5271J56134o1370r0841J35376l7282j12377
1033h8768J22950J1414j06373Q6239J8183j03066N8679L4781o6480M5657J6187
1044B9403o0220L4542K550l6372N8477j1455n1927O2711k1741o3375R1963l28
1056C4228q9363Q3427J0773j13721Q1059N5658j15031N0237O9861j18465J6037
1067c5300R6487q1597j1024Q8699o3391m2240P5298j8713l6155N1182n750l9543
1079b2047J7567O577n977R675k165M724q288k4127K7716J4030l5183K5437K0302
$$ plain form
1092 28241 -29379 -18519 30593 -10931 -16421 37519 -409 -38212 14635 14146 -26031 12146
1104 12146 29810 -22165 -19262 19519 -2740 -17972 22931 18638 -30632 -7934 25506 -18701
1116 -18701 -12918 42328 -4425 -38589 24161 6826 -36883 26998 28988 -37526 80 23182
1128 23182 -29625 -1739 34460 -10980 -11667 11883 -12896 -6140 12827 1303 8015 -3523 -18802
1141 -18802 13139 -803 -19767 34384 8478 -45803 22575 18361 -51114 28148 45828 -58001
1153 -58001 768 50056 -56160 -10420 72376 -35789 -32459 58892 -29770 -42518 60858
1164 60858 -2354 -39686 40913 -5623 -42016 31195 7414 -20275 26794 -7716 -24782 22530
1176 22530 -11133 -10080 40395 -19250 -25986 40500 -24608 -31170 63678 -10166 -50668 55396
$$ packed form
1092B8241n7620J0860M9112m1524n490N3940l7928l7803N2847m89m0177L8177
1104A2146J7664n1975K903L8781k2259j5232M0903m293m9270K2698L3440m4207
1116a8701N783N5246m6753l4164O2750j7335m3709O3881J990o6514L7606K3102
1128B3182n2807K7886L6199m5440o87K3550k4779O756J8967j1524O712j1538j5279
1141a8802L1941j3942j8964N4151k5906n4281O8378m214o9475P9262J7680j03829
1153e8001N8769M9288j06216M5740Q2796j08165L330R1351q8662j2748J03376
1164F0858o3212l7332Q0599m6536l6393P3211k3781k7689M7069l4510j7066M7312
1176B2530l3663J053N0475n9645o736O6486o5108o562R4848p3844m0502J06064
$$ plain form
1188 55396 -6409 -65071 59526 23567 -67341 40513 28733 -75136 23663 51476 -53933
1199 -53933 8068 46515 -51252 -11256 45657 -25015 -6297 35522 -23995 -14625 19429 -14330
1211 -14330 6485 19791 -21359 4902 9252 -32161 17707 28077 -35335 10424 28437 -49181
1223 -49181 713 50666 -35094 -11287 51143 -35828 -33340 53472 -9445 -33474 45527 -1679
1235 -1679 -46884 25356 16101 -28837 16920 19323 -26095 -6128 13137 -4931 -371 10109 2232
1248 2232 -8886 -10560 6476 8429 -8864 7402 13152 -22766 -8577 22779 -8585 -8591 25912
1261 25912 -6539 -26714 14267 9368 -16892 10750 17600 -18979 -13127 16069 -18 -12662
1273 -12662 16686 11946 -26159 -5266 22924 -13315 -10415 33300 -6094 -34612 22866 10040
$$ packed form
1188E5396o1805n8662J24597l5959r0908J07854j1780j03869R8799K7813j05409
1199e3933O2001L8447r7767L9996N6913p0672J8718M1819n9517R370L4054l3759
1211a4330K0815J3306m1150K6261M350m1413M9868J0370o3412M5759J8013p7618
1223d9181M9894M9953q5760K3807O2430q6971K488Q6812o2917k4029P9001m7206
1235a679m5205P2240r255m4938M5757K403m5418J9967J9265j8068M560J0480p877
1248B232j1118j674J7036J953j7293J6266N750l5918J4189L1356l1364oL4503
1261B5912l2451k0175M0981m899k6260K7642O850l6579N852K9196j6087j2644
1273a2662K9348m740l8105K0893K8190l6239K900M3715l9394k8518N7478j2826
$$ plain form
1285 10040 -32877 23323 25804 -39128 87 27288 -28599 -1376 36069 -17583 -15807 19740
1297 19740 -12309 -9952 21201 -1081 -5366 4672 -13095 1742 9632 -11579 14592 10790 -33119
1310 -33119 8738 22213 -34590 13201 39512 -44342 -8883 45616 -38352 -15205 61730 -26308
1322 -26308 -37585 51453 -15714 -43466 53666 6684 -47315 33225 7936 -45743 27101 21571
1334 21571 -31063 15658 9048 -29972 13196 9182 -15139 21643 -2890 -26035 23139 -4534
1346 -4534 -24909 40049 848 -42824 34197 5880 -50572 40312 27771 -57328 22425 32614
1358 32614 -60074 12998 51980 -46012 -4483 46187 -41281 -17559 48473 -17765 -18321 34896
1370 34896 -15890 -23708 24534 -2743 -8195 18567 -9716 -9043 9961 -13446 5659 21016 -20436
$$ packed form
1285A0040m2917N6200K481o4932L9215K7201n5887K7223L7445n3652J776L5547
1297A9740l2049K357L1153k2282m285J0038j7767J4837P890k1211K6171l802m3909
1310c3119M1857J3475n6803M7791K6311q3854L5459N4499q3968K3147P6935q8038
1322b6308j1277Q9038o7167k7752R7132m6982n3999Q0540k5289n3679P2844n530
1334B1571n2634M6721o610l9020M3168m014k4321L6782k4533k3145M9174k7673
1346d534k0375O4958l9201m3672P7021k8317n6452R0884j2541q5099P9753J0189
1358C2614r2688P3072L8982r7992M1529N0670q7468K3722O6032o6238n56N3217
1370C4896n0786p818M8242k7277n452K6762k8283O73J9004k3407J9105J5357m1452
$$ plain form
1383 -20436 -678 19733 -29261 -1948 37816 -22161 -13598 36069 -23338 -27222 42257 -2119
1395 -2119 -30965 32504 2818 -40861 20432 20824 -27597 9736 20896 -26009 -7888 20235
1407 20235 -5047 -6064 13263 -166 -13972 -2052 9289 1225 -4847 8283 3161 -17966 -281
1420 -281 16210 -7923 -3311 17283 -9570 -17689 13936 5402 -11569 10074 8522 -16221 -5979
1433 -5979 11733 172 -6382 9739 6125 -18176 -4655 18814 -6840 -10240 24194 -4210 -29902
1446 -29902 19452 12727 -28472 17264 23356 -36372 -1733 29913 -24890 -4907 35990 -18500
1458 -18500 -20590 25369 -8609 -15662 25481 -8 -16564 9709 -4826 -7430 13303 -2961
1470 -2961 233 9219 -19265 -533 20190 -19176 2363 29968 -29850 -14007 38164 -22497
$$ packed form
1383b0436J9758K0411m8994K7313L9764n9977Q563M9667n9407l884O9479m4376
1395b119k8846O3469k9686m3679O1293L92m8421L7333J1160m6905J8121K8123
1407B0235k5282j017J9327j3429j3806J1920J1341q064o072J3130n122k1127J7685
1420b81J6491k4133M612K0594k6853q119L1625q534j6971K1643j552k4743J0242
1433e979J7712j1561o554J6121l614k4301J3521K3469k5654l400L4434k8404k5692
1446b9902M9354o725m1199M5736O092n9728L4639L1646n4803J9983M0897n4490
1458a8500k090M5959l3978p053M1143k5489j6556K6273j4535k604K0733j6264
1470b961L194Q986k8484J8732K0723l9366K1539K7605n9818J5843N2171o0661
$$ plain form
1482 -22497 -18481 49040 -16376 -38517 42513 -4175 -41299 43943 12105 -48238 25366 16848
1494 16848 -43683 20618 28696 -34412 6092 19686 -29513 4674 21719 -16569 5854 8655
1506 8655 -21985 8646 8501 -17687 20063 7214 -32156 17234 12239 -34985 23568 25915 -43786
1519 -43786 8937 31282 -43381 3729 46801 -35268 -13660 42129 -28890 -21947 45740 -9956
1531 -9956 -26682 31524 -6590 -28816 24500 6707 -17576 14385 256 -16179 7982 439
1543 439 -1979 12694 -8774 -6368 11870 -14125 -2961 25929 -12763 -13588 24023 -13589 -20533
1556 -20533 31675 1285 -26281 22142 4447 -32268 15890 20366 -23391 4090 18794 -21716
1568 -21716 -8235 21563 -3526 -9779 12800 112 -15936 2242 11839 -3630 -4193 9504 -2269
$$ packed form
1482b2497M016O7521o5416k2141Q1030m6688l7124Q5242l1838o0343P3604q518
1494A6848o0531O4301Q078o3108M0504J3594m9199L4187J7045l8288K2423K801
1506H655l0640L0631j45k6188L7750j2849l9370M9390m995m7224N8553K347o9701
1519d3786N2723K2345p4663M7110M3072q2069K1608N5789p1019O943O7687n5696
1531i956j6726N8206l8114k2226N3316j7793k4283L1961j4129j6435K4161p543
1543D39k418J4673k1468K406J8238k5995J1164K8890l8692q25L7611l7612o944
1556b0533N2208l0390k7566M8423j7695l6715M8158M476m3757K7481J4704m0510
1568b1716J3481K9798k5089o253K2579j2688j6048J8178R597j5469n63J3697j1773
$$ plain form
1581 -2269 -15244 6111 11995 -9460 424 12371 -12264 -10575 14553 1430 -8687 9834 2517
1594 2517 -14196 -194 9176 -1347 -2227 5724 907 -11549 -2456 13687 -2603 -8822 15509
1607 15509 -1973 -23697 14738 14049 -23286 10522 20661 -30911 -3660 29863 -20007 -8423
1619 -8423 33151 -16430 -23069 27353 -4155 -19808 25892 2136 -23879 12345 3090 -14424
1631 -14424 13602 4791 -10224 6323 -6359 -6752 15278 -6021 -4831 19106 -16171 -14940 27906
1644 27906 -9347 -18390 34559 -7339 -35080 31484 5224 -36263 31624 16172 -44200 16356
1656 16356 23044 -38023 12014 31974 -32350 -2977 25720 -24528 -3263 27430 -14430 -6164
1668 -6164 15061 -15650 -2100 15371 -10670 5045 10083 -21901 5183 15133 -21898 10398
$$ packed form
1581b269j2975K1355N884k1455R884J1947k4635J689K5128j3123j0117J8521p317
1594B517j6713J4002R370j0523q80P951m817j2456R093J6143j6290o219K4331
1607A5509j7482k1724L8435o89l7335L3808J0139n1572K7251L3523m9870J1584
1619h423M1574m9581o639N0422l1508j5653M5700k3756k6015L6224r255j7514
1631a4424K8026q811j5015J6547j2682l93K2030k1299J190K3937l5277J231M2846
1644B7906l7253r043N2949m1898k7741O6564k6260m1487O7887j5452o0372O0556
1656A6356O688o1067N0037J9960o4324K9373K8697n0248K1265L0693m1860Q266
1668f164K1225l0711J3550J7471k6041J5715N038l1984K7084R950l7031L2296
$$ plain form
1680 10398 22079 -30852 -231 27400 -28416 -2487 38518 -24711 -18361 35187 -17012 -22973
1692 -22973 38501 -3017 -29785 25459 1614 -29594 20697 13764 -21980 8098 8449 -18056
1704 -18056 3685 10305 -5518 3667 280 -7333 3694 -2952 -1502 14199 -6081 -11136 13751
1717 13751 -5994 -14122 21655 3321 -21149 13739 5548 -24239 11748 18531 -19359 -138
1729 -138 16302 -16725 -7758 20132 -2121 -11219 10835 656 -15200 4253 12608 -5954 -4580
1742 -4580 9414 -3873 -13082 9037 9872 -10967 1953 10300 -14092 -5932 16175 -2603 -7872
1755 -7872 11147 -1834 -13104 5470 6736 -4083 1583 3440 -3939 -5792 760 7964 -386 -6017
1769 -6017 7988 -700 -16627 10049 13414 -17555 4584 17239 -24076 -5113 27680 -14625
$$ packed form
1680A0398J1681n2931L0621K7631n5816K5929M1005o3229O350N3548n2199n961
1692b2973O1474m1518k6768N5244k3845l1208N0291o933l5744L0078L51k6505
1704a8056K1741O620j5823R185l387p613J1027o646J450J5701k0280n055K4887
1717A3751j9745q128L5777j8334k4470L4888q191k9787L5987O783l7890J9221
1729a38J6440l3027Q967K7890k2253r098K2054j0179j5856J9453Q355j8562J374
1742d580J3994j3287r209K2119Q35k0839J2920Q347k4392Q160K2107j8778n269
1755g872J9019j2981j1270J8574J266j0819N666J857p379j853O552P204q350n631
1769f017J4005q688j5927K6676L365l0969K2139J2655m1315J8963L2793m2305
$$ plain form
1781 -14625 -11278 28571 -12387 -23679 25899 723 -21625 22613 4939 -26862 11738 9677
1793 9677 -17814 11054 10397 -16004 3072 3342 -9908 10322 3088 -9172 10248 -5687 -14139
1806 -14139 18963 -57 -16956 22007 -703 -29638 21554 11367 -30090 20107 18216 -38007
1818 -38007 8110 26724 -31114 3728 32782 -27975 -10667 28968 -17876 -10667 29392 -9755
1830 -9755 -15969 17647 -7238 -10657 17320 -2537 -6532 9435 -10671 -3570 14080 -9875 802
1843 802 16557 -19126 -6021 22382 -15869 -6587 29490 -15728 -19754 27781 -7768 -21647 30375
1856 30375 1869 -29383 18759 7389 -26873 15660 17114 -22635 2717 13179 -17070 58
1868 58 15658 -6279 -3290 4972 -5650 -1893 3056 1288 5034 -3319 -6349 6037 -2961 -6597
$$ packed form
1781a4625L347L9849m0958j1292M9578k5176k2348M4238j7674l1801L8600k061
1793I677k7491K8868o57k6401J9076K70j3250K0230p234j2260J9420j5935q452
1806a4139L3102j9020j6899L8963k2710k8935N1192j0187m1457N0197j891n6223
1818c8007M6117J8614n7838L4842K9054o0757J7308L9635m6844P209M0059l9147
1830i755o214L3616k4885l419K7977j9857l995J5967k0106P101J7650k3955J0677
1843H02J5755l5683J3105K8403l8251R282L6077m5218m026M7535l5549j3879N2022
1856C0375k8506l1252M8142j1370l4262M2533J454l9749K5352J0462l0249J7128
1868E8J5600k1937K989Q262j0622L757M949j768L746q353l030J2386q998l636
$$ plain form
1882 -6597 13963 1796 -15056 7927 4469 -16229 8757 14720 -15164 -2149 12983 -12430
1894 -12430 -6242 17844 -1357 -11641 8486 1449 -13219 4880 12216 -6923 -4925 8699 -4513
1907 -4513 -10718 10560 8008 -11400 1956 8566 -13222 -3321 16143 -4157 -7922 11256 -3908
1920 -3908 -12522 9599 5500 -7091 4153 2251 -7757 -812 3260 2549 1656 -3281 1196 399 -9400
1935 -9400 5663 11567 -11759 -536 13513 -16482 -6441 23847 -8790 -13358 22881 -7617
1947 -7617 -22968 23083 5286 -22449 17838 8099 -27213 9239 15199 -18406 6479 14506 -17961
1960 -17961 -1579 11120 -9629 3594 9354 -9738 1493 1975 -10747 10280 5927 -13608 10701
1973 10701 3311 -22256 13001 13886 -22697 10506 17167 -29799 2179 26133 -22822 -2193 29263
$$ packed form
1882f597K0560j2167j6852K2983l458k0698K4986N963k9884J3015J5132k5413
1894a2430O188K4086j9201j0284K0127p037j4668J8099P336j9139J998J3624j3212
1907d513o205K1278k552j9408J3356O610k1788R901J9464k0300l765J9178j5164
1920c908q614K2121m099j2591J1244j902j0008O945M072p11q93m937M477p97r799
1935i400J5063N904k3326J1223J4049k9995J0041L0288l2637m568L6239l0498
1947g617j5351M6051j7797k7735M0287r739l5312L6452N960l3605K4885Q027l2467
1960a7961J6382J2699k0749J3223N760j9092J1231M82j2722K1027m353j9535K4309
1973A0701p390k5567L5257Q85l6583L3203O661m6966L1978K3954m8955K0629L1456
$$ plain form
1986 29263 -22000 -14540 28176 -11151 -14643 27308 -5473 -21140 17223 -152 -14954 15995
1998 15995 3601 -13361 6638 -1237 -7764 10278 -380 -4354 8989 -9155 -7307 15344 -5962
2011 -5962 -7182 19226 -8748 -17611 19860 -967 -18025 21601 4407 -26109 12555 10772 -22086
2024 -22086 10470 17619 -20701 -1783 15217 -13751 -2755 17372 -5848 -8165 7303 -3360
2036 -3360 -5092 6405 2919 -1125 -2043 -2957 1822 -985 -1455 8576 -529 -10236 4981 2609 -9721
2051 -9721 7589 9627 -12025 -1976 8986 -8716 -3126 14049 -1839 -9999 6010 1227 -9614
2064 -9614 4990 10236 -6607 -5316 7108 -3323 -8363 10240 6772 -11471 1153 7716 -11625
2077 -11625 -1676 15601 -5000 -8528 10470 -3894 -11376 11223 5357 -9250 4329 2535 -9658
$$ packed form
1986B9263n1263P460M2716l9327l492M1951l2781j5667L8363j7375j4802L0949
1998A5995j2394j6962J9999p875o527J8042j0658l974J3343j8144J848K2651k1306
2011e962j220K6408k7974q863L7471k0827j7058L9626j7194l0516L8664j783l2858
2024b2086L2556P149l8320J8918J7000k8968J0996K0127k3220k317J5468j0663
2036c360j732J1497l486m044r18r14M779k807m70J0031r105r707J5217k372j2330
2051i721J7310K038k1652J0049J0962j7702N590J7175j5888q160J6009m783j0841
2064i614J4604N246j6843J291J2424j0431n040J8603l468j8243J2624O563j9341
2077a1625R949J7277k0601l528J8998j4364p482K2599n866j4607J3579j794j2193
$$ plain form
2090 -9658 1720 6098 -1294 1255 -693 -3041 543 -3133 2587 8573 -6981 -3836 9297 -9539
2104 -9539 -5972 18868 -4291 -13697 16432 -3350 -19948 18908 8296 -21314 12266 9878 -25088
2117 -25088 6763 18486 -17568 1736 16494 -17549 -5206 16279 -7921 -2467 12698 -8619
2129 -8619 -5672 7206 -5673 2491 8641 -9006 1193 5316 -13789 5790 13939 -15155 2132
2142 2132 14412 -20613 -2089 23520 -14673 -6961 23677 -15155 -16197 24926 -4261 -16450
2154 -16450 22171 -1369 -22693 14793 5876 -16187 12559 7430 -16603 3651 5544 -8946
2166 -8946 6589 5327 -7287 2779 -2032 -6397 9453 356 -6439 10225 -4293 -13432 13237
2179 13237 3058 -13338 13474 4578 -20952 7757 11836 -16397 5944 15512 -17442 -4685
$$ packed form
2090i658J1378M378p392K549j948k348L584l676N720N986j5554L145J3133j8836
2104i539L567K4840k3159r406L0129j9782j6598L8856j0612k9610L3580k388l4966
2117b5088L1851J1723l6054J9304J4758l4043J2343K1485k4200N454J5165k1317
2129h619K947J2878j2879Q164O150j7647J0199M123j9105J9579Q149k9094J7287
2142B132J2280l5025J8524K5609l8193P712L0638l8832j042M1123k9187j2189
2154a6450L8621k3540k1324L7486q917k2063K8746n129k4033K0254J893j4490
2166h946J5535j262j2614J0066m811m365J5850r097o795J6664j4518r139K6669
2179A3237j0179j6396K6812q896k5530K8709M079k8233K2341R568l2954J2757
$$ plain form
2191 -4685 15265 -9244 -4675 16210 -4536 -11309 7734 30 -6792 7199 4572 -5698 -2022
2204 -2022 715 -633 80 2216 4043 -2463 -6345 3048 1805 -4814 5975 5446 -9615 -1767 6552
2219 6552 -5366 -940 10344 -2547 -8411 4184 1294 -5976 4672 7420 -6088 -5225 5381
2232 5381 -1353 -5764 8423 5563 -10929 -340 7726 -9082 -1212 14836 -5557 -9902 10358
2245 10358 -2725 -10817 12494 5204 -11937 4354 3719 -10995 3654 8861 -5124 -234 2324
2258 2324 -5706 155 2796 179 4522 -2720 -5719 5305 -2898 -4834 13018 -883 -13004 10072
2272 10072 883 -15589 13704 9880 -18743 6057 10800 -20153 3701 19377 -14915 -3164
2284 -3164 16275 -14458 -7648 18488 -5125 -7428 12920 -6312 -9985 10143 -657 -3345 8502
$$ packed form
2191d685J9950k4509M569K0885k0746o773J9043p704o822J3991k627j0270L676
2204b022K737j348P13K136J827o506l882R393j243o619J0789n29j5061P848Q319
2219F552j1918M426J1284j2891n864J2595k890p270J0648K748j3508Q63J0606
2232E381o734m411J4187k860j6492J0589Q066j6808P870J6048k0393m345K0260
2245A0358j3083q092K3311p290j7141J6291o35j4714J4649N207j3985M890K558
2258B324q030N861K641k617M343p242k999J1024q203j936J7852j3901j2121K3076
2272A0072r189j6472K9293l824k8623K4800M743l0953K3854J5676l4292J1751
2284c164J9439l0733O810K6136k3613k303K0348j9232l673K0128j0800k688J1847
$$ plain form
2297 8502 -4743 -5233 5685 -5666 910 11456 -8598 -3602 10558 -11675 -3955 18976 -7936
2310 -7936 -9715 17060 -8662 -15204 20417 1209 -16619 15480 2143 -21187 11283 10518 -15359
2323 -15359 7210 9757 -16483 216 10658 -7655 1881 8198 -7899 -2318 3215 -3943 4366
2336 4366 3813 -5348 2952 -1152 -8618 8233 5094 -9356 6464 3863 -15207 4560 11555 -11089
2350 -11089 2118 11859 -13689 -5415 14040 -5175 -5323 12849 -3639 -11659 7082 2846 -6372
2363 -6372 5736 4783 -7554 -2790 3702 -514 -612 3915 1612 -4981 -3293 3602 665 -1967 5138
2378 5138 1275 -8240 11 5042 -3445 899 6849 -4051 -6364 3556 1281 -2931 4133 3994 -5708
2393 -5708 -4053 4075 181 -2991 5813 3322 -9148 -1267 7039 -5272 -1214 11628 -4836 -10209
$$ packed form
2297H502j3245m90J0918j1351O576J0546k0054M996J4160k2233P720K2931k6912
2310g936j779K6775k5722o542L5621j9208j7828L2099j3337k3330L2470p65k5877
2323a5359K2569K547k6240J6699J0442j8313R536O317j6097N581N533p158Q309
2336D366n53r161Q300m104p466J6851l139j4450J5820k601j9070J9767O995k2644
2350a1089J3207R741k5548Q274J9455j9215j48J8172j6488q020J8741m236r218
2363f372J2108r53j2337M764O492m216r8M527k303o593J688O895k937k632P105
2378E138l863r515Q251N031q487M344N950j0900k313R920k275m212P064j39r702
2393e708J655Q128l894l172Q804k491j2470P881Q306j2311M058J2842j6464n373
$$ plain form
2407 -10209 8765 -141 -9209 11013 5049 -13089 3002 5504 -10138 3808 10246 -7479 -2479
2420 -2479 4896 -6123 -659 7053 -1321 -272 415 -5458 1802 2356 -3081 6626 1047 -10890 4722
2435 4722 4128 -10452 8329 9461 -15273 861 10946 -13860 700 17809 -11298 -7418 14387
2448 14387 -9238 -8856 17633 -1772 -11202 10675 -2488 -11544 10298 3657 -7114 5966 -1003
2461 -1003 -8098 4950 859 -2003 7304 -3843 -6384 6729 -4128 -4009 13325 -3362 -10479 10728
2475 10728 -3142 -12063 15249 4000 -15254 9268 4198 -17242 8172 12287 -13318 2198
2487 2198 9835 -13751 -1903 12957 -5437 -2477 8418 -6400 -5627 6143 -506 -39 4224 -3545
2501 -3545 -1967 790 -3515 4387 4819 -6088 1313 2801 -9298 2631 10081 -6955 -1315 8245
$$ packed form
2407a0209J8974q906r068K0222n964j8138J6091K502j5642J3946O438j7725N000
2420b479P375j1019N464P712q374J049O87n873P260N54n437R707n579j1937J5612
2435D722n94j4580J8781J132k4734J6134J0085k4806J4560J7109k9107L880K1805
2448A4387k3625L82K6489j9405r430K1877j3163r056K1842o641j0771J3080o969
2461a003p095J3048m091k862R307j1147k541J3113j0857J19J7334j6687p117K1207
2475A0728j3870q921K7312j1249j9254K4522n070k1440K5414M115k5605J5516
2487B198P637k3586J1848J4860j8394K960J0895j4818P73J1770o649M67M263p769
2501c545J578K757m305P902M32j0907P401J488j2099J1929P450j7036N640R560
$$ plain form
2515 8245 -9270 -5213 12301 -1818 -6212 8989 -2311 -10781 6548 4982 -6048 3642 4092
2528 4092 -7926 -2441 5576 -80 -1278 3751 -114 -5952 -885 4552 -127 -1025 4097 -1502 -6799
2543 -6799 2095 4164 -2700 1876 3905 -5445 -3782 4023 724 -918 3386 475 -4767 -2084 2958
2558 2958 1601 -1120 2614 1540 -6868 -1616 6767 -2066 -2088 8032 -3625 -9603 7231 2764 -7733
2573 -7733 7740 4818 -12622 1189 7628 -7946 1987 10163 -7944 -4816 6681 -4233 -1801
2586 -1801 8545 -1736 -4260 2136 -3234 -579 5024 -1235 1042 1433 -7489 1165 5890 -5625
2600 -5625 3233 7558 -11322 -2460 10648 -7901 -1801 14630 -8118 -9880 12387 -3954 -9107
2613 -9107 14951 729 -13489 7898 1818 -11384 8715 6888 -9641 2358 2873 -8455 3371
$$ packed form
2515H245j7515M057J7514j4119m394J5201j1300q470J7329j566j1030R690M50
2528D092j2018N485Q017n656j198N029l865n838N067N437m679q98N122n599n297
2543f799Q894K069o864M576K029r350J663P805l299j642M304k911n242K683N042
2558B958j357k721L734j074q408N252Q383q833k2J0120j1657n978J6834m467j0497
2573g733J5473k922j7440J3811O439j5574R933Q176j8107L128J1497j0914K432
2586a801J0346j0281k524O396n370K655N603o259K277L91q922Q654M725j1515
2600e625Q858M325j8880Q862J3108j8549O100J6431k2748j762K2267j6341n153
2613i107K4058j4222j4218K1387o080j3202K0099j827j6529J1999N15j1328J1826
$$ plain form
2626 3371 5716 -3775 2472 -152 -6663 3562 1569 -3368 7364 -521 -9629 5693 1520 -8445
2640 -8445 9609 5293 -13158 3715 6177 -12255 4749 12323 -11011 -2286 9565 -9757 -3257
2653 -3257 13303 -3473 -6021 7366 -3916 -6861 7377 2322 -3422 2892 -1338 -4341 1471 1080
2667 1080 1753 2514 -3434 -1281 1365 -4034 2212 6942 -4484 -2730 4742 -5409 -3269 9601 -258
2682 -258 -6115 5041 -1000 -8051 5476 5809 -5355 832 3406 -6497 -2056 6645 486 -2601 2605
2697 2605 -655 -5472 823 5165 -636 -1523 2805 -2400 -5347 3654 4023 -2926 1296 2191 -5758 -1812
2713 -1812 5062 162 -878 2747 -1776 -4239 606 2618 1159 77 204 -514 -3860 -859 5585
2728 5585 -17 -2918 4436 -2196 -7853 6065 4659 -6814 4259 4483 -11147 191 9282 -5983
$$ packed form
2626C371K345r491O247k624o511J0225j993m937J0732p885r108J5322m173r965
2640h445J8054m316j8451J6873K462j8432J7004P574k3334Q725J1851j9322O500
2653c257J6560j6776k548J3387j1282k945J4238n055n744O314m230l003N812l91
2667A080O73P61n948K153K646n399O246M730j1426J754P472j0151K140J2870r859
2682b58n857J1156o041p051J3527L33j1164O187K574r903M441Q701o159l087N206
2697B605l260m817O295M342n801q87M328n205k947R001L69o949M222Q95p949L946
2713a812O874m900j040L625m523k463M845K012j459j082J27p18l346L001O444
2728E585n602k901P354o632n657J3918j406j1473J1073K24j5630J1338R091j5265
$$ plain form
2742 -5983 -423 9253 -7422 -6408 8374 -1684 -3667 8289 -1444 -7280 3384 -18 -2404 5417
2756 5417 377 -3168 1002 -3374 -596 5782 -2029 -630 4691 -7004 -3531 9149 -3005 -3493
2770 -3493 10077 -5112 -10025 10072 508 -8603 10865 2115 -13607 5429 5251 -9852 6070
2783 6070 8040 -10444 -718 5889 -6777 1221 7986 -4314 -1992 2364 -4683 901 4681 -2134
2797 -2134 1885 609 -6959 2493 3939 -4997 4785 4420 -10235 561 6924 -7433 1891 10285
2811 10285 -8630 -4963 8856 -5282 -4064 11631 -1835 -8422 5930 -786 -6741 7092 3877
2824 3877 -5894 1164 780 -4618 1807 3701 -275 55 -1648 -2044 816 -374 1852 3761 -3371 -3009
2840 -3009 2873 -2437 -1413 7043 -355 -5817 2830 -64 -5181 4863 4939 -5077 -844 2717 -4361
$$ packed form
2742e983N560R676j6675J014J4782j0058j983J1956r733n836J0664l402k386P821
2756E417n040l545M170m376K778O378p811J399N321j1695L473J2680j2154m88
2770c493J3570j5189m913K0097r564r111J9468q750j5722J9036j78j5103J5922
2783F070J970j8484R726O607j2666P998O765j2300K322M356p047N584L780o815
2797b134M019j276p568R452J446q936R782l65j4655J0796O363j4357R324Q394
2811A0285j8915L667J3819j4138J218J5695j3466o587J4352o716n955J3833l215
2824C877r771P058l84n398O425J894l976L30j703l96K860j190K226J909p132L62
2840c009N882n310J024Q456p398n462Q647k894n117J0044P6j0016M233L561p078
$$ plain form
2855 -4361 -1143 6334 516 -3812 1316 -50 -4308 1700 5466 -1578 -2666 2287 -2051 -4013 4675
2870 4675 3717 -3888 378 1725 -5204 -308 5907 -663 -1861 2255 -2425 -3470 2768 2546 -236
2885 -236 207 -835 -1743 -1338 674 3827 445 -2989 1482 -945 -4943 4665 4816 -5608 1107 3763
2901 3763 -8274 -137 9395 -4301 -2769 7536 -5770 -6572 8994 410 -5297 6760 -691 -8583
2915 -8583 4096 3019 -3789 4147 1575 -5680 537 694 -1447 4381 363 -3237 2129 -2935 -3170
2930 -3170 7176 103 -4741 5790 -2205 -8594 7730 3610 -7836 6194 3127 -11946 3197
2943 3197 7819 -7792 2431 7975 -9506 -2992 7997 -4300 -1195 8195 -3994 -5156 4121
2956 4121 -1794 -1216 5513 -1027 -2356 1049 -3483 432 4625 -2228 737 2770 -6705 -782 6639
$$ packed form
2855d361L218P477n818m328N128j366m258O008L766p044j088M953m338j962Q688
2870D675r58p605M266J347o929M896O215o570j198M116m680j045O238k22k782
2885b36M43j042r08M05K012L153l382l434M471k427l998R608J51j0424O715K656
2901C763j2037Q137R532j3696J532J0305j3306q02J5566q584n707J2057p451p892
2915h583J2679j077o808P936k572p255O217J57k141N828m018l600N366n064k35
2930c170J0346p073m844J0531p995o389J6324m120j1446J4030l067j5073J5143
2943C197M622j5611J0223N544j7481O514J0989j2297L105R390j2189j162R277
2956D121n915N78O729o540j329L405m532L915M193o853K965K033r475N923P421
$$ plain form
2971 6639 -3640 -403 7213 -6152 -5606 7713 -1528 -4254 8608 -777 -8976 4481 2213 -5797
2985 -5797 5134 4465 -6781 -717 3019 -3430 934 4870 -1389 -2464 -80 -1061 172 1668 1552
3000 1552 742 -2661 -2228 1887 -237 -226 4322 -912 -5078 1759 1104 -2986 3732 3538 -4946 -1572
3016 -1572 2652 -2521 -280 5354 -316 -4343 814 634 -2803 2095 4571 -2398 -3310 2081 -974
3031 -974 -2781 4716 2953 -4894 -264 2205 -4318 589 6164 -1937 -2992 2480 -2303 -2731 4427
3046 4427 1875 -2048 370 -1042 -2233 915 1717 1610 295 -2752 -443 529 -2223 2970 4068 -4615
3062 -4615 -1315 3491 -4873 -588 8293 -2834 -4689 5673 -3137 -5919 8214 2044 -6596 4347
3076 4347 797 -8146 3837 5360 -4695 1720 2702 -6263 -177 4037 -1606 1719 1765 -4089 -193
$$ packed form
2971F639j0279L237P616j3365N46J3319r241k726J2862r385q199J3457k268q010
2985e797J0931o69j1246O064L736o449M364L936o259j075K384r81J233J496j16
3000A552q10l403M33M115k124J1M548n234m166O837o55m090O718j94q484L374
3016a572M224n173K241N634n670m027N157j80l437M898K476o969r12N391l055
3031i74j807P497j763p847M630K469o523M907N575q101j055N472m783m28P158
3046D427k552l923K418j412j191L148Q02j07j315l047K309R72k752N193J098q683
3062d615L300M806q364M285Q881j1127j855J0362q810k782J4133o170q640J0943
3076D347l550q943J1983J523j0055O415R82q965O086M214n643L325M6n854L896
$$ plain form
3091 -193 578 -1892 4286 1562 -4772 2059 122 -5806 5212 4683 -6632 2097 3546 -8831 1555
3106 1555 8550 -5714 -959 6905 -7168 -4076 8712 -1761 -3478 6690 -2643 -6585 4679
3119 4679 1220 -2736 4325 117 -4632 908 63 -557 3657 -327 -1900 1137 -3198 -936 5433
3134 5433 -1130 -1968 4077 -3795 -4707 6407 745 -4158 5336 -246 -7852 3514 3919 -4594 2970
3149 2970 3920 -6562 -1537 4465 -2005 -108 4519 -1933 -3810 1107 556 -335 1997 1279 -1522 -2403
3165 -2403 -401 1554 356 643 2068 -1899 -3501 1687 1462 -1274 2515 1625 -4338 -1308 2627 -890
3181 -890 165 3659 -1087 -3984 722 1382 -1278 1747 2993 -2701 -3182 2013 301 -1667 3616 1892
3197 1892 -4960 -657 2793 -2676 575 5317 -2478 -3862 2728 -1003 -2289 4735 1410 -3817 400
$$ packed form
3091a93P71k470O178k724o334O831j937n928J1018n29j1315Q729J449j2377J0386
3106A555O995j4264M755P864j4073L092J2788j0473j717J0168r333l942J1264
3119D679l459l956P061m208m749N540q45o20M214l984j573L037m335K262O369
3134E433o563q38O045p872r12J1114n662m903R494n582p606J1366M05q513P564
3149B970R50j0482N025O002o470J897M627o452j877M917n51q91K332p18k801q81
3165b403K002J955j198K87J425l967j602N188k25k736L789q90n963L030L935l517
3181h90J055L494m746k897M706O60k660L025J246n694m81N195j712j968N283j724
3197A892o852M303L450n469L251M742p795j384O590l731j286P024l325n227M217
$$ plain form
3212 400 0 -2346 2142 2448 -669 -379 -1607 -1277 1393 105 1231 2465 -3411 -2388 3178 -1814
3228 -1814 -946 6206 -1888 -5604 4160 -431 -4914 6563 2769 -7219 2187 2455 -6629 2980 6279
3243 6279 -4990 -734 3508 -5121 -769 5760 -1395 -1109 2260 -3374 -1548 2917 -392 1290 1759
3258 1759 -3866 -407 1723 -2855 2791 4143 -5184 -657 3479 -5269 500 7574 -4045 -3172 5399
3273 5399 -4336 -3988 8046 -50 -5081 4719 -991 -6420 4591 3222 -3775 2340 1077 -5099 644
3288 644 2696 -860 1685 560 -2810 -154 -303 -270 3513 -19 -2665 1587 -1598 -3028 4760 1795
3304 1795 -3951 2399 398 -5836 2655 4652 -3676 687 3079 -5284 -1553 5106 -852 -1313 3372
3319 3372 -1896 -3961 2006 1775 -834 1493 706 -2572 -1630 1124 1414 287 550 430 -2276 -1931 2076
$$ packed form
3212D00m00k346M488L06l117K90j228L30K670j288J126J234n876J023N566m992
3228a814Q68P152q094l716R764m591m483J1477l794r988R406K68r084R609L299
3243F279j1269M256M242q629M352O529p155K86L369n634J826M465l309J682M69
3258A759n625L459K130m578N646J352r327M527M136q748N769P074j1619Q73Q571
3273E399r735L48J2034q096n031R800n710n429J1011j369o997O115j263o176N743
3288F44K052l556K545j125l370K656j49L3L783l532k646M252l185j430P788k965
3304A795n746O350k001o234Q491J997q328M363K392q363L731O659n958m61M685
3319C372n268k065N967k31k609K327p87l278R42K754K90j127K63j20k706L45M007
$$ plain form
3336 2076 1418 -677 1423 -19 -3483 -288 2516 -19 167 1727 -1549 -2977 880 1956 -303
3351 -303 670 1387 -2341 -2689 2062 1604 -1341 1897 1273 -4505 -810 3710 -1371 -273 4148 -2533
3367 -2533 -4238 3122 547 -2192 3875 1070 -4728 306 1549 -2026 1961 2775 -2337 -1277 104
3382 104 -1191 1376 1698 -277 419 -1878 -2273 2568 620 -1178 3440 -965 -5146 2765 1784 -3658
3398 -3658 3998 2860 -6735 379 3951 -4573 1377 6147 -4713 -2835 4233 -3111 -1584 6088 -957
3413 -957 -3474 2297 -1637 -2242 3723 821 -1262 1104 -2251 -1585 2519 -403 637 2786 -3550 -2178
3429 -2178 3359 -1996 -537 5692 -2539 -4461 4091 -1332 -3558 6342 1055 -5905 2670 972 -5299
3444 -5299 3626 4294 -4312 183 2112 -4282 232 4292 -1078 -559 1116 -2553 -905 1729 405
$$ packed form
3336B076o58k095K100j442l464L195K804k535J86J560l276j428L857J076k259
3351c03R73P17l728l48M751m58k945L238o24n778L695M520n081J098M421o681
3367b533j705P360k575k739O067k805n798N034J243l575L987Q14n112J060J381
3382A04j295K567L22j975O96k297l95M841j948j798M618m405m181P911r81n442
3398c658P656j138r595P114L572q524N950M770j0860J878P068p344J527P672p045
3413i57k517N771l934o05N965k902k083K366l355O66M104k922J040K149o336J372
3429b178N537n355J459O229q231j922Q552n423k226R900n287o960Q575j698o271
3444e299Q925O68q606M495J929o394M514M060n370N19J675l669J648K634j324
$$ plain form
3459 405 1345 131 -2456 81 49 -1201 3103 1616 -3432 349 965 -3469 1837 4302 -2852 -1231
3475 -1231 2351 -3225 -1432 4846 85 -2493 1955 -907 -3447 2182 2699 -1365 68 613 -2389
3490 -2389 -1159 2253 1341 -587 76 -155 -2117 -618 2527 1007 -1062 569 -568 -2697 759 2588
3506 2588 -264 -159 661 -1858 -1781 1601 1693 -193 33 25 -1734 -1395 2000 1859 -1080 219 754 -3245
3524 -3245 -799 4025 -393 -1567 2850 -1725 -4115 3326 2010 -2727 2482 1276 -5039 305 3244
3539 3244 -1856 842 2783 -3080 -1921 1842 -544 582 2274 -1177 -1211 -307 -1322 1667 1829 -1411
3555 -1411 865 -203 -3835 1622 3112 -2597 1279 2595 -5285 -871 4885 -2488 -585 5155 -3632
3570 -3632 -4119 4550 -667 -2567 5118 -210 -5025 2057 752 -2628 3258 1814 -3130 158 -130
$$ packed form
3459D05R40j214k587K537l2j250M304j487n048L781O16m434N306K465p154J621
3475a231L582n576J793O278m761k578M448k862k540N629N17m064J433N45l002
3490b389J230L412r12j928O63k31j962J499L145j520k069J631j137k129L456J829
3506B588k852J05Q20k519P7L382R2j886K26qj759L39L395j41k939J299N35l999
3524c245K446M824m418j174M417m575k390P441j316m737N209j206o315N344K939
3539C244n100K698J941n863J159L763k386J126J692l451l4R04j015K989J62l240
3555a411K276j068l632N457J490n709L876J316p880M414N756p373J903N740q787
3570c632m87Q669n217j900P685n328m815P082j305l380N886j444m944L288k88
$$ plain form
3585 -130 -1748 2262 1259 -1025 1021 -1775 -2336 2881 331 -1298 3369 -1284 -4522 3024 1126
3600 1126 -3100 3989 1666 -5851 1027 2784 -3836 1993 4477 -4216 -1712 3018 -2620 -530 4611
3615 4611 -1019 -2503 1303 -1231 -1280 2545 915 -593 -125 -1563 -511 1040 109 1505 788 -2843
3631 -2843 -504 1398 -1500 1214 3219 -2481 -2082 2056 -1452 -1079 4040 236 -3220 999 136 -2471
3647 -2471 1972 2835 -1775 -1121 845 -1487 -827 2653 1257 -1673 -417 199 -1691 118 2880 251
3663 251 -1746 416 -501 -1935 1608 2378 -1073 -653 383 -1733 -567 2201 980 -584 -292 -641
3679 -641 -1099 -27 1685 1358 -1041 -841 339 -1584 -400 3378 118 -2421 1483 -584 -3310 2874
3695 2874 2832 -3116 683 1725 -4286 27 4368 -1655 -826 2748 -2795 -2415 3181 260 -832 2134
$$ packed form
3585a30j618M010j003k284K046k796n61N217k550j629M667m653l238P546j898
3600A126m226P089k323p517O878J757o620N829K484q693K504M730n638K090N141
3615D611n630j484L806k534m9L825j630j508M68j438J052J551r31J396p17l631
3631b843K339J902k898K714K005n700L99M138l508L73N119l804l456M219q63k607
3647b471M443Q63m610O54J966k332O60L480j396k930J256O16j890J809K762k629
3663B51j997K162r17j434L543P70l451M20J036k116J166K768j221j564K92l49
3679f41m58J072J712l27k399K00J180j923J184L778l260k539L904k067k726O184
3695B874m2n948L799J042o011M313M341o023Q29L574n543L80N596k921j092K966
$$ plain form
3711 2134 -1156 -2385 959 140 520 1910 -1202 -989 460 -2040 807 3381 -1847 -844 2220 -3431
3727 -3431 -1392 4982 -1021 -2279 3871 -2108 -4414 4447 1291 -3445 3471 738 -5481 1670 2793
3742 2793 -2793 1824 2418 -3873 -714 1925 -1399 1140 2139 -1866 -654 -15 -1558 1852 1588 -1621
3758 -1621 1069 -285 -3564 2027 2537 -2577 1690 1891 -4890 29 3984 -2537 121 4053 -3508
3773 -3508 -2854 3765 -784 -1636 3969 -423 -3763 1359 639 -1606 2185 1478 -2020 -681 -57 -446
3789 -446 1058 948 243 -259 -1847 -427 1495 -275 552 1861 -2068 -2073 1940 -127 -873 2856 55
3806 55 -3369 633 1107 -1686 1498 2372 -2195 -1585 1260 -585 -559 2413 851 -2313 -609 881 -1001
3823 -1001 224 2668 -338 -2425 598 241 -1560 1821 2153 -2020 -976 887 -1378 -103 2572
$$ packed form
3711B134l290j229L344q19L80J390l112K13J449k500K847K574n228J003L064n651
3727c431K039O374o003j258O150n979k306Q861l156m736O916k733o219P151J123
3742B793n586M617N94o291L159K639l324K539R99m005J212O39j543L410k64l209
3758a621K690j354l279N591N10n114M267K01o781M919L955o521K658L932p561
3773c508O54O619m549q52N605m392l340N122p20k245L791p07l498J339O24l89
3789d46J504j10p05n02j588J420J922j770Q27J309l929nM013k067p46L729k801
3806E5l424M002M74k793L184Q74m567O10K845j845K6K972j562l164J704J490j882
3823a001J225K444l006k087L023l57j801L381L32m173J044J863k265J275K675
$$ plain form
3838 2572 140 -1377 -66 -629 -619 944 1226 422 -958 -1227 385 -181 -216 2454 225 -2867 737
3855 737 675 -2528 2148 3041 -3294 -721 2433 -3096 -513 4790 -1447 -2538 2830 -1664 -2874 3884
3871 3884 1082 -2543 1703 -238 -3091 1588 1642 -871 1145 -346 -2094 665 25 0 2528 -989
3887 -989 -2114 1755 -1311 -1658 4283 43 -3572 2715 -320 -4292 3868 2681 -4293 1691 2007 -5188
3903 -5188 968 4487 -2910 -156 3177 -3631 -1665 3613 -751 -675 2520 -1740 -1992 1378 -302 488
3919 488 1839 -1378 -637 464 -1961 1121 2772 -2035 -199 1833 -3462 -501 4310 -1587 -1440 3464
3935 3464 -2477 -3295 4086 498 -2671 3132 127 -4370 1510 2162 -2013 1250 1821 -2676 -1051 1433
3951 1433 -208 312 1315 -382 -1135 -787 199 1154 169 110 698 -1685 -1426 1891 460 -853 1727
$$ packed form
3838B572k432j517J311n63J0J563K82q04j380k69J612n66l5K670k229l092L604
3855G37o2l203M676Q93o335K573L154n529K583N303o237j091N368m494j210O758
3871C884k802l625M246j941k853M679N4k513K016j491j748K759o40k5K528l517
3887i89j125L869l066l47N941m240l615O287l035l972Q160j187o974N984L16p195
3903e188O156L519p397K754L333o808J966N278m364P6L195m260k52L370j680P90
3919D88J351l217P41J101k425L082J651m807J836K032n295K961M811n897J47M904
3935C464n941q18P381l588l169N803l005m497N880O52m175L263N71m497J625K484
3951A433j641N20J003j697p53L48R86R55r85n9N88k383K59L317j431j313K580
$$ plain form
3968 1727 -194 -2965 649 1731 -1192 745 1822 -2147 -1712 1709 191 -753 1833 496 -2553
3983 -2553 -440 1537 -555 -61 2192 -704 -2719 948 1064 -1497 1470 1980 -2675 -1167 1838 -1020
3999 -1020 -342 2799 -519 -2242 696 -37 -824 1571 995 -921 -677 -664 59 710 79 1117 159 -2579
4017 -2579 213 1638 -1699 1040 2874 -3159 -1642 3161 -1823 -1291 4683 -1142 -3840 2978 -184
4032 -184 -3360 3805 1782 -3988 1203 1207 -3387 1554 2829 -2043 -8 864 -2329 382 1678 -618
4048 -618 999 -59 -2377 985 479 -1474 2758 708 -3794 1466 1278 -3651 2611 3339 -4472 139
4064 139 3132 -4232 82 5268 -2764 -2011 3732 -2597 -2600 4514 -39 -2535 2468 -740 -2938 2090
4080 2090 1082 -1033 1374 -528 -1742 781 -290 269 2120 -1336 -1276 1586 -1761 -755 3778 -843
$$ packed form
3968A727j921k771L614J082k923J937J077l969M35L421j518r44K586j337l049
3983b553K113J977k092M94K253k896k015L667J16k561K967N10m655J508L005k858
3999a020O78L141l318j723K938p33p87K395n76j916K44J3P23O51o31J038r58k738
4017b579K792J425l337K739J834o033J517M803m984N32N974n825k698O818l162
4032a84l176P165k023n770N191Mm594M941J275m872K035Q72l193K711J296k296
4048f18J617j058k318L362n06j953M232k050m502N260j88m929O262P28p811M611
4064A39K993p364M314N186q032P53N743o329lP114m553k496N003l208k198N028
4080B090j008k115K407j902j214K523j071N59J851l456O0K862l347J006M533m621
$$ plain form
4096 -843 -2440 2600 -1160 -3110 3721 1394 -3358 1922 941 -4107 1298 3177 -2281 127 2129
4111 2129 -2661 -1325 2549 17 -656 1299 -508 -1704 99 918 553 48 1 -66 -1310 -578 1825
4128 1825 401 -933 997 -345 -2317 1011 1889 -1110 203 1243 -1918 -1331 2003 516 -941
4143 -941 1100 307 -2327 -201 2084 -331 -662 1724 -680 -2677 1335 1771 -1708 867 1870 -2892
4159 -2892 -1209 2706 -752 -874 2758 -847 -2836 1460 650 -1306 1747 877 -1990 -286 352 -361
4175 -361 914 557 -224 -92 -1441 -152 1856 -716 -119 2131 -2278 -2098 3217 -488 -2056 3791
4191 3791 -389 -4520 2761 1499 -3738 2883 2579 -4759 373 2917 -3325 607 3851 -2675 -1398
4206 -1398 2265 -1909 -526 2840 -749 -764 818 -1778 105 1661 -1031 972 1080 -3171 359 2324
$$ packed form
4096h43j597N040l760j950O831k327m752N280r81n048N405J879n458K408K002
4111B129m790J336L874k532o73J955j807j196J803Q19l65n05m7o7j244P32K403
4128A825j424j334J930j342j972L328Q78k999J313J040l161N87L334j487j457
4143i41K041p93k634K126K285k415l31K386k404j997M012M36l479K575J003m762
4159b892J683L915l458j22L632l605j989M296q10j956L053q70k867J704O38p13
4175c61J275l57p81J32j349J289K008k572N97K250m409J80N315l705j568N847
4191C791m180m131P281j262n237O621l04p338N132K544o242L932L244o526J277
4206a398L663m174J383L366l589j5J582k596J883J556k692K003J08m251L530J965
$$ plain form
4222 2324 -2560 1051 3359 -3881 -1212 3804 -2804 -1139 5170 -2113 -3507 3876 -1034 -3329 4473
4237 4473 878 -4073 2063 792 -3504 2002 2353 -2265 382 722 -2093 520 1245 -396 927 -461
4253 -461 -1606 1091 -233 -832 2690 -288 -2823 1847 135 -2772 2913 1865 -3692 852 1871
4268 1871 -3528 701 3752 -2326 -1235 2570 -1998 -1771 3139 384 -1853 1202 48 -2043 618
4283 618 1654 -237 -417 313 -443 -1101 338 1583 -114 -913 659 -448 -1606 1299 1559 -1253 -83
4300 -83 910 -1674 -721 2095 377 -1140 696 111 -1816 141 2046 -266 -1077 1173 -351 -2337
4316 -2337 1322 2147 -1883 34 2032 -2597 -1378 3413 -483 -1881 2679 -537 -3339 2094 1479
4331 1479 -2200 1473 1231 -2814 -6 1586 -895 588 1052 -1189 -379 -159 -394 1505 71 -1003
$$ packed form
4222B324m884L611K308p240K669N016o608J665O309p283j394P383m910k295P802
4237D473l595m951O136j271m296N506L51m618K647L40k815K613P25j641J323j388
4253d61j145K697j324n99L522k978k535M670j712k907N685j048n557M544J019
4268A871n399M229L051o078J091L805m568K27M910k755k237L055j154k091K661
4283F18J036j891j80P30p56o58J439J245j697p99J572j107j158K905K60k812J170
4300h3R93k584R53K816j718j517J836n85j927J957J905k312q11K250j524j986
4316b337L659Q25m030J917J998m629J219M791l896j398M560l216k802N433o15
4331A479l679L673k42m045K808J592k481J483M64k241Q10K20k35J899j434j074
$$ plain form
4347 -1003 1306 -1082 -2059 2812 636 -2622 2543 517 -4417 2176 2759 -3785 1483 3281 -4740
4362 -4740 -553 4279 -2836 -836 4442 -2574 -2798 3441 -922 -1856 3393 -333 -2482 1458 -477
4377 -477 -1003 2169 -250 -744 1147 -1877 -476 2652 -1416 -423 2943 -2768 -2030 3996 -1347 -2200
4393 -2200 4495 -1163 -4374 3715 595 -3941 3675 1820 -4909 1422 2388 -3636 1264 3301 -2921
4408 -2921 -749 2011 -1870 -234 2300 -655 -530 356 -1207 312 756 -580 1296 -17 -2374 1158
4424 1158 921 -2117 1931 1798 -3433 163 2383 -2711 120 3691 -2186 -2019 2754 -1104 -2079 3141
4440 3141 661 -2731 958 825 -2146 599 2192 -867 -1049 775 -373 -1160 976 1446 -900 -800
4456 -800 822 -608 -1029 1631 965 -1505 9 692 -1388 -89 1912 -116 -1109 463 -66 -1160
$$ packed form
4347a003K309k388r77M871k176l258N165k026m934O593N83o544N268J798q021
4362d740M187M832p115K000N278p016k24O239m363r34N249l726k149L940j935
4377d77n26L172k419m94J891l024J401L128m068R93L366n711P38O026n343q53
4393b200O695n658l211Q089l120m536P616j855o729O331R66o024M900K037o222
4408b921K172K760l881J636K534k955J25Q86j563J519M44j336J876j313k357L532
4424A158k37l038M048j33n231L596K220n094K831L571n877J67M773l858r75N220
4440C141k480l392L689j33k971K745J593l059j82J824j148p87K136M70k346J00
4456h00J622j430m21K660o66k470J514O83k080J299K001k028r93J572n29j094
$$ plain form
4472 -1160 453 1583 -315 -1137 668 33 -1719 1067 2126 -1798 -746 2096 -1845 -1550 3547 -127
4488 -127 -2779 2408 212 -3618 2211 2370 -2994 796 2029 -3234 -207 2879 -1358 -362 1855 -1591
4504 -1591 -992 1240 -348 471 792 -1279 315 105 -1622 1856 1270 -2661 1207 1312 -3774 1304
4520 1304 3513 -3471 13 3677 -3995 -1374 5001 -2176 -2224 4486 -1846 -3770 3992 216 -3085
4535 -3085 3174 499 -3653 1601 1091 -1980 1712 800 -1995 681 -198 -1034 2089 -226 -1396 2024
4551 2024 -1330 -2234 3419 -90 -2775 3326 -106 -4449 3096 1939 -4125 2435 2601 -4977 522
4566 522 3705 -3378 -12 3945 -2925 -1879 3082 -1203 -1292 2823 -422 -1851 925 -253 -524 1123
4582 1123 20 -53 31 -1380 517 1129 -1254 861 1397 -2676 -257 2440 -1743 -406 3092 -1755
$$ packed form
4472a160J613J130j898q22J805o35j752K786J059l924J052K842l941K95N097l674
4488a27k652N187k196l830N829J59n364L790J233n263L027L086m237R96K217l446
4504a591N99K232j588Q19L21k071J594k10j727L478n86l931L868J05n086N078
4520A304K209o984L484L664p672K621O375p177m8O710o332j924P762l776l301
4535c085O259k675m152N254n10l071L692r12k795K676q79q36L123k315j170L420
4551B024l354r04N653l509k685O101l432m343P545j157o064O560J66p578N499
4566E22L183p083L366L957o870J046M961m285q9M115l245j429K776j178k71J647
4582A123j103p3Q4j411J897O12k383K115N36m073K419K697m183J337L498m847
$$ plain form
4598 -1755 -2334 2658 -270 -2127 2653 803 -3037 683 1493 -1905 332 2296 -1130 -1539 1219 60
4614 60 -1255 1111 1410 -1450 -906 1265 -572 -988 1865 567 -1989 356 882 -1469 355 1860
4630 1860 -849 -1018 710 -273 -686 802 923 -508 -939 292 332 -990 637 1768 -1535 -1267 2019
4647 2019 -962 -1735 3175 306 -3319 2002 1084 -3615 1889 2936 -3495 0 2855 -3101 -716
4662 -716 3770 -1498 -1566 2515 -1339 -1827 2313 50 -953 1258 -842 -827 972 -752 595 1526 -2095
4679 -2095 -63 1807 -2619 285 3634 -2778 -1316 3794 -2748 -2258 5107 -1155 -3562 4246 -563
4694 -563 -4524 3950 1548 -4230 2512 1669 -4383 1359 2652 -2702 780 1961 -2596 -54 1445
4709 1445 -1262 944 870 -1734 828 62 -1895 2250 820 -2777 1934 812 -3834 2156 2652 -3846
$$ packed form
4598a755n79M992k928j857M780j850l840L720Q10l398K237J964l426m09K758j159
4614F0j315K366K99k860N44K171j837m16K853j298k556K345N26k351J824J505
4630A860k709j69J728r83m13J488J21j431m31J231M0j322J627J131l303K68L286
4647B019k981p73M910k869l625N321r18m699N504J047o431L495K855n956K385
4662g16M486n268o8M081l854m88M140k263j003K211k100J5J799j724J347R31l621
4679b095K032J870m426K904L349o412J462N110o542M90P365o262k407P808m809
4694e63l961Q474k402n778O742q43o052N742J293n354L482J181m557K542J499
4709A445k707K206p4k604K562p66j957M145j430l597M711j122m646N990M96o498
$$ plain form
4725 -3846 1092 3019 -4329 -257 4349 -2797 -1198 4098 -2314 -2737 3665 -353 -2400 2803 151
4740 151 -2843 1172 890 -1278 879 700 -945 -212 -258 231 823 -583 242 774 -1777 -249 2125
4757 2125 -1084 -660 2327 -1292 -2153 2358 290 -2051 1969 920 -2911 445 1931 -1621 -89
4772 -89 2240 -1156 -1832 1482 475 -1450 1037 1399 -1897 -804 1771 -563 -1144 2026 305 -2413
4788 -2413 757 1201 -1756 540 1966 -1549 -1017 1372 -524 -699 1400 289 -960 -224 123 131 -189
4805 -189 268 1053 -997 -1285 1681 -98 -1717 2376 661 -3419 1444 1920 -3413 1166 3328 -3579
4821 -3579 -796 3599 -2697 -1391 4297 -1436 -2643 3078 -750 -2593 2896 545 -2262 1450 36
4836 36 -1800 1354 348 -669 1238 -1030 -935 1742 -1212 -516 2959 -1793 -2034 3311 -1370 -2596
$$ packed form
4725c846M938J927p348M072M606p146J599N296o412m23O402m018k047N203k652
4740A51k994M015k82k168K157j79j645P33m6M89N92j406Q25N32k551J528K374
4757B125l209M24K987l619q61M511k068k341M020j049l831L356J486l552J532
4772h9K329l396o76L314j007j925K487L62l296J093K575k334n81L170j721k718
4788b413L170M44k957K296J426l515N32K389j896j75K099j111j249P36L47Ql20
4805a89M57P85k050k88K966j779j619M093j715m080M863M76n333M579K162o907
4821c579K783M395o296J306N688n733j207N721l828j843N489k351k807L712j414
4836C6j836L154j006j017J907k268R5K677k954O96L475m752k41N345m681j226
$$ plain form
4852 -2596 4372 -260 -4166 3515 648 -4684 3340 2559 -4782 1535 2805 -4459 626 3876 -3002
4867 -3002 -510 2957 -2524 -1042 2697 -1010 -528 1594 -1416 -428 1069 -1101 896 1196 -2189 610
4883 610 1276 -2749 1119 2747 -3128 -36 3012 -3283 -809 4296 -2079 -2075 3789 -1534 -3095 3645
4899 3645 418 -3052 2334 831 -3293 1133 1834 -1746 344 1344 -1354 -643 754 169 87 -18
4915 -18 95 32 -1097 161 1513 -853 -549 1595 -1149 -1613 2117 345 -1862 1497 730 -2554 504
4932 504 1972 -1449 -308 1898 -1052 -1697 1603 698 -1517 782 1297 -1921 -808 2092 -502 -1357
4948 -1357 2014 125 -2607 1175 1486 -2022 583 2016 -2080 -873 1971 -789 -802 1807 -275 -1415
4964 -1415 583 192 -317 454 176 147 -497 -909 1062 420 -1380 1402 783 -2921 816 2303 -2792
$$ packed form
4852b596O968m632l906P681k867n332Q024p81p341O317J270p264N085L250o878
4867c002K492L467n481J482L739l707M82K122l010R88J497k170J997L00l385K799
4883F10O66m025L868J628n875L092L048o295K474N105o375MN864n323j561O740
4899C645l227l470N386j503m124M426P01l580K090J000k698P11J397n85q2j05
4915a8J13o3j129J258J352k366L04K144k744m64L730j772k207L359p67l284L058
4932E04J468l421J141K206k950o45L300r05k215K299N15l218J113K900k594q55
4948a357L371j889k732L782L11l508K605J433m096J207K844k760j3K609k082j140
4964a415J998l91n09P71k78k9o44m12J971o42j800K782o19l704L737J487n095
$$ plain form
4981 -2792 367 3355 -3178 -1451 3899 -1985 -2109 4320 -1017 -3553 3319 180 -3350 3000 1272
4996 1272 -3420 1349 1195 -2530 1208 1493 -1672 604 269 -1498 1203 174 -1105 1876 -670 -2247
5012 -2247 2467 -89 -2591 3210 476 -4080 2562 1636 -4253 2328 3083 -4627 530 3590 -3960
5027 -3960 -240 4488 -2787 -1707 3601 -1910 -2000 3389 -452 -1894 1921 -544 -1516 1503 -59 -336
5043 -336 1068 -1192 -304 1258 -1486 328 2328 -2240 -758 2696 -2160 -1201 3829 -1427 -2586 3349
5059 3349 -711 -3247 3336 1026 -3500 1843 1484 -3347 843 2568 -2063 -346 1924 -1434 -1071
5074 -1071 1638 141 -761 454 160 -611 -386 619 731 -738 -227 901 -1004 -861 1823 134 -1520
5091 -1520 1130 418 -2033 635 1732 -1303 -429 1573 -989 -1412 1606 725 -1534 503 1152 -1747
$$ packed form
4981b792L159K988o533J727N350n884j24O429n337k536O872l139l530O350j728
4996A272m692M769j54l725L738K85l165K276l35j767K701j029j279K981k546j577
5012b247M714k556k502N801k734m556O642r26n889O581P55p710N157L060p550
5027c960L720M728p275J080N308n511r0N389l841j442L815k465r72L019j562k77
5043c36J404k260Q88J562k744J814K000m568J482L454m856R59N030n256j159N935
5059C349m060k536O583k310m526N343l59m831M190J725m631J717K270l358L63
5074a071K709j497r02J215k94p71K25J005J12j469N11J128j905J43K684j689j654
5091a520K650p12k451K668J097l035Q74K002k562m23L018q81k259K037O49k899
$$ plain form
5107 -1747 -695 2173 -371 -1596 1812 211 -2665 1250 1822 -2263 339 2213 -2314 -989 2601
5122 2601 -917 -1235 2203 -503 -1919 1339 396 -1014 922 255 -816 47 -271 317 734 -860 415
5139 415 848 -2071 285 2325 -2066 -354 2978 -2415 -1836 3844 -1166 -2624 3913 -412 -4038 3187
5155 3187 1163 -3866 2504 2000 -4025 932 2400 -2883 560 2522 -2234 -363 1534 -1511 267
5170 267 1328 -1233 521 318 -1897 1392 888 -2209 1811 1082 -3589 1526 2350 -3649 1223 3323
5186 3323 -4139 -368 4077 -3215 -1130 4622 -2357 -2702 3912 -1068 -2826 3590 218 -3099 1975
5201 1975 508 -2350 1520 955 -1440 629 -38 -925 920 -265 -235 1416 -1282 -946 2053 -1122
5217 -1122 -1154 2944 -870 -2585 2680 30 -2994 2741 1339 -3575 1261 1990 -3137 552 2938 -2187
$$ packed form
5107a747J052K868k544j225L408j601k876L915N72m085K602J874m527J325L590
5122B601l518l18L438k706j416L258r43j410J936o67j071Q63l18N88M17j594J275
5139D15M33k919K356K040m391J712L332n393N79N680n010j458O537m325l626P225
5155C187k024n029O370n04o025M957J468n283L443J962m756J871J897l045J778
5170B67J061k561J754k03k215L289n04l097M020p29m671N115Q24n999M872K100
5186C323p462L771M445p292K085N752o979l45O614m980j758O416l372l317N074
5201A975j467k858L870n65k395K069o67q87J845j185L0J651k698L36K999l175
5217a122l2M098l814j715N265k650l024N735j402m914M836P29n127L689K386n125
$$ plain form
5233 -2187 -931 2296 -1259 -1401 2120 226 -1486 664 458 -1117 -25 1081 68 -808 175 494
5249 494 -900 -220 1461 -275 -1153 964 153 -1480 875 1318 -1254 -310 1190 -901 -934 1484 499
5266 499 -1379 337 985 -1403 -478 2041 -333 -1675 1526 368 -2459 1248 2010 -2386 -43 2411
5282 2411 -2270 -1149 3097 -882 -1887 2456 -378 -2489 1905 807 -1831 1104 734 -1680 311
5297 311 612 -496 591 -142 -483 632 -949 -191 1928 -1202 -1012 2384 -1503 -2007 3412 -383 -2964
5314 -2964 3228 245 -4101 2837 1894 -4041 1841 2597 -4206 433 3351 -2942 -284 3240 -2358
5329 -2358 -1283 2577 -1222 -825 2061 -919 -756 1035 -1041 253 1285 -1497 530 1175 -2540 698
5345 698 2417 -2722 239 3069 -3281 -992 4038 -2345 -1826 4353 -1704 -3274 3910 -215 -3394
$$ packed form
5233b187J256L227l555j42L521j894j712K150k06j575J092J106j013q76R83L19
5249D94j394O80J681j736q78K117q11j633K355M43k572R44J500k091l3K418r85
5266D99j878J716O48k388R25K519k374j342L201j158k827L707P62m396K343K454
5282B411m681J121M246l979j005M343k834k111M394j098k638K935l70k414J991
5297C11L01j108J087p33l41J115j581P58K119l130J90L396l887n04N419l795k581
5314b964O192k983m346O938r43n935N882P56o803M639K918o293K658L524n598
5329b358J075L860l799L97K886k980J63J791k076J294J032k782K027O45l715L238
5345F98J719n139K961K830o350K289N030o383N19O179o057j570P184m125l179
$$ plain form
5360 -3394 3354 838 -3765 1839 1477 -2841 1214 1826 -2157 83 1084 -1255 388 809 -621 435
5376 435 -347 -869 1287 -226 -1004 1886 -404 -2225 2000 495 -2485 2001 1382 -3251 779 2214
5392 2214 -2667 128 2919 -2028 -1352 2506 -876 -1661 2226 368 -2027 737 905 -1365 67 1460
5408 1460 -462 -1039 642 334 -1048 297 1292 -761 -932 1081 -158 -1134 1148 845 -1355 -4
5424 -4 916 -904 -402 1313 85 -1134 263 645 -921 -254 1549 -263 -1599 1172 580 -2095 1029
5441 1029 2030 -2314 -404 2481 -1995 -1263 3264 -802 -2357 2574 -83 -2826 2197 1238 -2547
5456 -2547 1008 1253 -2251 384 1543 -1104 150 648 -988 176 148 -453 1223 -399 -1257 1612
5472 1612 -543 -1873 2619 264 -3001 2349 941 -3796 2155 2529 -4006 979 3151 -3979 -205
$$ packed form
5360c394O748k516m603N604l62m318M055O12l983K240J001k339J643M21j430J056
5376D35p82n22K156j513p78K890k290j821M225j505k980M486o19m633M030J435
5392B214m881K795K791m947O76L858l382p85L887j858k395K764J68k270J432J393
5408A460j922n77J681l08j382J345R95k053j71K013j239r76K282l03k200J351
5424dR20j820N02J715j228j219J397L82j566O67J803j812j336K771n92k675L124
5441A029J001m344J910K885m476P32M527m066j555M931k657k743N023r59l785
5456b547L555K45l504K635J159k647J254M98j636J164k8o01J676j622q58K869
5472A612k155j330M492k355l265N350j408m737N951L74o535M985K172p130L774
$$ plain form
5487 -205 4052 -2828 -1197 3777 -2189 -2111 3383 -791 -1900 2525 -499 -1907 1602 -185 -838 1484
5503 1484 -691 -626 1212 -1367 -110 2193 -1736 -607 2620 -2196 -1387 3681 -1436 -2280 3690 -920
5519 -920 -3503 3540 626 -3707 2725 1459 -4022 1390 2443 -3036 531 2522 -2418 -572 2024
5534 2024 -1153 -437 1473 -633 -545 376 -440 482 258 -717 907 -173 -1595 1362 741 -1918 1296
5551 1296 1234 -2664 463 2248 -2132 -227 2687 -1794 -1562 2480 -491 -1839 2110 475 -2318 745
5567 745 1296 -1480 -60 1703 -783 -1284 1091 335 -1275 658 1256 -1310 -677 1353 -433 -1024 1430
5584 1430 355 -1579 412 843 -1062 67 1206 -486 -868 473 289 -567 47 990 -238 -1284
5600 -1284 728 742 -1596 583 1850 -2013 -770 2513 -1434 -1508 3174 -507 -2830 2536 464 -3161
$$ packed form
5487b05M257o880J631M974n966P8N494m174j109M425l024j408L509j787o53K322
5503A484k175O5J838k579J257K303l929J129L227m816Q09N068n117q44N970m610
5519i20k583P043k914m333O432j266n481N412J053n479L567J991m940J846K596
5534B024l177P16J910k106Q8R21q16R22k24r75J624j080j422K957o21k659L214
5551A296o2l898L127J785m380J905K914m481K32M042k971j348L949j635k793L063
5567G45N51k776J420J763k486n01K375p56j610J933N98k566O33K030j786n91K454
5584A430j075j934J991M31j905J129J139j692l82J341j84q56O14R43j228j046
5600a284K012J4k338K179J267l863J243L283l947p4M682l681k323N366k072l625
$$ plain form
5616 -3161 2194 1713 -3185 833 1930 -2666 262 2354 -1693 -409 1457 -1264 -334 1148 -566
5631 -566 286 361 -1170 776 293 -1483 1637 716 -2655 1394 1424 -3225 1402 2817 -3617 93 3438
5648 3438 -3373 -840 4339 -2345 -2120 3940 -1513 -2860 3674 -90 -2914 2551 308 -2812 1757
5663 1757 873 -1786 1205 287 -1517 979 -140 -724 1652 -763 -1174 1985 -1107 -1553 2956 -625
5679 -625 -2552 2897 -168 -3407 3009 1318 -3765 1996 1983 -3953 977 3090 -2996 -164 2976 -2365
5695 -2365 -1168 2730 -884 -1281 1868 -324 -1365 822 248 -320 341 -129 57 -164 -743 924 528
5712 528 -1309 810 875 -2053 387 1964 -1719 -368 2162 -1519 -1409 2341 -234 -1785 1762 506
5728 506 -2283 682 1530 -1438 -157 1695 -868 -1383 1351 445 -1409 727 1205 -1598 -523 1697
$$ packed form
5616c161N355m81m898M018J097m596K928K092m047J284J866k721R30J482j714
5631e66Q52P5j531J946m83j776L120r21l371M049L0m649M627J415o434L710L345
5648C438o811K533N179o684K25O060n453j347O534l764k824N465k243l120M569
5663A757q84k659K991r18j804K496j119n84K376k415m11L159l092m46M509l581
5679f25j927N449l065l239O416j691n083N761j3n936M930K113o086K832L140n341
5695b365J197L898l614l97L149k192j041K187n74n68O61m70J86k21n79J667l96
5712E28j837K119O5k928K440J577l683J351K530l681J10L750k575j551L547j256
5728E06k789K965Q48k968J281J852k563n15K734r06j854K136M78k803J075K220
$$ plain form
5744 1697 -663 -1016 1774 -45 -1806 954 806 -1380 474 1136 -1069 -463 798 -156 -373 413 352
5761 352 -346 -695 443 651 -993 203 1487 -1555 -950 2321 -879 -1700 2790 -188 -3009 2333
5777 2333 1017 -3215 1878 2075 -3470 514 2606 -2766 -149 3004 -2019 -1103 2294 -1251 -989 1996
5793 1996 -540 -765 1074 -879 -138 1010 -1017 536 1021 -2065 510 1789 -2427 555 2732 -2936
5809 -2936 -635 3437 -2525 -1414 4225 -1777 -2796 3858 -704 -3350 3612 636 -3632 2264 1195
5824 1195 -3329 1510 1901 -2470 494 1296 -1828 303 1026 -993 713 196 -1246 1077 -87 -1276
5840 -1276 1943 -55 -2272 1956 408 -2859 2166 1536 -3457 1213 2251 -3465 426 3331 -2696
5855 -2696 -882 3078 -1967 -1631 3013 -536 -1935 1937 52 -1926 1102 832 -1031 301 477 -507
$$ packed form
5744A697k360l53K790j819j761K760j48k186J854O62k205O06J261r54k17P86o1
5761C52o98l49J138K08j644J196J284l042O05L271l200q21M490k978k821N342
5777B333j316m232N093J97n545L984K092n372K617L153n023R16L397l545K62K985
5793A996k536k25J839j953P41J148k027J553M85l086K575J279m216K982K177n668
5809b936K301M072n962J111N639o002j019O654m562k646O962k976m268N896j069
5824A195m524M839L91m371K964Q02l124K131P23k019J706n17j442K323j164j189
5840a276L219j998k217M228j548l267N025o30m993M670J038n716L891K905o027
5855b696J814L960n045L36M644l549j399L872j885j978L028k70j863J332J76r84
$$ plain form
5871 -507 -227 19 537 118 -723 456 346 -1310 500 1374 -1333 -317 1605 -1223 -1075 2025 -147
5888 -147 -1576 1377 482 -1962 628 1533 -1246 -392 1539 -745 -1372 1425 607 -1517 578 1276 -1692
5905 -1692 -503 1958 -728 -1224 1861 -137 -2037 1315 916 -1680 733 1232 -1598 -176 1271 -617
5921 -617 -219 839 -291 -454 32 138 451 -329 -173 897 -914 -948 1884 -228 -1709 2092 183
5938 183 -2888 1913 1531 -3095 1287 2380 -3385 -14 3150 -2525 -767 3374 -1890 -1873 2866 -799
5954 -799 -1793 2414 -156 -1845 1356 -113 -1069 1236 -166 -570 948 -1078 -312 1646 -1316 -286
5970 -286 2274 -1962 -1200 3083 -1507 -1827 3641 -1012 -3139 3404 133 -3495 3080 1250 -3980 1806
5986 1806 2003 -3466 1077 2636 -2732 -159 2150 -1920 -361 1919 -990 -380 942 -949 108
$$ packed form
5871e07K80K46N18m19q41J179j10j656J810Q74k707J016J922k828J48L100k172
5888a47j429K953q95k444K590R05k779Q54J931k284o27K797q18k124K095O98k968
5905a692J189K461k686m96L085j998j900L352l99k596K413M99k830J422J447j888
5921f17L98J058j130j63M86J06L13p80J56J070j811l4K832k112j481L801j909
5938A83l071M801l82m626M382J093n765L371L164n675J758M141n264J7M739l665
5954g99r94M207k570j689L201j469r56K305j402m04J518k026P66J958k962J030
5970b86K560m236P62M283m590l20N468m653k127O543l271l628O575j830n230N786
5986A806J97n469M543J559n368K573K309m070J559K280k909O10J322j891J057
$$ plain form
6001 108 644 -786 859 281 -1661 1038 758 -2019 1337 1505 -2717 498 2183 -2621 9 3114
6017 3114 -2167 -1285 2860 -1334 -1915 2944 -135 -2357 1769 503 -2181 1006 1324 -1433 8 925
6033 925 -832 -424 742 283 -340 -191 327 -79 -746 612 804 -1043 -178 1092 -996 -666 1638 -156
6051 -156 -1315 1123 298 -1592 620 1282 -1137 -407 1280 -679 -1168 1388 661 -1569 468 1170 -1615
6068 -1615 -451 2083 -733 -1379 1869 -128 -2172 1531 1096 -2048 694 1385 -1988 -120 1765 -1025
6084 -1025 -455 1323 -708 -809 768 -24 -76 306 -303 231 -234 -718 1205 235 -1486 1280 505 -2459
6102 -2459 1293 1802 -2701 612 2450 -3029 -466 3368 -2163 -1295 3474 -1556 -2385 3164 -326 -2434
6118 -2434 2569 304 -2616 1544 732 -1772 1156 656 -1382 615 50 -827 1165 -269 -756 1417
$$ packed form
6001A08N36j430J645n78j942K699k80k777L356J68m222L215J685m804K630L105
6017C114n281Q82M145m194n81M859l079k222M126j266k684L187L18k757J441R17
6033I25j757M08J166m59o23J49N18m06o67J358J92j847Q65J270k088L30K304j794
6051a56j159K438q25j890K212O62k419P30J687j959m89K556p27k230K037P02k785
6068a615J164K534k816o46L248j997k044L703m35l144K742O91l373J868J885k790
6084a025N70J778k031j01J577p92n2L82o09N34m65m84J923r70j721K766p75k964
6102b459L752N09m503L313J838n479K563L834n531Q68M769n030q29N549l490k108
6118b434N003k265k920M160q12k504K928n00k038J997n65q77J992j434m87K173
$$ plain form
6134 1417 -964 -1285 2307 -599 -1842 2668 -343 -2998 2631 814 -3262 2302 1679 -3805 1158
6149 1158 2531 -3173 441 3019 -2678 -798 2727 -1659 -1030 2450 -828 -1276 1387 -474 -722 1070
6165 1070 -236 -177 478 -967 285 849 -1193 600 1211 -2009 77 1933 -1870 -294 2633 -1712
6181 -1712 -1469 2635 -839 -1918 2584 166 -2544 1515 907 -2233 897 1641 -1670 -291 1358 -875
6197 -875 -632 1209 172 -859 144 449 -491 -339 854 254 -966 156 705 -893 -163 1293 -437
6214 -437 -938 900 35 -1150 741 938 -1024 -268 962 -554 -797 1179 490 -1272 265 1074 -1336
6231 -1336 -391 1948 -669 -1503 1693 -21 -2089 1594 1187 -2234 613 1602 -2147 -138 2199 -1222
6247 -1222 -773 1746 -821 -1158 1392 -14 -756 742 -176 -498 271 -244 416 437 -987 491 633 -1660
$$ packed form
6134A417k381l21L592k906j243M510l011k655N629j817m076N564o23n484M963
6149A158J373n704L614K578n697J880L525m386O29L480l278m48K663j861k48J792
6165A070j306N9O55j445J252N64k042J793O11l220K086J856l803J576K927m345
6181a712K43M104l474j079M502k418k710M059o08l140L130P44l311J379J649k233
6197h75K43J841j037j031J003L05r40J52J193o00j220J122N49j598P30J456j730
6214d37n01J838q65j185J891J97j962P56J230j516k43J976o89j762J537Q09k410
6231a336R45K339k617q34L196j714k068L683m07l421K847R89l749K009K337l421
6247a222M49K519k567l37K550j406p42J498r18l22P69n15O60K1j424J478J42k293
$$ plain form
6265 -1660 687 1681 -2010 -44 2216 -2233 -827 3159 -1487 -1728 3112 -1031 -2667 3034 287
6280 287 -2797 2293 783 -3049 1397 1500 -2243 812 1392 -1891 156 1032 -1111 522 642 -1034
6296 -1034 587 -32 -1145 1455 146 -1622 1668 145 -2491 1891 1191 -2827 1433 1784 -3318 565
6312 565 2750 -2702 -238 3080 -2314 -1405 2957 -1103 -1634 2549 -411 -1994 1574 208 -1352 1111
6328 1111 389 -943 346 -119 -234 636 -385 20 698 -1172 -146 1486 -1099 -431 1944 -1146 -1442
6345 -1442 2122 -349 -1757 2098 284 -2439 1199 1164 -2050 665 1726 -1698 -519 1622 -773
6360 -773 -873 1456 116 -1263 421 569 -794 -52 999 -225 -948 490 425 -886 256 1030 -724
6377 -724 -667 911 -193 -791 877 468 -943 -25 674 -484 -425 902 232 -1019 120 838 -858 -310
$$ packed form
6265a660K347R94l691J966K260m449J406L986m646k41M840m143j636N701k747
6280B87l084N090j510l832M446J03l743L055N80l283K047Q76k143J633J20j676
6296a034J621o19j113K600j309j768L290j523k636M382p00m018M260L51n102L883
6312E65K185n452K464L318n394R09M362m060n31M183k960j583L568j366j560K463
6328A111p22j332J289m65j15Q70j021M05O78j870J026J632k585O68K375l090k96
6345a442L564k471j408L855j814k723L638l5l214K715J061l424J179K141k395
6360g73j00K329j340j379J684J48j363P42J051j224p23J438o5j311J142P74j754
6377g24N7J578j104n98J668m09j411R18O99j158N9J327o70j251J139P18j696N48
$$ plain form
6395 -310 1549 -483 -1418 1349 191 -1844 1319 1308 -2179 310 1765 -1984 -233 2403 -1242 -1173
6411 -1173 1953 -752 -1459 1810 115 -1327 996 114 -1107 594 303 -327 442 -422 -224 563 -841
6428 -841 172 1384 -1331 -484 1816 -1431 -945 2693 -919 -1954 2591 -371 -2639 2575 841 -2947
6444 -2947 1703 1303 -3019 994 2128 -2302 193 1923 -1960 -375 1793 -1015 -232 1219 -939
6459 -939 -258 656 -736 541 597 -1272 638 576 -1803 1099 1391 -2212 602 1775 -2615 54 2769
6476 2769 -2129 -762 2878 -1838 -1703 2961 -586 -2027 2412 -21 -2400 1594 830 -1763 961
6491 961 917 -1465 123 702 -532 230 315 -277 139 -464 -132 907 -478 -386 1207 -774 -1091 1609
6509 1609 -36 -1441 1513 348 -2094 948 1244 -1720 421 1589 -1602 -662 1639 -574 -920 1410
$$ packed form
6395c10J859k032r35K767j158k035L163j1l487K489J455l749J751K636l645O9
6411a173L126k705p07L269j695j442K323q82j221J701k91o30P69q64J98P87j404
6428h41J013J212k715Q47K300l247M86L638l612j035M545k962k268N214j734l788
6444b947M650m00m322M013J134m430K495J730l883J585K168k808P83J451k158
6459i39O81R14j392J277N6j869J910o2k379K902K92l603K814J173m390K669K715
6476B769m898J367L640m716J35M664l547j441M439k433k379L994p64k593K724
6491I61m4k382J588N79j234P62Q5n92M16o03L32J039j385R2J593j981l17K700
6509A609j645j405K954j165k442L042K96k964K141J168l191R40K301k213l46K330
$$ plain form
6525 1410 56 -1431 515 758 -924 5 1108 -564 -933 741 266 -894 508 855 -1056 -394
6541 -394 991 -390 -550 1001 66 -985 277 476 -528 14 714 -117 -746 155 525 -558 -148 1134
6559 1134 -389 -1224 1050 399 -1502 1003 1206 -2011 42 1773 -1655 -450 2373 -1129 -1443 1995
6575 1995 -484 -1652 1919 343 -1778 1036 449 -1504 744 816 -914 289 171 -690 487 -38
6591 -38 -233 924 -686 -763 1333 -662 -958 2108 -448 -1973 1987 66 -2447 2098 1120 -2885 1195
6608 1195 1630 -2890 631 2479 -2304 -313 2252 -1818 -821 2282 -844 -977 1495 -617 -945 1067
6624 1067 -203 -259 726 -715 -129 619 -946 445 1189 -1459 9 1443 -1733 -259 2359 -1459
6640 -1459 -1083 2359 -1200 -1740 2618 -151 -2149 1980 352 -2473 1390 1281 -1923 631 1258 -1647
$$ packed form
6525A410j354j487J946K43j682R29J103j672l69J674m75j160J402L47j911O62
6541c94J385j381j60J551r35j051J262J99j004N42P00q31o29R01L70j083M10J282
6559A134j523q35K274o51j901K505K03l217K053J731l428J205K823l502l14L438
6575A995k479j168L571j576k121K814n87j953K248P2j730J203j18q61J177n25
6591c8j95J157j610p7K096j995k96L066k556j525L960j921k513M545r78m005M080
6608A195M35m520L521J848m783J991K565m070R97L103l126j33K472k112l28K012
6624A067j270n6R85j441N86P48j565J391P44k648J468J434l176J474K618l818
6640a459L76L442l559n40M358k769j998M129j628k825L863j09l204K554O27k905
$$ plain form
6656 -1647 -95 1251 -615 -168 731 -412 -367 118 15 388 -167 -277 567 -533 -643 1191 44 -1064
6674 -1064 1037 249 -1620 760 1149 -1354 193 1336 -1336 -652 1555 -353 -945 1207 83 -1412
6690 -1412 539 890 -901 -42 1059 -654 -929 919 287 -941 646 688 -1214 -183 1097 -557
6706 -557 -385 1100 -264 -1020 587 339 -609 359 480 -484 -397 222 263 -183 -45 612 -316 -937 781
6725 781 542 -1165 698 1056 -1739 -142 1732 -1308 -593 2154 -995 -1654 1998 -191 -1768 1883
6741 1883 532 -2141 947 895 -1703 670 1212 -1254 -37 696 -873 162 614 -421 310 -103 -770
6758 -770 762 -7 -833 1344 -75 -1706 1307 504 -1996 1469 1243 -2588 673 1771 -2383 255
6774 255 2532 -2058 -793 2326 -1467 -1124 2446 -575 -1542 1608 -287 -1408 1315 276 -886 666
$$ packed form
6656a647J552J346j866M47Q99j143M5M85j03L73n55j10Q44j100j10J834j147j108
6674a064K101p88j869K380L89k503J547J143k672O84K207j908n92K152j124j495
6690a412J951L51j791Q59J101j713k75J848o32j228J587M2j902J031J280j654
6706e57J72J485j364p56J607k48r48R68J21r64Q7O19M1m46J38O57r28o21J718
6725G81k39j707J863L58k795J597J874l040P15K747l149o59L652k189j577L651
6741A883j351k673L088n2k598K373N42k466J217P33j569J035M52j035P31m13o67
6758g70J532p69q26K177j419j631L013q03k500L465k26l831L261J098m154K638
6774B55K277m590J265L119l793L43L570l021r67L150j895j121K723j039j162J552
$$ plain form
6790 666 -168 -649 591 -209 -55 838 -871 -346 1085 -980 -354 1811 -947 -1172 1788 -657 -1577
6807 -1577 2130 204 -2091 1463 618 -2209 1079 1503 -1823 170 1402 -1502 -386 1547 -539
6822 -539 -623 883 -333 -724 483 269 -135 4 -40 65 -361 -170 801 -3 -744 643 32 -1135 662
6841 662 875 -1079 116 956 -1082 -474 1376 -260 -857 963 40 -1269 523 932 -788 -147 943
6858 943 -658 -903 1057 306 -1020 565 653 -1346 -34 1243 -662 -445 1165 -493 -1061 883 255
6875 255 -726 562 340 -837 -80 417 -58 4 115 74 -251 -515 434 554 -740 215 852 -1304 -283
6894 -283 1623 -869 -749 1842 -772 -1664 1831 159 -1861 1677 679 -2319 853 1278 -1781 504
6910 504 1523 -1567 -289 1203 -920 -150 1113 -541 -304 403 -612 233 468 -625 577 220 -1325
$$ packed form
6790F66q34m81J240q00J54Q93j709N25J431k065O26K165k758k25K960k445r20
6807a577L707j926k295L554q45k827L288M24l326J993J232k904J116J933k086
6822e39q4J506j216l91J207k14m04J39m4J05m26J91R71q04p41J387o11j167J797
6841F62K13j954J195Q40k038O08J850j636n97J820r23j309J792M09j720O41J090
6858I43j601k45J960p51j326J585Q8j999J312J277j905K17J610j658n68J944o28
6875B55r81J288k22j177P57M97m75O2J11m1l25k64R49J20j294R55O37k156J021
6894b83J906k492J20K591k614q92L495j672k020L538r98k998L172M25l059K285
6910E04J019l090J278J492k123P70J263j654K37P07j015Q45K35j093J202l57j545
$$ plain form
6927 -1325 726 746 -1450 814 1155 -2113 185 1791 -1789 -119 2310 -1664 -1137 2254 -931 -1374
6943 -1374 2321 -242 -1876 1506 173 -1634 1239 705 -1367 435 390 -967 435 418 -366 378 -311
6960 -311 -511 687 -292 -322 1248 -594 -1091 1324 -240 -1246 1649 281 -1895 1046 711 -1884 831
6977 831 1467 -1696 -113 1451 -1290 -482 1672 -453 -941 923 -139 -939 663 525 -461 -71 172
6994 172 -254 -300 284 499 -240 -405 396 -148 -632 668 557 -859 43 591 -826 -217 1091 -232 -734
7013 -734 655 -14 -951 526 803 -721 -253 816 -605 -747 1052 406 -1005 481 629 -1279 77
7030 77 1300 -716 -532 1208 -580 -1046 1168 287 -986 709 294 -1127 234 606 -405 182 341
7047 341 -357 -175 -47 190 423 -352 -127 536 -771 -334 1298 -435 -859 1313 -437 -1503 1530 473
$$ packed form
6927a325K051K0k196K264L41l268K298J606l580J670K429l974N27L391l185m43
6943a374L695k563j634L382j333j807K873n34k072J802m5j357J402j7p84P44o89
6960c11k00J198r79l0J570j842m97K415j564j006K895j368k176K941l35k595K715
6977H31O36l163J583J564k741Q08K154k125m88J864j062q00J602j38r86L90K43
6994A72m26m6N84K15p39j65Q01n44m84J300j11j416R02N48j417O09J308j323n02
7013g34J389o69r37J477K77j524M68J069j421j42J799o46j411J486J48j908J356
7030G7J223k016J84J740j788m66K214q81j273J695m15j421J361L72j011N87J59
7047C41o98J82J28K37K33p75K25O63j307M37J632j733m24K172j750j066L033j057
$$ plain form
7065 473 -1675 1195 813 -2156 628 1512 -1627 172 1629 -1534 -550 1564 -771 -489 1363 -547
7081 -547 -828 749 -277 -206 723 -342 -78 276 -724 289 791 -940 299 959 -1494 -77 1641
7098 1641 -1212 -384 1885 -1243 -1258 1960 -489 -1408 1952 27 -1954 1289 594 -1629 1006 985 -1530
7115 -1530 119 799 -903 183 872 -507 -149 147 -367 285 156 -209 518 -315 -820 743 61 -804
7133 -804 1063 311 -1499 647 776 -1341 575 1310 -1439 -324 1306 -978 -485 1573 -356 -1120
7149 -1120 872 61 -926 708 661 -745 -95 402 -366 -238 577 296 -415 -145 273 -295 -245 697 189
7168 189 -688 162 268 -616 125 848 -284 -519 451 -82 -602 492 663 -548 -292 527 -338 -517 871
7187 871 349 -938 250 555 -1011 102 1311 -697 -640 1056 -539 -1027 1255 324 -1119 675 328
$$ packed form
7065D73k148K870l82k969K784Q84l139J799J457l163R84K114k335K82J852j910
7081e47k81J577j026P1R29j065K64L54j000J013N02j731J239O60k453J417J718
7098A641k853Q28K269l128j5L218k449r19L360j925j981L243o95k223K635k1k515
7115a530J649O80j702J086O89j379L58K96n14O52j29l65P27q33n05J563o82q65
7133h04J867p52j810K146J29k117J916P35k749J115J630k284M93K058j929p64
7149a120J992q11r87J634m7j406O50M97p68J28Q15k81p11K70M18n68N0R42n08
7168A89q77Q50J06q84P41P23j132k35R70n33n20J094J71j211K56Q19q65j79J388
7187H71n22j287J188L05j566J113J209k008N7J696j595m88K282r31j443J794l47
$$ plain form
7204 328 -1231 394 864 -663 75 475 -610 -152 450 3 201 54 -334 222 -280 -219 948 -117
7222 -117 -805 841 -136 -1249 1163 662 -1476 732 808 -1853 402 1653 -1346 -153 1546 -1336
7238 -1336 -830 1680 -459 -821 1371 -362 -1135 820 128 -625 709 -30 -601 263 -166 -47 665 -350
7256 -350 -193 597 -900 -188 1310 -611 -566 1348 -790 -1171 1668 -57 -1289 1488 150 -1946 1019
7273 1019 912 -1501 725 1052 -1588 -102 1120 -820 -60 1059 -547 -555 417 -200 -84 494 -56 -72
7291 -72 -97 -422 410 227 -458 572 158 -1089 344 715 -866 335 946 -1096 -456 1157 -543 -472
7309 -472 1311 -250 -1140 722 243 -862 677 654 -897 -242 550 -346 -253 757 129 -641 10 292
7327 292 -389 -16 701 -151 -625 216 188 -490 344 556 -478 -366 324 -127 -273 531 315 -469 -176 336
$$ packed form
7204C28j559J625M70j527P38M00j085M58O02m47J98j47l88N56n02O1J167j065
7222a17o88J646r77j113K412n01k138K208P6k661K255J251k999J193J699k882
7238a336N06K510k139l62K192j733p73J955o92p53J334p39n71Q64m29J19P12j015
7256c50J57P90j497P12J498j921M5J914k138l81K839j725j232K777j338k096K965
7273A019j07k413K226L27k640J486J222j940P60J119j606qR72o17J16N78n50j6
7291g2k5l25Q32j83o85J030m14j247J433L71j581J201O11k042O40J613j700P1
7309d72J783j561q90J862m79j105J539k3j551O55P92q96R3J010o28p70O51K82
7327B92o81L73P17q52m74Q41k8o78Q34K12j034J12O90m51j46Q04k16p84K93N12
$$ plain form
7347 336 -159 -241 665 274 -808 73 413 -770 48 1156 -562 -781 874 -293 -874 1131 395 -1163
7365 -1163 470 438 -1173 391 1036 -780 -152 658 -694 -248 811 -88 -171 250 -363 -125 109 -71
7383 -71 454 63 -658 360 90 -778 852 636 -1219 284 790 -1414 192 1543 -1089 -440 1393
7400 1393 -1042 -856 1693 -247 -1077 1215 -198 -1320 933 482 -831 558 251 -932 221 320
7416 320 -278 417 24 -448 230 -297 -250 899 -216 -606 824 -399 -961 1223 274 -1140 880 272
7434 272 -1586 748 1055 -1218 359 1035 -1366 -308 1259 -624 -338 1077 -520 -817 675 37
7450 37 -297 516 71 -457 -71 -109 175 250 -148 150 4 -675 304 623 -493 194 629 -857 -390 981
7470 981 -300 -410 937 -201 -1031 580 368 -639 483 594 -880 -245 654 -235 -309 662 -34 -769
$$ packed form
7347C36m95q2R06l91j082Q81L40j183Q18J108j718k19J655j167n81K005p36j558
7365a163J633l2j611J564O45j816O28Q10j352M46J059q99q3M21o13K38K34j80
7383g1N25l91p21J018k70q68J630k16j855J503N06k204J606J351k632O49J833
7400A393k435J86K549j940q30K292j413j122K253m51j313J389l07j183J153R9
7416C20n98O95l93m72O78n27M7J149j115l90J430j223n62K184r49j414K020o08
7434B72j858K334L07k273J577O76k401J058J567j883K86J415j597k97J492o38
7450C7l34Q13m45n28L86l8K84P5l98K98j46o79R79L19j116O87M35j486M67J371
7470I81j281j10J347j138q30J611k12j007J122J11j474O35Q99q89p4R71o96p35
$$ plain form
7488 -769 130 375 -345 139 674 -380 -591 292 142 -344 453 304 -583 -206 303 -199 11 479 69 -463
7508 -463 -48 205 -120 27 462 56 -617 -50 363 -438 81 843 -466 -724 737 -84 -648 1015 374
7527 374 -1199 363 520 -1068 365 1045 -804 -292 758 -645 -280 949 -154 -442 338 -329 -315
7544 -315 452 118 -3 106 -490 -32 206 -419 436 547 -862 -45 654 -886 58 1247 -780 -660 1108
7563 1108 -624 -780 1530 -11 -1145 908 32 -1236 922 750 -969 334 403 -1011 114 702
7579 702 -351 139 229 -562 -22 137 -121 593 48 -572 350 -114 -628 901 262 -961 476 254 -1238
7598 -1238 518 1018 -1005 -18 866 -1079 -348 1268 -350 -519 914 -378 -894 715 294 -439 447
7615 447 117 -644 -52 287 68 166 77 -107 -171 -272 271 430 -225 -55 260 -625 -201 793 -86 -353 580
$$ packed form
7488g69Q99K45p20M84N35j054k11Q83j50m86P97j49q87L77N09n02K10M68m10n32
7508d63M15K53l25J47M35m06o73N67M13q01N19P62j309k58J461q21n64J663o41
7527C74j573J562J57j588J433O80j849N12J050j403L65J229j103k88P80o67J4
7544c15P67l34j21J09n96M58K38o25Q55J11j409Q17O99j540R44J189k027J20J768
7563A108j732j56K310j541j134K053q76j268K158j72j719J303O9j414J125N88
7579G02j053M90R0p91N40J59k58P14n45o20R22m64n14J529o39j223J437k22j492
7598a238J756N00k023R87Q84j945P31J616j618j69J433j292n16J609m21p33Q86
7615D47l30p61N92L39k19R8q9j84o4j01N43J59o55J70L15q85M24R94q79k67R33
$$ plain form
7636 580 -263 -874 478 472 -506 366 399 -794 -217 670 -110 -181 559 -116 -748 183 372 -311 117 496 -474
7657 -474 -535 458 160 -342 502 222 -723 -105 417 -196 44 491 -209 -439 101 88 -14 105 177 -168 -420
7678 -420 -39 330 -139 17 572 -407 -661 564 223 -467 703 318 -1069 220 673 -769 244 952
7696 952 -896 -486 803 -362 -229 909 -86 -668 404 -62 -419 513 250 -338 21 -174 -178 302 -47
7715 -47 155 401 -632 -197 536 -400 -31 1029 -549 -720 826 -250 -602 1212 123 -1241 579
7732 579 187 -1043 754 807 -940 35 474 -817 134 891 -346 -236 320 -430 -151 522 74 121 54
7751 54 -425 -16 81 -322 528 173 -719 144 289 -770 465 875 -776 -214 711 -765 -244 1181 -307
7770 -307 -574 692 -313 -798 695 404 -520 191 190 -656 -2 513 -17 -52 144 -170 -305 -18 344 187
$$ packed form
7636E80q43o11J352or78Q72L3j193N77Q87p80p1P40o75o32R31J89o83M28L79r70
7657d74o1R93k98n02Q44k80r45O18N22o13K40M47p00k30N40j3j02J19P2l45k52
7678d20L81L69m69J56N55r79k54J225l41o90J170l85j387J289M53j442J013P08
7696I52j848M10J289j165J33J138r95n82J072m66l57R32k63n88L59j95mM80l49
7715d7K02K46j033M35P33r36L69J060j578j71J546j076l52J814j089j364J820
7732E79l92j230J797N3j747R75M39j291R51P57j237J10N56p50K79O73m48M7o7
7751E4m79M09R7m03Q50l55q92Q63J45j059J235M10j651N62R25j476N21J425j488
7770c07k67J266j005m85J493k91r24P11jq46O54N15n30l5J96l14j35K87L62j57
$$ plain form
7790 187 -208 -42 54 -397 15 576 -112 -147 371 -335 -556 572 352 -384 124 178 -637 -124 636 13 -140
7811 -140 373 -178 -648 271 498 -292 52 361 -427 -430 589 85 -326 405 -21 -741 53 472 -192 81
7831 81 413 -389 -336 217 66 -8 302 -1 -335 -257 70 280 96 -24 180 -343 -478 481 225 -442 417
7852 417 195 -927 173 686 -514 133 755 -780 -536 810 -266 -327 895 -194 -811 405 111
7869 111 -408 557 271 -534 5 27 -234 344 190 -57 38 -374 -250 448 -20 -42 567 -483 -655 673
7889 673 5 -487 905 32 -1104 433 366 -768 585 730 -1012 -129 560 -598 89 876 -330 -398
7907 -398 379 -363 -194 567 84 -150 39 -246 -98 242 32 241 162 -587 -37 269 -317 285 640 -619
7927 -619 -299 472 -455 -134 898 -285 -666 379 -180 -560 688 373 -600 94 204 -627 55 564 -126
$$ packed form
7790A87l95J66R6m51M12N61o88l5N18p06k21J128k20p36N08N4q15N13P60o23j53
7811a40N13n51m70R19K27p90L44L09p88lJ019n04m11P31m26p20P94M19o64K73
7831H1L32q02N3N53j51p4L10l03l34P8L27K10j84j20K04n23j35R59k56o67Q59
7852D17k22j122J100N13j200O47O22j535K44J346j076o1J222j089o17J216k94
7869A11n19R65k86q05N39K2k61N78j54k47R5m12J24O98m68k2O09j050j72J328
7889F73o68m92J392q73j136J537o7j134J353J45j742Q83O89j158O87P87j206o8
7907c98P77p42J69P61m83k34J89k85J48L40k10K09p9p49N50L06n86O02L55j259
7927f19L20P71r27L21J032j183l81J045n59l80J248l15r73O94J10q31O82N09o90
$$ plain form
7946 -126 -157 99 -210 -210 288 368 32 -96 -70 -145 -198 192 477 -136 -190 84 -255 -198 438 275 -335 66 -62
7969 -62 -465 123 555 -73 -340 146 -141 -380 357 475 -268 -105 310 -399 -338 618 148 -313 244 -39 -615
7990 -615 210 582 -220 44 283 -396 -236 439 106 -55 322 -164 -365 32 150 232 180 -34 -77 -314 -286
8011 -286 270 245 -430 204 50 -735 150 648 -315 60 486 -638 -394 762 -162 -319 641 -247 -814 372
8031 372 273 -363 404 311 -650 -58 250 -252 406 244 -190 -199 -174 -122 299 180 -106 206 -222 -530 456 162
8053 162 -336 537 -11 -848 229 450 -461 397 563 -892 -243 570 -462 109 775 -359 -492 368 -140
8072 -140 -177 504 169 -340 -45 -124 -110 310 133 45 -135 -415 -11 263 -14 200 271 -528 -234 368 -260 64
8094 64 614 -171 -608 367 -10 -322 562 245 -550 -48 169 -337 66 508 -140 -366 32 -149 -129 364 257
$$ packed form
7946a26l1K56l09%M98Q0l36j28K6p5n3L90K85o13n4K74l39N7O36j63o10M01j28
7969f2m03N88M32o28k67M86k87k39P37J18p43J63M15p09O1R56m70m61N57k83n76
7990f15Q25L72q02K64K39o79J60O75l33j61L77m86k01L97J18Q2n2k14m3k37K8
8011b86N56k5o75O34j54p85Q85M98r63L75M26j124K44J156r24j57R60q88n67J186
8031C72r9o36P67r3r61N92L08n02O58j62m34rK5N2M21j19k86L12m28l08R86k94
8053A62m98Q73n48q37J077K21r11Q58J66j455O49Q13j032N71O66j134j33Q60n08
8072a40l7O81l35n09K95p9J4M20j77q8j80k80M04K74k77K14P1p99K94O02o28L24
8094F4N50p85m37R75l77l12Q84l17p95N02K17n06M03M42o48k26L98j81K0M93j07
$$ plain form
8115 257 -148 -228 2 -58 -59 326 262 -277 -92 10 -270 26 431 184 -301 -68 -95 -224 207 353 15 -164
8137 -164 -30 -130 -225 290 335 -283 -170 111 -258 -114 588 249 -515 20 1 -556 309 542 -270 -94 172
8158 172 -422 -192 595 120 -104 155 -216 -350 138 273 137 143 -82 -303 -24 -52 260 251 -274 -103 -5 -336
8180 -336 162 606 -249 -122 256 -499 -188 732 120 -329 472
$$ packed form
8115B57m05q0K30o0jL85o4n39J85J02k80K96M05k47m85K33k7j29M31J46l38j79
8137a64J34j00r5N15M5o18J13K81l69J44P02l39p64N35j9n57Q65K33q12J76K66
8158A72n94K30P87m75k24K59l71j34M88J35j36Ok25k21K79k8L12rn25J71R8l31
8180c36M98M44q55J27L78p55L11R20o12m49Q01
8191D72
$$ Imaginary data points
##PAGE= N=2
##DATA TABLE= (X++(I..I)), XYDATA
$$ plain form
0 0 0 0 0 0 0 0 0 8 -8 8 -8 8 -16 24 -32 33 -41 54 -65 81 -97 114 -136 161 -191 223 -258 299 -346 395
30 395 -453 518 -590 669 -756 849 -958 1073 -1202 1339 -1492 1658 -1841 2041 -2256 2492
46 2492 -2752 3038 -3348 3687 -4061 4472 -4929 5435 -6004 6640 -7361 8187 -9141 10260
60 10260 -11593 13209 -15220 17800 -21243 26087 -33449 46061 -73420 251067 -372087 -236347
72 -236347 666720 -480317 -331064 604102 -123620 -313116 501089 -145884 -420021 310265
82 310265 52139 -208501 297275 -32860 -245337 148324 -88925 -88393 327904 -114759 -146720
93 -146720 242374 -258439 -159761 463245 -134212 -241472 403132 -177049 -408449 437185
103 437185 79203 -371182 347873 96093 -525712 194773 297412 -345867 123501 299983
$$ packed form
0@%%%%%%%Qj6J6j6J6k4M0n6O5p4R5j19J46j78K11k50K97l52M14m81N57o45P41
30C95q48R71j108J259j425J605j807K031k275K541k831L150l499L882m297M748
46B492n244N790o386P035p748Q533r401J0364j1439J2644j4001J5548j7328J9401
60A0260k1853K4802k8429L3020l9043M7330n9536P9510j19481L24487o23154J35740
72b36347R03067j147037J49253R35166p27722j89496Q14205o46973k74137P30286
82C10265k58126k60640N05776l30135k12477L93661k37249N32M16297m42663l1961
93a46720L89094n00813R8678O23006n97457j07260O44604n80181k31400Q45634
103D37185l57982m50385P19055k51780o21805P20485J02639o43279M69368J76482
$$ plain form
113 299983 -361748 -88980 259717 -140877 -11829 231344 -100933 -141784 36198 -3182
123 -3182 30259 49791 17779 26985 -110797 -99594 131646 30937 -71762 147254 -11697
134 -11697 -251600 88569 144689 -158231 87007 179344 -227027 -100427 176732 -55091
144 -55091 -49553 182483 -9758 -192884 15163 100924 -68112 5229 171246 -61751 -199484
155 -199484 92297 76852 -138218 115344 166177 -225800 -83954 193330 -114043 -72143
165 -72143 274817 -57069 -229319 143935 752 -160383 189602 91101 -172630 25865
175 25865 15496 -101876 77246 70085 -16155 25120 -95393 -53347 109006 -53112 4997
186 4997 187891 -153065 -159069 223633 -80738 -157672 334022 -28604 -336191 239827 49865
$$ packed form
113B99983o61731K72768L48697m00594J29048K43173l32277m0851J77982l9380
123c182L3441J9532l2012R206j37782J1203K31240j00709j02699K19016j58951
134a1697k39903L40169N6120l02920K45238R2337m06371J26600K77159k31823
144e5091N538K32036j92241j83126K08047Q5761j69036P3341J66017k32997j37733
155a99484K91781j5445k15070K53562N0833l91977J41846K77284l07373M1900
165g2143L46960l31886j72250L73254j43183j61135L49985r8501k63731J98495
175B5865j0369j17372J79122p161q6240M1275j20513M2046J62353j62118N8109
186D997J82894l40956o004L82702l04371p6934M91694l62626l07587N76018j89962
$$ plain form
197 49865 -326814 279829 192227 -374569 100378 189513 -333239 84996 306657 -236034
207 -236034 -40680 196808 -220716 -45990 238809 -91594 -26987 120476 -166974 -26645
217 -26645 130865 -101374 82541 122520 -228874 23508 144051 -221430 96730 259033
227 259033 -279362 -42662 258982 -269024 -57269 391586 -186278 -193421 316558 -159063
237 -159063 -244331 361053 5687 -263672 234379 -3317 -289451 191402 118093 -180174
247 -180174 117351 46713 -197139 60821 65081 -66736 111694 -3855 -126103 76877
257 76877 -39737 -81594 198345 -10853 -167725 148676 -33719 -208036 218812 97281
267 97281 -232237 127095 86874 -279188 89234 216520 -186507 8829 175330 -197086
$$ packed form
197D9865l76679O06643q7602n66796M74947Q9135n22752M18235K21661n42691
207b36034J95354K37488m17524J74726K84799l30403O4607J47463k87450J40329
217b6645J57510k32239J83915L9979l51394K52382J20543l65481L18160J62303
227B59033n38395K36700L01644n28006K11755M48855n77864p143N09979m75621
237a59063q5268O05384l55366k69359M98051k37696k86134M80853p3309k98267
247a80174K97525p0638k43852K57960M260j31817J78430j15549j22248K02980
257G6877j16614m1857K79939k09198j56872L16401j82395j74317M26848j21531
267I7281l29518L59332m0221l66062L68422J27286m03027J95336J66501l72416
$$ plain form
277 -197086 -81429 202421 -44348 -68948 133613 -47770 -130795 60664 47108 -20307 34076
288 34076 15729 -40465 -55142 -4225 73838 11655 -32772 52916 -33165 -115233 71670 81761
300 81761 -74817 37852 63516 -132000 -38055 118097 -17333 -33513 86384 -25711 -115659
311 -115659 27903 74814 -28478 -773 71246 -49110 -113146 65822 75967 -81455 42360
322 42360 97579 -150075 -62611 158378 -50848 -67441 171114 -48123 -177490 118804 41457
333 41457 -122664 121710 70084 -165071 14384 67313 -83486 51615 84480 -70563 -15457
344 -15457 -3711 -48337 64241 24143 -34181 69967 -59701 -112287 128511 12475 -110135
355 -110135 160402 7182 -229764 124858 98830 -203975 133936 158004 -266641 13773
$$ packed form
277a97086J15657K83850k46769k4600K02561j81383q3025J91459j3556o7415N4383
288C4076j8347n6194j4677N0917P8063o2183m4427Q5688q6081q2068J86903J0091
300H1761j56578J12669K5664j95516R3945J56152j35430j6180J19897j12095q9948
311a15659J43562M6911j03292K7705P2019j20356o4036J78968J0145j57422J23815
322D2360N5219k47654Q7464K20989k09226j6593K38555k19237j29367K96294p7347
333D1457j64121K44374n1626k35155J79455N2929j50799J35101L2865j55043N5106
344a5457J1746m4626J12578m0098n8324J04148j29668n2586K40798j16036j22610
355a10135K70537j53220k36946L54622k6028l02805L37911K4068m24645K80414
$$ plain form
365 13773 192206 -201125 10971 249240 -172050 -102344 186955 -117390 -79743 213293
375 213293 -49052 -109111 109628 -69967 -72144 134322 -21923 -31454 83723 -109405 -41997
386 -41997 127320 -80837 284 161221 -149996 -87870 185158 -107236 -78397 249843 -88515
397 -88515 -190076 201710 -36427 -188099 232631 51579 -233984 123487 62962 -213104
407 -213104 115090 145521 -163892 24574 87622 -147145 14511 119123 -59242 10274
417 10274 37570 -91413 10481 38744 -37838 77225 14363 -114714 52597 21070 -107866
428 -107866 112749 81062 -159114 37165 83108 -159756 42015 170139 -124610 -44607
438 -44607 128866 -111645 -72343 166887 -11711 -94288 86505 -14897 -110929 63161 68618
$$ packed form
365A3773J78433l93331K12096K38269m21290O9706K89299l04345L7647K93036
375B13293k62345o0059K18739j79595k177K06466j56245r531J15177j93128O7408
386d1997J69317k08157Q1121J60937l11217O2126K73028k92394K8839L28240l38358
397h8515j01561L91786k38137j51672M20730j81052k85563L57471o0525k76066
407b13104L28194L0431l09413J88466O3048k34767J61656J04612j78365O9516
417A0274K7296j28983J01894K8263p6582J15063o2862j29077J67311l1527j28936
428a07866K20615l1687k40176J96279M5943k42864K01771J28124k94749Q0003
438d4607J73473k40511L9302K39230j78598q2577J80793j01402r6032J74090N457
$$ plain form
449 68618 -44381 5238 23177 -48481 -34393 38323 45993 -13534 -17461 21056 -37110 -49637
$$ packed form
449F8618j12999M9619J7939p1658J4088P2716P670n9527l927L8517n8166j2527
$$ [...]
8191D64
##END NTUPLES=NMR FID
##END=
