##TITLE=1H_GC1011
 CDCl3
 8 sc, 
 11.11.2021
##JCAMPDX= 6.0         $$ Bruker NMR JCAMP-DX V2.0
##DATA TYPE= NMR FID
##DATA CLASS= NTUPLES
##ORIGIN= UXNMR, Bruker Analytische Messtechnik GmbH
##OWNER= root
$$ XWIN-NMR		Version 3.5
$$ Thu Nov 11 10:31:47 2021 Russian Standard Time (UT+4h)  she@DPX200
##.OBSERVE FREQUENCY= 200.1313468511
##.OBSERVE NUCLEUS= ^1H
##.DELAY= (6, 6)
##.ACQUISITION MODE= SIMULTANEOUS
##.ACQUISITION SCHEME= undefined
##.AVERAGES= 8
##.DIGITISER RES= 18
##SPECTROMETER/DATA SYSTEM= spect
##.PULSE SEQUENCE= zg30
##.SOLVENT NAME= CDCl3
##.SHIFT REFERENCE= (INTERNAL, CDCl3, 0, 15.7039)
##AUDIT TRAIL= $$ (NUMBER, WHEN, WHO, WHERE, WHAT)
$$ ##TITLE= Audit trail, XWIN-NMR		Version 3.5
$$ ##JCAMPDX= 5.01
$$ ##ORIGIN= Bruker BioSpin GmbH
$$ ##OWNER= she
$$ F:/spectra/data/she/nmr/H-F/1/audita.txt
$$ ##AUDIT TRAIL=  $$ (NUMBER, WHEN, WHO, WHERE, WHAT)
(   1,<2021-11-11 10:30:04.43 +0400>,<she>,<DPX200>,
      <created by zg, POWCHK disabled, PULCHK disabled
       configuration hash MD5:
       00 E9 B6 7A A2 85 ED C7 34 08 36 98 17 FE 4E 26
       data hash MD5: 16K
       FA 2C 16 15 3E DB 58 B8 E6 3F 10 4C 69 41 FB F0>)
$$ ##END=
$$ 
$$ hash MD5
$$ 46 ED 56 09 A5 B8 0B A8 B4 9B 86 DE 4E 0E 59 3A
##$RELAX= 
##$RELAX= 
##$RELAX= 
##$RELAX= 
##$RELAX= 
##$RELAX= 
$$ Bruker specific parameters
$$ --------------------------
##$DU= <F:/spectra>
##$EXPNO= 1
##$NAME= <H-F>
##$PROCNO= 1
##$TYPE= <nmr>
##$USER= <she>
##$AMP= (0..31)
100 100 100 100 100 100 100 100 100 100 100 100 100 100 100 100 100 100 
100 100 100 100 100 100 100 100 100 100 100 100 100 100 
##$AQSEQ= 0
##$AQ_mod= 1
##$AUNM= <au_zg>
##$AUTOPOS= <>
##$BF1= 200.13
##$BF2= 200.13
##$BF3= 200.13
##$BF4= 200.13
##$BF5= 200.13
##$BF6= 200.13
##$BF7= 200.13
##$BF8= 200.13
##$BYTORDA= 1
##$CFDGTYP= 0
##$CFRGTYP= 5
##$CHEMSTR= <none>
##$CNST= (0..31)
1 1 145 1 1 1 1 1 1 1 1 1 1 1 1 1 1 1 1 1 1 1 1 1 1 1 1 1 1 1 1 1 
##$CPDPRG= <>
##$CPDPRG1= <>
##$CPDPRG2= <>
##$CPDPRG3= <>
##$CPDPRG4= <mlev>
##$CPDPRG5= <mlev>
##$CPDPRG6= <mlev>
##$CPDPRG7= <mlev>
##$CPDPRG8= <mlev>
##$CPDPRGB= <>
##$CPDPRGT= <>
##$D= (0..31)
0 1.2 0 0 0 0 0 0 0 0.06 0 0.03 0 0 0 0 0.0002 0 0 0 0 0 0 0 0 0 0 0 0 
0 0 0 
##$DATE= 1636612203
##$DBL= (0..7)
120 120 120 120 120 120 120 120 
##$DBP= (0..7)
150 150 150 150 150 150 150 150 
##$DBP07= 0
##$DBPNAM0= <>
##$DBPNAM1= <>
##$DBPNAM2= <>
##$DBPNAM3= <>
##$DBPNAM4= <>
##$DBPNAM5= <>
##$DBPNAM6= <>
##$DBPNAM7= <>
##$DBPOAL= (0..7)
0.5 0.5 0.5 0.5 0.5 0.5 0.5 0.5 
##$DBPOFFS= (0..7)
0 0 0 0 0 0 0 0 
##$DE= 6
##$DECBNUC= <off>
##$DECIM= 32
##$DECNUC= <off>
##$DECSTAT= 4
##$DIGMOD= 1
##$DIGTYP= 9
##$DL= (0..7)
0 120 120 120 120 120 120 120 
##$DP= (0..7)
150 150 150 150 150 150 150 150 
##$DP07= 0
##$DPNAME0= <>
##$DPNAME1= <>
##$DPNAME2= <>
##$DPNAME3= <>
##$DPNAME4= <>
##$DPNAME5= <>
##$DPNAME6= <>
##$DPNAME7= <>
##$DPOAL= (0..7)
0.5 0.5 0.5 0.5 0.5 0.5 0.5 0.5 
##$DPOFFS= (0..7)
0 0 0 0 0 0 0 0 
##$DQDMODE= 0
##$DR= 18
##$DS= 0
##$DSLIST= <SSSSSSSSSSSSSSS>
$$ [...]
##$SUBNAM2= <"">
##$SUBNAM3= <"">
##$SUBNAM4= <"">
##$SUBNAM5= <"">
##$SUBNAM6= <"">
##$SUBNAM7= <"">
##$SUBNAM8= <"">
##$SUBNAM9= <"">
##$SW= 18.0517286264689
##$SWIBOX= (0..15)
0 0 2 0 0 0 0 0 0 0 0 0 0 0 0 0 
##$SW_h= 3612.71676300578
##$TD= 16384
##$TD0= 1
##$TE= 0
##$TE2= 300
##$TE3= 300
##$TEG= 300
##$TL= (0..7)
0 120 120 120 120 120 120 120 
##$TP= (0..7)
150 150 150 150 150 150 150 150 
##$TP07= 0
##$TPNAME0= <>
##$TPNAME1= <>
##$TPNAME2= <>
##$TPNAME3= <>
##$TPNAME4= <>
##$TPNAME5= <>
##$TPNAME6= <>
##$TPNAME7= <>
##$TPOAL= (0..7)
0.5 0.5 0.5 0.5 0.5 0.5 0.5 0.5 
##$TPOFFS= (0..7)
0 0 0 0 0 0 0 0 
##$TUNHIN= 0
##$TUNHOUT= 0
##$TUNXOUT= 0
##$USERA1= <user>
##$USERA2= <user>
##$USERA3= <user>
##$USERA4= <user>
##$USERA5= <user>
##$V9= 5
##$VALIST= <valist>
##$VCLIST= <CCCCCCCCCCCCCCC>
##$VD= 0
##$VDLIST= <DDDDDDDDDDDDDDD>
##$VPLIST= <PPPPPPPPPPPPPPP>
##$VTLIST= <TTTTTTTTTTTTTTT>
##$WBST= 1024
##$WBSW= 4
##$XGAIN= (0..3)
0 0 0 0 
##$XL= 0
##$YL= 0
##$YMAX_a= 301471
##$YMIN_a= -247733
##$ZGOPTNS= <>
##$ZL1= 120
##$ZL2= 120
##$ZL3= 120
##$ZL4= 120
##$ABSF1= 10
##$ABSF2= 0
##$ABSG= 5
##$ABSL= 3
##$ALPHA= 0
##$AQORDER= 0
##$ASSFAC= 0
##$ASSFACI= 0
##$ASSFACX= 0
##$ASSWID= 0
##$AUNMP= <proc_1d>
##$AZFE= 0.1
##$AZFW= 0.1
##$BCFW= 1
##$BC_mod= 2
##$BYTORDP= 1
##$COROFFS= 0
##$CY= 11.3945322036743
##$DATMOD= 1
##$DC= 2
##$DFILT= <>
##$DTYPP= 0
##$F1P= 2.36226072786647
##$F2P= -0.459571619588291
##$FCOR= 0.5
##$FTSIZE= 0
##$FT_mod= 4
##$GAMMA= 1
##$GB= 0.15
##$INTBC= 1
##$INTSCL= 1
##$ISEN= 128
##$LB= 0.24
##$LEV0= 0
##$LPBIN= 0
##$MAXI= 10000
##$MC2= 0
##$MEAN= 0
##$ME_mod= 0
##$MI= 1.114404
##$NCOEF= 0
##$NC_proc= 0
##$NLEV= 6
##$NOISF1= 3.799351
##$NOISF2= 2.8
##$NSP= 1
##$NTH_PI= 0
##$NZP= 0
##$OFFSET= 15.70392
##$PC= 1
##$PHC0= -15424.91
##$PHC1= 15.40081
##$PH_mod= 1
##$PKNL= yes
##$PPARMOD= 0
##$PSCAL= 0
##$PSIGN= 0
##$REVERSE= no
##$SF= 200.130013532006
##$SI= 16384
##$SIGF1= 3
##$SIGF2= 2
##$SINO= 400
##$SIOLD= 16384
##$SREGLST= <1H.CDCl3>
##$SSB= 0
##$STSI= 0
##$STSR= 0
##$SW_p= 3612.71676300578
##$SYMM= 0
##$S_DEV= 0
##$TDeff= 0
##$TDoff= 0
##$TI= <>
##$TILT= no
##$TM1= 0
##$TM2= 0
##$TOPLEV= 0
##$USERP1= <user>
##$USERP2= <user>
##$USERP3= <user>
##$USERP4= <user>
##$USERP5= <user>
##$WDW= 1
##$XDIM= 8192
##$YMAX_p= 0
##$YMIN_p= 0
$$ End of Bruker specific parameters
$$ ---------------------------------
##NTUPLES= NMR FID
##VAR_NAME=  TIME,          FID/REAL,        FID/IMAG
##SYMBOL=    X,             R,               I
##VAR_TYPE=  INDEPENDENT,   DEPENDENT,       DEPENDENT
##VAR_FORM=  AFFN,          ASDF,            ASDF
##VAR_DIM=   8192,          8192,            8192
##UNITS=     SECONDS,       ARBITRARY UNITS, ARBITRARY UNITS
##FACTOR=    0.0002768,     1,               1
##FIRST=     0,             0,               0
##LAST=      2.2672688,     0,               0
##MIN=       0,             -247733,         0
##MAX=       2.2672688,     301471,          0
$$ Real data points
##PAGE= N=1
##DATA TABLE= (X++(R..R)), XYDATA
0@%%%%%%%%%%%JrJ6j6J6j6K4l2L2m0M8n6P2q2R0j06J26j46J66j88K15k45K78l12
35a64L49l91M36m88N44o05O72p46Q27r13J007j110J223j348J484j633J801j986
53a041K191k423K686k986L334l738M218m800N519o440P654r333J1812j5817K3292
68A4128m1576J60025J68894m86615J40740K46485l49266J2320L47806j73907o6534
79b7500J55290k74724q1448L93317p5191k27920K39884j0950l07847J46791J96004
90A25706j23185K3526O4950j52124o632R4692n6262L2492J01842r8281r2441N9544
102b6173K7472j0113K1731J6657M242m8273m4274O6780L4279m7239L6157J711
114C2957r2469M5665N1283r3661N7151R7436j55114l5026J63645p5316p5831J64280
$$ y = [0, 0, 0, 0, 0, 0, 0, 0, 0, 0, 0, 0, 1, -8, 8, -8, 8, -8, 16, -16, 16, -24, 24, -32, 40, -42, 48, -58, 68, -78, 88, -100, 115, -130, 148, -164, 185, -206, 230, -258, 286, -319, 353, -393, 434, -479, 528, -582, 641, -707, 777, -856, 945, -1041, 1150, -1273, 1413, -1573, 1761, -1977, 2241, -2559, 2960, -3480, 4174, -5159, 6653, -9164, 14128, -27448, 132577, 301471, -185144, -44404, 202081, -147185, -134865, 212941, 39034, -27500, 127790, -146934, -228382, 164935, 89744, -138176, 101708, 90758, -217089, -70298, 125706, 2521, 26047, 90997, -61127, -67759, 26933, -29329, 3163, 105005, 6724, -85717, -26173, 1299, -8814, 12917, 29574, 33816, -14457, -58731, 8049, 42328, -4911, 31246, 32957, -59512, -13847, 37436, -56225, 926, 98362, -56752, -91778, 71867, -3449, -79280, 85000]
126H5000l7222j38250J20453N650j27511J43484N3754j98520O9569J22714j81861
137h2740J0097J93849j16319q7334J44880o2762r0347J48887j3689j15077J17382
148D6827R437j52485Q7757R1217j27208J5606R5661r1629k2069Q7111n1966k2612
160c4353Q2221m5624n1397Q0602m144o5740M3395K3901m1632J0725J0089j5138
172g095J9841r867l1419L2388J6287l4883N376J9345q618k649j1517L523L9277
185B9989k2039m4616M9198K1325o3052J3433M7408l4499j0954K3800k1434J2064
197F23K4296m9705N462O2197m7394l9100P3359k366o3009L4793K1758l8950K0973
210B937J2397l6036K7647J5916n5714J9824N1107m5622j6272M8375k0349k6847
$$ y = [85000, 47778, -90472, 29981, 35631, -91880, 51604, 105358, -93162, -23593, 99121, -82740, -72643, 121206, 4887, -82447, 62433, -329, -90676, 58211, 44522, -70555, 46827, 56264, -96221, -8464, 82753, -44455, -28849, 66812, -24817, -46886, 40225, -11741, -34353, 47868, 2244, -49153, 31449, 27305, -38435, 4960, 28861, -12771, -2046, 8043, -7095, 12746, 2879, -28540, 3848, 20135, -14748, -9372, 9973, 1355, -1294, -12811, -9288, 29989, 7950, -36666, 12532, 33857, -29195, -15762, 31646, -2853, -13807, 9993, -11441, 623, 24919, -24786, -19324, 42873, -4521, -43621, 29738, 27372, -35637, -844, 20914, -18036, 2937, 15334, -20702, 6945, 22861, -32853, -13029, 38078, -7544, -23816, 24559, 4210, -22637]
222b2637L1854o256j3513L0797j6438k9494L6734L967l8738K2459K3819k8617
234f063k493J2561j0618R957N497k2785J4089K0534l1667p158L3849o969k1448
247a2714J1453O360l086j52j0801O437J9188j9462j6496K9027N708k8077M832
260g783J8101q043p743J427M085R228p851j4719J5239J1024k0345k044J9202l805
274E973j1424K994K269K425P23q999L592J2497j0283j0534J2563M180q656J568
288a112K089r08M003n431o452J2360M248j5360M41J3096l861q705K286N202K738
303D634n279p256R359R237j4025p557J6402M080j5058r77J1976M13r941l594R127
318A541P056j0164q353J2364O941j4222m259J4753K690j2752j674J0090J741q099
$$ y = [-22637, 9217, 2961, -10552, 20245, 3807, -25687, 11047, 15014, -23724, -1265, 22554, -6063, -8556, 4005, -6613, 3344, 8841, -13944, 145, 20679, -10988, -18146, 15703, 8734, -12714, -1261, 5099, 2013, 1861, -8940, -2503, 16685, -2777, -19273, 9754, 15462, -12615, -7783, 10318, 2275, -5468, -4041, 44, 9272, 1421, -13298, 1941, 12965, -7380, -9424, 9778, 5973, -5451, -2457, -188, 2237, 2960, -6039, -2447, 10050, -233, -10767, 1796, 5976, -2680, -1112, 977, 69, 4072, -1359, -7811, 4549, 8797, -6563, -6122, 6974, 3113, -5592, -3306, 1896, 4634, -645, -7901, 1458, 10695, -3330, -10887, 5515, 9595, -5463, -6440, 5536, 5949, -3992, -7586, 1541, 8597, -1567, -9920, 2444, 9385, -4837, -9096, 5657, 8347, -4405, -6079, 4011, 5752, -2347]
332b347l062O877M176o777n199O884N323p261n354P409N221o441l927N408L052
347C982l835l041J962M273k42o248r57P594K30q725R21Q767j386p502J018O390
363C201O03o154k271P585L847r400m480J0503L270j1623j874J1767R13j1295p35
378f143J0304R26r175o28Q864J410q225k549P890L632q583m311J0162L518j2203
393e111j906J2121r31r674L546N652l575j287M51p13N035l47r222L956R571q449
409h83n656J0665m61q998M579K883m404M933L35r443N977Q173j1776k177J4726
424H473m080j2657P118N867o587P41K707l108L330j23r022N906J1438j1001q152
439i150J4600J582j5543M344J2968o743p099N522N05k311K591k581p33P737m479
$$ y = [-2347, -5409, 1468, 5644, -1133, -6332, 552, 5875, -1386, -6740, 669, 5890, -551, -4478, 930, 3982, 147, -2894, -932, 3341, 3099, -3149, -4106, 3488, 3718, -5007, -4086, 4681, 3295, -4207, -3189, 3201, 3804, -2350, -4621, 2964, 6811, -2589, -7069, 3434, 6704, -4919, -6793, 4974, 5887, -5408, -6143, 4161, 5087, -4088, -4716, 4148, 5558, -2667, -5216, 2674, 6306, -2277, -6588, 3574, 7092, -5111, -7017, 5104, 4173, -5501, -1955, 3697, 122, -1165, -714, -1427, 3608, 3261, -5961, -2005, 7566, -883, -6539, 4126, 3665, -5333, -754, 2129, -2275, 2658, 2993, -6450, -473, 7700, -4076, -6253, 8473, 4393, -8264, -1146, 4721, -1866, -1125, 1582, -1526, 1804, 1681, -7341, -1435, 10003, -998, -9150, 5450, 7032, -8511, -4167, 8801, 2058, -5041, 481, 986, -1325, 1266, -1315, -2048, 5689, 1210]
454A210j0595R989Q731j3472k069J4041n366j0767R138L738p684M195K145q642
468e408M877O447j1016R20J3557q369j0102J2105J944j0689O121N184q873K954
482c48M707j0431K970J2680j0564p923J5211q90j5696Q009J1038r848k635P126
496C406m501j570N613n196j02J0907p497j2112J3150O576j5667K681J5035r433
510A290j0487R953K308n691N259J79o468N001K56r274P966J0273j2424n381J1893
525D653l761q920J0372M711r109J267K065p071M497Q191p099k350P565o189p301
540h479R826M882o609P02J173n833J722M908k722J847M629q186o301R184L888
555D631o645K261N391o465n915M752M589J28m55k531j896J711j252j395O937L391
$$ y = [1210, -9385, 604, 9335, -4137, -6206, 7835, 2469, -8298, 840, 4578, -3106, 1089, 3234, -5408, -531, 5916, -5100, -4180, 9377, 1008, -9094, 3011, 4955, -5734, 387, 5571, -3302, -348, 4359, -6072, -3102, 9578, -986, -8909, 6302, 5412, -10284, -2275, 8763, -1085, -3720, 3406, -1095, -2665, 2948, -2248, -2350, 8557, 1060, -11052, 2098, 8674, -6993, -4312, 10723, 1290, -9197, 756, 3064, -2627, 2632, 2811, -3657, 1344, 1600, -7674, 292, 10565, -1859, -7240, 4653, 892, -8028, 2344, 7055, -2054, -787, 1278, -5793, -1296, 6895, -204, -2554, 5011, -1178, -8479, 1347, 6229, -380, 322, 1495, -4338, -2616, 2292, -430, 1417, 6046, -2140, -8441, 743, 4631, -2014, 247, 5638, -827, -6742, -1990, 2599, 2727, 2272, -259, -2155, -444, -1696, -3091, 3846, 7237]
571G237r406m009P310K00m700N098M202o231l935K141J202K358J858l184r86J652
587H07l759j096P143J660n541n74J158k082J180K897k51K33r52m088M10M441K99
604A885j398M32o82j309q02P0L725K147m913k223M115p24l241L374K801k439j959
621a141j043Q79L685j561l572M825J695q026L54Q122k307m817L867R98l585O35
637i92P61n6K976j663m494L625K790n523K55O164k330m584K858J373k455J172
653a23J364j443M42N60k529K65L535q13k819J823J410l015n59L094J2j423Q06
670E87j039j298K733l6l166L228K606o224j010O746j646m756M388J689m889P73
686a314K106j815K316R24m998J967M520n879j483Q209j992p099M578K977n311
$$ y = [7237, -2169, -6178, 1132, 1332, -3368, 1730, 5932, -299, -4234, -2093, -891, 1467, 3325, 141, -845, 807, -2952, -4048, 3095, 4755, -786, -1360, -202, -2284, -1104, 1793, 1542, 1775, 823, -3265, -2855, 1586, 1885, 487, 919, 237, -1072, -1874, -1804, 1921, 4068, -845, -3068, 1047, 323, -2918, 456, 3257, 818, -1141, -2184, -1305, 2380, 819, -2753, 2072, 3767, -4259, -3905, 4217, 1910, -2907, 960, 1958, -1627, -992, -231, -287, 2689, 1026, -3468, 157, 2947, -2576, -2321, 3843, 1513, -3071, -213, 1160, -1295, -123, 1241, -202, 240, 800, -1729, -1464, 2071, 1258, -1561, 262, 1672, -1343, -1902, 1192, 1204, -219, 587, -452, -1750, 983, 947, -2219, 1009, 3615, -2609, -3619, 3127, 1481, -3275, 1113, 2802, -2087, -1314, 792, -1023, 1293, 2217, -2781, -814, 3706, -2173, -3656, 4553, 2561, -4538, 40, 3017, -2294]
701b294J213L647k949j36J764l370Q41M456l411k457M936q79m787L097K981l352
717g00n7K122k105m35K351j224r25K495o18k854J373K186j570r03J557n6j253
734f16J92L28J38R38p06j870J558J815k852q94L988l89m171J622L038k251j261
751a393J997K9p19J22j064R74K046k523j602L812o1m089J849L030k665j288K255
768G10k82r28P74o40K7J443j315j236K248K48k263Q46J437j261l26Q69m89Q3O39
787E84q62l20J282k84j188O12Q96n01p64J83Q31k6j002k0J220o9j349J45J384
806G52j40j390O5J525q1j735L30J826o13j698Q66J393q58j056N94R88l93j064
824f89K28J370l83j556O67J412r44j024R77N71p96k90L85L11p6m66l8O28j2p03
$$ y = [-2294, -1081, 2566, -383, -519, 1245, -2125, -1284, 3172, -239, -2696, 2240, 1361, -3426, -329, 2652, -700, -757, 1365, -740, -1175, 1176, -48, -973, 1522, 904, -1950, -577, 1609, 39, -864, 693, 637, -616, -424, -96, 42, 980, 274, -1596, -38, 1777, -1075, -1969, 2019, 1630, -2541, -919, 2119, -132, -1393, 604, 633, -86, 36, -1028, -54, 1992, -531, -2133, 1679, 1618, -2471, -622, 2408, -257, -1545, 710, 428, -500, 274, -366, -339, 1104, -211, -1447, 801, 1049, -1214, -368, 1069, -192, -518, 351, -138, -55, 584, -278, -598, 684, 400, -788, -176, 720, 219, -545, -362, 469, 443, -559, -579, 641, 572, -777, -632, 752, 612, -778, -713, 812, 731, -1004, -674, 1152, 539, -1159, -293, 1100, 242, -814, -220, 768, 375, -689, -461, 909, 526, -1030, -363, 1049, 105, -919, 58, 629, -167, -457, -72, 239, 163, -303, -341, 287, 275, -428]
844d28K33N90l64k88K62L5P2J41l80j96O69O6q76J68Q91l33q59L57Q01l51p28
865e18K23P44q9q64l3J056M9j331J59J527m83j488P58J282q79r24Q52O22o05n89
885e31L33P36q0r72J34J079m21j057O69R26q46o13P31K54n45J9L01n5k7j41j87
906b93L31L24l92k32L94M8m35J47L32q4l6j32k88L61M37o95k06R63j81j206N18
927c25J142p80o52P79J49n32j39K45M50J34q72j99J159j77j241Q56J122j225p96
946i02J106L01p11J9M26P2k86n38K80P92l60o97N62L43p38j08O70O5l21j76O0
967a41J76o7k06L48J93l81p5J64j72K41K84m69k0M96m32m70O92L35n58p3K09j59
989h5P3p1j03N66M5j034J16J027m37p76R35M94j083l50Q09J94l78L5K27r5k32
$$ y = [-428, -195, 395, 31, -257, 5, 40, 112, 253, -127, -323, 346, 412, -464, -296, 595, 262, -597, -240, 561, 210, -518, -295, 449, 360, -504, -537, 519, 568, -763, -604, 923, 440, -1048, -290, 992, 113, -811, 41, 663, 58, -531, -198, 538, 458, -514, -380, 699, 278, -779, -110, 816, -30, -643, 88, 342, -203, -184, 117, 62, 35, -106, -293, 38, 362, -30, -262, 132, 180, -255, -108, 224, 140, 104, -28, -316, 45, 482, -213, -419, 544, 363, -843, -325, 817, 37, -615, 164, 313, -219, -358, -113, 337, 471, -401, -600, 559, 382, -859, -3, 1119, -106, -902, 204, 505, -206, -187, 239, 311, 25, -513, -233, 559, 199, -498, 64, 407, -331, -439, 231, 296, -25, -201, -141, 35, -32, -238, 110, 303, -78, -153, 11, -161, 80, 364, -105, -125, 371, -61, -531, 161, 496, -62, -135, 74, -85, -12, -83, -186, 380, 425, -609, -493, 534, 97, -679, 256, 750, -333, -683, 126, 320, -58, -23, 204, 109, -123]
1010a23k60K30P39j62q51K35O51p21m09J252J88j207J14O31o38%R50m66m18N47
1030B82n62n29J290K01j185O17L91j324L51J293q17k32J061j116q61J696R1j425
1048g78J145O24j958J32J603p34l63J071p75p66J061k79o25J500j1k015P67J344
1066I43j517j14J917o74j567R57M06q29O79N54j032J40N08j066K41J616r31j144
1084i13J293L2j527R51J318j348l48J155r50n17J533k41j122J104R9j592Q34J274
1102A035j328r1J319j153o99J586l69j079J453Lj853R90J274j681l1J766j119
1119B3j078J435o2j011J042R0j170Q63M23j426O33J444j483o93J798m66j452J270
1137A80O82j329K40P75q85N0Q42p43j89J063o20r63J223K87j296N44R59j127l26
$$ y = [-123, -383, -153, 586, 424, -427, -192, 459, -262, -671, 581, 769, -438, -324, 307, -331, -331, 619, 153, -265, 282, -280, -809, 481, 682, -503, 114, 505, -819, -468, 825, 8, -224, 837, -279, -1140, 556, 647, -778, 367, 991, -967, -835, 768, 34, -329, 742, -33, -799, 262, -17, -642, 858, 847, -1168, -401, 943, -574, -688, 1229, 555, -1012, -55, 351, -478, 201, 755, -277, -137, 371, -695, -454, 1162, 231, -913, 380, 412, -1115, -164, 1154, -194, -542, 613, -337, -854, 679, 438, -684, 420, 519, -1073, -239, 1035, -293, -384, 935, -218, -917, 669, 300, -779, 674, 677, -1176, -186, 1088, -593, -624, 1142, 23, -1055, 380, 318, -693, 349, 439, -731, 132, 555, -871, -238, 1206, -277, -970, 828, 362, -1090, 180, 862, -467, -227, 548, -337, -287, 555, -188, -377, 686, 66, -897, 326, 613, -683, -139, 820, -307, -633]
1156f33J142m68n64R82j27r82P44M08j072M00R46r15l92R52l89n28Q63n2p98P04
1176B21J26j065O07R30j101k93J197m94r39R37L67p66K21L08n62K69L35o17K96
1195b3O58q75l96J100r3r08O13N26q55j03O11k18j71L60k68j60L47j67l21N15
1215A72J81o81P4N24l65j83N11j04l51K75J9k82L04K24m65k5M44k47k95L97J46
1236B73l59J1J19j10J33ok21K38K02n07r7O40j33n38L05L56l72k24L38J31j74
1257Ej04j0J89L9k92OM45j13m78K29L63k83k13K96Q6k29p8J63O6m0j32J5J49l2
1281D7j29L4J47m6j39L0R9ll3o0M0P5Lj39QJ92l0k13L4K25r9k49J42K25j27k11
1307a77J26K15j09k36M5L38j20l28J60L40j99k93K17K49k10k09J75K24j86k04
$$ y = [-633, 509, 41, -523, 459, 332, -650, 94, 502, -570, -170, 776, -139, -531, 421, 32, -496, 367, 315, -483, 221, 347, -718, -111, 819, -282, -575, 622, 128, -811, 126, 493, -273, -52, 256, -306, -37, 298, -319, -23, 635, -240, -636, 464, 371, -537, 76, 602, -253, -356, 255, 37, -134, 226, -42, -202, 145, -22, -343, 172, 353, -328, -254, 270, -95, -278, 233, 129, -222, 53, 72, -210, 94, 318, -147, -172, 272, 25, -270, 127, 273, -86, -75, 44, -66, 67, 61, -160, 78, 280, -227, -324, 316, 183, -355, -50, 306, -66, -290, 48, 179, 5, -99, -109, 80, 119, -173, -167, 278, 165, -313, -84, 279, -4, -217, 79, 165, -64, -142, 21, 87, 47, -85, -70, 79, 47, -82, -48, 99, 53, -86, -56, 43, 40, 7, -53, -13, 62, 65, -74, -66, 126, 96, -117, -83, 142, 43, -206, -64, 161, 34, -177, -51, 164, 55, -181, -136, 202, 82, -246, -86, 254, 55, -238, -21, 228, 18, -191, -16, 208, 22, -182]
1327a82J96J80j76j90J54J62j22j42J23J25j39j09Q8J28j44m1O4L9n1m6L7L1J15
1350A00j29j02J54P1m7j32P6M3N5j73r7L72j16j99J82J59j97k31J48L58k37k47
1372a89J94K08k45j61K37J33o0k76J17K87k70k18K73Q2m6l53L75J17j92j92L52
1393A73J10m52J53k0KK33m11M1M50k28k58J22P6j06J96q8M3N8J4j48j27K43j20
1416d4j57K38L05k99j88K17j04J3j49L20R2l08L2j58L90n6m29K07M14m03l75N43
1438A01J56m24O9L06j95r1Q3q2J29J16l15NM45k30m65N16K40n96N4M67l16k01
1460b28M03j09k67L31o0l82L77J89m80J01L77l65j59M65j60k35L79p0m30M19J97
1481B93o05K06N78n37l59P07m1n71L86K12m13J10J68l54K23L48n82m9P06m27n99
$$ y = [-182, 14, 194, 18, -172, -18, 144, 22, -120, 3, 128, -11, -120, -32, 96, -48, -89, -25, 14, -37, -83, -46, -15, 100, -29, -131, 23, 94, 47, -85, -9, 34, 89, -84, -181, 191, 75, -124, 58, 217, 20, -211, -63, 295, 58, -189, 5, 213, -32, -193, 44, 177, 117, -159, -42, 245, -25, -243, 30, 112, 66, -287, 88, 205, 13, -179, 173, 283, -169, -16, -36, -34, 199, -212, -171, 279, 51, -207, -85, -9, -115, 81, -7, 36, 94, 108, -40, -167, 76, -44, -201, 37, 342, 43, -145, 72, -32, -19, -168, 152, 244, -64, -32, -190, 200, 144, -285, -78, 336, -67, -442, 101, 257, -167, -98, 208, 13, -78, 5, -77, 52, 168, -147, -142, 303, 73, -392, 124, 364, -232, -178, 289, -27, -228, 175, 66, -201, 130, 70, -312, 65, 254, -226, -125, 252, -113, -272, 193, 33, -202, 177, 107, -323, 96, 293, -312, -106, 472, -65, -424, 283, 242, -329, 57, 269, -144, -34, 134, -220, 3, 351, -231, -280, 426, -1, -600]
1502f00P72L15q57J42O04n03k10N68j69k46L71k13l49N89Q5o99M37M76q26q7P60
1523C60k59m40O13n6o46M70K41n98K89N26o83k36P18k23m13N89L5o24L00K20m89
1544c06L46M81p03j64P45m47n07Q47K54r05J24N35m86n1N58k68j91L41l35k97
1564d29P57np24M67L93q60rR04l06m94M77k0n22L78K37l96K54K22o69O1O45l48
1586A3k72N80j22o13L55L02m38J65L96n15j52N14k42k79N53O8o30J52L66l13M6
1607f6L14k49j01K18j91j45M97n3n31K97L63n67p0O26j02m86K10J76l02R5J55
1628H8j10N8O9l45Q9L94k58k40M17K0n00J63M18k60j51K84j12j50J50Kj07J66
1650H5Q1k91P0K01j79o4K06j9j67R1k0r5J24R7j81NK04j79j89L03J17l26JK59
$$ y = [-600, 172, 487, -370, -228, 376, -127, -337, 231, 62, -184, 187, -26, -375, 214, 299, -400, 37, 513, -313, -400, 360, 101, -339, 274, 218, -428, 42, 283, -315, -26, 500, -183, -419, 299, 76, -337, 252, 287, -337, -37, 183, -306, 40, 521, -182, -346, 399, -48, -555, 292, 546, -359, -235, 300, -186, -237, 321, 53, -138, 203, -132, -429, 328, 323, -401, 66, 459, -401, -410, 494, 188, -306, 171, 151, -371, 7, 244, -152, 102, 324, -345, -284, 361, 13, -259, 321, 199, -414, -59, 243, -195, -30, 366, -149, -301, 213, -29, -308, 245, 313, -317, -165, 201, -112, -66, 248, -1, -102, 116, -75, -220, 277, 224, -307, -10, 353, -214, -284, 342, 240, -246, -36, 140, -162, -67, 88, -22, 36, 105, -240, -151, 243, -15, -255, 162, 182, -318, -155, 263, 3, -148, 136, 24, -126, 24, 26, -81, 85, 166, -125, -55, 146, -33, -97, 109, 90, -77, 14, -6, -101, 23, 120, -61, -56, 148, -31, -220, 83, 200, -126, -125, 134]
1674A34j11j96J66J27r8j1n9n2J62%k51K20K31l94j27M03L3l62J65K37k58j00
1696a41J68K3j0O3j88jJ68j07r4K17J02l14QK55j63j27K72o7j94J57K4k11J35
1719b5J80j81j01K14j00j67K00O8j29K3K1j12J25J15k20LK71k14k28L65J38l67
1741a21K3K90j83j47J86N2o3rp5lJ90r5k37K58J30l54rL39j46k38K67M6k14P2
1765d1R3j03P7N9j76M5J52j48p2K07l0j39P7Q6j48M3J11j20j7J62q9j52J99J1
1789H7j80L9J44r0j04J34K1m0jp1M6J14q8j55J78J09k55n0K83m3k37J44J24j12
1813cq5P2M4j0k3j05J68O1k03k7K34n5j85J05J49j60n4J11J9r9M7Kj3N6m6m4L8
1840fN9r3J4N6l7j7O7q7pJ29p9j11J15J10j72m8J75j3j23L0Q4j9l7knQ5p3j03
$$ y = [134, 23, -173, -7, 120, 22, 11, -48, -100, 62, 62, -189, 31, 262, -132, -259, 144, 177, -185, -20, 217, -41, -141, 27, 50, 40, 103, -85, -86, 82, -25, -119, 98, 200, -114, -106, 149, -14, -141, 131, 64, -130, 27, 51, -160, -25, 155, -26, -127, 87, -13, -180, 20, 88, -41, -18, 3, -109, 16, 131, -89, -86, 185, -29, -257, 108, 246, -121, -98, 192, 9, -138, 48, 100, 37, 28, -47, -50, 140, 45, -192, 66, 196, -158, -167, 172, 26, -212, 55, 101, -113, -41, 52, -51, 26, 85, -91, -46, 106, -42, -114, 93, 63, -76, 1, 87, -61, -18, 93, -27, -44, 118, 29, -123, 76, 87, -93, -54, 90, 0, -104, 30, 51, 11, 10, -61, -15, 99, 11, -144, 34, 143, -112, -162, 121, 78, -159, -15, 109, -3, -88, -16, 28, 18, -5, -110, 58, 119, -84, -111, 123, 68, -117, -12, 137, -23, -77, 34, 53, -46, 1, 3, -10, 46, 0, -44, -6, 53, -40, -26, 30, -7, -24, 43, -44, -51, 78, -1, -112, 3, 113, -59, -107, 68, 55, -68, -38, 46, 27, -10, -12, -17, 68, -5, -108]
1868a08J47J21k19m3K05kk31Q7J75j29q5J00j0j3%m0O4J9q6n5J70pj72P0J39j42
1894d5k9J22k0r4J06K9j42N8P6q1QQ6m9r0J39q4k0Q9j9j22J17J0j35Q5J50j64
1920a9j34K65l8k06J08J24j36l3Q9j4J2j6n3L0J23j41j34K59J8k37O2K26j70j32
1944a47J87N6j66O0K9m0N5Nr6N9J13j90j0K16j30j09J52O1k23J15J03j41J1J44
1968A14j22j18J66K2j98J12J41j52l1Q9o2NJ16j15k1J48n3k16K03J43k63j8K51
1991A41j16j83J88Q4j21pN6p0M3L5j06P2J13j70q7K20l6j96J48J27j67j10K03
2014F1l2j30J29J6j32P2L8q0Q1Q5j06o2R0l7r4K21k3j98R1Q9j84N0K27j31j65
2039a24J90j6j95J04J80j43o4J11q5j5J21m3o7J57j23j99K09J64k80M1K73j86
$$ y = [-108, 39, 160, -59, -102, 103, 101, -130, -43, 132, 3, -82, 18, 8, -5, -5, -45, 19, 38, -48, -103, 67, 60, -112, -42, 97, -45, -74, 48, 28, -66, 40, 69, -73, -15, 61, -20, -12, 74, 25, -65, 74, -10, -30, 59, 40, -82, 35, 45, -90, -5, 145, -19, -153, 112, 74, -132, -24, 100, -36, -69, 20, 6, 18, 2, -51, -21, 102, -39, -173, 86, 104, -133, -71, 155, -15, -147, 40, 96, -70, -10, 19, -21, 34, 39, -57, 2, 115, -75, -85, 131, 1, -108, 44, 105, -118, -3, 100, -41, -30, 114, -8, -126, 40, 62, -136, -24, 117, -35, -66, 23, -39, -34, 82, -33, -54, 94, 41, -175, 28, 171, -92, -110, 141, 25, -158, 30, 114, -7, -14, 42, -28, 15, 50, -56, 16, 129, -41, -128, 92, 56, -140, 8, 135, -32, -142, 61, 29, -101, 28, 44, -88, -16, 22, -58, 23, 108, 2, -60, 30, -7, -101, 120, 97, -101, -10, 79, -105, -55, 172, 41, -124, 66, 50, -145, -41, 139, -4, -68, 43, -42, -57, 64, 21, -46, 111, -12, -211, -2, 162, -118, -77, 196, 10]
2061A0k37K63R5k25Q9J08j87j5J71j02N2J53j80j90K53L6k48K01K04l52o6L17
2083A50j46j19K75n3k69J81Q5k59J86J78k65r3K79j64j17K88l9k70J92R4l09J47
2105d8L05l33j15L58j47k51K72J38k94Q5J48k19M4J87j62l2K52j92k05L49J8l61
2127b03J90K72l62q7L44j25j73K83m0k58J50J20k64J43K10l05k9L07k10j69L17
2148A11j0l20K42J45l66J24L08k59j27L06q8k52K57O6k51J56J16k67O7K05k09
2169d6o6L17j84k48L47O0l67J57K45l21m3K62r5j45K14n6j76J70J5j78J66J05
2191A33k25j2K57j86j52K90M5k80J21J34k26K4J84j35n1J69q6j19J69J6j62J18
2213B6Q0k09N9J77j76n4K00r4j40J56N5j80P9J24j33m2J03k7n5J22o7p8R5j9q6
$$ y = [10, -227, 36, 131, -94, -5, 103, -84, -99, 72, -30, 22, 175, -5, -195, 58, 94, -154, 47, 251, -101, -167, 150, 4, -115, 160, 107, -162, 19, 104, -155, 31, 209, -56, -149, 130, -34, -151, 137, 98, -172, 20, 114, -195, -48, 257, -76, -191, 167, 20, -231, 41, 179, -115, -30, 118, -101, -57, 130, -32, -64, 188, -4, -209, 140, 158, -203, -13, 259, -103, -190, 154, 29, -144, 139, 99, -159, -9, 111, -153, -10, 200, -105, -134, 173, -37, -206, 111, 101, -219, 23, 168, -198, -74, 234, -25, -152, 154, 66, -186, 71, 137, -114, 42, 158, -109, -42, 163, -46, -112, 205, 21, -227, 120, 180, -187, -30, 215, -106, -149, 113, 18, -127, 87, 31, -145, 25, 40, -138, 28, 133, -92, -104, 153, -33, -185, 105, 150, -130, -9, 125, -101, -77, 107, -28, -79, 90, 4, -115, 54, 70, -92, 26, 106, -103, -44, 133, -43, -97, 103, 9, -131, 25, 80, -100, -21, 103, -30, -72, 31, 4, -51, 71, 4, -74, 21, 2, -84]
2238h4J35Q4k09KJ66q1j33J70N0j40%R6o0ON4n1k9P4n6n1J34m9q2O2M2r9%J26
2266G7q9m9P6oq4O3L2p1L0M6m5%O0m7PM2n7j1N6J1r9N2R1j09pQ3k0m4J6M8l4m7
2298b9L1j1J0rj1kL4l3k3Q3k4q4M6Q6p2l0P5no7J8M3om7qM5Rk0j1K3J7o6L3P6
2331G1m4p4M5L4k3j4M5j6l8L0K1m6k0N1%l4J8Mj4Nj8kJ1ol4M8K5o3M4M2n3p5O7
2364a3O8o3l0O0Nj9k0M2Ln0k2N1K2Jp5M8L4n4l0Q1nn9PO6n1k5K5J3k2l0K9qM8
2397B7l3QJ7m5k7N4J2l6NK2qm7P9Kl9J7M7m8qM1k9pK3m6kN7J5j00Q7K3j03K3O4
2430D5n1n4Q5j6n8L6L8m4KJ4mlL5l7j0O1n6m2R6Jo6PJ08j22qQ2j4k6K6K0n4lN3
2463D1k7k2O2r0M3K1k9l6M8K3q2P2K6r9J6Q3m4j01J05Lq1P2Om1LQ7j17M0N5o4
$$ y = [-84, 51, 135, -74, -72, 94, 13, -120, 50, 100, -40, -40, 56, -4, 2, 56, 5, -24, 50, -6, -57, 77, 28, -54, 8, 50, -49, -49, 77, -12, -61, 15, 9, -75, -12, 20, -51, -21, 25, -20, -20, 40, -7, 0, 42, -15, -26, 30, 41, -58, -6, 85, -24, -31, 52, 32, -12, 4, 52, 18, -29, 2, -9, 1, -8, -19, -21, 13, -20, -43, 40, 16, -68, -22, 64, -8, -38, 37, 32, -35, -17, 26, 20, -27, -35, 10, 19, -1, -12, 11, 28, -38, -5, 71, 27, -47, -2, 32, 9, -5, 40, 24, -14, 16, 37, -9, -29, 22, 22, -12, 6, 10, -4, 1, -17, -19, -8, -14, -48, 0, 25, -38, 6, 48, -5, -80, -13, 55, -8, -38, 22, 27, 8, -12, 30, 33, -17, -39, 12, 34, 35, -40, 8, 42, -12, -42, 39, 34, -25, -18, 48, -3, -28, -3, 10, -12, -42, -13, -21, 27, -6, 2, 19, -26, -53, 1, 13, -23, -18, 4, -4, -51, 28, 30, -9, 8, 55, 7, -1, 40, 11, 4, 27, -19, -21, 36, 51, -49, 38, 61, -42, -19, 45, -6, -60, 25, 9, -49, -13, 25, -19, -17, -3, -7, -10, 25, -12, -22, 39, -17, -59, 37, 38, -28, -21, 87, -35, -43, 39, 25, -1, 25, 45, -9, -12, 41, 14, -8, 54, -36, 7, 28, -1, -37, 11, 34, -48, 24, 50, -49, -33, 50, 6, -95, 10, 13, -68, 4, 10, -31, -28, 59, -58, -18, 37, -27]
2493b7LJ10k9j27Q6O7j47L0J31q4n7J05k7q6J06j4r4P9nj12P4R0j06j9J09n3q6
2520h3J23Rj22P5N0j37M2J03q3k5J03o6n4J29k3j21J06L8r4j6J66j26o3J22pj20
2546g4J09N3j50N3J00r4m0R8p0j7Q6l9o2J09j6j31O7J21j35m4J45p1p0J25K4j47
2572g0O4M6r1M3R4j12qP9m1o0R7J6j23Q0O8j53J7J45q5n1R6m3q2Q9J7o3M5K8q5
2601d3J8P8q6rO2Pj18J07J2r7N8P1j13J2Q5n1n0O9M0j04M5O8q6L9M9n9k6Q5o2
2630Am8Q8j1n8L4N4p8rJ14p6m4O5k5n8M2K0m5J0N9o0KM4j3m0J9K5o6N5K7m7OO3
2662E0o0j0O8k7l2M1K5n9J2K1k3J5jm2LM1k9k9N1Jm2O2l0j8m1N8j4k2K8Qm8K2
2694b1mK4K9Np2K5L7j7l8M0K9p3QO3k0k9L5j6Rj1K7m3OJ4K%J9p3N8J7on6L0L1
$$ y = [-27, -24, 86, 57, -70, 16, 83, -64, -34, 97, 13, -44, 61, 34, -52, 54, 40, -54, 25, 20, -92, -18, 72, -34, -53, 56, 3, -83, 40, 49, -73, 2, 52, -85, -43, 60, -23, -48, 55, -11, -65, 64, 41, -80, 26, 64, -30, -46, 120, -6, -69, 53, 46, -74, 35, 88, -62, -9, 91, -3, -43, 55, -15, -32, 54, 15, -47, 62, 46, -85, -18, 103, -32, -76, 69, -2, -72, 53, 77, -70, -6, 40, -51, -8, 86, -26, -34, 45, 4, -56, 41, 57, -66, 14, 82, -71, -54, 91, 6, -45, 51, 8, -74, 15, 32, -31, 14, 42, -43, -25, 53, -33, -42, 20, 27, -91, 16, 28, -69, -11, 60, -53, -41, 44, -7, -57, 12, 52, -52, -7, 61, -25, 14, 63, 4, -22, 63, 1, -47, 41, 30, -28, 6, 60, -18, -27, 87, 11, -33, 32, 7, -51, -9, 11, -34, -24, 35, -25, -23, 21, 8, -32, -13, 12, -54, 1, 28, -19, -13, 50, -10, -20, 48, 21, -11, 30, 55, -4, 8, 29, 6, 21, 20, -22, -19, 22, -7, -36, 15, 16, -26, 36, 6, -12, -53, 5, -9, -31, -3, 5, -43, -21, -25, -1, 28, 33, -39, -14, 23, 6, -32, 8, 37, -36, -28, 35, 15, -14, 21, 5, 14, 3, 30, -13, -7, 7, 9, 9, 28, -45, 13, 30, 24, -32, -2, 29]
2728B9k0k5Qjj9N0k8k8K2K1l4J0j8L1qKj4jJ5k5K4K9J0n5M7%k1qL0%m2N0k1pl
2763@PJK2ok4j7K3ol9O0j4j6j7J0LoM7m5j9M2Ok6J7PnlNk0K7L6m3k5L5j6kM2%
2800D1n0QQqj0M1lj7QKl5PK3k8k8M7k1MJ6j0j8J7lLk5N5l4OJ3K2k7K5k2qj1K1
2836Ipj1M5n1M1kk6lK3k2J4m7M7lk7L3pj8OJ4j2Pj4K0j2j2J0kj7Rj5N2l0pJ5K3
2872B3J3l7J5rrnloQpJ1K4Ll0j7N9l7qJ7Rk2lJ1J0m1K8j7k2L1k3LKPj3J3kL1o
2910ALl2K5LLm1M5lm5L7J2Nn3N2l0K3J9l9L0qjj1PPn1N3J5k9k9J7Pm0L7kk4K7
2946a0K9l4Qmj2NM1l8oJ2Nl0O7j6prJ4j4LKj2pJ7Oj0j8N4n6L9rj1lK3j1l6L0K
2983Dm4M2J5m4JK6%m3L7k9L6J4k5K4k1pk9M2kNj5L9k8OL1j9kLmkj6K9k9oK5j0
$$ y = [29, 9, -16, -8, -9, -28, 22, -6, -34, -12, 9, -25, -15, -33, -2, -10, -8, -22, -23, -8, -33, -9, 20, 30, -25, 22, 22, 1, -7, 23, 23, -19, 31, 10, 3, 0, 7, 8, 30, 24, 0, -17, 6, 0, -39, 21, 7, -9, -26, -16, -13, -19, 28, -17, -36, 6, 12, -14, 3, 10, 5, 2, 7, -13, 14, 50, 7, -18, 17, 1, -1, 41, 41, -9, -1, 7, -1, -11, 30, 27, 10, 18, 20, -15, -8, 15, -13, -41, 6, -15, -11, 5, -5, -23, -6, -9, -6, -31, 24, -10, -4, 9, 31, 4, 29, 7, -1, -12, 9, 2, -9, 36, -15, 26, 24, -2, -5, 18, -4, 10, -37, 10, 7, -20, 13, 6, -12, -6, 8, -4, 3, -11, 9, -3, -15, -5, -7, -24, -15, -30, 22, -8, -15, 0, 23, 36, -1, 14, 5, -4, -9, -12, -18, -10, -17, -6, 18, 21, -9, -26, 33, -4, -12, 5, 14, -8, -11, 0, 10, -31, -3, -20, -42, -11, -34, -31, -29, -22, -35, -22, -24, 7, 1, 4, -28, -3, 0, 3, -38, 7, 4, -41, -4, 8, 13, -40, 12, -18, 5, 24, -15, 15, 7, 6, -5, 2, 9, -42, 11, 26, -3, -32, -15, -8, -48, -11, -13, -37, -10, 19, -15, -7, -11, -23, -18, 23, -15, -21, -9, -4, -34, 33, 17, 10, 1, 15, 1, 4, 6, -6, -13, 4, 10, 0, -18, 36, -20, 19, 10, -1, -4, 19, 8, -28, 2, 4, -40, 2, 17, -27, -26, 0, 0, -43, -6, -35, 1, 15, -10, 14, -7, -14, -43, -1, -3, 2, -13, 26, -2, 4, 35, 16, 14, 17, 13, 11, -5, 24, -5, -11, 14, 4]
3019DoJ4J1l7LM1mn6M5l7JJ1Pj6K6j4j2j3J9L0l4J8LJ1l2L4j8L6oj1k9O2k8l0
3053gM1%n7K0J6Rl5K2Jk1L1l9pL5m7J2QJ1j5RN8m2mJ8l4lNJ8MkJ3Nk6L6nl3K4
3090A9j3l4L0N1n2k1L6Kl7L3J9l0KM9n7nK5j2j3Qnj3N1k5l3K7J1m2K5J4Jm8K8
3123iM0o9lN9m3L3lJ9k3jJ1l6L8j7QjK9l7%M2l0l8N5l0lJ9J7m4PQj5J1Pm5K4K8
3159Hrl1K5N2p3K0M2l3k4O2k9k2M0Kl8K9Oj7%K2j9k1K8j6k2L3k9rL3j1l1L7mj5
3193a4MJ6J8o9J3J1Mj1L6l9oK4MNJ9k4%L5ql8J8M1l3oJNpJ8pk6K4Mk5K8Qo9M8
3230BK4n2K2J4nk1L2k9J1nJ4j0qOJ6j8jj3oJ2L1l1k2M2k6M3J9k8k8M2Lj5ROl2
3265bk3N4m0KK3qj9J7j7J1j5M6j3l2No%J7J5l3K0l1J7OJ0noJ2NJ1k3L8l2L3j0
$$ y = [4, -2, 12, 23, -14, -11, 30, 26, -30, 15, -22, -21, -10, -3, -19, 7, -7, -19, -32, -13, 17, -17, 1, 4, 15, -17, 17, -1, 35, 29, 18, -11, 51, 23, -7, 34, 34, -23, -3, 13, 22, -13, 9, 10, -11, 20, -19, -26, 9, -38, -26, -18, -7, -22, -13, 45, 3, -1, 17, -17, -20, -15, 3, 7, 5, 18, 23, -3, 33, 28, -5, 19, 6, -28, 2, 53, 1, -20, 16, 18, -19, 14, 33, 3, 5, 54, -3, -8, 17, 5, -8, 0, -5, -18, 33, 8, -25, 2, 13, -29, -4, 10, 11, -37, -9, 31, -38, -41, 18, -25, 8, 5, 24, 1, 0, 11, -25, 13, -4, 4, 3, 32, -5, -5, 37, 7, -31, 24, -6, -9, 10, 27, -17, -10, -2, -17, -6, 1, -44, -20, 8, -1, -32, -7, 45, -28, -8, 34, 1, -23, 39, 10, -12, 28, 30, -8, 21, 27, 10, 10, 32, 13, -8, 20, 4, -18, 15, -14, -23, 10, -1, -32, 5, 1, -14, -10, 6, 24, -45, -32, -21, -17, -28, 8, -31, -37, -13, -9, -4, 15, -9, -9, 26, 18, -20, -2, 39, 6, 0, 1, 6, -1, 17, 10, -16, 8, 12, -13, 15, 23, -46, 2, 26, -26, -4, 10, 5, -16, 16, -13, -2, -7, 7, -3, -11, -5, 11, -7, -8, -21, -27, -15, 16, -15, -37, 5, -21, 22, 41, 13, -15, 27, 30, 15, 24, 30, -2, -25, 29, -11, -9, 14, 6, -13, 4, -13, -2, -17, 29, 16, -16, -11, -17, -17, 0, 15, -18, 2, -29, -12, -6, 4, -1, -7, 5, 10, 21, -2, 36, 4, 37, 27]
3300B7k7%K1J0k9JJ5j4Pkj9KK7j8j3J8K0l0k1L9l4L2k0MrLlK6m0M2ok0K1k6J3
3335ckqPL1Kl0J2Rj9KJ9l0K5L0n5K0Ml9K4J3Jk5QJOm8K1K4pkJ0j4K6m5K8J3nj9
3373a5mK6mk9L0Ok9K4J8%kk1k4QL0l0L1K2k6PnJJl0L0K2o1N4k9LJ0k4j1nJ6k9
3409c9kM7rk8jL7l0jK1j8K0Nk2K9nK6k9jL7l5lj2J2KpQJ0o%%k2kQlkMJ1jj1kJ3
3450aQk8K1j2K0j6J4j2pJ9lKj9L2k1jJ4k7K0K1j2j2K5kk8L0j5Lj8QPj4RmQJ3r
3487A3l4K1J1j4l6N2Mm5K1Qj1J1Nj6qK5k9J7J2oNk8K7rKJ7l8K7M2l4OqQk0L9K
3523C9m8k3N4n3J3M6l0k0PJ2j4JNm6L5K6k6kJ1Rk0J8jj1OK9j8J3Qk2O1m5onL2
3558C5k9j0J7jnJ7J1k0m0K2K3j4J0pm4RK4j2MK3qj7K0j9J6kRk6K1J7l0%M1j2%
$$ y = [27, 0, 0, 21, 31, 2, 3, 18, 4, 11, 9, -10, -8, 19, 1, -12, 6, 26, -4, -25, 14, -20, 12, -8, -4, -13, -10, -13, 13, -27, 15, 9, -11, 10, -16, -3, -5, -13, -6, 25, 27, -3, 9, 18, -1, 1, 20, -10, 15, 45, -10, 10, 14, -25, -1, 12, 13, -12, -4, -3, 3, -45, -24, 0, -7, -9, 1, -13, 13, -32, -4, 9, 4, -15, -19, 7, 3, -26, 4, 10, -19, 5, 23, 23, 21, 0, -24, -16, 14, -16, 15, 37, 11, 18, 13, 14, 15, -15, 15, 37, -24, 30, 1, 4, 14, -10, -21, -26, -10, -39, -41, 6, -3, -31, -32, 5, -25, -26, -5, -23, -3, 2, -20, 9, 4, 30, 1, 0, 37, 2, -1, -13, -1, 1, -6, 2, 12, 6, 6, 6, -16, -18, -10, -13, -15, -11, 0, -1, -12, -14, -1, 7, -21, 0, -12, 8, -8, 6, -6, -13, 6, 3, 5, -14, 18, -3, -4, 10, -17, 3, 24, 12, 0, 25, 23, -5, 25, 10, 13, -5, 3, 10, -4, 5, 1, 9, 22, 13, -21, 0, 11, -3, -39, 13, 17, -28, -7, 1, -10, 1, 6, -10, -18, 7, -22, -5, 7, 1, 6, -22, 5, -4, -2, 15, -23, 4, 46, 12, 18, 10, 18, -2, 37, 39, -9, -32, 22, -31, -18, 28, -2, -22, -15, -3, -17, -16, -11, -57, -22, 4, -22, -24, -13, -4, -24, -6, -7, -18, -12, 17, -1, 12, 20, -2, 59, 14, 8, 3, 35, 6, -4, 13, 12, 7, 24, 35, 15, -25, -3, 20, 6, 16, 9, -35, -26, -2, -14, -10, 13, 5, -12, 8, -11, 5, 3, 12, -14, 7, 24, -6, -6, 35, 23, 23]
3593B3J0j9nJ3pl1J5L1l7K4J2k7j9M6l9NK8j6J0k0Klj1JRl9L2K4m2L6l5j1K5K8
3627A3j4k5L9k6mL4rJJ7j1j8j4L1rJ6Jj5k0L1Qj8K3pn3N5j0j4pK2j0kj2rj0J8
3662hJ5m4O1l6j9K7j9MLL3J2k6PPrl0K4Lk5K8nrMRJ%J3j6lKPrlK3l3jjK2l1N6
3702C4o2J6lK6k3j8L9l7M3l2K0Lnj1J6rJ5j2J8j1pOJQj5J4j9J4j3MrK0j3LRj4
3738dpJ3LKnk3%JJ4Nj1k8M0J6j8jJ7j7K0jl4j1J0M8l2PJ9nOkj2jNOj2m%K1j3m
3778Hkj6K6l1J2J1j7mK1j4k8L9j7j0mL5j3J2rj2J9JkqR%k9L0J8k0J8jl7K4L2l9
3814BJ4kLmk6J6JJ6k1MkLj5k0L1k3J8j6J1kJ9l2J9Rj8K5k3L4mNorOJ4m9M6k0m
3852@mKOL2m1L6l3L1m5J8k2N4p4M8Jk2K2j2j1QKj1rK7k1%J6j9J4mj3K0joJ0Po
$$ y = [23, 33, 14, 9, 22, 15, -16, -1, 30, -7, 17, 29, 2, -17, 29, -10, -5, 23, 7, 17, -3, -1, -4, -15, -14, -5, -44, -12, 12, -30, 6, -29, -40, -15, 13, -1, -26, 13, -13, -17, 17, 8, 9, 26, 15, -3, -17, 14, 5, 21, 22, 7, -13, 18, 26, 8, 31, 24, -29, 26, 16, 2, -5, 17, 7, 5, -7, -16, -26, -8, 7, -37, 24, -12, -31, -4, -23, -19, -16, 17, 29, 3, 10, 17, 8, -22, 2, 5, -20, 8, 3, -6, -2, 7, 8, 8, 21, 5, 2, 4, 11, 2, -1, 22, -11, -12, -13, 9, -22, 34, -28, -12, -15, 11, -12, -30, 9, -28, 15, -17, 3, 6, 1, -10, 6, -3, 12, 0, 18, 7, 0, 6, 7, 15, 0, 14, -5, 9, -4, 0, -9, 11, -2, 1, 10, -4, -11, 2, 5, 7, 2, -21, -21, -20, -6, -1, -12, -40, 0, 16, -2, -3, 14, -3, 17, 16, -18, -29, -19, 29, -3, 4, 23, 18, 24, 22, 10, 9, 14, 20, 8, 4, 4, 25, 12, 8, 6, -10, 16, -15, -3, 8, -9, -13, 8, -6, -34, 5, -12, -22, -26, 9, -4, 8, -1, -13, 6, 7, 5, -3, 6, 6, -23, 7, 25, 5, 23, 22, -15, 9, 41, 2, 16, 14, 17, 13, -13, 3, 4, 20, -1, 3, 1, 4, -11, -31, 0, -23, -5, -21, -10, -12, 7, -25, -6, 3, -15, 10, -13, 21, 17, 22, 16, 7, 13, 27, -22, 24, 4, 0, -4, -2, 4, 36, -5, 31, -2, 29, -16, 2, -20, 34, -40, 8, 9, -13, 9, -3, -14, -6, -4, -15, -24, 3, -18, -18, -2, -21, -7, -11, -24, -4, -5, -11, -1, 6, 0]
3889@nj4J9J7J4k4J8nkKklloLpj8J8oL1j3l4J6Nl0K9k0J8Rj0k8K7pJ5j0Qk6J1
3927a3K5j6J9j9J3k6J3J6k3K6l0J4J1K1l5jK6ll1LK1j8j1N%J3J7m1J6J2Jnj9J9
3961@j1NJ9k0k8M0lMPjMPj5k0J0MP%NQj4J2Kk3J0Ml4KK2K2j9lj5K5j2K7l4KJ1
4000GrJl1L1kJ5m4OK3OL7o9K3J3qQNrNnK2k3J9j8j0L2l3K3nJ5pj2Ok9J1L3n5L1
4038Cj3J2k1L3j8l1L9mJ0l2L2j3k1RKRqK0j0L3l3J7QMm2J4%J7k2J7j4k0K0J9Q
4073B4Oj2k2Mk7M4j3j2J5l2L9ooLlj7K1kk1M5m5J0rK3j6%j7K8J4k1L6j0l4J7K2
4108B6m7L6j3j9M0k0lJ4loQk9%lK1ol0O2mn1QRJ5mj5Nj6J2NnPnJ8QrJj4J5JJ2
4148B1l7L5n0P0l7Oj4J4j8M1m2L6k3Qn3R0ko0l1k7O8PQ1l1m9K3kj09NJ6j46J57
$$ y = [0, -5, -19, 0, 17, 31, 7, 25, 20, 18, 20, 18, 15, 12, 6, 9, 2, -16, 2, -4, 27, 14, -20, -4, 1, -29, 0, -20, -2, 7, -3, -31, -4, -11, 4, -6, 2, -24, -13, 12, -4, 15, -4, 9, -17, -4, 12, -11, 15, -15, -1, 10, 31, -4, -5, 21, 18, -13, -10, 11, -7, -18, -13, -13, 0, 17, -24, -8, 4, 5, 0, -19, 0, -11, -6, 13, -7, -35, 5, 2, 6, 13, 12, 16, 23, 8, -12, -2, 2, 9, 9, 14, 22, 8, 20, 22, -1, 9, 13, -21, -19, 3, 25, 6, 3, -12, 13, 1, 28, -6, -4, 7, -2, -1, -32, -1, -3, 12, -32, -26, -3, 3, 40, -29, -6, 7, -1, 7, 12, 3, 8, 3, 25, 2, 21, 3, -7, 25, -8, 15, 10, 25, 18, 6, 12, -17, -6, 27, -28, 3, -10, 2, -19, 14, -4, -35, 4, 0, 10, -22, 10, -3, -24, -15, -13, -4, -12, 8, -2, 31, -2, 15, 23, 27, -15, -1, -1, 16, -6, 11, -3, -23, -3, 16, 24, 30, 18, -4, 0, -27, 17, 4, -8, 7, -25, 14, 8, 2, 5, 2, -15, 6, 4, -17, 28, -17, -7, -16, 7, -9, -9, -26, 2, 16, -5, 31, 21, -13, 4, 26, -21, 15, 2, -17, 23, 3, 0, 14, 11, 5, 13, -16, -16, -19, 2, -4, -34, 28, 24, -27, -19, -10, 5, 1, -14, -9, -25, -13, -8, -13, -6, -11, 7, 15, 6, 7, -7, 8, 9, 21, -16, 19, -31, 39, 2, 8, -6, 8, -10, 31, -11, 25, 2, 10, -43, 47, 45, -15, -46, -73, -5, 2, 83, 52, 3, 26, 24, -85, -80, -64, -210, -53]
4180e3M0l5LM1j24J45J4K7r8J03O8j57P7q5J5JO3k5k0O7p6J3k2K8j5L9j8j3k5
4209b2ML6k5k0RmK6k0J7k7Q7m9l5JnL0J9J4j8n8Q1OLo9L9K1n0K2K3J6q1N1k2L0
4243C0k7kN4o5J8Mk5NK8Kj5l0j5K5MK4k8J2j2K4L3o2LqK8J8k4J0m1O4j6MJ8p2
4277c4J9J1J2jJ4K9m8Pk9j4M8oJ7L4n9J5j0p3M0K5jm1M6J0j5k2j4L4M2qk1p2M7
4310a8L4Qn1RN1l4L4M7o0m0J6K5J3m5k0j1k9N8O0n4l9J1NJ3k8j4P9Jr2P6Qp%k
4344DJ9n2k7P0L4k4q6N8Q0j32P7M4r3o8Q3R3o3K7j5j58J54j4j3R1n2l6O7l0n3
4373a5K3J4k1mM8j50J41M0l8p0Q5j52J36j5n1L2oKom1N6L9k4K8j5k2K3j55Q2R0
4403E4q1O7j1k5j29R9l5J84j86R6m2J8O8l3k7m1K8Rl7K0p4L2N3j9m8Q3rk9N1q8
$$ y = [-53, -13, -48, -45, -4, -128, 17, 31, 58, -40, 63, 131, -26, 51, -34, -19, -18, 45, 20, 0, 67, -9, 4, -18, 10, -5, 34, 16, 3, -22, -18, 18, -7, -27, -18, -22, 4, -16, 1, -26, 61, 12, -23, -22, -27, 3, 22, 36, 18, -40, 41, 47, 50, -19, 20, 41, -9, 13, 36, 52, -29, 22, 0, 30, 3, 1, 55, -10, 8, 12, -13, -8, 20, 22, 7, -23, -38, -13, -9, 15, -13, -1, -13, 11, 44, -18, -15, -23, 5, 23, -1, 9, -32, 32, 16, 20, 38, -34, -15, -4, 8, 7, 21, 50, 2, 9, -20, -34, 14, 8, 25, 59, 0, 15, 5, -68, -28, -3, -4, -45, 1, 11, -4, -26, -40, -6, 36, 28, 7, -65, -18, 16, 24, -27, -18, 33, -1, 33, 80, 20, -20, -4, 21, 34, -11, -31, -42, -71, -13, 47, -7, -46, -35, -30, -17, -45, -59, 20, 21, -71, 5, 13, 6, 6, 4, 23, -29, -56, 14, 48, 24, -62, -4, 76, -56, 21, 65, -28, -96, -13, 80, 17, 44, 29, -129, 25, 11, -2, 89, 37, 1, 68, 38, -15, 8, 22, 1, -3, 45, -105, 36, 76, 38, -32, 53, -99, 37, 22, -29, 3, -3, -1, -7, -48, 8, 47, 23, 51, 36, 14, 37, -118, -36, 54, -27, 40, 29, 4, -125, -26, -61, 123, -63, 33, -9, 9, 77, 44, 17, -24, 4, 13, -24, -4, -78, -46, 7, -12, -60, 23, 14, -15, 36, -52]
4433e2N3k1j9L4l4K2N2m5k6J61j07op2R4L5Rj09j3RQ9o2o8n5O8J87n7j40Q6lM3
4463E3k8l5M6j16P6J08n7m0jqQ4q7q8N1kL3n4O0Q3n9RK6Mn1p5J16J2n1L9k1M3
4494G0j25N4j1N4k5j8J1NOk6l2O0O2KN4j83K7R1j35L0N4r7J81j17K8j28J38j48
4522a18J31Q0j27J34j23m0R5J18j29n2M6L2pq4Q4r9J31j24P0r3J68j94J08K4K2
4547E3k2M8j37M3p9J17K3j30J51n1mQ4j82J45j6qJ67j31j24R8O8j26K91k83J40
4572A35j89P3m4k5N7j12R0M7m2k8J8m8K5J29j53P1J54l13P0N4l5%O5l3J4O5m1
4599DN1q0Q7K5j48J49O5k01O1J75m47K36J06m2k7K86k68L4k3j11K12j1n1m3k28
4624a89P8J87j42J21P3k13J07r9J24o3j6n4L3J04k07J54N5J9k09J66n2N2Q8j9
$$ y = [-52, 1, -20, -39, -5, -39, -17, 35, -10, -36, 125, 18, 12, -60, 34, 69, 78, -31, -44, -35, 54, -8, -76, -131, -63, 124, 67, -73, 13, 10, 53, 25, -10, 36, -80, -4, 104, 47, 7, 6, -2, 82, -5, -93, -42, -44, -11, -65, -5, 78, 19, 28, 54, 58, 7, -68, 48, 60, 9, 48, 27, 70, -55, -1, -12, 42, 17, -1, 10, 15, 21, -5, -37, 23, 85, 87, 141, -42, -15, 76, -59, -29, 25, -72, 109, -8, 20, -108, 30, -118, 13, 93, -34, 100, -23, -63, 32, 150, 21, -31, 15, 47, 40, -44, 40, -59, 72, -52, 18, -75, 93, -101, 7, 31, 53, 31, 79, -58, -15, -94, 23, 46, -84, 67, 16, 12, 96, -86, 59, 43, 35, 202, 71, -53, 45, 113, -13, 278, -5, 135, -54, 19, -25, -50, 7, -105, -15, 32, -10, -38, -20, -68, -43, 86, -67, 4, 158, -155, -85, -31, -66, -66, -1, -34, -20, 45, 4, 55, -25, 62, 87, -61, 88, 153, -48, 13, 188, -259, -23, 83, 41, 14, 300, 32, 66, 43, -68, 144, 133, 82, 39, -189, -111, 76, -66, 55, 128, -85, 22, -77, 47, -16, -32, -86, -53, 51, -156, -2, 53, 72, -137, 29, -23, 29, 117, 98]
4648I8K3k36K52k52J89m5n2p0K57j79j3m9K17j28j31J06J38k09J60J7j82Qj4l2
4672a27J49K03k12j3J0j7Q8J09j59j19K1J4k6J38j14j11K27j74K22j69J36r2m8
4695f4J35Kj18P3q3O4L7m4o0J0K37j35O8n4j81O5O8j21O5Q2l9K7m4l8k0J23j21
4722f6J43k8r4p1J8L4N2q6R7J29m2j11M4J00m5l4J37j01j02J09n4K0p3l3J40j39
4748e6m9J11N9N1m3r5J97K0j98k2RL8o2pkO7j09R5L3N9Oj12OL3n3P0j47J28N7
4777H4l9MN4j2o2K4o5l5M2N5l3m8L5M3j82J55J3lj17J68r9O0K7j10P4Ol9r2J00
4806HR3r5R4m4l8j9l4N9Kq0O8j14P9O8m1LK1l6Q9n7LJ9l3j04M9O8L9j3Pj12j3
4837f4J5l5M5J15l5n3%k1L6o9J51j93P1k0M5P1r6r2J06oK1K9p3L9L1K0l9pk2l6
$$ y = [98, 121, -115, 137, -115, 74, 29, -23, -93, 164, -15, -28, -77, 140, 12, -119, -13, 125, -84, 76, 93, -89, -81, -95, -127, 22, 225, 13, 0, 10, -7, 81, 190, 31, -88, -67, -53, -79, 59, -55, -166, 61, -113, 109, -60, 76, -16, -64, 71, 73, -45, 28, -55, 9, 46, 2, -58, -48, 189, 54, 122, 68, -113, -48, 20, -101, -36, 46, 7, 34, -10, -48, -68, 55, -66, 77, 49, -45, -116, -98, -64, -12, -98, -1, 128, 86, -25, 19, 119, 74, 40, 177, 76, -26, 83, 29, 49, -24, -57, 83, -56, -105, 6, 65, 116, 73, -22, 175, 195, -3, -25, -16, 22, -40, -47, -49, 18, -91, 4, 37, 96, 102, -10, -4, 29, -24, 46, -101, 27, 84, 45, 49, 103, 91, 29, 53, -12, -47, -5, 50, 17, -31, 4, 47, -135, 20, 33, 30, -87, 81, -18, 42, 69, -41, 33, 39, 0, -92, 8, 101, 6, 100, 56, 18, -1, -35, 24, 26, -54, 14, -100, -21, 47, 6, 9, 30, -6, 83, 26, 29, 48, 15, -89, -40, 28, 67, 54, 61, -51, -64, -49, -84, -39, 76, 41, -12, -12, -33, 3, -66, 85, -108, -37, -57, -12, 59, -37, -129, -23, -29, -8, 21, -52, -13, 18, 38, -1, -8, -30, -66]
4867f6M1J8O0j52J89j50RO6l0k0J6P5n6k2l3J28j68Q0J06o6n8N7k5OL9Nk1q9L2
4896b9o9J27l2jM2j0rk2k8K9Mj8J7N1k9n0K7J9k9j3j2M6m2O3m6J1j7J23r8rK5
4927B1k4QmJ8o2Q1m1N6o0k1P8l9j0L4o1L4Qj0k1L7j0k8M2j5j1K5j1m5K1Q3m7p1
4959d5P7ll1J0kj2k5M4Pk1jl2M4k3J8k1J3k1K2JJ8l1J3kPNk4J5K6ml2j0L4j2J1
4994A3J0j1l4K4Ok9M5n5L1l1J0Roj9K3J7j5j9J1J9j1J8J2l0jnmMJ2K4Qo5O0m2
5028b1L0k9qK5J8Ok4%J3J2k1L1J4l7qJ5o%kOl8L0J4l6Pl4M9Mk8j7M0J3k6j1K0
5063AK3l9N8m6k2J9L2j9K0J8l3j9J0J3j7K9rJj9J5L0k4KJ2k6J3KQLjk3J9j4k7
5097a0M0k6j0nK9j6J7J5j9Mk3m4O4lKJ7l8l4O6o2K5j4N2j9j1j5J2j8L1L3o8L1
$$ y = [-66, -25, -7, 53, -99, 90, -60, -51, 15, -15, -35, -19, 56, 0, -22, -55, 73, -95, -15, 91, 25, -33, 24, -1, 5, 44, 49, 28, -61, -29, -98, 29, -3, -4, 38, 28, 19, -3, -31, -2, 2, -16, 1, 52, 23, -27, 0, 19, -10, -23, -35, 11, -31, 32, -14, -3, -20, 103, 5, -4, 21, -3, 5, 1, 19, -43, 38, -3, 53, -7, -28, 50, 11, 1, 35, -26, 8, 16, 6, -15, 22, 12, -16, 26, 11, 0, 25, 14, -31, -10, 73, 26, -45, 32, 29, -2, 8, 6, -6, -31, 13, 20, -1, -2, -34, 10, -13, 5, -16, -3, -24, -2, -1, 17, -14, -1, -3, 4, 9, -15, 0, 26, 22, -10, -20, 14, 2, 13, 23, 12, -22, 2, 8, -21, 24, -31, 0, -31, -21, -12, -18, -37, -14, 3, -12, -31, -20, -1, -12, 6, 18, -12, -13, -18, -22, -18, -6, 18, 26, -39, 21, -21, 9, -20, -28, -3, 15, 21, -3, -3, 10, 22, 1, 32, 46, 9, 1, 16, 10, 10, 8, 14, -24, 6, 20, -16, -9, -43, 6, 10, -18, -35, 5, 18, -8, -19, 1, 24, -15, 43, -3, -25, -6, 26, 7, 27, 45, 12, -7, 3, 16, -1, 28, 19, 20, 1, 16, 46, 22, 24, 36, 10, 23, 25, 33, 36, 35, 12, 31, 17, -10, 30, 4, -6, -11, 18, 2, 19, 34, 15, 19, -4, -48, 16, 13, 15, 32, -6, -40, 26, -36, -11, -25, 27, 8, -3, -18, -6, -24, 7, 40, -28, 3]
5129CK0m5L6o8J14p9N2m9O7J4j14L4k0Q7K%l1k9k3l2K8L5j7K7pK4n5N9L2l2o1
5160b8P6m3M3l8M5l7Nl6J2NmJ3k3j0Mnl4N3k5L9k2NqK5lj7l3N9m1K3j3J5j3j1
5194b2L5l6M2Kl9J9Rj9LL0l4j2L4J3qnJ3%k7Mj1Qk1M4k0qJrJ1j8J4j9ROJ8pj2
5231a2Oj2J5j7L3j6OJ3OlJ8mj9Kj2J3l0OK2l0RJ8oLjm2L6Jk1%K8k6%RnJJ0j5N
5270a1Pj5N7l0j9J8mMrJ8j1QkPj0nQJ4k0K0j6J1m5K3j4K4Rj5qJ8l2j0M3k7K4J0
5306B0k4Qj0J7j7j8L1j3J6Jj8jPk4J0L4j9JkJ5kJ0k0J3lj6K8n0M0Rpmk1j5M9l5
5342a0Pj0J4k6J3OJ2k4lJ5j2ORpJ0mj5mK7kNK9k4k4M7k2l5K2J8J3k5LJ0j5J6j0
5378A0j2K4k8kRQLk5J1j9K1l1K2L4k6k5PONlLRnonK0k9L3l1J1M2l7jK3kj0J1j5
$$ y = [3, 23, -22, 14, -54, 60, -19, 33, -16, 51, 65, -49, -15, -35, 52, 54, 54, 23, -6, -29, -61, -33, 2, -15, 12, 5, 29, -26, 33, 65, 33, -28, 48, 5, 48, 10, 55, 18, 23, -13, -1, 4, 0, 13, -10, -20, -16, -21, -55, -2, -27, 12, -10, -5, -13, 12, 9, -8, -41, 18, -23, 0, -13, 2, -11, -22, 13, -23, 19, 21, -18, 1, 10, -9, -6, 24, -10, -22, 12, 25, 17, 12, 25, 25, -2, 2, -9, -1, -22, 22, 2, -6, -5, -14, -3, -21, -7, -26, -17, -11, 7, 0, -12, -6, -18, -3, -20, 13, -3, 3, 16, 22, 19, 37, 33, 14, 16, 4, 17, -13, -7, 15, -15, -6, 12, 6, 9, 8, -34, 2, 3, -18, -18, 10, -16, -16, -7, -12, -11, -1, -16, -11, -4, -19, 38, 8, -11, 7, 3, 7, -2, 16, 5, 13, 11, 18, 8, 3, 11, 25, 5, 25, 9, 20, -25, -2, -16, 8, 17, 2, -6, 12, -20, -30, 13, -14, 10, 20, -4, 4, -6, 11, -6, -24, 7, -6, 10, 11, -7, -8, -1, -25, -15, 19, 0, 1, -1, 14, 12, 22, 2, 15, 12, -4, 24, -26, 14, 23, 16, 12, -9, -24, 25, -10, -3, -13, 1, -25, -12, -6, 6, -18, -21, -6, -18, -12, -3, -10, 0, -4, -19, -23, 4, 2, 7, 36, 12, -12, 35, 13, -22, 0, 18, 31, 6, 9, 19, 4, 20, 10, -2, 22, -6, -8, 1, 9, 12, -13, -2, -21, 0, -31, -9, 25, -1, -26, -19, -13, -8, -11, -8, 1, -4, -10, -15, 5, -24, 9, -22, -11, 31, -6, -7, 16, 14, 4, 15, 0]
5416@K4k0j3K5k0j1J2MJ4j3j7lOj0K5qj8%nK5j6J9Pj4%jj0J3j1K3mj0J8j9Rj9
5452a8J0j0J9J1j1Mj3J9pJ2J5n2NK9j4mk0K6k6K6Nj3qPl9L9ml2K7kK1nj3K4k1
5487a3qM0j7Mk7L9rMj7K1mJ2rkJ0j2J0l4J4nJ0J3m8K6J8k4k1M1l1J4K4m4J7j2
5521b0J1lJ8j2j7QLjlJ5j7K8k6J3oOMJ6k1j7JL3rK6l1Pj1J6j1J2j0Pj3K2j1nj0
5558hk1K4j9K1Nj1lJ3j5J8o4N7MKj2k8PL0J8k3J0J5qMjl5M5l5M5l5qORj1J0K7
5594C3ol3ROj4jPj6jqJ0kRJ8j1k0MJ8j0kJ8k2QKJ5%pK9j7jk8J7NJ4k4QlOk2J2
5634@j7QMKJ0j8mJ9Jj8L6k3l2K3oNlK5j8Nj5NK8K5m7j6K1j1K9j1j5K8Mj8J5j8
5670CqNlQJ5j6oNrmJ3lJ7n3OL2j6Pk2L0l3J4J1JOnK9k4J1MKk4kQJ2j0%KJ0%k4
$$ y = [0, 24, 4, -9, 16, -4, -15, -3, 1, 15, 2, -15, -18, -12, -22, 3, -5, -23, -23, -28, -3, -19, 0, 7, -7, -7, -8, -18, -5, -16, 7, 3, -7, 11, -8, 1, -18, -8, -18, 1, 12, 1, 5, -8, 11, 4, 16, 31, -21, -16, 13, -1, -5, -25, 1, -25, 1, 6, -7, -15, -8, -47, -8, -12, -44, -17, -19, 2, -3, -16, 8, -13, -21, 19, 2, 6, -21, 18, 9, 13, -4, 17, 13, 25, 16, 14, 24, 12, 22, -12, 2, -3, 7, 20, -28, -2, 16, -8, -29, 12, -19, -5, 19, -25, -8, -20, -9, -12, 6, -6, -23, -15, -12, -13, -16, -1, -18, 10, -16, -3, -9, -3, 1, 17, -4, -21, -20, 13, 4, 30, -1, 6, -5, 11, 0, 12, 2, 9, -4, 18, 7, 2, -8, -29, -5, -24, -3, 2, -9, -12, 1, -14, 4, -60, -3, 1, 3, -9, -37, -30, 0, 18, -5, 5, 20, 12, 16, 15, -20, 25, -10, 35, 0, -8, -2, 7, -4, 6, 33, 27, -6, 3, 9, -5, -6, 1, -15, -16, -24, -14, -16, -7, 11, 0, -20, -16, 2, -8, -10, 8, -14, -6, -4, 11, 11, 4, 33, 16, 15, -13, 4, 9, 23, -1, 7, 4, 10, -12, 0, -17, -9, -5, -3, 7, -11, -15, 4, 5, -13, 23, 0, -32, -9, -15, -10, -13, 12, -6, -1, -16, -11, 17, 42, -5, -21, 0, -11, 18, 7, -8, 20, 24, 6, 21, 3, -5, 0, -3, 5, 20, 4, -2, 3, -6, -10, 3, 0, 17, -36, -30, 2, -14, -7, -29, 1, -32, -18, -7, -6, 0, -5, 24, 0, 11, 15, 17, -7, -9, -1, 11, 1, 1, 3, 13, 13, -11]
5711a1K7j2j9L2Kk0Mk2J6nNknJ6j4K4l8J4Q%k1RjLJ2J4n4K1K0l0PN6m0JJ8l7J2
5748a0J0K6j6Pl5L1%j3%J5j9L3nrk9L2ok1l3K7kJ3Lk6K5J1k0kJ6j2OJ4kk7lK0
5784aq%K1l0L7j3k5J4j7J1K9j8K5Ok7Ooqk5O0j7oJk0lpK5j0rmJ0k1J7J2j5K0r
5821e%JpLj7L2j1J8jl0K2J1qqK8l1L4rk6J3j5J2j2J4j1Ok4J4OOj6J2j9pM8n1J0
5858a8K0j5k1j0M1k1J3j1J7oJ9k0nK0qJ3J5l9L4kMqJ8k7OJ4j6k5OML0qKnj8J2
5894EJnk1M8n1L4l1oL8l1NJ0j3K9j1j3J2Jk6L7nk6J3j7L6mj4J1mJ3jj0JQJ4k7
5930@j1J5pJ1j9JkK3l8RkPJ6k4%RJ5m3K4J1j1JJ4JlJ4nJ3rMrJ0jK7n6L3k9J9k5
5969a7M4j4k3J7pRk3L3pj4j1j5OJ1kLk5K5QJ6rmjj1kJ8j1PlJ6k5K2k4J9QkJ0k6
$$ y = [-11, 16, 4, -15, 17, 19, -1, 3, -19, -3, -8, -3, -5, -10, 6, -8, 16, -22, -8, 0, 0, -21, -12, -13, -10, 2, 16, -38, -17, 3, -27, -20, 36, -4, -3, 15, -22, -10, 0, 26, 10, 17, -18, 13, 13, 0, 0, 15, -4, 29, 24, 15, -14, 18, 12, -9, -42, -15, -17, -4, -1, -27, -2, 9, -11, -13, 3, -9, -3, 11, 9, -18, -21, -1, -9, -9, 12, -18, 19, 6, -19, -5, -22, -11, 18, 0, 25, 31, 4, 10, 4, -4, -29, 31, 14, 8, 9, -11, -14, -21, 4, -6, -15, -19, -9, -30, -13, -1, -16, 4, -5, -5, -4, -11, -8, -25, 7, -4, 14, 13, -17, 5, 16, 8, 0, 28, -3, 31, 22, -4, 9, -6, 6, -6, 8, -3, 3, -21, -7, -1, 5, -11, 1, -18, -25, 23, -28, -18, 2, -13, -34, -44, -3, -24, -11, -22, -5, -11, 8, -12, -17, 3, -5, 8, 23, -16, 18, 16, 20, 12, 30, 3, 9, 23, 7, -18, -12, -8, 22, 14, 16, 11, -7, 5, 6, 1, -20, 28, -23, 11, -20, -26, 12, -19, -14, -4, -17, 12, 1, -12, 0, 1, -25, 12, 7, -19, -6, -23, 13, 9, -5, 6, 2, 15, 14, 4, 5, 13, 27, 0, -11, 4, -3, 8, -11, -10, -12, 11, -27, -18, -20, -13, 3, -21, -21, -12, 3, -40, -16, -5, -16, -15, -1, 0, -3, 11, 6, 19, 10, 14, 5, 15, 14, 41, -15, 18, -11, 8, -17, 27, 13, -10, 7, 0, 9, -14, 19, 12, -2, -13, -28, -22, -11, -13, -10, -35, -10, -2, 14, 5, 1, 0, -11, -13, 5, -6, 1, -2, 14, -11, 11, -13, 6, 14, 12, 22, -4]
6007dJ0Jj2K7%l4J2J6k1NJ2oK5l2k4K3j5kMLlooOML3m7j4K3J7NOj6O%jQj4OkK0
6048A3Rrl0J7kQjjj6j1K3j0J7j8K0l7PK5Pok5K0Qj3rPj9K4J2l1J3J4j4J7nl4L8
6085Hj3MJ3JJ0k0ql0J8J1RkRk4J6J2qKj1Rj9J6p%Qj4K0k1Jj0L1J8m3OKKK0j2j1
6124gK0j8NKK4rk2K3j3J3j2J3pqJ3kj7Ok5J7k0L3J2j7J9m2JJ4Jj4j8L5jj9MK1
6160Ej3pJ9lj1RJ6j1OJ0Lmj8oL9lp0O9n2K5pK6j1l5L1j5J3k1J3J6j6j6kK3j1Q
6196ak4L2k6K7plqJ5j4rK3jKK5j0Jj7J5j1k0j3K1P%K0l0LJ3Mj9J8mNl6%M0l0k4
6234c6L4kJ3k1j7J2OJ1l0LL2njk2lJ8k1NL6pK8pj8lj8kK8K4m2Rj8K6k1nL3m1M0
6271A8l0J7k7J6J8qJmqrM%J1lK3j6j1j5J6k0KL0j0RlKPRj1J7mkLnj0l7N2j4pn
$$ y = [-4, 6, 7, -5, 22, 22, -12, 0, 16, -5, 0, 12, 6, 31, -1, -25, -2, -17, -19, -15, -12, -15, -21, -27, -21, -17, 16, -31, -45, -22, -5, 0, 6, -10, -4, -4, -5, 3, -11, -5, -7, 13, 22, 13, -17, 0, -2, 6, 5, 4, -12, -23, 0, -10, 7, -11, 9, -28, -21, 4, 11, 5, -20, 0, 8, -5, -14, -7, -26, -2, 10, -21, -8, 6, -8, 9, 4, -30, 8, -5, -1, 12, 13, 23, 3, -5, -35, -17, -6, 3, 1, 10, -14, 2, 14, 6, 8, -3, 6, -13, 3, -4, -4, 4, -10, 10, -11, -10, -20, 11, 29, -14, -8, -6, -4, 16, 4, -7, 13, -5, 0, 2, 26, 17, -5, 18, 5, 18, 6, 19, 12, 4, 17, 15, -2, 4, -21, -4, -24, 9, 21, 4, 23, -19, -18, -4, -3, -17, -35, 0, -1, -20, -16, 5, -8, -15, 4, 1, -10, -1, 15, 4, 10, 20, 23, 19, 1, -5, 34, 31, -39, 30, -22, 3, -4, 22, 11, -24, 7, -8, 5, -16, -3, 13, -3, -19, -21, 2, -9, -1, -25, 7, -19, 8, 1, -2, -10, 5, -9, -18, 5, 4, 6, 31, 21, 22, 5, 20, 9, -11, -24, -3, 4, 4, 24, -6, -3, 10, 14, -5, 13, 9, 14, -22, -22, 18, -12, -36, -2, -4, 9, -12, -29, -17, -11, 0, -30, -27, 5, 0, -1, -23, -26, -8, -29, -24, 12, 5, 33, 26, 8, 5, -13, -15, 13, 37, -5, 4, -14, 12, -9, -14, 19, -22, 18, -12, 5, -22, -6, 12, 4, 5, 1, -7, -16, -12, -12, -1, -4, 19, 3, -8, -23, -7, -27, -25, 5, -5, 4, 1, 3, 10, 19, 8, 25, 21, 19, 22, 17, 7, -30, 22, 8, 1, -4]
6311dLRk2K5kk1lQ%k1mM2j4j8M5k8NK6k6k5mLL5j0oJ2NkQK2l0J6J2k5%J2l0lJ5
6350ERj2K5Rk0qqlPQl3J4j3OJ5kj6Lm7N7l2K9J3nOn1M2MpQj9QJ2j7J0J6j3J7o
6389A1ok2L5k5K1k6OoK7k5j3N2n6J2NJ9m1NM3l7NJ8Oj0k0K8Kj1K1j6k2J4L2k4
6423BpKrK3mk1J8Omj9K0j1QJJ2m8L9Kk5j3J2qJ4l2K8pk1J2K8j4K3j1j0J2qJ1P
6460Hj6K6k1MQk6K7K1j2k9K6J7k5j8J1kjJ0qRk8J7K0pk7NnK6rk3J9j5K8k3K%J5
6497Dk0PK9k8Nkk6RO1k9Mj1j3J8pOjj1J4J7k7rKL0m6M4l0k1M7m9L0mLK3l7rqK6
6535iKk5K7j2J2Oj3J2j3K6JJJ0j8NKmj2K2k9M4k1j4%J0MK2k9j0rj2K9Mj9qNOj0
6573a7Rpk0M0roJ6j6K4l5M8m3PPQk6K1K3k9kqPJ8Qk9K1k3J2KkqJ8mJl8L3K3k4
$$ y = [-4, -1, 8, -14, 11, 9, -12, -15, -7, -7, -28, -32, 10, -4, -22, 23, -5, 0, 26, 0, -25, -29, -26, 9, -1, -7, 5, 10, 8, 16, 38, 8, 24, 36, 11, 11, 23, -7, -10, 5, 14, 2, 27, 36, 16, 8, 0, -3, 4, 12, -21, -7, -20, -14, 1, -1, -17, -14, -61, -4, -36, -7, 6, 1, 7, -44, -2, 2, -5, 3, -16, -8, 4, -13, -3, 13, 0, 17, 11, 5, -17, 18, -7, 14, -12, -6, -12, 15, -10, -23, 29, -27, -15, -10, 9, -32, -27, 16, -21, -16, 2, 8, -2, -22, 6, 8, -3, 18, 2, -20, -6, 26, 2, -5, -3, -12, 11, 7, -14, 4, 10, 6, -13, 7, -4, 4, 5, 17, -31, 8, 10, -15, -28, -16, -24, -10, -42, -14, -21, -42, -30, -2, -16, 7, -4, -14, -2, -10, 1, 8, -8, 18, -3, 1, 9, -17, 10, 31, 19, -10, 16, 33, 8, -10, 1, -1, -2, 8, 0, 9, -19, -2, 18, 11, -16, -11, -16, 10, 1, -22, -3, -18, 10, -13, -11, -11, 4, -16, -9, 20, -8, -3, -5, -31, -22, 39, 10, 14, 3, -10, 8, 1, 7, 6, -5, 9, 26, -1, -10, -8, 22, -24, 20, -10, -31, 16, -33, -3, -7, -4, 19, -18, -27, -35, -9, -7, -32, -5, -17, -5, 1, -12, 0, -13, 13, 14, 15, 25, 7, 12, 14, 10, -2, 20, -9, 35, 14, 0, 0, 10, 14, 36, 7, -3, -12, -24, 5, 9, -10, -18, -13, -7, -17, -8, -15, -35, 5, -4, -10, 6, -10, 14, -21, 27, -16, -9, -2, 6, -20, 1, 24, -5, -7, -15, -8, 10, 18, -11, 10, -13, -1, 1, -1, -9, 9, 5, 6, -32, 1, 24, 0]
6611@j6qL1pl4J3J0nKJ5j0Kj2K0j5J4j5J0J8l1L9k9kK3Ml0K1lJ0pp%j0K0k4PJ9
6648A3k1Nj2QK0k9Jj3M3j4okj5oK5j3j4NL3l3lL9PjLk3K1Kj2k3JRQKPJk2K6j4
6687CJ4j3J3j0l6NJ9mL0n1M2j1rk7J5J1nkK8j3j5K0%J0k0rMJ6L0l6J6l7K3J8Q
6722B7j9RPj7jMk2QJ5Jjj6lNj2Rl0K4K1m3J9mj5M0m6L5jj9K4oPRk0LL0m7K5L6
6760C6rPj5j7K8l8K6k1J4%J2j3j5kJ7Lm5L8rpj8k2L2J0l1j0K7J1QNn1J4J0J8l
6795a0J5j5%K3k7J1J5L0l4J5l5L0j4ppJ0K1k8K4J2k2JqK8l1jj2K3J9k9rJ9nj9
6829a7JK3Kl5L0Nj6K2mj6J6j3OjlPj9k3L7pJ7NPj4rJ6ok4M5k2nmK2j7k2J2j4O
6867a2k2L7j0j2Pj3Knj0L8k6L7Qmml3Lj0K8MNj6J5lK0J9l9L2j2j6oJ3opK9j5k
$$ y = [0, -16, -24, 7, 0, -34, -21, -11, -16, -14, 1, -9, -7, -19, 1, -14, 0, -15, -5, 13, -18, 21, -8, -10, 13, 17, -13, 8, 5, 15, 8, 1, 1, -9, 11, -13, -6, 13, -8, -3, -15, -7, 13, -16, -15, -28, 15, 1, -5, -7, -22, -28, -3, -16, -30, -25, 8, -25, -28, 11, 18, 17, 20, -3, 18, 20, 8, -15, -14, -5, 3, 5, 12, 13, -9, 17, 3, 17, 4, 17, 7, -29, -24, -5, -9, 21, -30, 12, 1, -8, -35, -20, -9, -14, -16, 12, -1, -16, 4, 4, 14, -6, -15, -11, 5, 35, -1, 15, -22, 1, 19, 27, 8, 17, 24, 7, 6, 10, -12, -4, 11, 12, 11, -5, -8, -3, -15, -6, -36, -12, 9, -34, -15, -19, -34, 6, -40, -5, -6, -25, -1, -7, 0, 9, -11, -8, 22, -25, 0, 36, 27, 34, 19, 2, 30, -8, 18, -3, 11, 11, 23, 10, -5, -7, 10, 13, -32, 6, -3, -10, -28, -50, -18, -8, -39, -49, -22, -11, -3, 2, -49, -35, -25, -7, -10, 5, -10, -10, 13, -14, -3, 12, 42, 8, 23, -12, 18, 4, -3, -10, 0, 21, -7, 17, 29, 7, 8, 0, 28, -3, -4, -16, 7, 26, -3, -12, 7, 2, -17, -16, 7, 9, -26, 4, 9, -7, 15, 11, -5, 11, -2, 4, 3, 0, 7, -12, -35, 2, -5, 12, 17, 24, 10, 1, 17, 11, -13, 32, 10, 5, 1, 23, 6, -16, -4, -18, -12, -34, 3, -7, -19, -12, -25, -23, -28, -38, 0, -26, 11, 19, 15, 11, -22, -19, -29, -1, 3, 8, -8, 7, 4, 24, 43, 4, 36, 24, 8, 2, 15, 9, 2, 31, 16, 14]
6904A4Mk7N2m0J6j3n4K3j0L5l0L5PjJm1J9p7K8L5R6r3J5NJ9l7l0LJ08n8j90J68
6936a8j0N2N9K2j54RJ55j17J22m4Pk09J11L3k3J47M9r1j40M8O8k3J2j9m2p7j4
6963h7Q9J57q6j86J00q8N8mJ9P5j36J70j03O6j3L1N5k31J48j13R5m0j6k2R6p7
6989d3R1j37N2J08j85J38l4j7J6M1o3N4rK2m6J4k5RK1qj3Q1j26P8npL8k4oJ%j
7021A5Jj4Rj5L2k5rL6l0K6k6J7o8Q4%l2%l6M8o8K4R%nkL5PJ6L1k3j4j0k6n7R7
7056B7N6q0L4m6qJ1qN1nm5Mj3oO3k3o0O4K1r4O4Ok7J6J2j40Q3M9m6QK1m5P9L4
7089E7j58J11n6N3k7m4K6jP8r0P5n1J21j00O4m1J3J7m3L1p9L6K5P0j06L6L8no8
7118a8K9r4J49r2j1j3K4k3n4P8J4j7m2J18j06J55j12P6lm1k1j3j4l3O0R5J5j1
$$ y = [14, 18, -9, 43, 3, 19, 6, -48, -25, -35, 0, -30, 5, 12, 11, 12, -29, -10, -87, -59, -24, 72, -21, -6, -1, 18, -19, -49, -46, 62, 4, -186, -18, -28, 24, 83, 105, -49, -40, 115, -2, 120, 76, 83, -126, -15, 18, -5, 142, 191, 100, -40, 8, 76, 53, 65, 46, 4, -73, -87, 2, 159, 73, -113, -13, -101, -43, -47, -28, 47, -89, 81, -22, 44, 31, 62, 117, -114, 34, -79, 16, -24, -40, -62, 34, -43, 48, -89, -37, 71, -114, 24, -10, -27, -11, 30, -33, 21, 12, 34, -12, 2, -23, -14, 7, -1, -14, 67, -59, 19, 14, 7, 45, 21, 15, 16, 16, 15, 16, 2, 11, -4, 28, 3, -6, 30, 0, 26, 0, 17, -51, 33, 33, 1, 1, -35, 13, -55, -31, -22, -22, -27, -29, 6, 13, 29, 60, 37, 23, 13, -13, -70, 27, 83, 3, 37, -9, -17, -6, -14, 37, 32, -13, -9, -22, -28, 35, 12, -48, 16, 37, -57, 7, 13, -14, 2, 14, -126, -43, 6, -40, -32, -11, -56, 23, 57, -101, 10, -46, 7, -20, -64, -38, -39, 39, -51, 24, -27, 94, -6, 58, 17, 30, 47, 4, 35, -44, -8, 17, 87, -19, 17, 55, 50, -18, 11, -83, 66, -26, -37, -50, -26, -49, -103, -25, -11, -28, -70, 48, -58, 97, -15, 61, 58, 17, -4, -17, -31, -64, -4, 91, 106, 95]
7146I5lj32R2o0mk3PQ2mpm1Nn1n9J4P0nO8j39J39k6M2q2l3R7l6Q2j37Q7j29P5
7177a6Mo0k7Q2Q0k5j01KP1o3N2Q9j14jR6m7K8q8q0J59j4l2m5J26k8qj13J17o6
7206b2J12m4r0O0j00L1J08q2J2M1L6j42M2N4m5L5l2N9m0K5r4J01L4q8M3m7N7j2
7234A2O0k0ML7l7j23MR0Oj54K22o8L1j02kP7j08L6%L7r6J37j04J18j27L3J69j18
7262A4q1J15m2J2M0j05K0Q6l0l6Q0p8K0l9O7N7j85J50j45P3j5Q8o8L9mq1J14j67
7290a01L9K3K3k0Rn1M0j3J39r5M2Kj16Q4L5m2l5N8o3j07J88m1L1N2j22oOP4n6
7319b3J6k8L2P9M7j13k1j0J0P7N0k21N9k9R5l7loRq5O2K9J2J03k08M6K2mJ11j43
7349g2j9J27Nl8j9Q4o6J21j35K42l42J38nj36Q7r2K81k51J84j13n1R0j53L2J62
$$ y = [95, 92, -40, 52, -8, -12, -35, -28, 54, 50, 43, 2, 7, -44, -103, -89, -19, -24, 44, -95, 44, 18, 60, -22, -55, 42, 6, 88, -49, 38, -91, -16, -12, -72, -99, -17, 63, 38, -63, -61, 10, -53, -1, 88, -26, -27, 69, 22, 50, -38, -118, 41, 27, -5, -50, 76, 48, 40, -73, 44, -22, 90, 46, -44, 16, -84, -53, 55, -27, -15, 26, 62, -80, -38, 16, -29, 6, -26, 33, -7, 18, -76, 25, 59, -29, 14, -33, 24, 12, 72, 52, 56, 93, 56, -67, -63, 27, 33, -121, 101, 33, 64, -38, -40, 37, -71, -35, -35, 2, -94, 43, -61, 57, -70, -37, 132, 14, -67, 48, 6, 18, 58, -47, -27, 59, 29, -7, 73, -5, 15, -24, 43, 100, -85, 65, -80, -7, -22, 66, -2, 37, 33, -48, 66, -101, -62, -39, -16, -36, -27, -78, -38, -51, 88, -7, 35, 37, -79, 5, 40, -2, -37, 21, -42, -149, 39, -2, 29, 81, -41, -47, -41, 33, -23, -7, -35, -3, 76, 123, 10, -11, -21, -11, 66, 116, -105, -46, -75, 20, -17, -20, -26, -17, -102, -40, -11, 1, 104, -104, -58, -36, -40, 71, -72, -91, 36, 41, 3, -16, 68, 2, 123, -12, 230, -112, 26, 21, -115, -28, -120, 161, -90, 94, -19, -70, 20, -133, -101, 61]
7374F1j91O4K5Q1pl3PO7o5J0j1j12L1n8L5J62k66O0J20J29q2%k20J71p9J1O7R1
7402F8j77l8P0K16k86J08N4J43k0r8J01k00j81L93j34o1J41j31n2m3J9mo7J01
7426g8j19l0K71j4MNk5j46J58j63J25p5O6j6J08J1M1j58P2j41J36M3j58R4j28
7451a17J23O5M2N2j14m5k9OM1m6J0Pn6K5k1m4R4mk8rJ37p5koj61K03q9M6k3m5
7481f3PJ29j15J75j17l6J08q4Kp1O6R2n2k0m5K0P0j20J09l2r9J29o4j8O8k0n7
7508c8O8k0q0O9J7p4P1j08Q7R3q7Q2j39O2N4q7N1k4%m1J5N3o8p1Q6J48j78k3N4
7537b8J15j33N9R7n6q6Lq6L7R7m6J0J3M9j48J72q4j5M2J13l1r8m4P9j0R0j0k9
7565G2O0k24o0J92j2O8p7r6J77J02j20o9j8P2j36L9N7p0J51j11j18K47l39J80
$$ y = [61, -130, -66, -41, 40, 33, 0, 7, 74, 9, 19, 8, -104, -73, -131, -96, 66, -200, -140, -20, 109, 27, 27, -193, -22, -101, -90, -23, 68, -109, -147, -77, 139, -147, -39, 15, 158, 138, 40, 141, -59, -240, 153, 19, -42, 99, -32, -84, -127, -108, -112, -179, -78, -197, -227, 44, 30, 34, 39, 14, -132, 26, -137, -12, -87, -21, -37, 71, 82, 123, -35, 37, -104, 32, 75, -83, 11, -117, 6, 71, 113, 165, 51, 6, -23, -17, 24, -22, -12, -5, -61, -36, -57, -101, -7, -11, -39, -48, 89, 14, 12, 6, -155, 48, -41, 5, -18, -63, -56, 73, -42, 133, 16, -20, 88, 4, 6, -65, 1, 93, 41, 21, -24, -4, 66, -54, 55, 23, -76, 53, -11, -29, 39, 19, -38, 30, 10, -70, -1, 16, -58, 13, -95, -8, 85, -2, 80, -59, 3, 57, -30, 21, -3, -3, -44, -29, 24, -44, -115, -29, 119, -59, -82, -28, 87, -46, 13, 110, 54, -32, -29, -115, -78, 19, -27, -17, -4, 45, -103, 69, -15, -30, 12, 125, 94, -4, -48, 31, 21, 111, 101, 72, 132, -92, -152, 40, 28, 96, 19, -77, 100, 202, 82, 13, -5, 67, -69, -30, 27, -43, 108, -3, -121, 126, -213, -33]
7589c3J16l6nJ4q8O3Q0q6Mpo0Q9m8K7k7k25L35M6k04o2J18p9J0J48J2m1j47J48
7617F2p2n2L3PJ8O4l6j11R8o7k2K71l07O4RK08j37K2j06J37j44m5J51k7q2J20
7643E6r8P5n8m9Q5j15P5O2r3J57j26K03k23j0Q8N4n3On8J52j31K7p0M0J71k99
7669a32J55K9nK6j30l0K4Q6MO6k21J60J28j48pL6M6J4o1Nr6q6K47j61J49j3j18
7696c3O3pr2o4K63j90KJ8k5O9MPq1L7M7j53J86M4j35l3Q9r1L2J13n3K8J8m4N1
7725G0k5p2P2j9l3J2jQ1m7j00M2Q3q3q2K15o8qPK7o7M4j42M5N6m8lO3k3n6N7N2
7756D9m4Nl6j7K9J00j42j4N7j9m7M1p4J26Lo6J14m1o3O4LoLM6p3L0oKn9L6j2k5
7788c6Q0n9J5n8l9J30n1J1l6O0J0j28R8j4L1j0m8K9j2J8L0Jqn2N7m9QM5J2Nl8
$$ y = [-33, 83, 47, 42, 56, -32, 31, 111, 25, 29, 22, -38, 51, 3, 30, 3, -222, 113, 159, -45, -107, 11, -68, -58, 90, 102, 61, -86, 62, -10, -62, -29, -22, -4, 60, 24, -87, 11, -56, -78, 193, -114, -50, -41, 167, 30, 52, -54, 83, -61, -106, 45, 18, -64, 56, -42, 33, -25, -74, 11, -104, -29, 33, -60, 97, -29, 174, -49, -59, 29, 83, 30, 36, -22, 130, -1, 26, -44, -4, 167, -132, 23, 52, 47, 73, -57, -87, -63, 23, 27, 93, -128, 32, 160, 12, 5, 41, 87, 101, 40, 45, -51, -137, 110, -51, 98, 85, -33, 30, 23, -69, -133, 130, -60, -58, -40, -65, 4, 8, 15, -66, -29, 18, -135, 51, 95, -40, -73, 16, -75, -43, 70, 17, 45, 63, 19, 70, 45, -27, 45, 26, -7, 5, 4, 85, 38, -62, -20, 63, -20, -102, 113, 45, 37, 44, 71, 4, 48, -94, -49, 7, -41, -44, 19, -4, -60, -3, 49, 5, 10, -26, -43, -14, 86, -56, -70, -13, -32, -79, -38, -112, 14, 17, -49, 65, 24, -39, 25, 28, 22, 25, 71, -2, 28, 22, 24, -35, 1, -11, -36, 44, -15, 0, -58, -97, 33, -18, -7, -43, 17, 27, -101, -3, -17, 14, 4, -44, -15, -27, -9, 21, 22, 14, -38, 19, -30, -22, 23, 35, 40, 2]
7819BJ1LOJ7m3K8NrlOj8jK4J0l4kQj2j2J3KJm4LM9oM4k3mpk3Olj6LN5m8J4K8j3
7859A7oMJJ4j6K1j7%Jj4pJ0J7k2RrJ3k0MqjoLl0L5l1K9kK5o1O6l1Kj3J2Rl3N0
7897A5k7J1%j7L4Nj%Ok3Pk0M4Kn3lL3rQpj6mPmoL3l0L4m4nJ1K1rKl0M6l2K2J8
7936A9k0J2J0l9L4JrJ3j7l0K1OK4k7jJ6nroK3k1K5k8l5L5J1j0j1J2L2rl1K1j8
7970a1Jj4NL0k4J9j0j7J8oMK6k3K0pKJJ0Mj3oj0OK6k7J6KJ4l9oK8%j0k3L3k3N
8007AJ6pl2J6r%K1nmpKJ5rJ0k0oj0J9LqK7k2J0J5NJ3k9Rjj1LkJ0ok9RK7l5K4M
8047GJ1k2L3m5KjponK9QnKjJ0j5J0LmJ5j0J9lj2L7n7j2K0j1K0kRkJ5k2OrMJ1k3
8087cKkL7k3k2k4L4j2J8k2J6MRk0j1J7j7K3jMJj1J9j7pK1rnK8j7K4m4lL4k4%J6
$$ y = [2, 13, 16, 22, 39, -4, 24, 29, 20, 17, 23, 5, 4, 28, 38, 4, 2, 10, -2, -14, -1, 1, 2, -42, -39, 10, 4, 48, 25, 21, 14, -9, -3, -6, -22, -19, 36, -12, 2, 30, 17, 11, 15, 16, 30, 14, 35, 18, 18, 19, 5, -2, 8, 25, 3, 12, 3, 16, -4, 0, -8, -9, -15, -12, -42, -7, -38, -9, -11, 14, -47, 19, -12, -10, -23, -11, -2, -35, 15, -12, -1, -1, -18, 16, 21, 20, 20, 26, 3, 10, -10, 34, 36, -17, -20, 13, 4, 12, 5, -11, -15, -8, -12, -18, 15, -15, 19, -25, -30, -19, 2, -7, -5, -35, 11, -21, 1, 19, -1, 11, 21, -18, 16, 17, 8, 21, 4, -26, -5, 1, 25, -2, -3, 13, 8, -1, -7, 16, -5, 20, -8, -43, -8, 3, -7, -18, -6, 26, 17, -14, 7, -11, -10, -24, -19, 11, -13, 6, -4, -21, -3, -9, -5, 21, -2, 18, 11, 13, 14, 24, 28, 15, 9, -1, 5, 31, 4, 20, 22, 36, -3, -9, 19, 19, 9, -14, 19, -4, 1, 17, 10, -22, -6, -15, -15, 6, 1, -3, -10, -8, 7, -2, 8, -12, -18, -28, -9, -6, -14, 13, -9, 1, 16, 21, 34, 5, 14, 13, 2, 5, 3, 13, 7, -22, -13, 14, -21, 3, 7, 18, -4, 29, -16, -14, -15, -22, -28, -33, -4, 4, -1, 1, 0, 10, -5, 5, 8, 4, 19, 9, 28, 25, 13, 50, -7, -19, 1, -10, 10, 8, 17, 15, 30, 8, 14, 5, 9, 20, -3, -1, -3, 34, 11, -11, -35, -1, -13, 5, -17, -1, 3, 12, -8, -19, -2, -19, 4, 3, 7, 8, -3, 16, -1, -8, 13, 4, -1, 27, 10, 34, -10, -13, 21, -3, -3, 13]
8124A3Kl9L8J1k8Pjj1kk1K0j9JLJ6okJ3J7k6RJ3j3mK1Kkj9J4kK4l2PNk1J0M8l1
8162A5j5K7Kl0lK4l8PJ5J5l8oJ7J1k6L2qpoJNJ1j7PrQk6L5L4
$$ y = [13, 15, -24, 14, 25, -3, 4, 3, -8, -10, -31, -11, -30, -29, -26, -10, -16, -18, -5, 12, -14, -5, 8, -5, -9, 12, 14, 12, -7, 7, 5, 29, -3, 4, 9, -12, -2, 46, 15, 0, 27, 29, -1, -4, 20, -18, -11, 4, 19, -19, -25, -8, 3, -23, 9, 1, -6, -12, -11, -6, 5, -12, -5, -14, -6, -32, 3, 37]
8191C7
$$ Imaginary data points
##PAGE= N=2
##DATA TABLE= (X++(I..I)), XYDATA
0@%%%%%%%%%%qJ6j6K4l2L2m0N6o6P4q9J13j36J60j92K24k56K96l44L94m51N15
32B74n87O67p56Q52r56J074j203J345j502J671j854K055k273K510k772L059l372
49a768L717m095M509m968N478o047O688p410Q235r190J0303j1621J3215j5191
63h145J7712k1058K5736l2782M4742p0291K17625k09497k11775L94835k41910
74i4808l7149L43199j33427k41702K25435j21838j46443L37823K7326l14588J86710
85C0538R5220k97972Q9826K75376j57242q6729R6954r4872l1694J40291l9369
96B0327l8727P9784p2195r8148R7263O6128l1609l960o23j9926k6937j9504O8776
109B0649M8613o7056j2675J8930p4869K6168R2111o5406p7R9103j20130p9210
$$ y = [0, 0, 0, 0, 0, 0, 0, 0, 0, 0, 0, -8, 8, -8, 16, -16, 16, -24, 32, -34, 40, -49, 64, -72, 88, -104, 120, -136, 160, -184, 210, -241, 274, -313, 354, -402, 450, -506, 568, -635, 710, -792, 879, -975, 1080, -1193, 1317, -1455, 1604, -1768, 1949, -2146, 2363, -2605, 2873, -3174, 3514, -3896, 4339, -4851, 5452, -6169, 7046, -8145, 9567, -11491, 14245, -18537, 26205, -44086, 173539, -35958, -247733, 147102, -94808, -131957, 211242, 77815, -163887, 61548, -60290, -206733, 131090, 158416, -156172, 30538, 125758, -172214, -82388, 192988, 35746, -50983, 45971, -48901, -80595, 59696, 20327, -18400, 61384, -10811, -108959, -11696, 54432, 22823, 18863, 18240, -1686, -28623, -48127, 20649, 69262, 2206, -10469, 8461, -66408, -40240, 51871, -13535, -13612, 85491, -34639, -113849]
121a13849J73719j1540j20648J34379J8314j72916P9192P6523j34664P8850J05240
132A12600j84480L435J69075j38878o0679K05299o5706j46887J44636R463j31073
143h3195J14673L9514j44478P4201P0291j45246M2256J27734j20930m0245J21286
154E5861n7452n7474J01284j9641o2710P1476j4669p0809P2982K7100p8112K5589
166f575M1864n1053m568K9696j4074R041M741l1244J9774K4207l6330j964L2009
179A5524p821r721j173k533K4425j0622m3595L8659L7541n9845o246N6177k8832
192A938k9858L5657n030o357K6783l4722j5007N9205k5908n2296O6337J9856p4051
205c3453J8923M2546m1869K495L0878l1132Q142K8602m6827n4N7599l3968l3993
$$ y = [-113849, 59870, 48330, -72318, 62061, 80375, -92541, -13349, 63174, -71490, 7360, 112600, -71880, -68445, 100630, -38248, -98927, 106372, 40666, -106221, 38415, 47878, -83195, 31478, 70992, -73486, 715, 71006, -74240, -31984, 95750, -25180, -65425, 55861, -1591, -59065, 42219, 22578, -40132, 31344, 16675, -54134, 18848, 45948, -32164, -6575, 35289, -15764, -20332, 9364, -4710, 4331, 9072, -22172, -2398, 21809, -14521, -16485, 15524, 7703, -2018, -3191, -5724, 18701, 8079, -35516, 3143, 40684, -19161, -25407, 30770, 1938, -27920, 7737, 2707, -3650, 23133, -11589, -26596, 32609, 6701, -45595, 20742, 40598, -33453, -14530, 28016, -13853, -11358, 19520, -11612, -3470, 25132, -21695, -21749, 35850, 1882, -32111]
218c2111N2038l410m1285K8241R007k5904K2087L07l2492K8799J7425m1976R528
231i746L2856k7556j1379K3846o012k145Q889j9286L458K4675k2678j3799L4778
244A5901j752l0313J0024J3652p416l49l024J583J5035j3964j9870K5691J2824
257A8022k8811O51K3358q761j3477N334N377N038m198j2709J0976J2877j9382
270e705p003K1163o78j5159M413N895j612n25o013J281J2318o351j2033J1740
284A731O885j1852q43O085j280J797j862o375Q344N285j4513j455J5415k146j1006
299e790L170N965m19m557m662P647Q990j2012r336J5021N570j5982j853J4079
313E831N02j0976k154Q863N358r194p461J1773Q144j3585o076J4312L204j3832
$$ y = [-32111, 19927, 16517, -24768, 3473, 12480, -13424, 8663, 8970, -23522, 5277, 22702, -19274, -9746, 23110, -4446, -15825, 8021, 2009, -136, 8753, -10533, -7075, 17600, -5078, -18877, 15901, 14149, -16164, -6140, 7512, 96, -253, -3277, -1694, 13341, -623, -20493, 5198, 18022, -10789, -10138, 13220, 4459, -9018, -3684, 1693, 6731, 2533, -10176, 800, 13677, -5705, -12708, 8455, 7777, -7382, -2969, 2926, 1314, 789, -5224, -3943, 8375, 2024, -10009, 1731, 8616, -3236, -4079, 2006, 726, 2523, 661, -5714, 2630, 7915, -6598, -8053, 7362, 5216, -5790, -2620, 3345, 2926, -1631, -6293, 1354, 10344, -1668, -11004, 4017, 9587, -6395, -8248, 5831, 6333, -4643, -6797, 2066, 7424, -1770, -9231, 2542, 10686, -2899, -8975, 5337, 8541, -5291]
327e291j647J1733J547r277k834O902L528o513m310P179N403p254n721P235N373
342F053o729m241O234L386m986l308K676L516q30m885l19O979N39q492J79R060
358D832r83p917J518O783n83o424j653O710L261q262m312R868L756j1366k638
373g410J1937J607j1265n22J0815O91r908p62R108J122q420j908P803K824q351
388b639m182R329M243j1043k825J2384M39j1365K442P914l737l155K405j80J915
403A945L85p558J996J0169o148q097R847K490j0443L002O565m826J315K778q024
418d604K591R398r086n388J3878j183j4466N903R456p385k252N138k493K79K048
433A834o474K812J0825q555j0318J3108N102j5488J597J4624o096j0313O575L706
$$ y = [-5291, -6938, 4795, 6342, -2935, -5769, 1133, 4661, -1852, -6162, 1017, 6420, -834, -6555, 680, 6053, -676, -4917, 1317, 4703, -283, -3591, -915, 2601, 1771, -3114, -3433, 3546, 4085, -4407, -4228, 4832, 3849, -4068, -2550, 4233, 3650, -2774, -4427, 2283, 5544, -2718, -7030, 2838, 6594, -4772, -7410, 4527, 6134, -5131, -5653, 5162, 5853, -4055, -4817, 4291, 5413, -3007, -4915, 2888, 5712, -2639, -6821, 2508, 6751, -4292, -7117, 5267, 5706, -5659, -3217, 4697, 960, -2195, 210, 30, 1945, 2330, -5228, -3232, 6937, 789, -7308, 2539, 5029, -5414, -2412, 4153, -673, 642, 3420, -4604, -2013, 7385, -1701, -7089, 6789, 5606, -8860, -2957, 6499, -886, -3138, 2000, -493, -214, 1834, -4640, -1828, 8997, 442, -9876, 3232, 8334, -7154, -5557, 9067, 2971, -7342, -767, 2939]
447B939m085J656o9k286N208j634r477P431J0385j2127n928J4098j930j2968P955
462h32P726r061L06N240p242J311Q522q154l010J2986m949j2710J0852O395j1964
477d584K546Q410q378j322P379p072j095J2470o916j1132J3379L633j6170M978
491c874J4029r593p013Q958j440m680N961j837l461Q431l679j2320J0727J0104
505A0313j4793k046J5830o677j3271J0541O656q189J899K938o882K455M079p326
519d473L984J0363j0933q628J2689R75j0582P909O980j0831j954N955m420J630
533a336Q563o250o035P414k149p533Q944O592q870k370L785l803O84O338k224
548A750j943L580n598n772R352N734q029j019N726m991n659O324N619k323k625
$$ y = [2939, -1146, 510, 441, -1845, 3363, 1729, -7748, -317, 10068, -2059, -7987, 6111, 4181, -8787, -832, 6894, -2167, -1861, 3379, -3863, -2552, 5970, -2184, -5194, 7792, 2843, -9867, 985, 7380, -4584, -2038, 6372, -2006, -3328, 4051, -3021, -4116, 8354, 1438, -9694, 3685, 7318, -8852, -3874, 10155, 562, -6451, 2507, 1067, -3613, 2348, 511, -2950, 5481, 1802, -10518, 209, 10313, -4480, -6526, 9304, 2627, -10644, -103, 6553, -1636, 263, 3201, -3681, -1226, 2853, -4473, -489, 9874, -1059, -9687, 3002, 3977, -6605, 1304, 8284, -2547, -4501, 1454, -2966, -1336, 7227, 977, -5058, 2356, 207, -7326, 1618, 8210, -660, -3030, 755, -3048, -2364, 3974, 1750, -193, 3387, -2211, -7983, 1369, 7103, -926, -1945, 3781, -1210, -6869, -545, 5074, 2751, 126]
563A26j858j234K363R75j271M172K255q839m145Q793K655n776K591M182o416m316
579e743M675K917L70N64l301k091K485j186j168O080J333p006j441L361p39N03
595c87K983r53j732n10k393Q57M886O6l102j06K5j045L03R98K319J091m606k648
613c954M670R71l594K339K939l357k469P85J332K695r21l964K968K718o606o86
629d134Q601j314o771L240K788m089J79K510n54J195p75m127K604L984m623j284
645b570O063j521n711K768L046k708R7J993j570n57J057j559p5L249m68l351J202
662f15K124k442r10L271K98k387L43K18j208K027Q93l078J512K975m907j997O841
679B958k52n953L131L211n026k95L823j486Q2J637m004L00N175l934l180P407
$$ y = [126, -1732, -2966, -603, 372, -899, 3273, 5528, -3311, -7456, 1337, 3992, -1784, 807, 4989, -1427, -5743, -1068, 1849, 2219, 2783, -518, -2609, -124, -1310, -2478, 3602, 4935, -2071, -3512, -151, -890, -387, 2596, 1643, -89, -599, -2992, -2135, 2751, 2817, -285, -391, -366, -1411, -1108, -110, 2209, 3300, -1306, -3954, 716, 1687, -1907, 432, 3371, 14, -2455, -1670, -338, 2357, 1436, -2528, 440, 3158, -3448, -4134, 4467, 3153, -3618, -378, 2410, -1679, -1500, 1010, 456, 1651, 876, -3251, -647, 3337, -1286, -2570, 3493, 1972, -3739, -971, 2075, -633, -536, 1457, -113, -670, 387, -1172, -1247, 2002, 1534, -1817, -615, 1509, -933, -1843, 1428, 1726, -661, -318, -100, -1308, 719, 1612, -1466, 46, 3021, -1886, -3883, 2958, 2706, -3247, -116, 3095, -1931, -2226, 1597, 111, 193, 1830, -2174, -1874, 3301, -633, -3813, 3594]
695C594l05q097L444N275n206o94M801k476k066K675j804n38M312k202l738M256
711A231P97n107K246M076l468j566K838j213j282K451l96j757J932J48k805J091
727g84K649j489j576J595L57j492K39Q71n9L14m54j493J071J959k167j431L481
744A591K60m256J045L757k073k155K249N30j461K17j83L40J703j721k008L259
760A094Q64m083J023L702k412k187K566M37j642O90R4n08J113o37j494J882P82
777A284k368L50J887j128r10J176j50m17O40m95n05J130J1j306N37J052o25p76
795f13L44P63m5q90o1J118k0j287J31J309j45j374J09J443r0j625J95J799n04
814E57j751P77J528q81j216P48J007m75r93K92J209k80j454M77J554q14j264J007
$$ y = [3594, 3289, -4808, -1364, 3911, -1295, -1989, 2812, 336, -1730, 945, -859, -1397, 2915, 713, -3025, 1231, 2028, -3079, -833, 3243, -225, -1791, 1047, -166, -1448, 1003, 607, -1150, 782, 930, -1875, -784, 1865, 376, -1200, 395, 752, -740, -501, 370, 311, 625, 171, -1322, -251, 1708, -459, -1890, 1591, 1851, -2405, -1360, 2397, 324, -1831, 418, 948, -513, -296, -479, -139, 1564, -157, -2165, 1094, 1958, -2125, -1102, 2600, 188, -1999, 567, 1004, -638, 52, 146, -362, 751, 114, -1380, 502, 1284, -1084, -734, 1153, 25, -885, 291, 141, -276, 364, -131, -636, 494, 505, -801, -264, 788, 163, -613, -269, 494, 449, -441, -502, 616, 596, -691, -560, 749, 604, -770, -661, 782, 692, -933, -738, 1061, 557, -1194, -417, 1111, 230, -986, -238, 769, 294, -699, -407, 802, 522, -932, -455, 1099, 285, -979, 28]
832B8P50r23l90N95L00k31m19l5N62P1o93J19O60l24m52L57J70j68J38k15k05
853c05N47J08p47Q4R11k74r24L87Q48m01p40L05O96j59q14J8R30O6j206Q1J404
874H15k99j550O14J433q21j140R07P59p37n82N21N90k06p86P6J051k61j077N32
893a61J015p89q10Q12M38o47q6L88n1j72n3p8K55K59l91k86M02J50m22Q9L80j22
915A20k00l5r3K50L82m93l47Q24%j124L64J247o61r26P35M47p02j21M22K22po95
937c91k17J039N3j227N07J270j138r59J203N43q84j17N54j5l16l05L13O86l14
956B85q19M44N71o84k00P14P5m98j37J30K17n7j84K12J85l87j46K53NL9K68l67
978h1k33N38j70n26O16M13o59j91L64n0l5N1q1L00O3q34J4J088k73r18P15N50
$$ y = [28, 778, -145, -535, 60, 360, 129, -290, -325, 237, 308, -385, -266, 394, 70, -382, -25, 145, -23, 115, -100, -305, 242, 350, -397, -313, 598, 324, -600, -213, 635, 234, -506, -201, 495, 336, -478, -460, 470, 536, -670, -589, 815, 516, -1034, -420, 1013, 192, -948, -41, 718, -19, -601, -80, 510, 304, -482, -406, 645, 384, -693, -161, 854, 65, -745, 67, 505, -142, -228, 160, 109, -63, -116, -194, 61, 320, -71, -357, 45, 195, -227, -138, 242, 120, -80, -115, -208, 42, 424, -69, -416, 408, 408, -716, -352, 895, 234, -692, 43, 490, -212, -333, 89, 311, 304, -391, -608, 431, 484, -743, -236, 1034, -104, -1063, 140, 683, -201, -318, 236, 221, -95, -400, -87, 599, 285, -534, -90, 481, -203, -403, 311, 386, -112, -249, -119, 98, 41, -143, 69, 254, -133, -279, -26, -21, 18, 286, -81, -314, 224, 54, -472, 144, 557, -102, -293, 71, 21, -14, 37, -44, 256, 319, -515, -501, 587, 314, -604, 111, 661]
1000F61j015m11R78K81n94q0K84j13k01q4K73N40j93q34J52Q10m75m90R96L30
1020H15j318r5R63l74k53Q37l14p56N36q8n92J039M24j322J43Q13j035jJ480n90
1040C12r13R80m70j018J546N81j664N44J042j715j91J932m83r91R62l44j017J022
1058A15L38q88R59K98j953L78J827j163p34J772l24j885Q81J067r17K28O95r85
1076b91k46Q59o40j01J443n88j543J143O70j514N83J458j247q84J285l39q35J316
1094E29K03j458O86O38j456M10J597j162p96J409n60j031J434K43j396R28N71
1111G89j796N23J714j408o82J809o23j533J356N88j308O15N90j252L94Q69j207
1128e62J09J571j155j129J713N8j619R34J073j355k06J105o03l52R29m11n97J005
$$ y = [661, -354, -765, 213, 494, -100, -180, 104, -9, -210, -294, -21, 519, 326, -508, -356, 454, -21, -511, 485, 815, -503, -598, 365, -9, -262, 575, 261, -495, 41, -47, -639, 400, 824, -498, -355, 458, -577, -578, 902, 312, -601, 379, -91, -1109, 437, 1018, -646, -102, 940, -775, -966, 966, 483, -508, 454, 110, -907, 115, 453, -435, 524, 822, -1131, -753, 1074, -89, -823, 949, 625, -1260, -379, 688, -229, -1, 694, -291, -537, 322, -318, -419, 1024, 436, -1107, 36, 706, -808, -225, 1233, -14, -898, 387, 48, -787, 529, 732, -726, -40, 598, -858, -448, 1149, -13, -809, 600, 40, -991, 443, 686, -710, 218, 789, -1007, -484, 1230, -178, -860, 949, 326, -1207, 149, 737, -571, 44, 634, -618, -224, 645, -562, -453, 1118, -37, -1166, 547, 605, -1014, -80, 993, -362, -568, 537, -66, -418, 511, 100, -497, 508]
1146E08k68j058R53O58j303J27J181q74o96J153o5q44P64K13j060M52P41r37j8
1165c73J069o99p37R96L8p88O77K59q87L82N12r30K50J104r44o42J215j47j067
1184g12P43O68r16p8N57m21LM84m73o4O86o04n88J058J97j073L78P49p97k76P56
1205B77m6l91K72m9k93L53L0m14L87K39o50k8N91k13l17M21Pm37J85K08k97J61
1227dL11m27j48M67j31l33L40K10l84l1J86o2K0N0j78R8K38l64j44N53J0o20K35
1250a08M28l31l08L76J38k56q2L0J71N3k51l3L83p8m57K22L80k67k50K87J36k17
1272c4j03J80P3r9p1m3J80k1j26J3J35l4j50M7R9m4k9j1N3pOq6j7J90j9k47P6
1299h9K71q7k67J16K23j07k29J27J95r5k21R5K37j05k55J13L06j95k75K14K13
$$ y = [508, 240, -818, 135, 793, -510, -383, 798, -76, -772, 381, 316, -528, 236, 449, -611, -159, 582, -355, -373, 696, -3, -740, 256, 294, -494, 183, 442, -445, -63, 449, -481, -231, 873, -71, -713, 502, 355, -712, 31, 699, -217, -295, 262, -159, -156, 328, -145, -209, 477, -127, -715, 343, 540, -533, -155, 594, -203, -479, 277, 231, -160, 112, 63, -230, 123, 153, -261, 126, 365, -285, -313, 278, 65, -252, 169, 176, -261, -76, 132, -165, -4, 307, -120, -268, 199, 68, -265, 75, 285, -99, -130, 56, -6, 14, 64, -114, -16, 222, -142, -286, 267, 277, -343, -108, 320, -11, -319, 57, 195, -61, -143, -113, 58, 111, -140, -173, 210, 132, -325, -103, 277, 10, -240, 47, 183, -34, -137, 43, 116, 17, -54, -97, 83, 62, -64, -51, 84, 50, -100, -53, 46, 2, -27, -38, 15, 8, 14, -72, -89, 101, 82, -165, -89, 182, 95, -172, -56, 167, 60, -169, -42, 153, 58, -163, -68, 169, 64, -191, -78, 228, 33, -242, -28, 185]
1320A85j53k75J79K29j51k26J64K03j50j83J84J62j67j42J55J28j32j43J77O8
1340A12j12r3P9P7n5m4J6J8L7j6j19J19Q0j51K2J6J77k28OQ9N9j25j59J33L55
1365B93k13k85J45L62k33k58J69J40j57k52L92O5j19j41P6J29j36k41K24J93j71
1386a8k94L04K44k67q0L30j11k68Q7N6L3O2j5j03rR8k69L42j2j77P1MJ72k70J53
1411F3j27O1K31j25j92O1K34m06L3J95P7j96P5R3Kk6j06k62L53K01m85P8M31k88
1435b5l59M97J95m25j10M75j86k11J32M6K4K9j88j05M15r2m76L85L53n72q7N49
1457B64j78l00L21N0l50K17J15l74K55K94m55m4M55k56k91M39Nl94K66J02m22
1478b81K43L62n39jO28l83n16O69J27o16K20M29m68k8L52l12N1L62l77k71O52
$$ y = [185, 32, -243, -64, 165, 14, -212, -48, 155, 5, -178, 6, 168, 1, -141, 14, 142, 10, -133, 44, 112, 0, -93, -14, 63, 8, -36, -20, -2, 35, 19, -100, 19, 99, -52, -30, -14, 163, -65, -59, 30, 89, -36, -195, -62, 293, 80, -205, -60, 302, 69, -189, -20, 120, -37, -289, 103, 168, 49, -92, -16, 113, -23, -264, -40, 153, -18, -312, -8, 236, -31, -111, 219, 108, -160, -73, -17, 16, 78, 63, -40, -49, 49, -220, 122, 110, -67, 4, 8, 180, -90, 63, -64, -3, 228, 103, -89, -28, 206, -200, -167, 28, 105, -91, -16, 77, 79, 53, -53, -315, 38, 239, -246, -168, 263, -25, -384, 113, 308, -117, -227, 248, 62, -149, -17, 29, 53, 82, -106, -211, 204, 112, -364, 21, 374, -198, -285, 264, 86, -214, 107, 157, -193, 24, 139, -235, 20, 314, -141, -185, 270, 14, -277, 162, 167, -227, 39, 141, -281, -38, 324, -215, -216, 412, 29, -487, 182, 309, -307, -87, 342, -126, -154, 198, -114, -63, 299, -78, -349, 303]
1499C03j31o88O06M78q83q9P83l42m57N99M1m61K97J4m08M39K79p12J80O20o71
1520b03k73Q42j01o44N01J66o42K46M97n24J5N63n38l86P45j4o25M87K36p00J70
1541a82M68m15L3N32n49l50P21j16o45O65M16r43k2P30l57k82N87q5m52L13q8
1562b1l39O09J67p70J98O06p16k04R49j40p65M14K40n37J95M49m06pL18m75p9
1583c14O79j97m57M56Q9o44K65N00m37n1M15m03k85N74j6m55M20J42n69M0N10
1604B62k59j48L38j46k50K60n6j99L76P8n56J47M88m34j98N88j5n83J96L06k53
1625e8l5K33j43k1J07k40jL97j73l27L46J26m95Q2M60j91k86K89Jk23J35R4j43
1648f6J09J01k52%K63j52j38K46J6k06K0J29j15L0J37j75p1K08p0k22K62J65k91
$$ y = [303, 172, -516, 90, 568, -315, -404, 379, 37, -420, 179, 220, -241, 56, 70, -338, 101, 380, -332, -152, 468, -203, -476, 366, 265, -379, 122, 288, -354, -108, 389, -135, -120, 443, -95, -481, 264, 250, -375, 112, 348, -352, -182, 286, -129, -96, 436, -113, -463, 258, 142, -503, 162, 578, -365, -387, 343, -14, -296, 291, 206, -246, 67, -21, -360, 249, 416, -354, -156, 450, -266, -470, 479, 339, -426, -12, 228, -309, -114, 335, -71, -78, 240, -235, -314, 365, 168, -289, 167, 256, -388, -123, 377, -60, -111, 304, -99, -384, 190, 174, -281, 139, 281, -288, -248, 262, 3, -145, 193, 47, -203, 57, 1, -198, 178, 256, -300, -153, 335, -99, -297, 291, 276, -307, -111, 195, -58, -93, 140, -3, -24, 83, -157, -158, 239, 66, -261, 85, 211, -284, -202, 258, 67, -219, 70, 71, -152, -17, 77, -66, 43, 144, -108, -108, 155, 3, -135, 111, 127, -79, -59, 70, -45, -15, 122, -53, -124, 84, 14, -208, 54, 219, -72]
1671g2j06K86o3k17J59J22r0q0k3J2J60k0j92J20K57l38j77M27O5l75Q3K72k46
1694c6j47K36P2j41L7p1o0J86m8j56J93J22l14j4K68j02j46J99K0k23P0J34j51
1717g2O7J88j94j47K31Ok10J81R8j97j1P7p7K6J63j83m1K32j49k28K75K08l79
1740a36n0L69j40k35K09J01j26rOo2J96l1k42J70K02l23q9L69p2k83J67J62k40
1763h7j8J85q0qP1j20k0J66q0j03J68K1k10R2J52j47kJ28j02q6J71o7j22J66N1
1788A19j89NJ62p2j40J11J5j1m0JNJ30r2j28J37J09j78j00K95k0k78J02K16j29
1812C0j13R0O2m4o0k5J00O6j42p8K22K1k44O6J60r0j03Q2P1j02J3Ql0Q8k8o8L4
1839a4N8p0KN1ml5L6k2n0O6J5j21P3J32j67p0K08l9j42M7R5l3m0PL9L9o5o6Q9
$$ y = [-72, -178, 108, 45, -172, -13, 109, 19, -61, -84, -72, 88, 68, -124, -4, 253, -85, -262, 165, 230, -145, -62, 210, -36, -183, 53, 125, -16, 21, -50, -110, 76, 28, -128, 65, 187, -127, -141, 127, 25, -121, 78, 98, -125, -55, 79, -72, -5, 183, -11, -158, 73, 79, -131, 50, 148, -49, -60, 17, -60, -34, 129, -54, -95, 137, -12, -240, 35, 243, -136, -186, 183, 43, -192, 17, 118, -8, -17, -11, -73, 123, 92, -150, 20, 222, -101, -190, 179, 107, -176, -9, 153, -87, -105, 80, 0, -8, 63, -57, -77, 89, 9, -94, 74, 95, -115, -23, 129, -18, -20, 108, 6, -80, 91, 24, -98, 68, 119, -70, -65, 97, 25, -115, -4, 11, 0, -40, -39, -34, 96, 4, -124, 13, 122, -56, -156, 139, 119, -159, -57, 159, 30, -83, 7, 69, 25, -35, -60, 40, 106, -36, -114, 108, 129, -115, -49, 111, 21, -82, 0, 71, -31, -18, -10, -40, 48, 20, -48, -14, 44, -26, -24, 27, 23, -12, 24, 2, -48, 18, 33, -88, -15, 117, -50, -120, 88, 49, -93, -46, 49, 16, -24, -17, 22, 61, -4, -70, 19]
1868A9J19j72j25K30M1k37M7K04r9j36R8R3q3j6J2j1M6o6o4J43J8j67L7J74j23
1893a8r8J85K0j72R5M8j58P9P0m1n5J28m8j24J21L6r0L2L1j01M7Q4j41L7J51j43
1919b5j40K20O7k29M1K05j27j09R8M3l4L1q3J1J01p0j48K13J06l01L2K60j25j92
1943a55J93Q7j81J3R8q0K2O6j15M5R2j72k2K18k1k03J04J22j93J7J96j67p5K09
1967I8p1j33J26R8j96O4J41j53m0J36n0m8P8n9n9J37jk43J87J50k47m9K36j0k36
1992a44J26J55j56l6J13q5J7M4p4N6R6j43r5J94L2k14O1J99j98j05K40Lj62N5
2016b1Q9j63M1R7p4j1J34j04r7J38K5j38J56N0k16L6J25j24j7K65r2k66J94N9
2040H6j88P7K09j60j40J57n6m4J44k1j53J30l1j64J50K41k95q3K84j18k61K36
$$ y = [19, 138, -34, -159, 71, 112, -125, -78, 126, 27, -109, -11, 82, -1, -17, -5, -16, 30, -36, -100, 43, 61, -106, -69, 105, -18, -116, 69, 89, -83, 12, 60, -98, -19, 51, 10, -45, 83, 35, -89, 32, 68, -22, 10, 41, -60, -13, 71, -70, -33, 118, -25, -165, 55, 122, -107, -66, 139, 12, -97, 1, 44, 10, 41, -42, -31, 70, 0, -148, 65, 171, -130, -98, 162, 37, -155, 38, 125, -56, -43, 55, -25, -3, 63, -52, -7, 85, -87, -109, 109, 88, -115, -11, 111, -82, -65, 131, -36, -111, 98, 27, -106, 20, 118, -78, -14, 127, -26, -66, 70, 20, -28, 50, -9, -68, 69, 68, -175, 12, 162, -85, -134, 102, 92, -144, -18, 137, -19, -55, 58, -27, -10, 34, -40, 16, 112, -31, -126, 68, 100, -114, -53, 146, -52, -157, 83, 86, -76, -21, 68, -95, -54, 43, -31, -42, 92, -12, -109, 29, 54, -84, 72, 122, -94, -58, 67, -57, -74, 191, 99, -167, 27, 86, -102, -25, 184, 24, -116, 41, -15, -59, 85, 64, -89, 41, 10, -154, -4, 237, -58, -141, 143, 25, -236, 0]
2062@K04k71l6J91j42o3K06m4r4J28p5k11K44R4k42J01K12l04j17L38m1k11K18
2085H5K8l11J58K01k41K8K29j91j70K95q5j74K63L7l11J33J36k36N4L30k49k11
2107b02L05ll22K30K35l29j9K07j54m4K54j24j78K75j02k85K97J75l74R4L19l19
2129f4j59L93m9k77K31P4l06R8J80k16K7K35k18j21L11j11k38L16L6l17J32K39
2151A96k94l3L28j87k06L01qk68J91J58k80O3J98k35m9K81j42j67L14q6l04K82
2173E3J30l19L9K89k41j76L14k3j92J50O2j98O4J08j55M3K04k02q2K71j06k08
2195a75K40J05l10R0J85j81l7K08q9j35J34lj47J52O2k05P2J32j74%J82j05j09
2218a08K01k0k22J42J43k23M6J39r0j23J76lj26P7Nq9R5Qj16Q7J28j72p2J87j6
$$ y = [0, 204, -67, -103, 88, -54, -117, 89, 45, -49, 79, 4, -207, 37, 131, -111, -10, 202, -102, -219, 119, 78, -133, 85, 113, -198, -40, 161, -80, -52, 177, -14, -184, 111, 26, -148, 115, 152, -159, -26, 110, -126, -72, 258, 9, -202, 103, 100, -222, 8, 243, -86, -105, 102, -52, -96, 158, 34, -144, 131, 29, -256, 41, 216, -158, -64, 255, -64, -223, 170, 121, -156, 75, 149, -157, -59, 121, -95, -68, 167, -51, -172, 139, 28, -210, 106, 142, -175, -43, 196, -98, -131, 197, 10, -196, 105, 97, -171, 20, 178, -102, -39, 159, -76, -125, 156, 14, -153, 161, 75, -229, 53, 183, -136, -97, 192, -49, -225, 89, 66, -126, 24, 86, -112, -48, 60, -95, -52, 152, -50, -132, 139, 33, -175, 65, 170, -140, -50, 135, -46, -83, 125, 36, -99, 35, 32, -115, 37, 99, -106, -34, 98, -76, -76, 106, 1, -108, 93, 73, -149, -7, 136, -87, -41, 98, 8, -115, 61, 58, -68, 9, 14, -75, 20, 28, -88, -1, 127, -45, -117, 70, 54]
2243E4j64J24R2j62lJ26n4n5P5n7J3K9m4l2J07j6j06N5J10j22o1J62m6q4N7K4
2269B2q1N2O2m2n6O2k6j8N0l1m0N5J3m9K1L4n4k1J04p5l0Q7k1o8J6P8l7k3PM4
2299C5j1k4j0K2J8m2k0M3L4j02L8N3m7k3N5J8p7J3M8j7orJ8J1k0J0Rk6omO1oo4
2332b8j1P6n0QK3Ll3J6Kj6K0j3Mj6L6j9k2jK5mJl8J9K1Mk3k2P8j5m0J3L1n2PJ6
2367@K7l8lJ1NPk4mN5l2k1K4L0n1k2O8J8r9K8N4l3J1mpk1%K4J0j5j4K2j4Pk7L
2402b5P5q6J3M6j0o6O8Km4NN8l8k9M6rpk7M8k4J6Rm0K4J2m1k9J37q7n9O9L4q7
2434d6M5K4l7l5P5m8QNQrL4j9q2R5M9j18J3P8l3m4M5K5p0J5N0m6J8J5k5MO8q4
2466b2k7Q1j4p6N9N1j21L4Q6p9k0Q5k9p5P3M5j03N8L9o5j2Q0p8JJ01o5n2J18k7
$$ y = [54, -110, 14, 106, -56, -59, 67, 13, -42, 33, -24, -11, 18, -26, -58, 49, 33, -73, -18, 92, -30, -91, 71, 25, -59, -2, 22, -59, -7, 55, 13, -43, 19, -7, -25, 25, -6, -46, 9, 22, -27, -6, 28, -26, -47, 57, -18, -48, 39, 18, -50, -34, 44, 7, -16, -9, 35, 24, 0, -10, 12, 30, -12, -32, 11, 45, -57, -19, 34, -13, -36, 19, 37, -40, -27, 21, 4, -2, -11, 7, 18, -2, 8, 17, -9, -15, -19, 42, 36, -28, -39, 37, -13, -5, 18, 21, -12, 4, 6, -10, 10, -3, 1, -15, 21, 2, -20, -21, 4, 0, 1, -37, -18, 3, 7, -16, -38, 40, 25, -15, -2, 29, -23, -16, 0, 27, -11, -14, -3, 2, 9, -15, -19, 36, 4, -17, 7, 37, -14, -36, 32, 50, -49, -21, 33, 0, 11, 7, 0, -21, -21, 3, 13, -2, -16, 6, -8, -1, -28, -25, 50, -36, -23, 23, 13, -53, 15, 17, -27, -22, 36, -2, -31, 15, 6, -1, -28, 20, -4, 12, 21, -19, 5, 17, -24, -53, 84, -3, -62, 7, 41, -46, -1, 23, -14, -49, 26, -22, -14, -9, -1, -10, 24, 5, -77, 18, 67, -51, -38, 40, 7, -37, 8, 33, -37, -22, 28, -18, 0, 15, -10, -6, 62, -22, -49, 32, 18, -58, 1, 52, -69, -35, 51, -28, -48, 37, 8, -67, 6, 51, -52, 6, 45, -20, -32, 48, -30, -29, 72, 7, -45, 73, 46]
2495D6j21Q2O5q5l2J39q6q0J13k6p3Q7L7j01L9J9o3L2R2j07m2J45l8j44J32L6
2521F6j14mJ46j25j5J12o7q2J10k4q0R3O7j31K7R9j26jJ31n8o0O2L0j34Q3Q7j28
2548c6RR0k9j13J12j0q4J02kj29J04K8q8K8J06j32l5J63o4r9J16N0j47K2R7o8
2574ij2P8l2o8R2j4q7R9%r9N1P0j14j0J15m2p6R7k5j09J02M8r3J8Q1q8m1J08k7
2603A3o2R8l3r0O5O8j00J1J08j07k7J16Rj14M3O3r4j2R6p5RM7n8J4K9np5R2L9
2632F8j19M6L9n1o0J33l6k3lM0n9J3M0o8N0M3r7J4O9m2m5O7J6n6jL9p8L6N9m0
2662fk7N1k5m1N9Lj7j8N3n7PP7r6K7J9j4k1K8L9n8k7N2k0l8M7K3l1jL3l5j3L3
2694Fj5k6N7k7rO3k9l2OK4k2j3M1jl0K4j2k1J0K9m5J7N0m3l9N9j7l1K4J5n0L0
$$ y = [46, -75, 7, 72, -13, -45, 94, 8, -72, 41, 15, -58, 29, 66, -35, 4, 23, -40, -8, 84, -23, -65, 80, 42, -102, 30, 66, -48, -52, 94, -31, -46, 66, -1, -83, 27, 3, -77, 16, 83, -48, -21, 78, -48, -49, 82, 24, -36, 26, 56, -78, 5, 92, -36, -27, 63, 34, -79, 33, 23, -61, 41, 39, -90, 14, 42, -46, -18, 88, -44, -79, 84, 20, -79, 37, 87, -60, -38, 59, -9, -21, 57, 25, -43, 49, 35, -52, 47, 47, -52, -1, 69, -45, -55, 60, 18, -58, 39, 14, -95, 7, 55, -38, -20, 61, -27, -68, 40, 13, -49, 49, 16, -74, -9, 59, -41, -30, 78, -29, -56, 60, 69, -45, -2, 61, -33, -45, 51, -24, -15, 32, -26, -12, 17, 12, -63, 29, 68, -51, -5, 34, -17, -77, 56, 20, -3, -6, 34, -25, -12, 28, -40, 10, 53, -44, -30, 39, -3, -48, 19, 35, -21, -22, 17, -61, -25, 34, -6, -33, 18, -7, -48, 11, 14, -3, -21, 32, -25, -18, 59, -37, -10, 9, -5, -26, 2, 41, -17, -44, 8, -12, -50, -3, 20, -11, -12, 21, -14, -27, 6, -9, -35, 22, -5, -14, 49, 20, -12, -6, 18, -4, -17, 24, 23, -7, 17, 5, -16, -6, 23, -22, -5, 45, 2, -37, 22, 5, -26, -2, 13, -37, -7]
2726gQl5K2L8l7k3K3K0k4j8R5m7l3OJ3j6lJ0J6K3n6QK1L8p6K7J8mm1M2k%mL2l1
2761Ck3K9k7K6nk3j7N3Jk6K4qj9J1J8j1JJ2l0j7J5K1l0NK8j8pK5k1j0J4NpL6j6
2796A2n0O6Qn6J3L3rm9L9J9k1k0K0Lj1j9K4j6L2n8K7J7lj1K9lm2K5Rjk9J1pRJ9
2831A0qj3j3K5jj3K9k1PL5l0mj2K1Lk0K6k8j0K1k2RMKRl7M7j2k8K4NPOrj4J7M
2868A6m7K3K5l4j7M0rj5J2K2k8PJ6k3J1j2J9j4MOl0K5J4m0L0L6l2k8K2k6RK6j7
2901iK0k5o%J8MrMj9K2j0K9m4QK4J7m0j2M5k0K7k9K1k4OK8j3Pl3j2L0%k4J3J7
2936A1nl6M8l6j5L6j0j4j8L5Lj5KOrL1m5J1L0roJ2J8j1j1J5J1l6L3l5rK7lk9M3
2971B0Rl0j4Pj9MK6qlJ1J7l9J6j5J4k1M6k5j2J4J6l6J2K8mPLm0j1N5l0oM1j6m0
$$ y = [-7, 1, -34, -12, 26, -11, -34, -11, 9, -15, -33, 62, 15, -18, -12, 1, -15, -18, -8, 8, 31, -25, -17, 4, 42, -34, -7, 11, 7, -34, 8, 6, 6, 2, 34, 3, -20, 9, -18, 8, 3, -20, -37, 16, 17, -9, 15, 7, -12, -1, 17, 6, 7, 19, -11, -28, -13, 8, -22, -17, 11, -7, -14, 11, -10, -20, -6, -1, -8, 28, 12, -38, 28, 36, -20, -7, 26, 17, -32, 7, 26, 5, -15, 5, 8, -3, -22, 2, -14, 18, -40, -13, 4, 1, -10, 19, 16, -26, -1, 8, 7, -22, -11, -18, -9, 10, 2, -11, -24, 1, 0, -13, 16, -5, 2, 37, 7, 3, -9, 12, 15, -5, 21, -7, -17, 4, -18, -9, -5, -3, 6, -31, 16, 4, -24, 0, 5, 12, 18, 9, -5, 12, 16, -31, -8, 17, -17, -34, 6, -3, -18, -6, 16, -12, -5, 11, -12, -1, -13, 6, -8, -4, 2, -28, -3, 11, -29, 1, 37, 5, -23, -1, -27, -18, 8, -9, 11, -14, -20, -20, -2, 2, -7, -3, -22, 0, -10, 19, -25, -17, 7, 24, -16, -28, 17, -3, 24, -5, 16, -8, -2, 26, 13, 20, -13, -25, 5, 5, -19, -6, 11, 6, -30, 18, -18, -33, 3, -7, -21, -39, -4, -1, -16, -14, -8, -17, 14, -31, -20, 10, 1, -5, 7, 25, 14, 3, 18, 29, -7, 26, -9, -18, 9, 6, -23, 20, 29, -1, -15, -8, -27, -23, 3, -5, -8, 3, 20, -19, -3, -18, -4, -25, 21, -4, -16, -2, 14, -22, -10, 18, 14, 21, 24, -16, -27, 28, -2, -8, 33, 17, -23]
3006b3J0J6j4nJ3JJ2K1m2QJ8pk5J1K5j6pPPj7J0j9j0M8ln1K3lK3n4M6%k2K5K1
3041B7m3J1K7m5kN9m4nJ7J6k7J2J1Ok0J8k1l1M4Jk4K6k1l4K5QLj4L6k1LM2k9k9
3075a8K0J6k8k2N0j4k0K7j4rlK3qL0kl7J5OJ5l7J8k1j3N4Jm9K6%l3K2K0j2m3M0
3109@J3m9L8J8nl3M2n4K1J8j4rOM8o1L6K3k5qK5l2OK4m6lL0K6o1L1K0n3K8N0k8
3143B2l1J6L0o9K7L7m7L1Ml0j9M0Kk5NK9m9J3K1l7L8J7l4KK0J5n5L3K6m8K3Oj6
3176ck8O1%m4L0m2K8K5k9k3J5L4l5lM0k6k2QM0o2J1J6j2J4Rlk8M5j9k1L8j4j1
3209a1L3j2k9%P9m3l1L3j6j5K1j1k1J7J5k1lJ9ml3K4k9OK6M9r0L4K3l4J5L1j7
3241Ej1J4K0k8oRj2J9nloJ7j0RoMj3LK7o1L8Rk0J8l0M6l4%K9j9k5M9j9j6K2j4
$$ y = [-23, -13, 3, -11, -16, -3, -2, 10, 31, -11, -3, 15, 8, -17, -6, 19, 3, -4, 3, 10, -7, 3, -16, -26, 22, 19, -32, -9, -12, 11, -43, 3, 3, -19, 6, 27, -16, -5, 22, -23, -25, 34, -10, -15, 2, 18, -9, 3, 14, 20, 0, 18, -3, -34, 10, 11, -13, 13, -8, -42, -17, -9, -6, -20, 16, -5, -2, 40, 11, -18, 2, 18, -10, -32, 18, 4, -16, 11, -3, -12, -15, 8, 0, 30, 28, -9, 6, 12, 27, -10, 8, -13, -26, 28, 29, -20, 6, 6, -27, -5, 15, 3, -40, 0, 13, -36, 2, 20, 15, -18, 24, -30, -9, 9, -5, -14, -8, 40, -21, 15, 38, 13, 5, 30, -2, 4, 28, -18, -21, 9, 35, -26, 5, 25, -28, 0, 50, 22, -9, 7, 37, -32, -5, 32, -15, 16, 20, -10, -29, 11, 13, -12, -7, 22, -27, -14, 7, -30, 8, 25, -9, -7, 13, 28, -27, 6, 32, -16, 7, 13, -3, -31, 30, 30, -14, 16, -26, 2, 27, -2, -25, -10, 24, -11, -14, 26, 0, -22, -14, 26, -36, -25, -9, -21, -7, 2, -1, -29, 16, -3, -24, 14, 0, -11, 22, 10, -19, -19, 60, 17, -14, 19, 3, -12, 9, -2, -23, -6, 9, -12, -15, 4, 0, -33, -9, -38, -32, -6, 43, -47, -13, 10, -24, -9, 22, 5, -6, 8, 28, 0, -6, 3, -9, 10, 5, 2, -4, 13, 3, 12, 6, 10, -3, 0, 27, -34, 4, 13, -7, 11, -19, 27, -7, -7, 22, 3, -22, 27, 8, -8, 14, 0]
3277@m2N7l8k0L8nkK9pn3N0j9J5LMj5J3j3J0j0K5ok5J4J6j4k0K4J3m3J7K7l6K
3311a1M4on3K3J1j8J5qj6j4K1J7Pj3%j2qMJ5klJ7j6qK4Kk2J5PpJ1j6J1J6l5J2
3347DQj8k3K5QNK1l2j4jK1j7K3qj4OmpK2Qk9M2l6K4l6L9oj9nJ1PJ9kK3l5ppLM
3386CJ5K3l3l1J1jK2j4j1L1k1J5J4m0J2J7Oll1J5mJ5jK1Jl5Nj8J8JJ2rk0J5J5
3421A5oj6K8l1OOMPJ3k7k3K3Qj2JM2j6j0k0mOK8l4J4kpk0LL0j9j1K3J0m0K9j4
3457a6ppL0nJ6k4J8mK1k3%L1j4jNj1J3m6L4l7L2Qj2k5J9oQJ9k3LLK2k4J1Lk0L
3494fJK4l6K6qnj4J6J1qJ9l9OL9k3nnK7nj6J8Ol1K5k%k9K2k1L7ppj5LJ6k6PJ2
3532Gk1J6j5k2J2K5j4oJ8K0j3k9K4%ml8K6pM4k6J4J8m6kL7j4j2JK0lMNm1MN6o4
$$ y = [0, -42, 15, -23, -43, -5, -10, -12, 17, 10, -43, 7, -12, 3, 6, 10, -5, 8, -5, 5, -5, 20, 14, -11, 3, 19, 5, -15, 9, 22, -21, -4, 23, -13, -11, 33, 27, -26, -3, 8, -10, 5, -3, -19, -33, -12, 5, 12, -1, -1, -13, -21, -17, -2, -4, -7, 10, -6, -14, 10, 12, -10, 5, 12, 5, 16, 0, 11, 27, -8, 4, 12, -6, -29, -4, 4, 9, 30, -2, -16, -17, 4, -13, 10, 2, -12, -6, -10, -17, 5, 13, -16, 26, -10, 14, -22, 17, 11, -8, -13, -2, 5, 24, 22, 45, 10, 3, -4, -1, 3, 18, 41, 8, -23, -12, -13, 9, -5, -16, 15, -6, 9, 23, -17, -5, 12, 18, 15, -16, -1, -5, 10, 9, 30, 31, -4, 1, -17, 1, 2, 14, 5, -15, 0, 15, 9, -7, 21, -10, -4, 2, 6, 13, 26, -1, -24, -1, 7, -5, -4, 38, 22, 12, -8, -12, -6, 22, -12, 2, 0, -7, -27, -24, 6, -13, -24, -1, 9, -31, -2, -16, -23, -30, 0, -5, 11, -13, 5, 1, 22, -1, -1, 30, 16, 15, 20, 9, 22, -24, 10, -27, 5, 13, 1, -24, -5, -11, -3, 16, -7, -4, -1, 21, -3, 8, 11, -9, -6, -5, 19, -17, 9, 1, -4, -18, -2, 9, 1, 20, -19, -13, 26, 3, -2, -7, 20, 15, -1, 17, 23, -8, 17, 15, 15, -14, 8, -13, 24, 17, 10, -5, -2, 14, -12, -5, 7, -14, 2, -13, -35, -23, 2, -12, -18, 0, 20, 7, -22, 2, 2, -2, -40, -14, -21, 23, -3, 11, 29, -17, -19, 18, 4, -8, -7, 13, 10, 14, 19, -22, -18, 38, -26]
3568b6RL1j5KOjk0oK8ql0K5L1m4MJ9j3pJ2pjJ7QqJJJ9npj2qJ5lk2L5n1J1L2Mm2
3608b6K1jnkOMj5L1prL8l3j1J8j0K2j3J6k5oK5j1j1kK2j3mQKk0J9qPQk0PK5l2
3646ekJ5mnJrmj6O9l3k8K9%J5m9mJ1J0K7k2j8K4%oj7RmKL9k4qL3k5KMK3j7qK1
3685B6l1Plj8L3%j0k5K4K1k8J1l2M9m1qK2k5L5k1J4j1jMqQk0M2j7PKJ3%l0J7N
3721A1lKJ0nj7Oj5rNJ8k2K4pl6K9rLJ2j5J3k5J9K7j8pN1m6J0joQk8N3k7MQj9j2
3759a4J7qMJ3Kj6K5l3Nk4M6j6k2J3J5J4k3NQMJj8MJ6j8Pk6nJ2K1orRrJ1j3oJ4
3797@K3l2K2j8JJpj3M5j5J2j3oJ5rj1K2l2Q%K8l6L5rj6J9mm2M0k4NPorMj9L4j1
3835a1j9J4jM5l8J4OK1l1kj5L3j1jK3l0J5j4j7K6Ojl6J6PRLk6mNj0K7JonJ0K0
$$ y = [-26, -17, 14, -1, 1, 7, 6, -14, -20, 8, 0, -30, -5, 26, -18, -14, 5, -8, -15, -3, -10, -11, 6, 14, 6, 7, 8, 27, 22, 15, 3, -5, 10, 7, -15, 20, -31, -20, 12, 16, -26, -5, -6, -11, -13, -7, -3, -18, 13, 6, -3, 35, 2, -9, 9, -1, 21, 8, 24, -1, -7, 18, 7, -4, -6, 16, 3, -1, 7, 9, -11, 8, 0, 7, 15, -5, 2, 27, -5, -7, 8, 4, -1, 0, -9, -13, -29, 40, 7, -21, 8, 8, 23, -26, -30, -19, -9, 18, -4, -22, 2, 2, -4, -21, -12, -16, -14, 25, 1, -7, 26, 1, 3, 7, 30, 13, 5, 26, -5, 2, -1, -19, 14, 14, 4, -21, 3, 24, -4, 7, -25, 24, -17, -25, -3, -28, 7, -14, 0, -11, -12, -8, -16, -8, -28, 14, -3, 4, 6, 19, 19, -11, 6, 11, 8, 10, 20, 15, -2, 4, -11, -20, -15, 3, -19, 5, -2, -38, -9, -18, -15, -3, -18, -5, -30, -11, 16, -2, -9, 42, -4, 6, 5, -1, 7, -21, 32, 5, 9, 17, -2, -14, 3, -5, -1, 12, 14, -2, 23, -10, -5, -29, 17, 1, -21, -8, 7, 21, -2, 3, 11, 15, 16, -2, 2, 18, 0, 7, -19, -24, -12, 9, 3, -6, 3, -6, 5, -8, -14, 0, 23, -9, 13, -5, -4, -3, -10, -23, 22, 7, 19, 6, 0, 15, 6, -5, 17, -15, -7, -7, 21, -15, 20, 11, -5, 14, 10, -32, 8, -16, -11, -4, -10, -19, -15, -34, 0, -11, -30, -16, -17, 28, -10, 4, 10, 31, 0, -2, -17, 16, 5, 4, 27, -3, 12, -2, -19, 7, 13, 12, -24, -8, -1, 8, 11, -15, -19, -14, -24, 3, 4, -2, -7, 3, 23]
3872B3k2RMmk2Rk6K8J0nj7L0j5pJ3nmk0L9onk6JJ1JJ4lLj1J4k4L1l6k8QK6J8O
3910A2j7J4Ll2J6l1L7Pj7oOk9M4Ll0J2J2j7LrL6j9JNmj2K4ok3nO1l7moj4J5qK2
3948GrJl0J8K1k5L1l1LJ2qJ8k6Nj0J1K3J3ompQj9jJ7l0%L3j7K1j0J1j2ml7K1%
3985a2J2lJ5Ok1K5j2j0k7L5j1rkL3k4K5j6Pkpk0OJ5Lomj5J3RKj2kL0Ml4j5N3l2
4023cJ9n1K4%pN6l1l4L5K3l9J2k1K8omnL2rl6Lj6L6jj5NjnJj5J7QqK0j1j1J5j7
4061a2nL%K0qJ8qj2mMJ1j4J3K5p2L0QJ8k8L1pppk3L8j5Lj3j2oL4j8M6m2QL1k3
4098ERj0j0J9l0K4j3K7jl0PJ8j2j9Qj4j2M4j2lJ7j5K0k4J3k6j2J6K5k4OJ7j7L4
4132B5j3%j5pJ8j0KM0k1nm7L5k0K0J1Kk0Kk7K4j9K0RnJ2j8J0J3m8M8m5J53j36
$$ y = [23, 1, 10, 14, 10, -12, -3, -29, -1, 9, 4, -13, 17, 2, -5, 8, 3, -1, -21, 18, 12, 7, -19, -18, -7, -6, 8, 5, 8, -3, 11, -13, 18, -18, -46, -38, -12, 6, 12, -5, 9, 12, -20, -4, -35, 2, 9, -8, -14, -8, -37, 7, 10, -20, -8, 4, -13, -10, -19, 17, -2, -1, 4, 0, -12, 12, 6, -17, -22, 39, 2, -2, -8, -22, -7, -15, 7, -2, -1, -31, -13, 8, -17, 14, -17, -14, -2, -10, 8, -18, -13, -23, -12, 11, 24, 18, 14, 7, 15, -4, -5, 12, -18, -18, 15, -2, 19, 9, 20, 8, 4, -33, -12, -12, 0, -3, 12, 18, -3, 22, 10, 0, -27, 8, -3, -12, -14, 19, -5, 20, 4, 11, 9, 2, -18, -12, 3, 6, 0, -4, -19, -6, 3, 5, -7, -9, 21, 25, -9, -24, 29, -3, 16, -35, -11, -11, -18, 38, 7, -27, 8, 31, -8, 4, -17, 11, 5, 1, -4, 28, 19, -17, -14, -30, 6, 5, -10, -5, -6, -11, -10, -25, -8, 0, -8, 12, 1, -10, 5, -12, -17, -14, -14, 6, -2, 16, 8, -4, -8, -4, 7, -7, 6, 31, -41, -11, -3, 15, -13, 18, 11, 4, -3, -26, 12, -3, 0, -13, -25, -31, 3, -15, 31, -11, -3, 28, 5, 14, 4, -6, 13, -17, 7, -6, 21, 20, -10, -3, 15, 3, -16, -8, -22, -34, 10, -2, -5, 12, -3, 17, -7, 6, -20, -32, -16, 9, -15, -9, 8, -9, 25, 12, 12, -3, -10, 8, -2, 0, 40, 19, 14, -33, 2, -18, 2, 13, 15, -5, -3, -30, -6, -25, -5, 4, -1, 11, -7, 3, 16, -32, 16, -29, 124, -12]
4165a2o3N3R1L2j43O1N7Nj98J16l2M4n6K0J0K1L0J4Lp7O4j9kK4p4pP9m2m7M1k2
4196b9M6j1jm2L2l9N7j9L1k8Kj7M1l7kj8M8k1RMk4NjK1nk9J6K2Jk2m0Q2m8kNK1
4232Hj3j5J2j8k4M2qL1J9k1l5K1J4Kk9J6J1n7L2M1l0K1n0M1Kj5l7N1Qk3K9ljj3
4266IlkRPmO2o4n1O5o7M9l9RK4KJ3K4l7J6n3K7Ool2M2o0J21p9j0l7P8p0pJ01l8
4301Emj9M0j4jJ7Pp1K3J9O4q0K4l6K0O1n8k9K8j7jM6pk2k7Q0o6ln8N7j0K1j2J04
4335H1q6N3o8J4j9J0M3j3l6j2J8P7l6k2K0k8K4m2J00q1j4J1j3l1NoK3j8pj5M3
4366b5j2k7J10j40O8K0pP7j03L7q2J32j53J09M0L2r0o6Q2K7m9J17Mj27L3j07J03
4393Cj8P6p9MJ42j03J2l8J06q9p0L7l7K7j3M6Qjo5J42l2p7O2j60J70n1q1J11K9
$$ y = [-12, -75, -22, 69, 101, -42, 19, 76, 81, -117, -1, -33, 11, -45, -25, -15, 6, 36, 50, 53, -24, 40, 21, 19, 43, -31, -38, 41, -1, -48, -7, -29, 17, 6, 5, -37, -5, -44, 13, -6, 25, -3, -1, -18, 23, -14, -16, -34, 14, -7, 2, 6, -18, -13, -14, 7, 2, -27, -11, 11, 12, -10, -50, 32, -16, -18, -13, 8, -5, -20, -8, -26, -50, -8, -16, 15, 34, 13, -22, -1, 13, 15, -14, 2, 13, -44, -12, 29, -1, 20, -30, 11, 13, -2, -39, 12, 20, -3, 26, 23, 22, 9, 6, 4, 13, 20, 16, 78, 14, -37, 28, -39, 10, -29, -20, 4, 6, 19, 43, 6, 22, -31, -4, 2, -4, -36, 6, -54, 67, -12, -22, -59, 19, -51, -58, 43, 5, 1, -18, 22, 8, 7, 24, 31, -40, -17, 2, 66, -14, 10, -26, -6, 55, -3, -32, -4, -21, -22, 24, 17, -5, -32, 48, -18, -21, -79, -22, -32, -11, -23, 81, -5, 48, -20, -6, -25, -15, 28, 15, -21, -33, -15, 62, 26, 4, 24, -4, 20, -22, 78, -3, -17, -6, -19, -50, -45, -51, -28, -46, -53, -68, -25, -37, -64, 46, -94, -26, -6, -13, 64, -39, -2, -84, 48, -105, 4, 44, 76, -14, -80, 2, 29, -20, 97, 101, -26, 7, -100, 3, -15, 61, -18, -14, 128, 25, 37, -1, 105, 16, -54, -17, -54, -27, -40, 6, 14, 13, -52, 90, 58, -19, 43, -117, 53, 2, -79, 32, 61]
4422F1j26pJ61j10rJ19j54J29j29L9J56k03j0L7K3jk0J10j33R9k1L5k3N2n6J4
4448C3o0J0l0lk1Q8J8N3r1l8j7m1O2R2j48P0n1lP2PpL4P2j03qJ0o7N7N9j20N2
4479a9j1k0pJ32J1k5j2j9M1q6P4rJ9r6P3k0j26J90j56L21k58k9m9P2q8O3Kj12
4507a44J61K7m5R4k28J38r5J51o3L6n8j16J99j5j21P7K9Oj87K26n2J1l8j7m6L
4533f7N6k1K5j3l9m1N3K5J33l0Rm5k8j83J57r3J06j1Qo5J16j6j40J5J9k6Q0j13
4561a29q0J52o3O0J90j14Q8j26J11l26J79R8k58J33k0O0l2J46o2J25j74M4j58
4584a56P5l7Q4K66k43O8Q4k62K1Q9K8M7j19L5K2Rj02J01m6J43j87K83j06lk69
4609a75N6J73L1j57q5J76J12j57l2r0J39K03j63N0j16J33r1rK0k52L01pl5j8p
$$ y = [61, -65, -72, 89, -21, -30, 89, -65, 64, -65, -26, 130, -73, -83, -46, -23, -24, -44, 66, -67, 32, 11, 46, 23, 75, 19, 33, -27, -17, -47, -50, -71, 17, 35, 88, -3, -41, -58, -99, -37, 55, -93, -23, -74, -77, -5, 2, -5, 29, 101, -2, -10, 0, -67, -10, 49, -71, -19, -30, -50, -57, 75, 86, 61, 49, 30, 71, -15, 59, 50, 69, -27, 46, 26, -100, 90, -66, 255, -3, -32, -81, -9, -97, -34, -32, -144, 17, 44, -1, 93, -135, 3, -92, 59, -4, 32, -26, -142, 57, 42, -79, -2, 27, 33, -154, 72, 20, 31, -7, -24, -70, -67, -11, -32, -7, -20, -59, -100, -47, -22, 111, 81, 90, 45, 17, -166, -9, -102, 4, -7, 1, -64, 52, 36, -104, -89, -70, -96, -16, -129, -209, -57, -120, -60, 130, 16, 104, -22, 89, -237, -58, 40, -218, -85, -105, -45, -77, 69, 7, 132, -42, 2, -156, -81, -118, -34, 232, -11, 57, 141, -121, -100, -11, 17, 64, -55, -20, 2, 11, -91, 10, -36, 107, -80, 203, 97, 94, -175, -119, 54, 85, -72, -157, 19, 131, -26, -58, -148, -9, 194, 31, 81, -35, 98, 7, -2, 18, -234, 67, 60, 25, 7, 0]
4634@j25J77j8M5P1k33m2J28m1j8l8J28k1P1n0p3r0N0J45k32Q9J28P2j15l7O5
4660C6k2j08M5nJ06M3J3j7K7r9K6j03J11k23K06J50k47r9J53l9Q4p2K8L4k08J47
4686c3N4P0Kj08j12J35J29p6j61M0J57k8j89J93j21R0K4n3j9P9J2m5o2N1QK4j
4713F0rm9oK9o3Q9m2k7Q3K0k05J01k0Q7l3J2n4J28L9r6p2K2k0j23K21qj93O3J47
4742H1n4m9j4j17J09J41j11O0q4R0K3j4K5j73R1%j24J50J5q3J3NJ09m2j3O4k3
4769G5Jj28R6pl8l7L9K9r8J62j23k1J39j00oQ3j14R6J4k2l4l9N5o8m0J26m2J0
4797Hj09Q1J4j5J45p1j8J1k2J3q2M4m4Qrkm6J33K3o1m2P4p0l4pJ33q5K4N9q1L5
4828GJ05j22P2r1O0m9L7o6L8j43J41J3qLkQK7qK2l5K6o2M7q1J00J9O0o8m1k2o7
$$ y = [0, -125, 52, 34, 79, 150, -83, -125, 3, -38, -56, -94, 34, 13, 84, 34, -39, -129, -79, 66, -166, -77, 51, 123, 8, -29, 36, 14, -94, -49, -54, 52, 95, 108, 91, 118, 19, 45, -58, 53, -170, 36, 186, -61, -160, -7, -46, 38, -34, -6, 28, -180, -33, 21, 91, 93, -15, -127, 8, 137, 61, -100, -60, 97, 69, -120, 73, -48, 42, 66, 13, -6, 73, 85, 40, -22, 29, 37, 61, 60, 51, 2, -4, 25, -38, 51, 9, -18, 65, 85, -120, -19, -39, 48, 15, 27, -27, 101, 140, 44, -28, -6, -26, -149, 72, 64, -129, -66, 81, 27, -22, -36, -153, -44, 97, -14, 46, -38, 52, 75, 61, 86, -87, 4, 4, -120, 30, 45, -38, -25, -20, 89, 47, 34, 98, 75, 76, -52, 44, 37, -1, -38, 1, 30, -68, 94, -29, -50, 89, -11, -17, 66, -48, 48, 62, 40, 6, -33, 22, -46, -86, 40, -2, 8, -101, -20, -6, -21, 124, 53, 35, 46, 24, 37, -45, -1, -45, -37, -46, -48, -94, 39, 62, 1, -41, 33, -37, -71, -78, 55, -30, -6, 53, -28, 7, 112, -10, 62, -29, 31, -18, 19, -47, -9, -152, -11, 2, -6, -3, -5, 3, 30, 22, 44, 9, 35, -27, 20, -61, 39, 58, 118, 50, 9, -13, -80]
4859h0P6L9r2O3m3P8m7J8k3m7K4Q8r1LrLj5N3qk7Q2j08J66j36Ol2Q8rj8L1N3j18
4891c2J0O4n4l3O7q1Q7K6qq4J3mL2J0L0q3M4l1k8J1k0N4J5K7%lK8p3l2N1rn7J2
4924e1jN9j1mk5L7kPM7q5J8mj0%l2Q4m4L1k5j7L7J2J3m1J5k1J2Pln2N8j6O5j13
4958e5M8l0M8k7qM2Pq9P5rm5O0l2J3PJ5j0l2K8j3MQk0K3j8JKJ3oJ4m7Q3rm6K6
4993B1Ml1L2m0RL7m3L2n7L7J3Pl7L0j1m9L0K5nl3K3Rj8J5mlMJ5k6J4Ok1K4l2M8
5028B5k2j8K6j0Qj1OjJ5k5M2k6jk0L3k5PLj2k1J5L7l9NK5j7OpKJ4o4P1l9J8j9
5063a9OQk1LJ0L5k3qk0L6k8J9J0%j4rJ9k1OoJ6k1KL5k5NJ7k1J7j4QK9k1jq3J08
5099C4q9N4KNj4J1j2Nok7L7Jj7rO0j0k1kk9L5koL0m4J9oJ22j61N0j6ONj4K3j9
$$ y = [-80, -4, 35, -57, 6, -37, 41, -6, 12, -11, -58, -34, 54, -37, -34, -43, -40, -55, -2, -10, -37, 45, -63, 103, -33, -27, -59, 29, 20, 2, 33, 86, -32, -22, 42, -12, -45, 22, -59, 28, 54, 46, -38, -25, -29, 3, 13, 43, -40, 4, -27, -55, -44, -64, -10, 5, 32, 32, 29, 57, -16, -48, 3, -6, -63, -51, -52, 7, -4, -8, -33, 4, 2, 9, 56, -29, -11, -15, -25, -25, -57, 27, -17, 14, -11, -28, 9, 21, 34, -7, 8, -13, -1, 6, 3, -49, 9, -7, 58, -55, -7, -37, 11, -16, -24, 18, 25, -64, 11, 2, -43, 17, -15, -2, 5, 20, 10, -22, 6, -7, -3, 5, -15, 8, -10, -9, -7, 6, 0, 14, -33, 50, 41, -5, 21, 25, -6, 26, -14, -5, 32, -11, 21, -36, 1, 14, 21, -16, 14, 3, -46, -16, 9, 4, -29, -6, 3, -15, 0, -4, -7, -3, 12, -14, 0, 6, -15, 9, -23, 25, 3, -15, 11, 1, 9, -2, 4, 3, 18, -7, 35, 9, 8, -12, 21, -4, 3, 6, -6, -27, -12, 25, -14, -9, 16, -1, 5, -2, 0, 14, -50, 21, -18, 0, -19, -13, -5, -26, -23, -13, 22, -1, -9, -29, 7, -21, -2, 8, 8, -6, -15, 4, -17, -11, -17, -1, -22, -20, 15, -10, -5, 12, -9, 8, -6, 2, 31, 10, 9, -74, 34, -55, -1, 1, 6, -8, 3, -9, -4, -10, -37, 0, 1, -16, -25, 35, 25, 4, 2, -27, 8, 6, 0, 30, -14, 5, -1, 121, -40, 10, -6, 0, 5, -9, 14, -5]
5134emM6o2M6mpJ0n9J0J03o5J6l7J4o3j8Q6rQQJ3k6jj4l7N2QMk7N6n1j6J1K6J1
5169B3J3k0p8P3j9L0k4l2N8k1k9M7J4m2k3L0J7Opk8Qk0J9K4k7rJ0L6n2L1Lj4N
5202BQk9L0nm0L2kJ2k2J9Rm0PL0j2K8k0J4k2k0K6j7rJ8j9K8j3PNoLj4nL4qk6J6
5239amJ8K8m5j7M1k4K3l9N6k2kqK1om3kK8oJj%lqMJ1Kl4L2K9m5L1j0nJ2k4J2J4
5277A4Mlk5LK6k2j5J8j3J6nj6NjJ3nnNJ4lRm5M4j7K6j3k2L7qj1k8K4j1J0JjL1
5314C1m4k2L8Mk0MOPOLOk1J9k6K7pk1L2Mk9J8j1j8J8PJ4k0K8l8mJ5j2J1rj3K0
5350Cnj0j3lL4j3pJ9J9j2l3J0J8j6jL2m5K1%L6l0J0j2lJ8j8L6n7M6j2k4J8pRk
5385FqJ9j5kNmQmJ8j5j6LK1j2j8N2l0j0J7p%k6K9L3m4J0Rqk9RK1oOj3Lmqk0O0
$$ y = [-5, -9, 37, -25, 21, 17, 10, 20, -39, -29, 74, 9, 25, -12, 2, -61, -79, 7, -2, 6, 14, 27, 1, 0, -14, -51, 1, 9, 13, -14, 42, -9, -25, -14, 12, 23, 36, 16, -62, 11, -8, 22, -2, -34, 24, 3, -26, 21, 35, -7, -30, 0, 17, 23, 16, -12, -4, -24, -5, 19, -8, -17, -7, 29, -23, 8, 11, -3, 2, 10, -19, 11, 6, -34, -2, -4, 8, -14, 5, 14, -26, -19, 11, -1, 27, 7, 21, -1, -21, 5, -12, -21, -3, -22, 6, -7, 0, 5, -1, 2, -12, -17, 17, 9, -17, -1, -5, 13, 41, -4, -21, 20, -4, 19, -20, 36, 14, 12, 4, 25, 19, -24, -26, 2, -4, -3, -4, -4, -7, -15, -11, 0, 2, -32, 0, 29, -16, 15, 5, 0, 12, -12, 0, 14, 18, 15, -10, -7, 19, -3, -18, 0, -13, 3, -2, -18, -13, -14, -1, -6, -11, -6, 8, 5, 14, -31, 13, -4, 22, 9, -13, 24, 16, 5, -23, 1, -10, 0, 1, 0, 31, -13, -35, 3, 7, -13, -9, -3, 4, 10, 13, 19, -2, 17, -9, 18, 11, -10, 22, 26, -3, 15, 4, -14, 4, 11, 25, 5, 33, -5, -9, 6, -6, 5, -4, -17, 3, -2, -12, -25, -28, 6, -7, -14, 5, 24, 12, -21, -11, 7, -9, -10, 22, -23, -2, -2, 34, 4, 14, 2, -1, 17, -1, 35, -22, 24, 12, -12, 6, -1, 8, 6, -2, 17, 2, 0, 5, 1, 9, 5, 23, 8, -8, -5, 16, 4, -14, 38, 8, -2, 15, 8, 8, -18, 11, 44, 0, 10, 19, 11, -18, -9, 12, 6, 12, -1, 2, -2, -10, -30, 30]
5424C0k9j9J7nj8OK1j0pLK4Mk9JML9m8K6j6%k2J2J5%RQk8K8L2l8j0LkmJ2r%K4
5462B4K1o4nJ9Rj2mK5j5k1L5j8j3PK0qk6K9rj0lj3K0J1%jJ2J3l1K3nQPk1j7L2
5498A9k8J0%Pk9J9kk3K9knKJ6j6kj4K8j7j7mL5mJ5l0OJ7j9J2mjJ5Kk8ljj6M6k0
5536gK1jk3PJ7j5KPj4J7jj2oMjj0J2R%k4MJ5j7L3k7Oj8K3%k7K4J1Lj0J0%j0j0
5574hOj6QkLlL6m3J1J7J8k3k5J2j0J3RLj9J7qJ0j7j2L2k9K8J2k1K7k1J4j7k6K
5609b2J4KK9rl4L8J8n3L4j6L5m5JQJ6j9J8j0Rql7L6k1J0kK4l4K1Jk3RLlK7l9L1
5645IloJOJ6k7J2k7K9j4K0j1j4L2l7J9L2l1PMmj5Qj0j0J7k0QJ2JlonNPj6j1L1
5683Fl3L7k8J1l3O3k0k0K1j8K1jk4jOK2k2J4j4J9nj9K0Pkk2M0m4PpK2j4jJ3K1
$$ y = [30, 1, -18, -1, -6, -24, -18, 3, -7, -14, -11, 13, 17, -12, -11, -7, 32, -16, 10, -6, -6, -28, -16, -1, -1, 8, 16, -12, 16, 48, 10, 0, 3, 1, -3, 9, 0, 0, 24, 45, -19, -24, -5, 4, -8, -12, 13, -2, -23, 12, -6, -19, -12, 8, 0, -26, 3, -6, -16, -19, -32, -12, -1, -1, -2, 10, 23, -8, 15, 10, 18, 25, 4, -13, 19, -9, 1, 1, 8, -21, -2, -4, -27, 2, 0, -5, -3, 13, -3, -5, -19, 9, -8, -25, -29, 6, 2, 17, -13, -7, 10, -9, 3, -1, -2, 13, 15, -13, -16, -17, -33, 13, -7, 14, 13, -10, -3, 14, -1, 1, 8, -6, 11, 10, -2, -8, -4, -5, -15, -3, 6, 6, -18, -14, 1, -16, 17, -10, -4, -22, 1, 1, -26, -2, 9, 12, 2, 12, 12, 2, -8, -2, -18, -10, -12, -9, -12, 24, -19, -8, 9, 27, 4, -21, -9, -19, -6, 3, 6, -13, 4, -4, 6, -11, -23, 9, -20, 8, 20, -1, 26, 5, 19, 2, -24, -22, -8, -6, 23, 14, -20, 18, 36, -17, 17, 1, 36, -9, -8, 0, 16, -3, 15, 5, 14, 6, -31, 5, -16, -6, -8, 16, -18, 3, 4, -19, -10, -7, -10, 17, -22, 9, 6, 0, 1, 7, 23, -4, 8, -19, 10, -4, 16, 5, -9, 23, -14, 5, 37, 6, 13, 17, 13, -2, 6, -4, -14, 3, -17, -9, 3, 4, 1, -5, -10, -5, 2, -14, -25, 6, -27, 10, -18, -7, -40, 23, 3, -17, 4, -14, 7, 6, -18, -19, -13, 9, -13, 1, -13, 6, 1, -18, 2, 9, 7, -15, 25, -19, -12, -19, 3, -11, -12, 1, 22]
5718B2%l3MJK3j0k5K2l9L7lj1j0j1K3k0L7k5J9kjNj5L1j7pL1j3J4j9k1K6j4J1
5752A0%oJj7K7qjj5Nj9K2mmoJ0J7k8j5J9J1k8M8k5K8j7j9J6rqPJ0PK5l5pKJ0J1
5790A5k0MJmJPj8L5k7MOj6j0Njj2Rj8K6K0k5J6J2k6J1J6j1%J1nj1nK8l2J4J4l1
5827a7J8j0J0k1J9kLjnj1K0kj5LJ3j2kKmMK2j3qPJ0k6K1j5l0K0K5n1N2Qk4JQm
5865gKJ0j6K4m9K6ONpOJ1j3OmOJ0mk3nJ0MlQJ3k2K0j7qJj0J3MJ0j1KpK1nj4j6
5905b3K0kK4l2K0lmj0PNj4J1Mk8QL7l6L5j2Ok1kK3jop%Ql9nJ0KN4l2jm4L2KPj4
5945b1NOmL3j2k2K1k6oK4kj0qK1j9M5m7M4j4pRj4rj0J3j5J9lJ6jJ4m1pL6J7k5
5981@j5J6RrqK5Jj3j4K0j0jQj3%K0k1J5Jm3J9Qk0L0%mMj4%L2J0l6j3Qj8L7j6r
$$ y = [22, 22, -11, -7, -6, 17, 7, -18, 4, -35, 2, -1, -12, -22, -33, -10, -30, 7, -18, 1, -1, -2, 3, -12, 19, 2, -5, 26, 13, 27, 8, -13, 13, -1, 10, 10, 4, 5, -12, 15, 7, 6, -9, -4, -23, -1, -5, -9, -15, -5, 12, -16, -31, -12, -1, -29, 19, -6, 22, 5, -14, 2, -7, -15, -8, 2, 9, 34, -1, -8, -6, 4, 15, -5, -1, 0, -4, -3, 4, -14, 21, -6, -2, 4, -12, -22, -17, -18, -30, -21, -39, -13, 7, -18, -2, 10, -16, -5, 11, 0, 0, 11, 6, -5, -10, 18, -14, 0, 14, -17, 1, -9, 1, -20, -1, -3, 0, -1, -6, -17, 3, 1, -14, -11, 2, -10, -12, -10, -14, -10, 12, -1, -9, -2, 8, -18, 3, -12, -42, -22, 3, -48, 4, 12, -12, -11, -3, -7, -5, 5, -11, 13, -36, -10, -4, 1, -6, 0, 11, -2, 4, 0, 6, 16, 12, -11, -16, -6, -2, -5, 3, 16, -6, 14, -3, -11, -10, -20, -7, -3, 7, -4, -2, -9, 12, 7, -7, -23, -3, -5, 19, -13, 7, 4, 0, -10, -3, 2, -12, -1, 3, -25, -17, 20, -16, 19, 7, 13, -8, -10, 13, 12, 6, -1, -1, 7, -32, -37, -27, -25, 29, -3, -4, -48, -16, -14, -7, -21, -16, -10, -14, 19, 7, -15, 6, -20, -26, -2, -4, -14, -22, -1, -20, 25, -22, 22, 8, 1, 10, -4, -13, -23, -10, -25, -6, -9, 7, 6, 20, -21, -28, 8, 25, 0, -15, 1, 10, 1, -7, 18, 19, 6, -8, 12, 2, 1, 9, -4, -4, 16, -5, 10, 11, -32, -13, -5, -25, 5, 5, 1, 5, -9, -9, 23, 33, -3, -16, -8, -26, 11, -5, -14]
6019a4L9k5j6QjOOnlmj2L7j4pLJ3qpj2K5QOk9K2Ok0J0pJ3j8j5K1jk8LK2lK6j9
6058Fj0k1OJ6j3lJ3mJKK5j7Qj0Jk7K7K5m7K4k1K6j3nk9O2k7jjJlNj2J9nj9K4J0
6096A3l6J9j0k7L6L0k4j7K8k7oK0j3K9k1k8K6lM0k3qKk3K4J2j0OKj7jJ7ljj1K4
6131A9mmjpoKnj1J8P%j3j4K8%plj1JJ4loRlj4J8Nl3J2JJ4rJ0K5j3%j4mQJ5k1J8
6173A8qk7jJ1J2QJj4k3K2J1k2Lj0J8Ql6K6mKok1K5jK1J0l3J0n%PJ2nk2LnLKJj1
6213b0K6JNk3K0mpNNk1J6kPl0J5j4qK7j2rJ5M3n8L6nJ5k7J4RlRl6L2m2J0J0J1
6250A0qpJ0RQj4pJ1koK4j3k8M%K7pqjk4J8K8j2pk6J6mqPK3jk3OqJ5%j1j2K0jL
6291Aj5K6Oj9J0j5K6j4pmJ1j2J1lk7K8k6M0j7j2Nl1K1P%pj8L1J4j5oKnL1lJ6l6
$$ y = [-14, 25, 0, -16, -8, -9, -3, 3, -2, -5, -9, -21, 16, 2, -5, -2, 11, 3, -4, -16, 9, 17, 23, -6, 16, 22, 2, 12, 5, 18, 0, -15, 6, 5, -23, -20, 2, -1, 25, 6, -4, -25, -19, -3, -16, -19, -6, -10, -9, -7, 18, 1, 9, -1, 0, -27, 0, 25, -22, 2, -19, 7, -6, -11, -40, 22, -5, -6, -7, -6, -9, -4, -16, 3, -2, -21, 3, 13, -23, -4, -14, -41, -5, 25, 1, -16, 12, -15, -21, -1, -14, 15, -6, -34, -8, -11, 29, 6, -2, 0, -23, 1, 13, 3, 9, 11, -6, -7, 10, 7, 6, -5, 19, 15, 11, 10, 3, -3, -1, -6, -17, 1, 8, 8, -5, -19, 9, 9, 2, -1, -12, -11, 3, 0, -6, 3, 0, -14, 4, 9, -24, -12, -11, 3, -6, 4, 29, 16, 16, 2, -2, 6, 21, 0, 18, 10, -17, -18, -7, 5, 13, 14, 0, -23, -1, 10, -12, -9, -19, -1, 7, -29, -3, -7, -5, -11, -32, -7, -8, 13, 23, -10, 0, -5, -5, 2, 14, 9, -13, -10, -15, -12, -10, -9, -20, 6, 7, 12, -11, 9, 5, -2, 3, 8, -13, 3, 1, 8, -22, -7, -21, -29, -2, -14, -23, -8, 35, -23, 13, 8, 23, -4, 10, 19, 16, 25, -11, 21, -21, -11, -1, 10, 2, -5, 5, 14, 22, 8, 1, 12, 10, 4, 28, 15, -13, -9, -9, 18, 11, 3, 2, -22, -4, 24, 12, 5, -21, -5, -9, -17, -10, 13, 12, -11, -5, -13, 2, 2, -9, -21, -1, -2, 1, -14, 12, 18, -1, 9, -6, 20, 6, -1, -5, 6, -6, 5, 2, -25, 3, -23, 17, 0, -12, -7, -38, -17, -10, -10, -17, -35, -4, 10, -5, -11, -9, -14, 17, 14, 30, -6]
6328fLpk4N5m1L1k4J8k4J9j8K9k1J7j4J3KKJ6j8Jk5nnK5j2K4Ro4N3lj4L1l3LQ
6364ANj6J9jMk4J4k0j9L3Qlj1oK0Nnj6K4oJ4On4N6m4J8pj2J6J7l0K4k1jKn2Q1
6401A9j8rLj2NnL4Oj2nPKj1J1l2jMK1mOk3jJK2KlJ4Ll3%NK7l9K5k3qJ4lj%L%J6
$$ y = [-6, -3, -10, -34, 21, -20, 11, -13, 5, -19, 0, -18, 11, -10, 7, -7, 6, 8, 10, 26, 8, 9, -16, -21, -26, -1, -13, 11, 20, -44, 9, 6, -8, 23, -10, -7, 1, 6, -10, 9, 8, 12, -12, 2, -18, -37, -4, 4, 1, -10, -16, 4, 9, 4, -12, 12, 6, 20, 26, -28, 28, -16, 2, -5, -17, -1, 16, -14, 10, -11, -12, -10, -62, 19, 1, -8, -5, -17, -12, -17, 17, 23, 11, 6, 13, 15, 4, 15, -17, -18, -14, 7, 3, 9, -14, -15, -14, 8, 10, 7, 21, 24, -9, -9, -4, 23, -16, 9, -14, -22, -8, -11, -12, -12, -9, -9, 7]
$$ [...]
8191A8
##END NTUPLES=NMR FID
##END=
