##TITLE=1H_FNO504
 CDCl3, 8 sc, 
 8.4.2019
##JCAMPDX= 6.0         $$ Bruker NMR JCAMP-DX V2.0
##DATA TYPE= NMR FID
##DATA CLASS= NTUPLES
##ORIGIN= UXNMR, Bruker Analytische Messtechnik GmbH
##OWNER= root
$$ XWIN-NMR		Version 3.5
$$ Mon Apr  8 14:06:19 2019 Russian Standard Time (UT+4h)  she@DPX200
##.OBSERVE FREQUENCY= 200.1315
##.OBSERVE NUCLEUS= ^1H
##.DELAY= (6, 6)
##.ACQUISITION MODE= SIMULTANEOUS
##.ACQUISITION SCHEME= undefined
##.AVERAGES= 8
##.DIGITISER RES= 18
##SPECTROMETER/DATA SYSTEM= spect
##.PULSE SEQUENCE= zg30
##.SOLVENT NAME= CDCl3
##.SHIFT REFERENCE= (INTERNAL, CDCl3, 0, 15.7039)
##AUDIT TRAIL= $$ (NUMBER, WHEN, WHO, WHERE, WHAT)
$$ ##TITLE= Audit trail, XWIN-NMR		Version 3.5
$$ ##JCAMPDX= 5.01
$$ ##ORIGIN= Bruker BioSpin GmbH
$$ ##OWNER= she
$$ F:/spectra/data/she/nmr/H-F/1/audita.txt
$$ ##AUDIT TRAIL=  $$ (NUMBER, WHEN, WHO, WHERE, WHAT)
(   1,<2019-04-08 14:05:24.42 +0400>,<she>,<DPX200>,
      <created by zg, POWCHK disabled, PULCHK disabled
       configuration hash MD5:
       00 E9 B6 7A A2 85 ED C7 34 08 36 98 17 FE 4E 26
       data hash MD5: 16K
       16 8F 6C 8F 0C C8 3D 04 1C 2F E0 A3 05 28 29 E1>)
$$ ##END=
$$ 
$$ hash MD5
$$ 79 10 4B CE E6 31 F6 32 26 94 92 09 1B BF 5F 11
##$RELAX= 
##$RELAX= 
##$RELAX= 
##$RELAX= 
##$RELAX= 
##$RELAX= 
$$ Bruker specific parameters
$$ --------------------------
##$DU= <F:/spectra>
##$EXPNO= 1
##$NAME= <H-F>
##$PROCNO= 1
##$TYPE= <nmr>
##$USER= <she>
##$AMP= (0..31)
100 100 100 100 100 100 100 100 100 100 100 100 100 100 100 100 100 100 
100 100 100 100 100 100 100 100 100 100 100 100 100 100 
##$AQSEQ= 0
##$AQ_mod= 1
##$AUNM= <au_zg>
##$AUTOPOS= <>
##$BF1= 200.13
##$BF2= 200.13
##$BF3= 200.13
##$BF4= 200.13
##$BF5= 200.13
##$BF6= 200.13
##$BF7= 200.13
##$BF8= 200.13
##$BYTORDA= 1
##$CFDGTYP= 0
##$CFRGTYP= 5
##$CHEMSTR= <none>
##$CNST= (0..31)
1 1 145 1 1 1 1 1 1 1 1 1 1 1 1 1 1 1 1 1 1 1 1 1 1 1 1 1 1 1 1 1 
##$CPDPRG= <>
##$CPDPRG1= <>
##$CPDPRG2= <>
##$CPDPRG3= <>
##$CPDPRG4= <mlev>
##$CPDPRG5= <mlev>
##$CPDPRG6= <mlev>
##$CPDPRG7= <mlev>
##$CPDPRG8= <mlev>
##$CPDPRGB= <>
##$CPDPRGT= <>
##$D= (0..31)
0 1.2 0 0 0 0 0 0 0 0 0 0.03 0 0 0 0 0 0 0 0 0 0 0 0 0 0 0 0 0 0 0 0 
##$DATE= 1554717923
##$DBL= (0..7)
120 120 120 120 120 120 120 120 
##$DBP= (0..7)
150 150 150 150 150 150 150 150 
##$DBP07= 0
##$DBPNAM0= <>
##$DBPNAM1= <>
##$DBPNAM2= <>
##$DBPNAM3= <>
##$DBPNAM4= <>
##$DBPNAM5= <>
##$DBPNAM6= <>
##$DBPNAM7= <>
##$DBPOAL= (0..7)
0.5 0.5 0.5 0.5 0.5 0.5 0.5 0.5 
##$DBPOFFS= (0..7)
0 0 0 0 0 0 0 0 
##$DE= 6
##$DECBNUC= <off>
##$DECIM= 24
##$DECNUC= <off>
##$DECSTAT= 4
##$DIGMOD= 1
##$DIGTYP= 9
##$DL= (0..7)
0 120 120 120 120 120 120 120 
##$DP= (0..7)
150 150 150 150 150 150 150 150 
##$DP07= 0
##$DPNAME0= <>
##$DPNAME1= <>
##$DPNAME2= <>
##$DPNAME3= <>
##$DPNAME4= <>
##$DPNAME5= <>
##$DPNAME6= <>
##$DPNAME7= <>
##$DPOAL= (0..7)
0.5 0.5 0.5 0.5 0.5 0.5 0.5 0.5 
##$DPOFFS= (0..7)
0 0 0 0 0 0 0 0 
##$DQDMODE= 0
##$DR= 18
##$DS= 0
##$DSLIST= <SSSSSSSSSSSSSSS>
##$DSPFIRM= 0
$$ [...]
##$SUBNAM2= <"">
##$SUBNAM3= <"">
##$SUBNAM4= <"">
##$SUBNAM5= <"">
##$SUBNAM6= <"">
##$SUBNAM7= <"">
##$SUBNAM8= <"">
##$SUBNAM9= <"">
##$SW= 24.9337058887773
##$SWIBOX= (0..15)
0 0 2 0 0 0 0 0 0 0 0 0 0 0 0 0 
##$SW_h= 4990.01996007984
##$TD= 16384
##$TD0= 1
##$TE= 0
##$TE2= 300
##$TE3= 300
##$TEG= 300
##$TL= (0..7)
0 120 120 120 120 120 120 120 
##$TP= (0..7)
150 150 150 150 150 150 150 150 
##$TP07= 0
##$TPNAME0= <>
##$TPNAME1= <>
##$TPNAME2= <>
##$TPNAME3= <>
##$TPNAME4= <>
##$TPNAME5= <>
##$TPNAME6= <>
##$TPNAME7= <>
##$TPOAL= (0..7)
0.5 0.5 0.5 0.5 0.5 0.5 0.5 0.5 
##$TPOFFS= (0..7)
0 0 0 0 0 0 0 0 
##$TUNHIN= 0
##$TUNHOUT= 0
##$TUNXOUT= 0
##$USERA1= <user>
##$USERA2= <user>
##$USERA3= <user>
##$USERA4= <user>
##$USERA5= <user>
##$V9= 5
##$VALIST= <valist>
##$VCLIST= <CCCCCCCCCCCCCCC>
##$VD= 0
##$VDLIST= <DDDDDDDDDDDDDDD>
##$VPLIST= <PPPPPPPPPPPPPPP>
##$VTLIST= <TTTTTTTTTTTTTTT>
##$WBST= 1024
##$WBSW= 4
##$XGAIN= (0..3)
0 0 0 0 
##$XL= 0
##$YL= 0
##$YMAX_a= 36000
##$YMIN_a= -32281
##$ZGOPTNS= <>
##$ZL1= 120
##$ZL2= 120
##$ZL3= 120
##$ZL4= 120
##$ABSF1= 10
##$ABSF2= 0
##$ABSG= 5
##$ABSL= 3
##$ALPHA= 0
##$AQORDER= 0
##$ASSFAC= 0
##$ASSFACI= 0
##$ASSFACX= 0
##$ASSWID= 0
##$AUNMP= <proc_1d>
##$AZFE= 0.1
##$AZFW= 0.1
##$BCFW= 1
##$BC_mod= 2
##$BYTORDP= 1
##$COROFFS= 0
##$CY= 11.3945322036743
##$DATMOD= 1
##$DC= 2
##$DFILT= <>
##$DTYPP= 0
##$F1P= 18.9103706918063
##$F2P= -1.10871071338519
##$FCOR= 0.5
##$FTSIZE= 0
##$FT_mod= 4
##$GAMMA= 1
##$GB= 0.15
##$INTBC= 1
##$INTSCL= 1
##$ISEN= 128
##$LB= 0.24
##$LEV0= 0
##$LPBIN= 0
##$MAXI= 10000
##$MC2= 0
##$MEAN= 0
##$ME_mod= 0
##$MI= 1.114404
##$NCOEF= 0
##$NC_proc= 0
##$NLEV= 6
##$NOISF1= 3.799351
##$NOISF2= 2.8
##$NSP= 1
##$NTH_PI= 0
##$NZP= 0
##$OFFSET= 15.70392
##$PC= 1
##$PHC0= -9011.044
##$PHC1= 14.60026
##$PH_mod= 1
##$PKNL= yes
##$PPARMOD= 0
##$PSCAL= 0
##$PSIGN= 0
##$REVERSE= no
##$SF= 200.130013532006
##$SI= 16384
##$SIGF1= 3
##$SIGF2= 2
##$SINO= 400
##$SIOLD= 16384
##$SREGLST= <1H.CDCl3>
##$SSB= 0
##$STSI= 0
##$STSR= 0
##$SW_p= 3612.71676300578
##$SYMM= 0
##$S_DEV= 0
##$TDeff= 0
##$TDoff= 0
##$TI= <>
##$TILT= no
##$TM1= 0
##$TM2= 0
##$TOPLEV= 0
##$USERP1= <user>
##$USERP2= <user>
##$USERP3= <user>
##$USERP4= <user>
##$USERP5= <user>
##$WDW= 1
##$XDIM= 8192
##$YMAX_p= 0
##$YMIN_p= 0
$$ End of Bruker specific parameters
$$ ---------------------------------
##NTUPLES= NMR FID
##VAR_NAME=  TIME,          FID/REAL,        FID/IMAG
##SYMBOL=    X,             R,               I
##VAR_TYPE=  INDEPENDENT,   DEPENDENT,       DEPENDENT
##VAR_FORM=  AFFN,          ASDF,            ASDF
##VAR_DIM=   8192,          8192,            8192
##UNITS=     SECONDS,       ARBITRARY UNITS, ARBITRARY UNITS
##FACTOR=    0.0002004,     1,               1
##FIRST=     0,             0,               0
##LAST=      1.6414764,     0,               0
##MIN=       0,             -32281,          0
##MAX=       1.6414764,     36000,           0
$$ Real data points
##PAGE= N=1
##DATA TABLE= (X++(R..R)), XYDATA
0@%%%%%%%%%%%%%Qj6J6j6J6j6K4l2L2m0M8n1N9o9P7q8J03j14J25j40J58j79J99
36A04k20K46k73L02l36L71m11M58n06N60o22O92p70Q60r70J099j254J450j703
55i23K039k512L245m533P444k5782L827M9958k7096l6936J2960L5696j3598k4081
69b0292J1708K0330j7301j5943J8914J9031j9960k0431J4169K2730o696j8754
81a2495k694J2109Q415j169j0501p686Q144J4135m137j5201J477J3666k444j0561
95h942P154J0522j3719j3159J9361J9456k1387k5648J9564L0110j4576k9845R607
108a1502K5992o643j9546P919J3846j1595j0496J6591J0910j9329j3042J8768
120A873J5379j4714j4463R301J0416m608l346L406m012n086R485R043j1301j2317
$$ plain form
0 0 0 0 0 0 0 0 0 0 0 0 0 0 0 8 -8 8 -8 8 -8 16 -16 16 -24 24 -27 32 -37 40 -48 55 -59 66 -74 84 -95 104
36 104 -116 130 -143 159 -177 194 -217 241 -265 295 -327 365 -405 455 -515 584 -670 780 -923
55 -923 1116 -1396 1849 -2684 4760 -21022 -17195 32763 5667 -31269 -18309 17387 3789 -20292
69 -20292 -8584 11746 -5555 -21498 -2584 16447 -3513 -23944 -9775 12955 6259 -12495
81 -12495 -15189 -3080 5335 4166 -6335 -14021 -5877 8258 4121 -11080 -9603 4063 1619 -8942
95 -8942 -1788 8734 -4985 -18144 1217 20673 -714 -26362 -6798 23312 8736 -21109 -11502
108 -11502 14490 7847 -11699 -3780 10066 -1529 -12025 4566 15476 -3853 -16895 1873
120 1873 17252 2538 -11925 -2624 7792 3184 -162 3244 -768 -5854 3631 12674 1373 -10944
134a0944J0069J3379p156j0858N336O067n742r04R169k551j3577K961J7423p87
148A1885j8337k202J6084L970j1590k796O761r01l475N935K846j0150m517J2428
162E941O476j1741p106R187N499o813j575O098l370p593P377J0831r165j4335
176a0289Q380J6379o136j5994M063J3278l545r702M976O734p758n684J0591O366
190A1659j2087q001J1241R069q605q621N320O013k910k199K145j786l088M376
204B526M680n085o066M444N653l305l612K781N18l906K357O134l986q987L926
219a928J1104k748j1774J225J0586o59q556J302O412l158n439N332N504o856o628
234f281P195P322o236p503M533O211l252m041K617J448l294M82M418j523n657
$$ plain form
134 -10944 -875 12504 5348 -5510 -174 5893 151 -753 8416 5865 -7712 -4751 12672 11885
148 11885 -6452 -8654 7430 11400 -190 -2986 3775 2874 -601 5334 8180 -1970 -6487 5941
162 5941 12417 676 -6430 2757 8256 1443 -132 5966 2596 -4997 2380 13211 4046 -10289
176 -10289 -1909 14470 8334 -7660 -3597 9681 6136 -3566 1410 8144 386 -5298 5293 11659
190 11659 -428 -8429 2812 11881 3276 -5345 -25 5988 3078 879 3024 1238 -1850 2526
204 2526 7206 2121 -3945 499 6152 2847 -765 2016 2534 -1372 985 7119 3133 -5854 -1928
219 -1928 9176 6428 -5346 -4121 6465 5806 -2750 -1448 4964 1806 -3633 1699 7203 347 -6281
234 -6281 914 8236 2000 -5503 -970 5241 1989 -2052 565 2013 -1281 -799 3619 2096 -3561
249c561J276N972q99n224K81L696q39k176J969P99l739n54N023Q71n893j597N543
266I48J809m781j660L686N04l099O22L023k039l552K614M018k848m326K282L847
282A048j819l155J549J871j968r21K523K10l363j04L656J40l664l48L079K57k640
299c649K18J965q85j711J539J680j975j809K146J789j990j647J763J172j491q71
315c756J653L26j688J82J766j87j920M63J837m59j590P10J336o84j122R47J171
332a015j111q19J243P94j101m65J160M22j125m8J199N4r87J9J220J79r58KR17
351d20n1m99L09N09m81j87O68M92n71m74O85N16j45l26J92J12M0L89J82m90k45
372B05O46O06l73n41K48M76O6q0j0o0n9L51M62l36n32J12P39J73m49m06K70M29
$$ plain form
249 -3561 -2285 3687 2788 -2436 -2155 1541 702 -1474 495 1294 -2445 -2999 2024 2895 -2998 -4595 948
266 948 2757 -2024 -3684 2 506 -2593 -1971 1052 -987 -4539 -1925 2093 -755 -5081 -2799 1048
282 1048 -771 -3926 -2377 -506 -2474 -3395 -872 -662 -4025 -4129 -473 -333 -3997 -4345 -1266 -1009 -3649
299 -3649 -3431 -1466 -2351 -4062 -2523 -843 -2818 -4627 -2481 -692 -2682 -4329 -2566 -1394 -2885 -3756
315 -3756 -2103 -1777 -3465 -3283 -1517 -1704 -3624 -3161 -1324 -1783 -3373 -2663 -1327 -2011 -3133 -2186 -1015
332 -1015 -2126 -2945 -1702 -908 -2009 -2474 -1314 -892 -2017 -2065 -866 -812 -1799 -1780 -560 -381 -1339 -1337 -420
351 -420 -471 -970 -661 -152 -633 -820 -152 340 -231 -705 -20 496 351 25 217 329 369 758 940 450 205
372 205 851 1457 1084 543 791 1267 1333 1253 1243 1183 1124 1475 1937 1601 1069 1181 1920 2093 1644 1238 1508 1937
394A937K27k30l41RL34K55j63l32m4K19L43Jk63k93K0M73L53m91o33K35P93l7
416B372n94k43L88K19j84Kj14j49j01N17J65o43m70O27M52k88o90J21M40pk20
437A600k0j71j63K54L74m01o35K13O35m3o39l9M21m9l38K07J04m52j02O19J58
458A533q41l63Q45L77p46o21O20M53n57k63M91j29n74K98P73m70j065M61J106
477A328l76j233J41J196k22q14K2N39m15l29P03K55j170l81J344N67j427p92J127
496F3P60j011m99O94mp41M66Q63r56j353J083J784j087j928N67J740m52j255M12
515h54N50q21k07J428k1k262j44K449N60k483r56K068P51j515l78R99n88r89J421
534i92J384k133j970K119K433j900k480J244J959r88j119J082J41j866M91K756
$$ plain form
394 1937 2164 1934 1593 1602 1936 2191 2028 1696 1652 1871 2214 2215 1952 1659 1679 2152 2505 2014 1381 1616 2409 2372
416 2372 1778 1535 1923 2142 1958 1960 1846 1697 1596 2113 2278 1635 1165 1792 2244 1956 1266 1387 1827 1820 1600
437 1600 1580 1409 1246 1500 1874 1473 838 1051 1686 1643 1004 965 1386 1337 999 1206 1310 858 756 1375 1533
458 1533 692 329 1174 1551 805 184 804 1257 700 437 928 799 225 523 1296 826 -239 222 1328
477 1328 952 -281 -140 1056 834 20 42 581 166 -163 540 795 -375 -756 588 1155 -272 -1064 63
496 63 823 -188 -687 7 3 -738 -272 591 -365 -1718 -635 1149 62 -1866 -1299 441 -11 -1266 -854
515 -854 -304 -1125 -1332 96 75 -2187 -2331 118 678 -1805 -2761 -693 58 -1457 -1835 -836 -1424 -2413 -992
534 -992 392 -1741 -3711 -1592 841 -1059 -3539 -2295 -336 -1324 -2443 -1361 -1220 -3086 -2595 161
550A61n53l520Q5L719N14l335p98K343O01j561M54J008j678j009K577J627l034
567b399k203K862K498k191k065J543R52j234N42J755j640k780K264M058k136m504
583d678J472M481q28l623J021K484j681j441L104J313m396j744N272K700n028
598a572l327M256L393k877k347K117Q80j900Q69K686j824l586K139M409j453m202
614b339Q22L169l05j343J000j76k353J384M142j337n467Q26O010Q0n360l10M366
631B809l65l083J962K672l680l096N175M161n480n216M930N694l815m847K780
646F01L331k546j271L295l06m549Q88N899n62o475k75O118O81m567l27K880j097
663A718j691L030J388m827k154N861L121n725l867M721L506l395k285K683J19
$$ plain form
550 161 -392 -3912 -3827 -108 406 -2929 -3727 -1384 -783 -2344 -1890 -882 -2560 -3569 -992 635 -2399
567 -2399 -4602 -1740 758 -1433 -3498 -1955 -1003 -2237 -1695 60 -1580 -4360 -2096 1962 -174 -4678
583 -4678 -3206 1275 447 -3176 -2155 329 -1352 -2793 311 1624 -2772 -4516 756 3456 -1572
598 -1572 -4899 -643 2750 -127 -2474 -357 523 -1377 -508 2178 354 -3232 -1093 3316 1863 -2339
614 -2339 -1517 1652 1347 4 1004 828 -1525 -141 4001 2664 -2803 -1977 4033 4113 -1247 -1557 2809
631 2809 2444 -639 1323 3995 315 -2781 2394 6555 1075 -4141 789 6483 2668 -2179 601
646 601 3932 1386 115 3410 3104 -1445 -557 5342 4780 -1695 -1970 4148 4829 262 -65 2815 1718
663 1718 27 3057 4445 -382 -2536 3325 6446 721 -3146 1575 5081 1686 -599 2084 2203
678B203k899J751L806k903n145K881N949k168n726J251M204j140k224J992J98
693B030l719P98N624r16p181R4P573N22o885o70N629m64m672K352M353m374n156
710e062N663O383o015p597N286P794m041p052K918N335k846l332L428J873m734
725a999j350N801J475n899k212M878K455l197j772J296M1j56K318l48m231k51
741c151N432Q58n570j269M944P85m355O34M198k615m803M167O133n028p567M780
757b427Q369l963q335L105P297k812n894L412M365m492l723N734L684o458m202
772f340O336M431n357m177L968K949k937j166K428p07k719K051L389k827l779
787d457K668L497k166k731K131J220k531J88L503j270m775J600N807j517o064
$$ plain form
678 2203 -696 1055 4861 1958 -3187 -306 5643 3475 -2251 -1000 3204 2064 -160 1832 2030
693 2030 -1689 -891 4733 3817 -3364 -3270 4303 4825 -2060 -2730 2899 2435 -2237 115 4468 94 -5062
710 -5062 601 6984 969 -6628 -1342 6452 2411 -4641 -1723 3612 766 -2566 862 2735 -1999
725 -1999 -3349 2452 3927 -1972 -4184 694 3149 -48 -1820 -524 -483 -639 1679 1331 -2900 -3151
741 -3151 2281 3139 -2431 -3700 1244 2029 -2326 -1692 2506 -109 -4912 -745 5388 360 -7207 -2427
757 -2427 5942 1979 -6356 -3251 4046 1234 -4660 -1248 3117 -1375 -5098 636 4320 -2138 -6340
772 -6340 -4 4427 -930 -5107 -1139 1810 -1127 -2293 135 -572 -3291 -1240 2149 -678 -4457
787 -4457 -1789 1708 -458 -3189 -1058 162 -2369 -2181 1322 52 -4723 -3123 2684 1167 -4897
802d897J091N790j114m933J666L868k658l333L955L311n008l506N460L869n367
817a806l835M830L356m300k324M163J047m346j1M911n04n379P40N493n86n074
833c625O01M264q14l161J500K405k436j734L317J577l769j357L833J361l579p85
849b402L325j3k885J052L037k001l088K638L560l000l480L136L425l055k895L231
865E85K363l487j580L927J244m142r05M396P36m173m96L970K82l472K74L139q15
882A846k705J425K576j853k293K304J986k379j567K582J085k742m94K954P8l072
898b69L43L244o31l304R64L236j230l132J555L007j895k818K126K657k293k492
914i32K342K097k286j748K293J285k391q88K460M11k487k04K330M7k189J54J828
$$ plain form
802 -4897 -3806 1984 870 -4063 -2397 1471 -1187 -4520 -565 2746 -2262 -5768 -308 3561 -1806
817 -1806 -5641 -811 2545 -1755 -4079 84 1131 -3215 -3226 1685 1181 -4198 -3458 2035 1449 -3625
833 -3625 -3024 1240 426 -2735 -1235 1170 -1266 -3000 317 1894 -1875 -3232 601 1962 -1617 -2402
849 -2402 923 910 -1975 -923 2114 113 -2975 -337 3223 223 -3257 -121 3304 249 -2646 585
865 585 2948 -539 -2119 1808 3052 -1090 -1995 2401 3137 -1036 -1532 2438 2720 -752 -478 2661 1846
882 1846 -859 566 3142 1289 -1004 1300 3286 907 -660 1922 3007 265 -229 2725 2803 -269
898 -269 74 3318 2687 -617 347 3583 2353 -779 776 3783 1888 -930 1196 3853 1560 -932
914 -932 1410 3507 1221 -527 1766 3051 660 -228 2232 2643 156 -48 2282 2329 140 294 2122
931B122o37j419R79J017j488j035J937R10k215q80K110P47k054m77J825m9j937
948e44N04K036j035k293J163K440j192k570R91K255r36j878R61J282j291r01J622
965F14P45k106p81K064R49j929j124J534R40j250m06P36j59q92O90J059r82j324
983a622Q62J554p64j317L78Q03k21k74M33m17q61O12J400m88j735J18J756J22
1001C39j348k65Q62o4m74O36L55j213n66J457R54j453j249J029J321o06r85K01
1019a069L53q7J57L60n09p90N34J149k87j178j81Q76M10m19k22j80k11M95P44
1038e5m79j172P2J392L52j172o46P28O45l50k13N9k20j85O17N70p89r88M94J290
1058e0n6j094m83O50P45j17n80l80J90N66L17m75n18J23N53J68j69l00j91L3O50
$$ plain form
931 2122 1485 66 1045 2062 574 -461 1476 2386 171 -709 1401 2148 94 -383 1442 1393 -544
948 -544 -40 1996 961 -1332 -169 2271 1079 -1491 -500 1755 819 -1059 -98 1184 -107 -1008 614
965 614 1359 -747 -1528 536 1485 -444 -1568 -34 906 -344 -750 -14 -173 -1065 -375 684 -298 -1622
983 -1622 -760 794 30 -1287 -909 -106 -327 -601 -168 -585 -1446 -834 566 78 -1657 -1539 217 339
1001 339 -1009 -1274 -412 -476 -950 -314 41 -1172 -1738 -281 673 -780 -2029 -1000 321 -285 -1270 -1069
1019 -1069 -716 -803 -646 -286 -795 -1585 -1051 98 -189 -1367 -1548 -672 -262 -681 -903 -1083 -1294 -799 -55
1038 -55 -534 -1706 -1634 -242 110 -1062 -1708 -980 -335 -685 -898 -839 -1059 -1244 -627 -57 -846 -1834 -1340 -50
1058 -50 -106 -1200 -1683 -1033 -288 -405 -985 -1365 -1175 -609 -292 -767 -1285 -1162 -609 -441 -610 -910 -1101 -1068 -418
1079d18L87n90r85N22J179N2j118m69Q30O85l37n65J31J73Q2K20J67m35l93L55
1099e27P48O5q31l47O51P25q8p07l08N04O53m3o76j62N55L80j84l04O9O1O4L11
1121F09K39m60m46L98Q71j15r36k16R14N52n32o33L13M53QL3j85j95R3L44K29
1142A338l45l66K31M37K7j89j77l4R9M87l3n67l06O56O16n83p19L62P13k14m73
1163I60M8L05j49j37L48Mn98j20P97J56p40l76N47L77l60l30K00J6r5L17j0n87
1185E73k89O63M90p60o16N73N30m23n51M11J86n41o5P62j61j051M7J276nj363
1205c14l17J164K88q58k76M73J00m89K95K46n05n29O73O18p36o41M24O06l43k93
1225d14K22k51l16N72N72q39j004Q68J191o80j391N22J194m54r26O18N25r21l93
$$ plain form
1079 -418 -31 -621 -1606 -1084 95 147 -971 -1440 -610 75 -262 -827 -696 -523 -441 -221 -54 -489 -882 -527
1099 -527 221 286 -545 -892 -241 484 396 -311 -619 -115 538 495 -181 -343 212 592 408 104 173 234 298 609
1121 609 848 388 -58 340 1211 1096 160 -56 858 1410 878 245 558 1011 1019 1052 867 672 765 1109 1338
1142 1338 993 627 858 1295 1322 1133 956 922 1021 1508 1475 908 602 1258 1874 1291 572 934 1647 1433 960
1163 960 1008 1313 1164 1027 1375 1379 781 661 1458 1614 874 498 1045 1422 1062 732 932 948 853 1170 1160 573
1185 573 284 947 1437 677 61 634 1164 741 190 601 787 246 181 943 782 -269 -222 1054 1049 -314
1205 -314 -631 533 821 -37 -313 160 260 -229 66 312 -193 -722 -49 569 -167 -808 -384 222 -121 -414
1225 -414 -192 -443 -759 -187 385 -454 -1458 -590 601 -79 -1470 -948 246 -208 -1134 -516 9 -912 -1305
1244a305J302M30j646o39J688R75j623j004J218Q42q59m57O50J5p67N09R38p39
1262d72j276P29J383n06j224M11O99l22l18O45j07j160L80J711l58j974M9K053
1280C43K29j890q4J341j35r67N51J034j206j156J619J402j617j701J402J712r67
1297i0j402P52P63q03m3J082l03j623N77J932m62j993K01J793p1j441L99R50q98
1316f80n54J515O23k081q86K353J136k202j306J901J168j548n38J172O7j398N40
1333g18J848r14k049Q13K255o81j932M05J604n17q47Q22K61j324L1K034M4k445
1351a310j89K613L01k331j44J937k06j577Q85J615j549j769J965K234k048k479
1367b052J847K599j440k222J347J519j263r18J660M79k071j93K391K76k288m31
$$ plain form
1244 -1305 -3 427 -1219 -1858 -170 805 -818 -1822 -604 238 -621 -1078 -428 -413 -1180 -671 267 -472
1262 -472 -1748 -1019 364 -142 -1366 -955 -256 -578 -896 -251 -358 -1518 -1138 573 215 -1759 -1710 343
1280 343 572 -1318 -1402 -61 -196 -1163 -612 422 -784 -1940 -321 1081 -536 -2237 -835 877 -90
1297 -90 -1492 -740 23 -780 -823 259 -44 -1667 -1090 842 380 -1613 -1412 381 310 -1131 -732 218 -680
1316 -680 -1234 281 904 -1177 -2063 290 1426 -776 -2082 -181 987 -561 -1099 73 140 -1258 -718
1333 -718 1130 216 -1833 -1020 1235 554 -1378 -973 631 114 -733 89 350 -974 -943 1091 1135 -1310
1351 -1310 -1499 1114 1415 -916 -1060 877 671 -906 -21 1594 45 -1724 241 2475 427 -2052
1367 -2052 -205 2394 954 -1268 79 1598 335 -583 1077 1556 -515 -708 1683 1959 -329 -760
1383g60K041M41j476j65J055m27p25J313N42j834o50K266Q72k325q10K035P16
1400B109j956p4J928n38k159J114K559j413k923J371L157j326k914J090K593j161
1416A457k083J370J722j861j419K251J249k455j331K401J286k202j179J889O91
1431A786j596q1J404n35j504Q93J683j252j679J184J551j248j281J217P97j461
1447a22l03J744j46k167K33K393l89k428L06K396n71k242Q09J869j235j800J609
1464d4J789k070j742K078J765k209j661K159J368k277r64K106O75k312k80K243
1480F24J63k427M0K332k66k291M58J912o20j538P96J311j158j042J413Q24j551
1497a020p14J705L45j709p3J716k13j754N06J872r10j824J162J807j346j790J544
$$ plain form
1383 -760 1281 1722 246 81 1136 709 -16 1297 1839 5 -645 1621 2493 168 -642 1393 2109
1400 2109 153 79 2007 1469 -690 424 2983 1570 -1353 18 3175 1849 -1065 25 2618 1457
1416 1457 -626 744 2466 605 -814 1437 2686 231 -1100 1301 2587 385 -794 1095 1786
1431 1786 190 109 1513 978 -526 367 2050 798 -881 303 1854 606 -675 542 1339 -122
1447 -122 -425 1319 1173 -994 -761 1632 1243 -1185 -879 1517 946 -1296 -487 1382 147 -1653 -44
1464 -44 1745 -325 -2067 11 1776 -433 -2094 65 1433 -844 -1808 298 973 -1339 -1619 624
1480 624 787 -1640 -1600 732 466 -1825 -1367 545 -75 -1613 -817 494 -664 -1706 -293 531 -1020
1497 -1020 -1734 -29 316 -1393 -1466 250 37 -1717 -1211 661 -249 -2073 -911 896 -450 -2240 -696
1514f96J589j586j538J863J350j958j188J995J061j965q46J996N43j925l56J922
1530B61R1j795J86J762l53j663O08J482p46j193R08R40j140o81J488M79j703l59
1548a428J942J93j928m4J897j01j846L82J729n90j765R04J839j054j858J118J814
1565A204j039j632R97J369r43j039J047O97j210l97J365K03j386j65J406J5j095
1582f03N5R17l28p25Q52N47j178n80J465O19j553p05J537P48j418n28J335K48
1600G05j376J04J461k78j592L62J803k64j829K13J546q3j148J53R92n74n64Q36
1618D67N63j141n26J225O37j137n78R52M06o39j26P27m07p33P01Q76p84j053P56
1637A86J248n50j175M96Q97m94l75M53K65p64j12J061J45j148k95J113L55q08
$$ plain form
1514 -696 893 -693 -2231 -368 982 -976 -2164 -169 892 -1073 -1919 77 620 -1305 -1661 261
1530 261 352 -1443 -1257 505 152 -1511 -903 579 -167 -1360 -452 488 -652 -1333 155 634 -1069 -1428
1548 -1428 514 707 -1221 -1265 632 531 -1315 -933 796 206 -1559 -655 1184 130 -1728 -610 1204
1565 1204 165 -1467 -470 899 -44 -1083 -36 661 -549 -946 419 622 -764 -929 477 492 -603
1582 -603 -548 369 41 -684 168 715 -463 -1043 422 1041 -512 -1217 320 1068 -350 -878 457 705
1600 705 -671 -567 894 616 -976 -614 1189 925 -904 -691 855 772 -376 -223 769 195 -369 467
1618 467 1030 -111 -637 588 1225 88 -490 462 868 229 103 830 423 -310 391 1267 483 -570 186
1637 186 1434 884 -291 205 1102 608 233 686 951 187 75 1136 1281 133 -162 951 1306 498
1655D98k82M33R4k68M05J44p05l02R25N33j027o76Q64O30n28o32O68R9o21J33
1675C85Q61l45j144K94J321j12j360l5J008K34p91k54N48r4l04K62L03n37m68
1694b28N96N58m86o13J56M70k0j98j31k33J7M71K46o29o00N24N83l15o17J46L54
1715E1j73j67L36j11n91J00P62l0p84l75P77M69o71m16L18K59j51l3J33l15k45
1736h57L98L74l94m82K71M50j19k91q8P2O3J21J87k83l96J68P03j56o73j5N30
1757d17J11l12k2P2rj06K09R5l06j72L79L01j97n07J56L36J40k05r6r8O5L56k0
1780b47l39m7J76K91j46k00L3J76pk7K04k19k19K54M67j50n59N4N36J27m37j18
1802c97L01Q9j48n2J55r5l0R9K19j89j72P9K44kj98K3m6J26J72j06k68J10K06
$$ plain form
1655 498 216 649 743 475 880 1024 319 17 942 1475 448 -228 636 1266 738 106 774 873 252 385
1675 385 1246 901 -243 51 1372 1260 -100 -135 873 1107 316 62 610 516 212 474 777 240 -228
1694 -228 368 926 440 -173 -17 453 433 235 104 -129 -112 359 605 -24 -624 -100 483 168 -449 -303 51
1715 51 -122 -289 47 -64 -655 -555 207 177 -607 -982 -205 264 -407 -823 -505 -246 -397 -430 -297 -612 -857
1736 -857 -459 -85 -479 -961 -690 -240 -359 -650 -738 -666 -603 -482 -295 -578 -974 -806 -103 -259 -932 -947 -417
1757 -417 -306 -618 -640 -568 -577 -683 -474 -379 -685 -857 -478 -177 -374 -881 -725 -389 -249 -454 -550 -648 -583 -227 -247
1780 -247 -586 -633 -457 -166 -312 -512 -479 -303 -310 -337 -133 -352 -571 -317 150 0 -559 -505 31 158 -279 -397
1802 -397 -96 -7 -155 -207 -52 -147 -177 -78 141 -48 -220 -141 103 101 -97 -74 -120 6 178 72 -196 -86 120
1825A20J91l08k47L28J83j89j72J87J03k38M4K58j28k75L9M34k1l76k7L11J30
1846C47k35j62K10N1q5n2Q4o6k7J43J07k73j00K75J07k36K1R9o3J3J02J68l14
1869A14o3K58K64l58l24K72L90k10k71K29J08j70n1K97q6k97k8N58l7m93MM31
1891E37L2l34oK53j09j44L83j1m57j04N51J80m22l31L69K78k96p0K86j04k98J91
1913C74M50l52m95K80N69j30n76L1M68n0k04J10P8l73M4M51on69n1N03J76n76
1935A52m1L51l7k62J96J98m57l49N95M44o67n68O04O06m93n59M10K59m51rM31
1956C53r0p05J07Q43p5r22q5Q00L7n72k8L60j09l41L55J92o25k40P19K59o78l15
1978g60M69L11l94j91L46o4m91L54O23n34p46M15R01m00q73L17P14m30m31M50
$$ plain form
1825 120 311 3 -244 84 267 78 -94 93 196 -42 2 260 132 -143 -104 330 309 -67 -94 217 347
1846 347 112 -50 160 211 126 74 158 92 65 208 315 42 -58 217 324 88 109 208 145 158 260 428 114
1869 114 51 309 573 215 -109 163 553 343 72 301 409 239 188 485 399 102 74 632 595 102 106 537
1891 537 569 235 229 482 373 229 612 601 144 40 591 771 349 18 387 665 369 299 585 481 183 374
1913 374 824 472 -23 257 826 696 120 151 619 569 365 475 553 180 224 675 669 100 49 552 728 152
1935 152 111 462 425 163 359 557 100 -249 346 790 123 -445 159 765 272 -287 123 382 -69 -78 353
1956 353 263 -442 -335 508 433 -489 -574 226 263 -309 -337 23 -86 -427 -72 120 -505 -745 -26 233 -445 -760
1978 -760 -291 20 -374 -565 -219 -283 -774 -420 203 -331 -1077 -662 239 -161 -1034 -717 -3 -433 -864 -414
1998d14K42o00j72Q45J62r76j76R18K95p87l71P24J54n32J15L95k74n43N59N85
2018A49n85p25O20P34n41n76M41M15m53j45O36lq24J46R94k02r98J06J066j43
2038A12p88K26N92l09n29O33N07p93n76R62N45q56n57Q72M40p42k21O74J55q26
2058d79J23Q97k31r09K71R70k31r28K83P99k94o54M79M49o00k98P34K81q99k57
2078d94R93K42q52l04R23J48r40K45P30l45q20N64P94n35r25O59Q48o88p33P44
2098B54M92p16l83Q51K21r11q1R56M8j020K8R74r0r15J31Q81l73o90M43O94o34
2119A60o69Q43N70q74m66R09L55r22l17R83J62r51n0J021r0j074K18R61k55r86
2139d72M44Q95m28p92L95P45n43n79O27N16p34k86P40J75q91o4Q93L6q94J37Q45
$$ plain form
1998 -414 -172 -772 -944 -99 63 -913 -1089 -171 124 -663 -1034 -310 -156 -688 -573 -178 -452 -995 -436 149
2018 149 -436 -1161 -541 193 -348 -924 -483 -68 -521 -666 -30 -33 -857 -711 283 81 -917 -811 255 112
2038 112 -676 -450 142 -167 -696 -63 444 -349 -925 37 582 -274 -831 41 481 -261 -482 192 347 -479
2058 -479 -356 541 310 -599 -328 642 411 -517 -234 565 271 -383 96 545 -55 -353 381 662 -237 -494
2078 -494 499 741 -111 -415 508 656 -284 -39 691 346 -474 90 884 349 -576 83 931 243 -490 254
2098 254 746 30 -353 498 719 -192 -273 683 731 -289 -261 713 623 -292 -161 720 347 -343 100 794 160
2119 160 -509 334 904 30 -436 473 828 -94 -411 572 734 -217 -267 754 664 -410 -192 769 514 -472
2139 -472 -28 867 439 -353 42 787 244 -335 292 808 74 -212 528 703 -188 -252 641 677 -217 -80 765
2160G65l24o92L62P00n27o14N44P20p38n80P81N99r08n65R31M71q86l70Q72K38
2180G79r34l6R33j03r36J13R61j76r13K19P67k42o66L13N63n79l24N90K88p81
2200a64k15P86K20q26j80P40L8p05J12O63l01p61M36P54o10p55O22O75n92o27
2220f90N33N19o15l84O94K49p60k19Q56N7q59j65R35%p00n3N93j74n09L21N03
2241A32n91l83O32L94p01m20O09M03n00l06N45O2n48L9O83k43p37K06Q63j37q57
2262h55Q0P43n8o31J93M84l67l54N41L28n24m46P13L33o45k55M33K81m38l5M30
2283d9r3m42L07M51l10n81M11N37k82m16K04M18l42k30M95N0m99l3P51Q1p87r3
2305d52O89J66n78n0M19J4l30J67L97l96m24M61N11l75n65M19M42k64l34K60J74
$$ plain form
2160 765 441 -251 111 811 284 -330 214 934 196 -384 397 996 88 -477 454 925 39 -331 541 779
2180 779 -155 -191 742 639 -297 -184 777 601 -312 -93 674 432 -234 79 642 63 -261 329 617 -164
2200 -164 -379 407 627 -199 -379 361 399 -306 -194 469 168 -593 -157 597 -13 -768 -146 529 -63 -690
2220 -690 -157 362 -253 -637 57 306 -454 -673 183 240 -619 -784 151 151 -549 -602 -9 -183 -692 -371 132
2241 132 -459 -842 -210 184 -517 -937 -328 75 -425 -731 -186 -124 -672 -633 50 -193 -930 -724 139 2 -855
2262 -855 -775 -32 -90 -721 -528 -44 -411 -765 -224 104 -420 -866 -153 180 -465 -720 -287 -6 -444 -479 -49
2283 -49 -142 -584 -277 174 -136 -717 -306 231 -51 -467 -263 155 -187 -417 78 128 -371 -404 347 428 -359 -452
2305 -452 237 403 -175 -225 194 208 -122 45 442 46 -378 83 594 219 -346 73 515 251 -83 177 351
2326C51k86%L88j30n04J47N72p7m81o6M76P9m08P7K81j94j71L22J66l61l39N11
2348C53L17m35m22M36K80l43j30K86q4k63J36L54k09l71J84M06j02l89M5L01j22
2369B28j62K18O0k99n8M03J09n04j50M81J18l99q5K79m6k05N0L14k42l10K80L71
2391D51k29m07K17M03j96k84J64J23r9r0J40Q8k76n0L49j6l06jK45L3j82l8J80
2414B19m0j92J76J12j76k07K84J52k52j92K38J55j44q6J34j8j40L7K30j28k38
2435g6J49J82l5j72p5K47l9j55Q6L6j16p1J82L6k50j0K13L7k21J2M8R4k23J46
2459B5J00n2j92R4J45j39j29R2J70j79j30O6J28j08q1P4J34j78m5J51k3k07P0
2482b14J61p1j89m1K49o7j54R2L6r3j8J70pk65K8J69M2j61k8J29o1k7n1J16n6
$$ plain form
2326 351 65 65 453 323 -181 -34 538 461 -20 -86 390 469 61 138 419 225 54 376 542 181 -158 353
2348 353 670 235 -187 249 529 186 56 342 258 -5 131 485 276 -95 89 495 393 4 49 350 228
2369 228 66 284 344 45 -13 390 499 -5 -155 326 444 45 -40 239 193 -12 38 352 110 -200 80 451
2391 451 222 -185 32 435 239 -45 119 242 143 53 193 281 5 -45 304 288 -18 -19 226 259 77 39 219
2414 219 179 -13 163 275 99 -108 176 328 76 -116 122 277 133 47 181 163 23 60 290 162 -76
2435 -76 73 255 220 48 -27 220 181 26 112 148 32 -39 143 179 -71 -81 132 169 -52 -40 8 102 -121 25
2459 25 125 73 -119 -25 120 -19 -148 -56 114 -65 -195 -129 -1 -109 -190 -116 18 -160 -205 -54 -77 -284 -214
2482 -214 -53 -124 -313 -354 -105 -172 -326 -234 -198 -291 -309 -139 -146 -411 -383 -214 -172 -333 -361 -232 -293 -320 -371 -255 -311
2507c11qN9N3j29j20J39J77k04r4P9R7o0J4J10j13j01J47J23j01k08J00K28n1
2530a74j93LJ48K4lo0J32j06m0J56P9j95m2J59J83j61k38K25O2K7nN7j66q2K17
2555GJ60j65j91J98J02k8n3m5O9l4P8J04p8j84R1K61m7j93k0J24J35l6n3Q9k03
2580H8%K24O6l29q1L50J65l46n2J37Q5j25j7J58r8j95J98K77k40l28K14K99j24
2603C26k63P8J74j06p2Q7k7l8m0K15J0k19j34K17J37j82n7N7O0r4J26m3k48O4
2627B8K02J06k43k25K25K32k36n4J61n2j50lK96j12l20O7L93p0l69m2L75K9k97
2650e9M2J46j27p8J81R8k56j19K55M0j25j17J86k5o8P5Q2j97j33K86J50k01k75
2673b39K04K75j59k80K92P3j63j13K28P3l44q7M19L6l24q8L83Q9l19n5K33j6j81
$$ plain form
2507 -311 -319 -260 -207 -336 -456 -317 -140 -344 -438 -359 -262 -322 -308 -198 -311 -412 -265 -142 -243 -451 -351 -123 -174
2530 -174 -367 -364 -216 -192 -195 -255 -123 -229 -269 -113 -34 -229 -271 -112 71 -90 -328 -103 -41 -14 -19 38 -128 -210 7
2555 7 167 2 -189 9 111 83 30 -15 54 20 98 202 124 -60 31 292 245 52 32 156 291 255 202 291 88
2580 88 88 312 378 49 -32 318 483 137 85 222 307 182 165 323 225 30 228 505 265 -63 151 450 326
2603 326 63 141 315 209 137 224 197 159 119 334 344 125 -9 208 345 163 106 163 223 129 255 212 -36 28
2627 28 230 336 93 -132 93 325 89 35 196 144 -6 -9 287 175 -145 -78 315 245 -124 -166 209 238 -59
2650 -59 -17 129 2 -76 105 203 -53 -172 83 123 -2 -119 67 42 -26 49 131 -66 -199 87 237 36 -239
2673 -239 -35 240 81 -199 93 166 3 -110 118 191 -153 -240 179 215 -109 -197 186 275 -44 -99 134 118 -63
2696f3O0J26j86n8K00J00j58k22K25J43j61q0K62j24k97J68L15k24k78J33L68
2717B49k16m31K51L17j50l21K35J99k74j60L48J13l49k33L87J92l95j03K61J45
2737F5k51j36L64n9k69N5L02j17l23J19K57j10k88K02J51k34l0K24m8j90q2K98
2759a00l2k87Q3K64k9l02R4L45k28k74K61K12k57k73L11L07l66l05M24K03k93
2780b42j95L26J65l59j30L42K10l88q8L62k5k74P7K96j01k77J42K03r7j88K11
2801c0P3j65r6K93P0k93l0L71p0k07j10M39n4l23J23K80j49l59K12L85k18k97
2823a55K72L47l18l20L89J54k47j91K44J51k74pK68L7l76R8L77j27k85J36K13
2844C86j30k12J47K78l45m1K35J50m01j29M67Q6m22j18L71O5l21j0L02k5l73J68
$$ plain form
2696 -63 -3 123 -63 -121 79 179 21 -201 24 167 6 -74 188 64 -233 -65 250 26 -252 -119 249
2717 249 33 -398 -147 170 20 -301 -66 133 -141 -301 47 160 -189 -422 -35 157 -238 -341 -80 65
2737 65 -186 -322 42 -17 -286 -231 71 -46 -369 -250 7 -103 -391 -189 -38 -272 -302 -78 -126 -316 -398 -100
2759 -100 -132 -419 -336 -72 -101 -403 -309 36 -192 -466 -205 7 -250 -523 -212 95 -271 -576 -152 51 -242
2780 -242 -437 -111 54 -305 -435 -93 117 -271 -359 3 -22 -296 -219 77 -24 -301 -159 44 -53 -241 -30
2801 -30 43 -122 -218 75 145 -148 -178 193 123 -84 -194 245 191 -132 -9 271 122 -237 -25 360 142 -155
2823 -155 117 464 146 -174 215 369 122 -69 175 326 52 45 313 350 -26 72 449 322 37 173 386
2844 386 256 44 191 469 124 83 318 468 67 -62 405 491 69 -49 322 387 66 56 358 333 -40 128
2866A28L05j12l94J32L65k50k35J39K52k01j55J85R1k01m6K51m3k86O5K86K8l61
2888e7L9K43j67j95K05J78j90l24L51K64l23k64L28K21l47k21K80K49m04j16L62
2909A12N5l51LL33jk77r2K44Q9j80r3J64Rj37J55P7j26j68K47J7k09M3J71j1k56
2934a82J65K15j70l03K45L08j84m05K28L57j84l44K02K77k08k68J76K20k15k02
2954b72L25K14l38k07L24J36k08k23K30Q9j47o6J94o3j19J27J20j56j84J81Q9
2975D6j00j18J26K2j40O5J47j2k58O9L12q7l17M1L01l8k73K5K23j58j78K01K23
2998A22k19j77K37J49k68k32L04R4j29j37J51M1j20m1K02p1k22J07K04j9k57Q7
3020a94J13k9j87K05O1j65j9J56mk11l4K27Q1k72k2K31m2j60Q6K55j09k60J12
$$ plain form
2866 128 433 321 -73 59 424 174 -61 78 330 129 -26 159 250 49 3 254 211 -75 -10 276 304 -57
2888 -57 -18 225 58 -137 68 246 56 -268 83 347 24 -240 88 309 -38 -259 21 270 -134 -250 112
2909 112 167 -184 -181 152 151 -126 -218 26 115 -65 -158 6 15 -122 33 110 -16 -184 63 80 -129 -86 85 74 -182
2934 -182 -17 198 28 -275 -30 278 94 -311 -83 274 90 -254 -52 225 17 -251 -75 145 -70 -272
2954 -272 53 267 -71 -278 46 182 -26 -249 -19 70 -77 -143 51 -12 -131 -4 116 -40 -224 -43 46
2975 46 -54 -172 -46 -24 -164 -99 48 36 -222 -153 159 72 -245 -204 97 59 -214 -189 34 -124 -302 -101 122
2998 122 -97 -274 -37 112 -156 -388 -84 10 -119 -256 -105 -64 -184 -225 -23 -94 -316 -209 -5 -24 -281 -194
3020 -194 -81 -110 -297 -92 -31 -196 -215 -59 -63 -274 -308 -81 0 -272 -294 -63 -105 -265 -179 76 -33 -293 -181
3043a81K21j46j52J84J28j25j85K04R2j27j9J47Mj28J2J34M4j18NQ5K8j68Q0R7
3067A16p3j01J18Q4j69n0K47Q1j61j33J43J42k31M8Q4P8j74M5J91l1k03K0K33
3090C04m0k27M0J78k9q5l5J33o5o2R7Ln2MJ08m2j41J00P5l7j08M3J08o9p4K3J98
3117C48k01j48J84J61k35j17J28K11j64j67J29L5q3q0J32N2j14j42K33P1j87m9
3139cK7N5p9l2J07ok7QJl6l4N4Qj42L3J37p4o3L4J16j42p5K11Oj15j74J95Q4j15
3168d1j69J34J20j05r5N2J21j50l7J41M1j48l3J45Q7j81n6J34M7j14K8N3rn6Q3
3193hj2n1o4Q1Q8j10o8J62n8l9L7Q0q4j04O0J46q5j32N6J53j7j29k6J29n9kL3
3220b3R5j59n9J21N8n4r6J13O1m5o9L5M3l0N7n5j01j9J36J8k6j45Q6J16o2p5J0
$$ plain form
3043 -181 40 -106 -258 -74 54 -71 -256 -52 40 -87 -106 41 45 -83 -71 63 107 -11 -6 79 107 -61 19 116
3067 116 43 -58 60 144 -25 -75 172 253 92 -41 102 244 13 61 145 223 49 94 285 254 51 71 304
3090 304 264 37 77 255 226 141 106 239 174 112 209 212 160 164 272 230 89 189 264 227 119 162 270 201 127 150 348
3117 348 147 -1 183 344 109 -8 120 331 167 0 129 164 81 1 133 185 71 -71 162 233 46 -3
3139 -3 24 79 0 -32 75 69 42 50 51 15 -19 35 43 -99 -66 71 -3 -66 -32 84 -58 -133 78 84 -31 -205 -10 74 -41
3168 -41 -210 -76 44 -61 -156 -104 17 -133 -170 -29 12 -136 -169 -24 63 -118 -174 -40 7 -107 -79 -26 -35 -91 -8
3193 -8 -20 -71 -135 -54 34 -76 -144 18 -40 -79 -42 38 -46 -150 -90 56 -29 -161 -105 48 31 -98 -124 5 -54 -56 -23
3220 -23 72 -87 -146 -25 33 -21 -117 -4 57 12 -57 -22 21 -9 48 -7 -108 -127 9 27 1 -144 -58 58 -4 -79 -69
3247f9N8j55N4J56J5k71%J89K1j11m5O3M7p1NJ14r8J6J7N9j23j6N7j2K1l6j6N
3275a26N6L5l5q0o3J91J4j64n7J55J06r0j13J19N9q7o6R9Oj32K5J16J22j87j22
3300b19K06J0n9p2J48J2j25J7J63n9j39J51O2o4j02Q2oN9Qn0Pq2J22R3p3j55Q7
3327B2J35o2j11P0J26j59M9J12J0j31o7J57P7j85o0J33J73j59j13J85n7q3K6J93
3351B81j54p3O6J37q4o8L2Q4q5lJ6Mm3JJ37q6r2L9J51m5j00m6J47Kj75Q3J05r6
3379A35j28J06P9p2j28J13J04j67o3M4J09j28n4J18q6KP4P2n7j19PQ9m5q0J5Q8
3405B8m4r0O3Q7j55J0R4M5q9n9R8N5j65QJ27l3j29Q0J52j76j10J41O9l8m5l3J45
3432C6j45r7J75J05k15p9J65N7j52O8J23n7j10QO7M8j09p2K05n9p0K3J02p8j21
$$ plain form
3247 -69 -11 -166 -112 44 59 -212 -212 -23 -2 -113 -158 -95 -48 -119 -114 0 -98 -82 -65 -6 -129 -145 -88 -100 -79 -115 -131 -126
3275 -126 -70 -35 -70 -150 -213 -22 -8 -172 -229 -74 32 -58 -171 -52 7 -80 -146 -47 -41 -173 -148 -32 90 -97 -219
3300 -219 -13 -3 -62 -134 14 26 -99 -82 81 22 -117 34 96 32 -70 12 6 65 73 23 30 -52 70 163 90 -65 22
3327 22 157 95 -16 54 180 21 70 182 192 61 -6 151 228 43 -17 116 289 130 17 202 145 62 88 281
3351 281 127 54 120 257 173 105 137 221 136 133 149 153 110 111 248 162 70 109 260 215 115 69 216 218 43 126 231 135
3379 135 7 113 192 120 -8 105 209 42 -21 23 132 4 -50 68 -18 -16 58 130 73 -46 -39 50 5 -75 -60 28
3405 28 -16 -106 -43 44 -111 -101 -7 38 -51 -110 -12 43 -122 -114 13 -20 -149 -69 83 -93 -203 -62 7 -31 -76 -109 36
3432 36 -109 -206 -31 74 -141 -220 -55 2 -150 -82 41 -16 -126 -118 -51 -3 -112 -184 21 -38 -108 -85 17 -61 -182
3457a82J20N7o3j7L4Q0j34k8J55Mj27m7J93p8j38J23Q6n3r1P1J27j26l2Q9M9j38
3483f6m4J48L5j24j14K35Nj87J4J63m2p9LK6R0j49k5J26J0j52J53J8o5j53J87
3508A3Rn9q6J43L6r8p5P1J26k16N4R1l5j05M0J26o4j16O7O0q1n4J20K1q4p6J78
3535FL5j53m7K41n0j70M3J37J7k21Q7J24j4j98J38J31q9j38N9J42p0j81J21J24
3559G4j00r6M8kL1n6J34N6j17KK3O3j03O5J0kl8P5K8j31l8J97Jj11RP4N9j30r
3588A6J47l5j82J09Q4J6j55L8K00p2k44J17J89j9j54k4J47m3j24J89J1j00o7L8
3612H2J23r6r6Q4N1k0l3J27j65m5O1J11o4q2P9J00q2j10L8R0r2m5J02K3r8r2J75
3639A26J4k44J05J57n7j51L2J36p2j16Q2Q0r5j55J49P4k6j80J53N6j50m9J33R
$$ plain form
3457 -182 -62 -5 -68 -85 -51 29 -105 -133 22 26 -101 -148 45 -33 -171 -48 38 -15 -106 -35 92 -34 -66 23 72 -66
3483 -66 -110 38 73 -51 -165 70 75 -112 -98 65 23 -56 -53 -27 63 -86 -111 15 25 -127 26 44 -21 -174 13
3508 13 22 -37 -123 20 56 -42 -117 -46 80 -136 -82 9 -26 -131 -91 35 -29 -145 -78 -18 -99 -153 -33 -12 -96 -172 6
3535 6 41 -112 -159 82 32 -138 -95 42 59 -162 -75 49 35 -163 -25 106 17 -121 -62 80 10 -171 -50 74
3559 74 -26 -122 -74 -76 -45 -101 33 89 -28 -26 -3 60 -43 22 32 30 -8 67 95 -36 -74 123 124 13 22 96 155 25 16
3588 16 163 128 -54 55 139 155 0 38 238 166 -78 39 228 209 55 31 178 135 11 200 211 111 44 82
3612 82 205 109 13 97 148 128 95 222 57 12 73 184 120 38 117 217 135 25 63 153 61 16 118 141 43 -49 126
3639 126 140 -104 1 158 101 -50 -18 118 46 -70 12 92 -3 -158 -9 65 39 -141 12 68 -82 -131 2 11
3663A1j05m1J36J4p4nO0J6j33l6J99n2r1o4J59p3m7J03K3j52M1O9l5m5k6P9m8
3690a17n2J02L5j08m5P4J24j43k2J55K3j09j34J18J32j78k2R4Q4j54l6J48M8p7
3714f0j03M2J89j64l9J52O1j46j5R2l1o9%J20m6n3L7Q4r0K6PJ2l1n2J15l8k4L0
3742FQ0l3q3NO7k1q4R6L5r8l1J43k8q2pO1R0j30j13J15P1j11J1J31l9m3o3Q5k6
3771Do3J1J4M1j08N3Q8m9p2O5N4Lj5k4j2m2k2J08p6Ro9M1O3k9Jl7M6l0j0L0o4
3802i1K3J04ql8m6O2k2j3m2J52k4q5J6O8pj56L7J43m6r8J6J99j64N4k2mQ4j68
3830g6J39Nq6M4P7K5j47N0L2K2o2J0L9m1K5N7m4Kj2N8L9j18k2M8j8N4L7K9n8q
3860A00p7J00O9r3j06J63m6n0M2nM0j02J00k8j6l1J23m3r2m0P7P0j29M4J04l4
$$ plain form
3663 11 -94 -135 1 15 -59 -64 -4 12 -121 -157 42 -10 -101 -165 -6 -79 -126 -23 0 -152 -111 -42 -77 -122 -148 -69 -117
3690 -117 -169 -67 -32 -140 -185 -111 13 -130 -152 3 26 -83 -217 -99 33 -145 -167 -73 11 -143 -179 -31 17 -60
3714 -60 -163 -121 68 -96 -135 17 78 -68 -83 9 -22 -91 -91 29 -17 -70 -33 51 -39 -13 -6 6 -25 -77 38 0 -24 6
3742 6 86 53 -30 -25 42 21 -63 33 68 -30 -61 82 54 -28 -35 26 116 -14 -127 -12 59 -52 -41 90 51 8 -55 30 4
3771 4 -59 -48 -34 7 -101 -48 40 -9 -81 -16 38 41 26 2 -10 -52 -74 34 -42 -33 -102 -61 2 -27 -26 -63 -17 -47 -57 -27 -91
3802 -91 -68 36 28 -10 -56 6 -16 -29 -71 81 57 -28 -12 56 49 -107 -70 73 27 -71 -55 144 -20 34 12 8 92 -76
3830 -76 63 68 -18 26 103 128 -19 31 63 85 23 33 72 31 56 113 69 71 59 117 156 38 16 64 46 100 137 166 108 100
3860 100 23 123 192 99 -7 156 110 60 102 97 137 35 135 107 91 60 183 140 48 8 85 155 26 70 174 140
3886A40n5p0R7L1r4j0Q4l1j05j2J32r7Kk7R5oj20L4Q0m0j22O5R2q0k6PJ1N1k7
3915ap4P1n0N0l6k3q1J34J7r7J6qO1n6k4Q2k7k1o5R8m2j00N3O9Pj05L9O4mr5Q8
3946f0J0m0q7J04M7k7r5mR1l6o2J55M4r3jM4j8nj11R0j5mmQ5j04j2J13l4JqL7
3977AOl2l6L5j5J2L2L9o4m2O2J7l9k9M0J02o4r9J08K8m8p9J64j0q7j9k8O0k9K
4007a2O8mk6m5N2Jn3K3L2q5K2MJ10r4n3J15Nm7n7jR7m3k9qL1l2o0J20k0m6j8J24
4039G1r8n8R2M2l5n9KM7pJ9nm0M3k8L0N7l4j1J8j3n7lN8On0O3l0K7q9K1J5l3p
4072d6P1l1j1l3J18m1q7J4P2J7q1N0j2J3j09J69m7N6j17j0J28Lj30P4N4o0L6o2
4100bP3o7l3J24Jp5j4K8O9l5j6P1o3m2K2R4j9q4O1RPr2O5J1r1R5k5Opk6N2J1m7
$$ plain form
3886 140 85 15 112 143 49 39 123 92 -13 -25 107 10 12 -15 80 74 -46 -12 68 28 -94 -29 63 -17 -43 -36 -25 26 -1
3915 -1 -75 -4 -54 -4 -40 -63 -144 -10 7 -90 -74 -82 -21 -77 -101 -19 -46 -67 -132 -34 -76 -176 -123 -54 -47 -152 -113 -49 -53 -148 -60
3946 -60 -50 -90 -177 -73 -26 -53 -148 -152 -61 -97 -159 -4 40 -53 -54 -10 -28 -33 -144 -54 -69 -73 -77 8 -96 -108 5 -29 -28 -36 1
3977 1 7 -25 -61 -26 -41 -29 3 42 -22 -64 -2 15 -24 -53 -13 89 25 -74 34 62 14 -65 99 89 2 -17 -45 15 -14 -12
4007 -12 56 52 26 -19 33 34 -19 4 36 -49 -27 -23 87 -7 -60 55 60 13 -44 -45 52 9 -20 -28 3 -29 -89 31 11 -35 -53 71
4039 71 -27 -85 7 49 14 -45 -43 4 -3 16 11 -29 14 -14 16 73 39 28 46 33 -24 -27 31 37 -13 50 20 47 -42 -21 -6 -39 -46
4072 -46 25 -6 -17 -50 68 27 -60 -46 26 43 -38 12 0 13 -96 73 26 82 -35 -45 83 86 -44 30 84 24 60 -2
4100 -2 71 4 -29 95 96 21 7 35 104 69 53 124 61 19 41 135 116 32 93 102 109 17 82 93 2 97 72 78 71 45 97 108 61
4133F1qQ0o7o4K6K9M7j06Q3K1k5r4J6P3rl7J25j37q4K9L0J9k9KP6l4k5J5O1p4
4163@k7m2Q9k6o1M0R1j72N3N9l8j26J26M0p4p3J05nk2o7M9J26p0M7p2ok4k4O2
4192d2L0r6k1Q7L2j33P6k9K6j08K4J09n2o2J08Ql5Jn9J58o0n4oN5n9j8L5P6j4
4221b3j41J14J3l9m3J08j5j4qP7j2r4M5O6j15K5N9L7m2n7K1M0r6M1J41Jj43n9
4249a13J49n8Ll7J86k6j45N2O4l8p6Q7N0o5n5J3R2p1k3M4J2n5m1J29r2j8P3L9
4277H0qj10N6N2o0J4k2L2m2L5M6n8j2QK2O1o2p5J13%n6kJ05rj50K4Q5r7j1M1O5
4308F5o9j2J8n6K7n1M1Q7r8n1J08L1j05j5J06m1j3l0K3O9j4l9lRj0l1M3o2LJ00
4338C0m5j4N0J7l2L3n5P7mo6oJ04n2j13K6J03p0kK8O9k3j16J30L4p8m5%J39m0
$$ plain form
4133 61 53 133 66 2 28 57 104 -2 81 102 77 -17 -1 72 63 26 151 14 -70 -41 -11 8 -21 -19 57 23 -2 13 74 0
4163 0 -27 -69 20 -6 -67 -27 64 -108 -55 4 -34 -160 -34 6 -68 -141 -36 -41 -63 -130 -81 45 -25 22 -50 -56 -80 -104 -42
4192 -42 -12 -108 -129 -42 -10 -143 -67 -96 -70 -178 -154 -45 -97 -159 -51 -43 -78 -77 -136 22 -38 -92 -98 -43 -102 -120 -85 -9 -23
4221 -23 -164 -50 -37 -76 -119 -11 -26 -40 -48 29 17 -77 -32 34 -81 -56 3 40 -2 -59 -38 2 -94 -53 88 89 -54 -113
4249 -113 36 -22 -19 -56 130 104 -41 11 75 37 -39 48 98 33 -22 -9 83 12 -11 33 45 -10 -51 78 -14 -32 41 80
4277 80 72 -38 18 70 10 24 2 34 -8 27 73 15 3 11 33 94 32 -43 70 70 14 12 117 108 -42 -18 67 -30 -41 0 65
4308 65 -4 -16 2 -54 -27 -78 -37 50 -48 -99 9 40 -65 -80 26 -15 -28 -58 -35 34 20 -19 -22 -13 -23 -54 -11 -73 -70 30
4338 30 -15 -29 21 38 6 39 -16 61 57 -9 -15 89 37 -76 -50 53 -17 -19 9 78 55 -61 69 103 25 -20 -20 119 79
4367G9j05RJ85q1q6k3J59j51N7J17j77pQ4k3J4n3M4N0n0m6P5rm1m7J10o4j26Q5
4395b1J18n8n2k0J02J8j27J5Q8j0n2K7K0l0j00N6J09j20kM6k2o3OR2o0k0M3O4
4423D7p7l2J4O4n8p9N4P6n4o4M4M6o3O6o2K5r5J20m4J07j53L5M5Nl9m6Q4Lq0O4
4453d7oN6r9K3J6l8K5N9o8j0J5k2L9k0j2L7NjJ1K9k3o5N2jN6j62J37KJ0p6K4R1
4485C7m8j07R1K3mm3J4M3n1J6O6kn7L6J8J7k8j2M0K3m9j7K9j3j7M1pq6J8Q4Nl0
4517C0o6P0j0k8k7J22k2p5N5j3j2o0N7K0k9j1K9k7L6j5O7nm2n7K0O3r2j6Q0L9
4547H1j25K1Q3l4k9K1J0K8o8K5K6mo3O4rK5J9o4J8k5j7L3M6q0P5L3j22m0N2M9
4577B9pp8K0R5n9m1K8J9j16N3N1j2om0J01m5L3r0J11k1m4l0N0j0j4M8k5O4o9j9
$$ plain form
4367 79 -26 -17 168 87 1 -22 137 -14 43 160 -17 -24 60 37 51 -2 42 92 42 -4 71 62 21 -26 84 20 -106 -21
4395 -21 97 39 -13 -33 69 87 -40 -25 63 53 1 28 48 18 -82 -26 83 -37 -39 7 -15 -78 -72 20 -40 -60 -17 47
4423 47 -30 -62 -48 16 -42 -121 -67 9 -45 -109 -65 -19 -82 -16 -78 -53 -148 -28 -72 35 -118 -83 -38 -33 -72 -118 -34 -31 -111 -47
4453 -47 -53 3 -96 -73 -57 -95 -70 -11 -79 -89 -74 -96 -57 -77 -89 -52 -47 -48 -37 -8 -31 -96 -44 -45 11 -151 -14 -12 -2 -78 -54 37
4485 37 -11 -118 -27 -4 -8 -51 -37 6 -45 -29 37 35 -22 14 32 49 21 9 49 72 23 6 35 22 5 46 39 -47 -29 55 60 30
4517 30 -36 34 24 -4 -31 91 69 -6 49 36 24 -36 21 41 12 1 30 3 39 24 91 86 44 -13 7 70 -22 -38 42 81
4547 81 -44 -23 60 26 -3 18 28 56 -12 13 39 35 -28 36 27 52 71 7 25 0 -17 16 62 -18 57 90 -32 -72 -20 29
4577 29 22 -56 -36 59 0 -41 -13 6 -110 -57 -6 -18 -24 -64 37 -8 25 -65 46 25 -19 -49 1 -9 -23 25 0 64 -5 -24
4607b4N5k4o6N8L2M4r6M8P2p1k8L5Pn6M4M1n4n5R2k0L3m5j3P6p1m2M8k8NpK0N6
4639F6m3j2L0J1o3nP0pq2N7k5J7l7K5J16q4m6M0N2j99N9J20q3J1rK2K9p7O9J0
4669C2m0nl6N7nJ0j1J3M3j00mjL2J8l6qk1Nj0J9K5j9j0M3l9N9mr7k5Q2J7ol1P7
4703B4m2n6j2N6K1j4n9k5P2j6p9L8K1K9o7J5J13j4m3L5n6n7R2nl7l4O0K8o1N9
4733a4l4J7j9k0O2Pm3J7O0q4J0jQK3o5N7Q6m9p7N5N4m6p0N3O9j14L3K5M3j5r3
4764f5Q5P5p3k1R2n1rn6N9l3kk4K8L3n9J5L4n1M0O6j1r8JQ9J8p1J8R9lj11pP8
4796H5L5j75M2J01k8m3L1o2RK1j9J02q4J6Mool8O3J8j20O4K9Kn5J08p1J8l5J4
4826B0K3k3m2J45o0j48J08l6l8K1N5j2q3K3K3M8no3J7J0J6o6L7L0L6o3o0J10J9
$$ plain form
4607 -24 31 7 -59 -1 31 75 -21 27 99 28 0 35 42 -14 30 71 17 -38 54 34 67 22 9 85 14 -28 20 -8 -3 -10 10 66
4639 66 23 11 41 52 -11 -16 54 47 -35 22 -3 14 -23 2 118 34 -12 28 80 -119 -60 60 -23 -12 -21 1 30 -47 22 32
4669 32 -8 -13 -49 8 3 13 2 15 58 -42 -46 -47 -15 3 -33 -41 -62 -57 -67 -48 -23 -42 -52 -9 -48 11 7 -90 -115 -33 -16 -22 -53 24
4703 24 -18 -74 -86 -30 -9 -23 -82 -107 -35 -51 -130 -92 -71 -42 -109 -94 19 5 -38 -3 -59 -116 -24 -29 -66 -100 -40 -12 -73 -14
4733 -14 -48 -31 -50 -70 -8 -1 -44 -27 33 -51 -41 -42 -34 -11 -76 -19 67 18 -59 -4 50 4 -66 -13 56 -58 -25 0 43 28 -65
4764 -65 20 95 22 1 93 42 33 -23 36 3 1 -23 5 38 -21 -6 28 -23 17 83 72 -26 -25 64 82 11 29 128 125 14 7 85
4796 85 120 -55 -13 88 60 17 48 -14 -5 16 -3 99 15 31 35 29 23 -15 48 66 -54 10 39 41 -14 94 23 41 6 20
4826 20 43 20 -22 123 63 -85 23 -13 -51 -30 25 13 -70 -47 -24 24 19 -44 -27 -17 -1 -67 -30 0 36 -27 -87 23 42
4855D2q8K8J0m9j9R4J06j55mN5L2l2NL4j5l5J5K3p5l5J48j7j38L4P1om2M8j6R
4885B8oj1l0k0l9Q5j4M9l2N8Jr9o8J76k5Lm8R2n0o0k0O2J5j02Q7N3p8l9M9L8r6
4916d1K5K2L2J9o1M4Km9oL6k0m2P7l4M1j1Ll0j8l1J7M5M5j22M3Mj7l9L1L9q0l4
4948a10J18r6j5N9K2j6jk9P2o6l6M1K8k2K3j9J6O7j64P3L6rk6L3o5R3j7mP0j24
4978f8M7J8K5j24N4M0o5l7J28n1j04L2Q6L4m3rN6j04Q2mL7m6L0k0O6m1j2k0J0
5007cK6n5P7j2m7l7O7M0p4L2j6M4nn0QM6j03M3N4J4p8M0JJL1k8R2o7n2pJ5K8m1
5040a6L7N1K0j07P9m1k1j2J01n7k1NO0l1RJ3q2M3L1n3J35j37K2o8Q5q4J0O8K1
5069F0J8n5m2K1K8p0k3J19m8jL8o9m1k1J07l2l2O0o4K6Qn5N7LLJ2jl3O4q6N9N8
$$ plain form
4855 42 -46 -18 -8 -57 -76 18 124 -31 -35 20 52 20 25 59 44 9 24 47 -28 -63 85 68 -70 -36 35 29 -13 35 19 28
4885 28 22 11 -19 -39 -78 7 -7 42 10 68 69 -30 -98 78 53 56 8 100 50 -10 -30 32 47 -55 32 85 7 -32 17 55 -41
4916 -41 -16 6 38 57 -4 40 42 -7 -13 23 3 -39 38 4 45 34 37 7 -11 -42 -25 20 65 -57 -14 -10 -27 -66 -35 4 -76 -110
4948 -110 8 -88 -103 -44 -22 -38 -39 -68 4 -62 -98 -57 -29 -51 -28 -47 -31 36 -128 -55 -19 -28 -54 -21 -86 7 -10 -14 56 -68
4978 -68 -21 -3 22 -102 -48 -8 -73 -110 18 -33 -137 -105 -19 15 -28 -37 19 -85 -3 -7 30 -16 14 -6 60 19 7 -13 -3
5007 -3 23 -32 45 33 -14 -51 16 56 -18 14 -2 42 37 -13 -5 41 -62 -19 35 49 -29 11 12 13 44 16 108 41 -11 -18 -3 25 -16
5040 -16 21 72 92 -15 64 23 2 -10 91 34 13 18 78 47 56 69 -13 30 61 8 143 6 28 -40 45 -39 -29 39 60
5069 60 78 23 -19 2 30 -40 -63 56 8 7 45 -24 -65 -86 21 -11 -43 17 -47 -21 -13 -68 -11 -8 -5 7 6 -27 37 -49 10 68
5101F8r2Q1n1k6k3Q6p7k0M8M9o8p9M6R2l7l9M1P1j02j5J12o0j9J6M9k7l1kK4r
5131Fn5j2O6K4o0j7N8k0p1R4k0oL9NL2o0l5N8n6Q2o4RN7o5n8J20L6q7k9L7K5j0
5163B3j3M5r6Q2j8k0Rl9P0j7m1L6jk3l8L0L1m5l4O4k9K8pJJ2o0N2o7J23m2k7N
5195fK7n8J0K1M4l1l1K6k5J4k0M4l4n2P2pn7K1kmJ1o0P4l0J2k5M5MK0n4L7L4j16
5228i6N9J4l4L9l4M5j5rl5N6L0p9O0M6q7K4P6l9o5O7n6O4n6j0K3O9p4j9l9J06
5258C1k3j6M0m7Qnm3J35j23N9k3L7k0JM9j9Mn6j5M5M7q1P9l1l1J0J2nk7J11r1
5289A2m2M3N9l1k0L8J2l2K9q5N8k9N4l7M0k1n0Q1r0O9k4l5M2m0O0j8lJm1L1l5
5320dOk9O0K6q4Q5m0k0rO9n8m5P8%qo4O0m6M8l1R8r8K0j3M0q4OqN8l2l8J1K4J0
$$ plain form
5101 68 -24 57 6 -20 -43 43 -34 -54 -6 43 -25 -104 -58 34 -3 -42 -1 70 -32 -47 65 5 -14 2 51 24 -7 -9 15 6
5131 6 -49 -61 5 29 -31 -48 10 -10 -81 13 -7 -13 26 31 63 3 -32 26 -30 52 -12 -3 54 -11 -69 51 87 0 -29 8 33 23
5163 23 10 55 -41 41 23 3 12 -27 43 26 -15 21 20 -3 -41 -11 20 -25 -59 5 -24 4 -3 -2 10 -50 2 -65 58 16 -11 -6
5195 -6 21 -37 -27 -6 38 7 -24 2 -23 -9 -29 15 -19 -71 1 -6 -63 -42 -44 -48 -37 -97 -23 -53 -41 -66 -21 -17 3 -51 -14 20 -96
5228 -96 -37 -23 -57 -18 -52 -7 -22 -31 -66 -10 20 -59 1 47 -40 -16 60 21 -44 23 -33 31 -25 -35 -12 57 -17 -36 -75 31
5258 31 8 -8 32 -15 -7 -12 -55 80 -43 16 -7 30 10 11 60 41 45 -11 -26 19 66 -15 64 33 2 12 24 19 -8 103 12
5289 12 -30 13 72 41 21 59 71 39 68 -17 41 12 66 29 69 48 -2 79 -11 58 34 -1 41 1 61 43 40 41 0 31 -4
5320 -4 2 -27 33 59 -25 60 20 0 -9 60 2 -43 35 35 27 -37 23 -23 25 -6 92 -6 14 1 41 -43 -37 -45 13 -19 -57 -46 -22 -12
5354a2l4N5pK2m6j1%K1K9j1K4o3j2O0j12J09k9m0Q6j4j9R3j15k1M9o9M3k2K8J5
5384cJl8k4N6L9j10P2j2J5J6j5j1Jk6O1j1k7K2l5M3l3MJ7Qo1O5m1k7nP9Qj5j00
5417h7Q4M0k2l0OOK1n3M2Rn1M9P0l9j08M7J0Nl3K0N0m7K4k9Q7j25P9J6Rp2N6N5
5449H9r4rl3K6l1M5J0K0Klp6P2Mr8N9j3n3M8m8J00j31QP5O8q1LK%NK4L0j2%j1
5483cl6O8l7K4j0k9k5M6k2K4n8L8K1%l0QP6n3l7K1M8Jk1n3O5p1M3k8J9J5k2J3
5515ek3k5Q1q4j7N9K1k1L3RNk6k3K6K7l4pp1R1N0k8Oj2L4j12J11Jk2k6J4O6l6
5547F2l0M9n6m1P8n9Q1m5J8o8N2k9J3K1Km8N7k5n8K8Pk5K8L6K1p5L8K7j7j4Pj0
5579B5m5O9o7l0J18n5m2O4k3Rm3lL3q0L2P3l8m6M3j4j0M4J1r8R8j8Ro5N6k0M5
$$ plain form
5354 -12 -46 9 2 24 -22 -33 -33 -12 17 6 30 -33 -45 15 -97 12 -17 -57 29 15 -4 89 -26 -47 2 -67 -24 -46 -18 -3
5384 -3 -2 -40 -64 -8 31 -79 -7 -19 -4 12 -3 -14 -13 -39 22 11 -16 6 -29 14 -19 -15 2 10 -51 14 -27 -54 -59 20 28 13 -87
5417 -87 -3 37 15 -15 -9 -3 18 -35 7 16 -35 14 84 45 -63 -16 -6 -1 -34 -14 36 -11 13 -16 71 -54 25 41 50 -22 34 89
5449 89 -5 -14 -47 -21 -52 -7 3 23 25 22 -54 18 22 -76 -17 -30 -83 -35 -83 17 -114 -106 -31 37 -44 -41 -39 -39 -34 -10 20 8 8 -3
5483 -3 -39 29 -8 16 6 -23 -48 -2 -24 0 -58 -20 1 1 -29 -21 55 2 -35 -14 34 35 14 -39 26 -45 -2 -30 -11 4 -18 -5
5515 -5 -28 -53 28 -56 -73 -14 7 -14 19 28 33 7 -16 10 37 3 -4 -75 16 66 38 44 32 66 -46 65 66 44 18 32 98 62
5547 62 32 81 25 -16 62 3 84 39 57 -11 41 12 25 46 48 0 57 32 -26 2 9 -16 12 48 69 -6 32 59 42 28 35 25
5579 25 -20 49 -18 -48 70 15 -27 37 14 23 -20 -23 10 -70 -38 35 -3 -49 -6 -20 -30 14 25 -73 25 7 16 -49 7 -13 32
5610C2m6n5O0J5m6M2k9J4%m7M8m6N0O1p9M7l7Pj0j5L4j39P1N6J8rl6J3o6J19m3
5641a6n9Q4J9m8l4Q6j5j6M8j20N4m5M3k5J3k1RP7l1M6m6Qk9J4l5L0K5k5M0n4M4
5672B1m5J1K0ql3J7MR1r5N9Ol8k3M5p7j2O6n2J02r0k9O9N6r8k0Q6ko5j0O1jMo4
5705d4K4j2l4M7M7Nk8J1k3j2J1%m2L3j5q0P0J13j24M4k8NO2lo9m7M4P6o3j2K7
5736a7K0k3K8K5L7j01j04R9J6J3n2J42p9ql7M8m0M9p1LN8q4J08jn4J6L8l4N9l4
5766B0p7P6pp6M1K0p0J4K9Rj9K7k4M9j4lO1j5n1J7K1p3O4j7NJ7jO4n0k1L3L0l0
5799D9n1J2j2O1m6jR5n8n4oK2M6o0N5p8R8l6L5L1j12k4PN4k8l7O0M6k9K4j6K5
5830G2r2O1j02Q1n3K0P6Rj18K7O8o3K1j5J7m7j0k9J16o6N9m0J7m2L3LjJ7l1p3
$$ plain form
5610 32 -14 -69 -9 6 -40 2 -27 -13 -13 -60 -12 -58 -8 53 -26 21 -16 -9 -19 -34 0 -139 -68 -12 6 -3 -39 -26 -92 27 -16
5641 -16 -75 9 28 -20 -54 32 17 1 49 -71 -17 -62 -19 -44 -31 -52 -43 34 3 49 3 11 -18 -4 -39 -9 16 -9 31 -23 21
5672 21 -24 -13 7 -1 -34 -17 -13 78 -17 42 48 10 -13 32 -45 -57 9 -43 59 -31 -60 9 65 -33 -53 33 31 -34 -44 17 16 20 -44
5705 -44 -20 -32 -66 -19 28 33 5 16 -7 -19 -8 -8 -50 -17 -32 -112 -42 71 -53 -9 -37 -32 30 27 -42 -89 -45 31 -32 -44 -17
5736 -17 3 -20 8 33 70 -31 -135 -36 -20 -7 -59 83 4 -4 -41 7 -33 16 -55 -52 6 -78 30 29 -25 -9 29 -5 54 20
5766 20 -57 19 12 -64 -23 -3 -73 -59 -30 -21 -40 -13 -37 12 -2 -5 56 41 -10 7 28 -45 19 2 7 24 23 87 37 16 49 79 49
5799 49 -2 10 -2 59 13 12 107 49 -5 -11 11 57 -3 52 -26 72 36 71 102 -10 -34 -27 27 -1 -38 22 68 39 63 47 72
5830 72 -20 41 -61 20 -33 -13 63 72 -46 -19 49 -14 7 -8 9 -38 -48 -77 39 -27 32 -8 9 -33 0 3 2 19 -12 -85
5860h5J24p9RPm3J5N6k2l7J05L8j50L9l9J00o7N6jj8j6K4k2rK3m3R4k7l0l4L7
5890Ek1nqOK2K1j2J9%j0l1nm3J4RN8j4k0q3M7O5j6k4K1J6k9J05j20K4pJ5j6O0
5923D3l4NJm2Q7k0m9L3K3m0M2j5n0N5m2JM6q3O0l0kM7jm6M5k9j7L2Jm4k0O6n9
5956c6P4j05J7R2j2m6K4j4k3L0n0P5nkn1J0M4r0J3J39j5j15N6M8j08L7k8L2O2
5985E3r3L4k8K2J6Kl1NK9l0O5n9J1J2rO0ppo4M1j4J9rl6k9J9k3L1L3m9P7n7k1
6018c7L2Rk5M9k3l0OJ5K1n2N3m0L3k2Rrk8j2Rj4R0k6K7l9o5N0J00k8j8q3J7k5
6050e6k4P9k1m1R8M4m8j6n2R7l7J9l8K6o9O1l8P2q0L5J0N8j02jM7J6m8K5m7M1
6080A0rN2K2r9M9o3Q6n0l5O4rk1LPM2m6m0K0N0m7M6j6K9l6J6N5l4l5j30J54J9
$$ plain form
5860 -85 39 -40 -31 -24 -67 -52 4 -18 -55 50 88 -62 -23 -62 38 -29 27 26 8 -8 16 -6 -15 8 -35 59 32 2 -32 5
5890 5 -16 -21 -29 -23 -1 20 8 27 27 17 -14 -19 -62 -48 -39 19 5 -15 -98 -51 14 -2 -26 -5 11 -18 87 -33 -9 -16 -1 -17 43
5923 43 9 14 15 -27 60 40 -9 24 47 7 49 34 -16 39 -3 -2 44 -39 21 -9 -11 36 35 -11 34 5 -12 20 21 -23 -43 23 -36
5956 -36 38 -67 -50 42 30 -16 8 -6 -29 1 -49 26 21 19 -32 -22 22 -68 -55 84 69 -46 10 58 -50 -13 -41 -9 53
5985 53 -40 -6 -34 -12 4 6 -25 -20 9 -21 44 -15 -4 8 -1 59 52 45 -19 22 8 27 18 -18 -47 -28 -51 -20 13 -36 41 -16 -37
6018 -37 -5 4 -21 28 5 -25 -19 -4 17 -35 18 -22 11 -11 -2 -11 -39 -51 -42 -56 34 8 35 -4 -69 -19 81 53 35 -48 -31 -56
6050 -56 -80 -1 -22 -63 35 79 31 15 -37 60 23 42 4 30 -39 22 -16 56 -24 11 21 79 -23 -24 23 39 -9 16 -31 10
6080 10 1 53 75 -24 25 -38 48 -2 -37 27 18 -3 0 7 49 3 -37 -17 33 -14 32 16 45 9 25 80 46 11 -119 35 54
6111E4o7j2K3L2q6J31p8l7J0N5j7L4q6O0oj3j7pm0O8K7m6K3l7j3K3Jl8K4qLP8
6143C8n5m1J8J6NqK5n3j2R2j13N5K6k0Qm9R9j5j01Q8k0J6K6o4M0lkok2J1K4K7
6175C0j4L4p1J2Qn8P5L0k7qJ3oKl2Jk9j0O1K3k7J1n1M1j1k2R5l7J9p0j0K8K4m
6208B0j03J0L4%O8J6m8M7n4j3K2p3N6j7j1Q2j3n4K3n6J51n0m9P9p5K7k9k1J02
6237G1q2J2MPJ2omMm6lj0L7K3m9J9l5M1O1n2oKK0n5k6R4n9M6k2j3k5M1n9M0L6
6271A8k3j9j0K8k8K1J2K9j7o5J8N8j1m3rM4l7N9k7J4JpK6k5m6K7NQ2p2M2j6p8
6303d9L2O7J3o0m9M8j0L1J9k1k5j3L8l2rlN7N1j21L6Q9m8l6P6n1jm0m4P0J7Nn5
6335a8k1N5jk1J9n0PJ3J2j7N2J8p8R2l7L9k5q3L6M2m4K4n4j6P0k1M8ml2J5kJ1
$$ plain form
6111 54 -13 -25 -2 30 -56 75 -3 -40 -30 25 8 42 -44 16 10 -3 -20 -27 -67 1 28 -18 5 -32 -45 -22 -21 -59 -35 -43 -40 38
6143 38 -17 -58 -40 -24 -19 -27 -2 -55 -67 25 -88 -33 -7 -27 -19 -68 31 16 -85 3 -17 -1 25 -39 1 -2 -4 -10 -32 -21 3 30
6175 30 16 50 -21 -9 -1 -59 16 46 19 11 24 18 20 -12 -11 -40 -50 11 34 7 18 -33 8 -3 -25 70 33 52 -18 -28 0 24 20
6208 20 -83 -73 -39 -39 29 45 -3 44 -10 -23 -1 -74 -18 -35 -46 36 23 -31 -8 -64 87 37 -12 67 -8 19 -10 -31 71
6237 71 -11 1 5 12 24 18 14 18 -28 -31 -41 -4 19 -30 -11 -46 -5 56 4 -2 0 20 -35 -61 33 -26 20 -2 -15 -40 1 -58 -18 18
6271 18 -5 -24 -34 -6 -34 -13 -1 28 11 -54 -36 22 11 -32 -41 3 -34 25 -2 12 13 6 32 7 -39 -12 -7 75 3 45 29 -49
6303 -49 -17 50 63 3 -46 2 -8 23 42 21 -4 -17 21 -11 -20 -23 34 85 -36 0 89 41 5 81 30 29 -11 -55 15 32 37 -18
6335 -18 -39 16 15 -6 13 -37 -30 -17 -5 -22 30 48 -30 62 25 64 39 -44 -8 34 -10 14 -40 -56 14 -7 41 37 5 20 18 29
6367B9r5j9P7M2l5%n3J7L8pnk0K2o1L7M0k6m8K3j0m7M0L9ll6J5M3%J1j5QlJ5R
6401B2j14L0J8J1j0J04l7k2QK1o9N3K3l6O0K2j18k3M2%jLJ2m5Q8m7k2K2RJ1l6
6432b1K3J8j6K2k0N2m1n1PJ4%P4on4M7n1L6p7L5N6l5J1j4M3n7J9j5P2q2LM2n2
6464a8K8ok8L1nL8K0o3K1j7J0j3K1K4q8L9p4P8rLo0J03J8Pm8%o1K2J6K0Nq6Q9
6497A7r0J14j23R0m9K1m0N8j6k3M8m1M1N6p1Oj2l1P4O2j22r0Q4P9m3Nl7K9L8j08
6527g4P5l3K1l3L9QK3L6lo9L9l2k6N7k9Q7q9M8m7k4P4Lk6p8L5M7l7K7j1L3m1J0
6559A0NK0r9J37n0m7K9R2j33K7k9P1n6N9l8K0K3nqq7M7N1m6K2K1q5L5O3p2K8K6
6590C1j12J04k5N6K4j9r5O3%JJ9p2ll0P3jl3M8j1Lp4N7RJ6m5J3n0Q4k8K2mk1K7
$$ plain form
6367 29 -66 -85 -8 34 -1 -1 -54 -37 1 -6 -11 -31 -9 -70 -33 7 -19 -67 -44 -54 -101 -61 -22 -25 -61 -46 -3 -3 8 -7 1 -2 13 22
6401 22 -92 -62 -44 -33 -43 61 24 2 10 31 -38 15 38 2 62 84 -34 -57 -15 -15 -16 -13 -1 -46 42 -5 -27 -5 4 15 -21
6432 -21 2 20 4 26 6 58 17 -34 -27 -13 -13 61 55 1 48 -3 33 -44 -9 47 12 23 9 52 -5 14 -1 71 -11 -8 34 -18
6464 -18 10 4 -24 7 2 40 60 -3 18 1 11 -2 19 43 -45 -6 -80 -2 -11 -8 -68 35 53 60 12 12 -49 -27 -11 9 14 -72 17
6497 17 -73 41 -82 8 -41 -20 -60 -2 -18 -41 7 -34 7 63 -8 -2 -14 -45 29 91 -31 -121 -37 42 -1 4 -33 -4 34 -74
6527 -74 1 -32 -11 -44 -5 3 26 62 59 -10 29 -3 -29 28 -1 86 -3 45 -2 -26 48 51 25 -53 -18 29 -8 19 8 41 0 10
6559 10 15 35 -64 73 23 -24 5 97 -36 -9 -38 33 -23 36 -2 18 41 36 28 -59 -12 39 -7 15 36 -49 -14 49 -23 5 31
6590 31 -81 23 -2 54 78 59 -36 27 27 28 47 -25 -28 -58 15 14 -19 29 18 21 -53 4 13 29 -16 -3 -53 31 3 25 21 0 27
6623B7k5JJ1k9O7m6o2L8m4O1l8k2N8k2m1K0K7J9k0k4MN4n9m3R4l9M4K6o5j3L1
6654a0lO0j14K3J6K1knK8Rq1KJ08o3qJ3J3n6J6k4Q9qK7o2OL1l6j9N9J5q1N1Lm5
6688b7K8lJ7j6J6J0r3J1N5J6J2j5m2%jO7j8k2Jl2R1q8k4M9J3k1l3O2J0L6j1k0
6720B8r6J6M5M3k8k1J8M1J2l0L9r6J01o5o5J44o4j3j0l5K8LQ6j06LJ18r3J2L0
6749D5p7j1P3J5j09R6j9p3O2l2K3j2K5l6PK2n3M2J0K5n1j2K7P8p8l1JpQ6j8m9
6780c1Nk6O8j2ORL7n6LR2j02l1O5o3N2j1J8l9k9M4K1j0k1rK2N6p8J0M2j2nk8L0
6813A7K2l0l2K6o4P4j2n6M6J9p2N2L7k8j5l4J16m8k0jk1L1qL6n2L1J7m3n6J07
6843C9n5J2l2L9kK1l6j8l7P9k7K3K5n1j7K5M0l5N3m4J7j0K8j11N5pN7k5L9m3m7
$$ plain form
6623 27 2 3 14 -15 52 6 -56 -18 -62 -1 -39 -61 -3 -25 -66 -46 -19 0 -20 -44 -40 14 -45 -88 6 -33 11 37 -28 -41 -10
6654 -10 -13 47 -67 -44 -28 -7 -9 -14 14 23 -58 -56 52 -11 -19 -6 7 -49 -33 -57 32 24 51 -11 -5 26 -10 -29 30 45 -36 15 18 -27
6688 -27 1 -2 15 -1 15 25 -68 -57 -2 14 26 11 -31 -31 -32 35 17 -5 -4 -36 55 -33 -57 -8 5 -16 -49 13 23 59 48 28
6720 28 -68 -52 -7 36 8 -13 5 46 58 28 67 -29 72 7 -58 86 22 9 -1 -36 -8 -5 81 -25 -22 96 3 15 45
6749 45 -32 -43 30 45 -64 32 13 -60 2 -30 -7 -19 6 -30 -23 -1 -54 -12 -2 23 -28 -40 -13 65 -13 -44 -43 -50 36 18 -31
6780 -31 -26 -52 16 4 10 19 56 0 3 95 -7 -38 27 -36 16 5 23 -16 -45 -1 20 10 -11 -20 2 58 -20 -10 32 20 15 -13 17
6813 17 39 9 -23 3 -61 13 1 -55 -9 10 -62 -10 27 -1 -16 -50 66 18 -2 -3 -24 7 -1 35 -17 14 31 -12 -68 39
6843 39 -16 -4 -36 3 1 22 -14 -32 -69 10 -17 6 31 -20 -37 -12 28 -7 46 2 19 9 37 -74 -19 -26 31 6 45 2 -45
6874d5R9o7Qj7k1K9K9j8k1NlPn2O0l0M4k2R2j35P3nm4M6l8j7J6J1K0k9N9n3k4
6906d3J2K6m3M9l1K7j5j8Q7q9N0p5N7m4Q2l8k7K1L8k2n1P3K8q6J6OJ2Ko4O1kl
6938dm5N1j0l7j4R5j45J07m3KN3J6k4k4L1RP%n8O8NJ3r9O6k0J4Jok1m7J65j40
6970c4M4n1R1k2j4Mk8n3P3lL0N2k1q6P6q8O5o2O3m1PJ1j5J0l3j7N1ON3m7kl7R
7003iKJ6nm8Q6l3%m1P8j0o1O3l7k0m5k2Q0n1O6m4M7j8k1l0N8j6Pj9OL1mm7P4n1
7037a8R5p2l1J7JL8n8l9K8O0j4Op0R1k6k7L1M3r6Q4l4oj0N4o8omk4R4jKL4j25
7070e1O6Ln0L0O8j06J0K3N1m3J8p8L1J0N1j1p8L1M8J7m9MO1qr4R7j02M9PM4qo4
7102b3J2l7N0Lk3K4mn4M0K0l8R7q8RRL9ol9L6K0l3l5l5J05j17J5L1M3r2J3N6%
$$ plain form
6874 -45 54 -13 -5 -22 -43 -14 15 -3 -24 -19 -22 -15 -67 -7 -37 7 -15 77 -58 15 10 -34 12 -26 -43 -27 -16 4 -25 34 -19 -43
6906 -43 -31 -5 -48 1 -30 -3 -18 -36 51 -38 12 -63 -6 -50 32 -6 -33 -12 26 4 -47 26 54 -32 -16 -10 2 4 -60 1 -1 -4
6938 -4 -49 2 -8 -45 -59 36 -109 -2 -45 -43 10 26 2 -22 9 18 25 25 -33 35 40 53 -46 20 0 14 15 9 -12 -59 106 -34
6970 -34 10 -41 50 28 14 18 -10 -63 10 7 37 89 68 -18 58 -30 35 -27 36 -5 2 13 -2 8 -25 -42 9 15 68 21 19 -18 -9
7003 -9 -7 9 4 -44 42 9 9 -32 46 36 -25 38 1 -19 -64 -86 -6 -57 9 -35 12 -6 -27 -57 1 -15 -8 -27 -21 10 6 -41 33 -18
7037 -18 77 5 -26 -9 -8 30 -28 -67 -39 21 7 13 -57 34 8 -19 12 55 -41 43 9 3 -7 47 -21 -27 -31 -55 39 38 40 74 -51
7070 -51 15 18 -32 -2 66 -40 -30 -7 44 1 19 -59 -28 -18 33 22 -56 -25 23 40 -9 -5 56 48 -46 51 -51 -2 5 49 41 -23
7102 -23 -11 -48 2 5 -18 6 2 -52 -12 8 -30 67 -21 -12 -3 36 30 -9 27 47 14 -21 -56 49 -68 -53 -22 21 -71 -58 -2 -2
7134bJ1l0L3n2P9p3J00j25P1o2QM0kj28J27l3K5j2L7l8N7k7q2O5n5P9KM5n8J5
7164A5n6M9mn0O5k2J1L8p6M4M3j02M6l3KK6o3L2Q%J1J5K2LL5o2m3M1m9R6k2k8
7196hl1P5K1j02K4jL3J3j1k5L0kn7mL5k2l9Q1J4Rp3M5L7k8j3J4ko1K9MJ1K3o4
7229d5PO2k1K0j3J1nl2K5Np0O2l3L2L3m3M0l4l4O3j6j9K7o1Q5m5L5l1n6R8oo0
7261a9L9l6O3o2p5J00%k2m5N2J3O4q2kK4pqm3K3n4M1R5m5l5l4L7Pm2J00n7L6L3
7293E9m1N0p6M1km0j05J63n8L5l3jj4K3M9q6N1j3J3n2n3M9P2p8K5L6k0j1mm5N7
7324ij0M3q6J02jm3nj8Nj3L2pj9M4k2n9Q8l9N4p0O8k8l7K4k3N2l8K8k4L0l4k5
7356d0N5lkM7j18N6O7%m3l0L1l5j3P5PJ6p2K1k3j7L6m5K8l3R2k0k9q7P6N1j01
$$ plain form
7134 -2 9 -21 12 -40 39 -34 66 -59 12 -50 -42 -2 -4 -132 -5 -38 -13 -25 12 -26 31 4 -78 -13 -68 11 13 58 0 15
7164 15 -41 8 4 -46 19 -3 8 46 -30 14 57 -45 1 -32 -30 -4 -67 -35 -27 -27 -16 -1 21 24 59 -3 -46 -5 -54 42 20 -8
7196 -8 -39 36 57 -45 -21 -22 11 24 13 -12 18 16 -41 -45 -10 -32 -71 10 24 33 -40 5 42 14 1 15 13 -48 -19 -15 -4 19 -45
7229 -45 -38 24 3 23 10 21 16 -16 9 14 -56 6 -27 5 38 -5 35 1 -33 30 14 -5 22 -39 46 1 36 5 -51 47 41 -19
7261 -19 20 -16 47 -15 -90 10 10 -12 -57 -5 8 72 -10 -12 12 5 -3 -46 -23 -77 -36 59 14 -21 -55 -18 -11 -53 47 -10 26 59
7293 59 18 68 -8 33 31 -9 -114 49 -9 26 -7 -8 -22 1 50 -36 15 2 15 -37 -90 -41 31 -47 -22 14 -6 -17 -21 -66 -9
7324 -9 -19 24 -62 40 39 -4 -9 -27 -22 -35 -3 -10 -29 15 -7 -66 22 -17 37 -33 35 7 -30 -6 -29 23 -15 13 -11 19 -15 -40
7356 -40 15 12 10 57 -61 -5 62 62 19 -11 20 -15 -28 47 54 70 -2 19 -4 -21 15 -30 -2 -35 57 37 8 -79 -3 48 -53
7387e3N5K5Om9J0rM2K3n5N7p8R9n2l9j3M0j5j1oj4RM9l3L1j7l1L0J8K3k0o0RP2
7420D3j5K2p7M3l7M2%l6O0l5j4k0N9j5K5k9l3J8L8q3J3M8Pl7%J6J8n1N2o7k0L1
7452c4K5RM0o4oN2l6L0l2QJ10j02j9O9o9M2j01Q3p4Q2J6p4K9Q9q4J4o1J4O0n4
7482c8O8l3mROP8n4jJ2k7K7K5j1pk6N3k2K0q0N4n7J5L6l1j2L8o2M3J5o1N3j8M6
7515E4m1K2o6L2J6J5j0J0o9J0L0K2Jk0m2K1Q2k9l7KM0j04P9m5K8lO2l9NPk3l5
7547b5J4N9k3l3k5O1k1Q5k3o0RK1o3mR1o4n9J06K3n4k1J2o7J1Mj4R6m8LL2n4n
7579c6K3k7P6j7nN0l2Ll3M3m8k1N2on6K6l3P1K6j15Q0ro4O7l1K9m4RL7l6J2J9
7611A0K3rM1l4m7K0K7%k9O6o5K5mm4J9K3p2Q3m9l0J4P7n0n3K6M2j5Mm9J8M3K8
$$ plain form
7387 -53 2 27 33 -16 -6 -15 27 50 -5 52 -26 73 21 -18 -31 9 -6 -17 -23 -37 -28 21 -12 19 2 -29 1 19 42 22 -38 -29 43
7420 43 28 50 -27 16 -21 21 21 -15 45 10 -4 -24 35 20 45 16 -17 1 39 -44 -31 17 24 -13 -13 3 21 -30 22 -45 -65 -34
7452 -34 -9 0 40 -24 -30 22 -14 16 -16 -8 102 0 -19 50 -19 23 -78 5 -69 13 29 -45 -16 73 -11 3 -58 -44 16 -38
7482 -38 30 -3 -7 2 8 86 32 31 43 16 43 68 57 50 24 77 55 75 -5 49 -8 7 43 12 0 38 -24 19 34 -27 26 8 54
7515 54 13 35 -31 1 17 32 22 32 -37 -27 3 25 26 6 -36 -15 67 38 1 3 43 -61 18 -27 1 -2 60 21 26 33 10 -25
7547 -25 -11 48 25 -8 -33 28 7 92 69 9 18 39 -24 -28 63 -1 -60 46 69 15 -6 6 -61 -50 -46 -60 36 -12 -9 23 -31 -36
7579 -36 -13 -40 36 19 14 64 32 35 2 45 -3 -24 28 22 -34 -8 -41 30 56 -59 21 12 -52 15 -16 13 -31 -22 15 -21 -9 10
7611 10 33 24 65 31 -16 4 31 31 2 68 3 28 24 -20 -1 22 -50 33 -16 -46 -32 45 -5 -58 -32 10 -5 -1 -50 -32 11 39
7643C9r9JO8M9l9m1L1j3L5j3knl6j4KK2L7m1M7l5Mo4J20m0KK0p0L2n5O4m4L0M6
7676C8L1l2l3Or5R9j6n3K9K7JJ3o8N8M6r7M0mJ6mKn5OjM0l4P5r1J02n6m4N6m7
7709d5M8J8lRn6N3m7p5J57q1L0k9L2Jl7n7Q7M1p8J31o4j08J14k3k7K1j4M6Nm2
7739GpL0m6oK2J0K4r1Q6P0m6m8j7rJ6NJ5o2O2J2n5L0n1N5k0K2k4J9L2qop1J07
7772E7l5l5j5J3NM6l0j08J15l9m7N4K9m9P0K4n5L0m3PO5j01O2LJ7p5Q4q7O1m5
7802b2K3n2K0P1k6l2lK3k9j5O8Mjo2N1m9L5j1L1l3q9J52n1lK7nJ6n9N3q8KO8q7
7835g3J20o3kp0J38j5K1o4j7J8RL8Qk0m4K8q6JjR8nm8P4j25J24k9m0K3j7L3k2
7866hN5k8k7L3om3Q0q4R4J5j03l3Q2p2k9O9K6j09O2K0K5J2l0j4L4mJ1M0p7M2m
$$ plain form
7643 39 -60 -59 9 58 19 -22 9 -4 31 18 16 11 -25 -39 -37 -15 22 -19 28 -7 -3 -67 53 13 15 35 -35 -3 -58 6 -38 -8 38
7676 38 69 37 4 10 -85 14 -2 -55 -26 1 2 15 -53 5 51 -46 -6 -10 6 2 4 -51 -45 -46 -6 -40 35 -56 46 -10 -54 2 -45
7709 -45 3 21 18 27 -29 24 -23 -98 59 -22 8 -21 11 12 -25 -82 5 46 -32 99 35 -73 41 18 -9 12 -2 44 49 7
7739 7 0 30 -16 -22 0 10 34 -57 29 99 53 5 -12 -21 -5 0 15 -47 15 27 -28 2 -49 6 -14 8 -16 3 35 27 21 -50 57
7772 57 22 -13 -28 -15 -10 36 6 -102 13 -26 -73 -19 10 -39 31 55 0 30 -13 -6 59 -42 20 23 40 -35 49 -38 23 -22
7802 -22 1 -51 -31 40 14 -18 -21 2 -27 -42 26 30 29 -33 18 -31 4 -7 24 -9 -98 54 3 0 27 22 38 -21 32 -56 -54 14 -73
7835 -73 47 -16 -18 -88 50 35 56 -8 -25 -7 2 40 48 28 -16 12 -74 -73 -74 24 19 -29 45 -80 44 15 -25 -2 -19 14 -8
7866 -8 47 19 -8 25 19 -24 56 -28 66 81 -22 -55 27 -45 -74 -5 21 -88 -26 -6 19 31 1 -13 21 17 28 68 -9 33 29
7897B9nn1L5p3M7L5l7o0Q1k2N5j2k8J3l9Q7l4m0k9O3m6QL6J8j7n1N8p6P9k4J3
7928A3Qm9L8kk9L2k2J2M4lr8JO7j4j9k2P4J1l1j6K3p1O4j5jm2K0j3L6nPm5L5K2
7962A0m2P9n3j6Q0r7M9k6j9O2k4o9M5Q7m8m0O6o3K9O5r7P4j2k3M7j08O4j2J6J9
7992D3n5L6K9j8n8O2J2r0J1J2J0l4M3j3%J5Lj0K3m5M0rn1J07j00pK6L5m1l8O6
8023Dl4J2KM5j5K6n9R4o9n3Q0K0m2j2k2k2M7Np2M9Q9m2j6l5Q1nm5l0QM0n7Q3q2
8056b7pN3M2j15M6L8q5J02j8p9K2L5l9M8qn1L1j5K4k8L2K3Jj7j5M8n9NM%N6k1
8088B6jj2L9p2M3j3j4L8l3K7n5L6N7o2J1q2P7N0j3m2p4O2mK3J0K2k4rOL0p5K4
8120dj7L8j1k2N4j29J34r4K0N2k3n4J03k9l1L5o1j1Mm1J15l1J5K0rl9l3K2L3j0
$$ plain form
7897 29 24 -27 8 -65 -18 17 -20 -80 1 -21 34 22 -6 7 -32 55 21 -19 -48 15 -31 -23 13 31 14 -37 21 -55 24 0 13
7928 13 21 -28 10 8 -21 11 -11 1 45 42 -56 -55 12 -2 -21 -43 31 42 11 -5 18 -53 11 -4 -5 -47 -27 -40 -4 -9 -2 -47 -12 10
7962 10 -32 47 -6 -22 58 -39 10 -16 -35 27 3 -66 -21 66 18 -22 44 -19 10 75 -22 52 40 17 64 -44 20 8 24 43
7992 43 -12 24 53 35 -23 39 51 -39 -28 -16 -6 -40 3 -10 -10 5 8 -2 21 -24 16 7 -44 63 -37 -44 -18 17 -24 -62 4
8023 4 -30 -18 -16 29 14 40 -19 75 6 -47 33 53 11 -1 -23 -45 2 7 -65 -16 73 31 15 -20 61 56 11 -19 -11 29 -28 55 -27
8056 -27 -34 19 61 -54 -8 30 -55 47 29 -50 -28 7 -32 16 8 -43 -12 -27 -3 -31 1 24 25 8 -7 41 -18 -13 -9 -9 47 26
8088 26 25 13 52 -20 23 10 -4 34 1 28 -27 9 66 4 15 -67 10 60 47 5 -69 -7 -11 12 22 44 20 11 17 47 -28 -4
8120 -4 -21 17 6 -16 38 -91 43 -51 -31 21 -2 -56 47 18 -13 22 -39 -50 -46 -87 28 -3 12 32 23 -16 -49 -27 6 -4
8150doNL8l1oM3n8K8nm4N5ll1O1o0M8l0M9l4n9M5n8O2O1m5k5nj4J4K0k5J3k5J1
8184a5%K2m3N9n6R6n5
$$ plain form
8150 -4 -10 -5 33 2 -4 39 -19 9 4 -40 15 12 -19 42 -18 30 0 49 15 -44 1 -57 5 66 21 -4 -9 -23 -9 11 -14 -1 -26 -15
8184 -15 -15 7 -36 23 -33 63 8
8191H
$$ Imaginary data points
##PAGE= N=2
##DATA TABLE= (X++(I..I)), XYDATA
0@%%%%%%%%%%%%%%%%%%%%%%%%%%%%%JlMmMpJ0j2J4j5J8k0K0k0K1k6L0l1L4l7L9
50B0m4M9n0N2n3M7k9j7J46o12M002L2489k5377m2904J9203L6940j2918k9844J1958
69f942K1797j4372j7775J8382J7056k0056j9865J7598K1991j0806k1421J809J5851
82C247O035o854j0171l588R681J1472o091j5411K467J4688j476j2150M362J0123
96F334j0404j1390J6722J6006k0888k2744K0962K8149j7328l0431J1803K8380
108A5171p762k2982O856J6390r618j1746J4193J0328j8359j1927J9513J4329j7079
121b693j5388J2087J2856o796o987L481l84l829P041O879j0810j0802J0997J3223
135H875q587j2532O015Q747n187l366P242j149j1299L155J5755k028j8306o69
$$ plain form
0 0 0 0 0 0 0 0 0 0 0 0 0 0 0 0 0 0 0 0 0 0 0 0 0 0 0 0 0 0 0 1 -2 2 -2 2 -5 5 -7 7 -8 10 -10 10 -10 11 -15 15 -16 18 -19 20
50 20 -24 25 -25 27 -26 21 -8 -25 121 -491 3511 36000 10623 -32281 -13078 23862 10944 -18900 -6942
69 -6942 14855 483 -17292 1090 18146 -1910 -21775 -4177 17814 7008 -14413 -12604 3247
82 3247 9282 2428 -7743 -11331 -1650 9822 3731 -11680 -9213 5475 3999 -8151 -3789 6334
96 6334 -4070 -15460 1262 17268 -3620 -26364 -5402 22747 5419 -25012 -13209 15171
108 15171 7409 -15573 -8717 7673 -1945 -13691 502 10830 -7529 -19456 57 14386 -2693
121 -2693 -18081 -5994 6862 66 -6921 -3440 -3824 -7653 -612 6267 -4543 -15345 -4348 8875
135 8875 288 -12244 -6229 2518 -2669 -6035 1207 58 -11241 -8086 7669 5641 -12665 -13334
149a3334J7646L429j4000l672R043J334m710L395K954q280l415J1774N490j2187
163d533p072J0686O730p797l704O320q09o468N602R220q412j2673R198J5737p299
178D726j6351N090J4913l374j1481M090Q221o264n809R326N935j1439p091J2057
192B549Q755r912r113P064P660l827m163K387K03k388L390L942m882n437M994
207A222O088l781m723K904K218k985R78M917l289p624M284J0304l464j1637K060
222b528J1338p22r674Q30P439k096n753M282N337o285n946P261P052o908p572
237c945N391O972l797n134K714K647k798l23L653j158n046J477N768j095n694
252c68M24M473n28k920J254J354k868n56M287N36n606j200N683J752n311j890
$$ plain form
149 -13334 4312 7741 -6259 -9931 -888 446 -4264 -869 2085 -6195 -9610 2164 7654 -4533
163 -4533 -11605 -919 5811 -1986 -5690 630 -179 -6647 -1045 8175 -237 -12910 -3712 12025 4726
178 4726 -11625 -6535 8378 5004 -6477 -2387 5834 -430 -6239 3087 9022 -2417 -9508 2549
192 2549 11304 1392 -7721 -657 7003 3176 -987 1400 1603 -785 2605 6547 1665 -3772 1222
207 1222 7310 3529 -1194 1710 3928 943 1921 6838 3549 -4075 209 10513 7049 -4588 -2528
222 -2528 8810 8088 -1586 -756 6683 4587 -1166 3116 8453 2168 -3778 3483 10535 3627 -3945
237 -3945 1446 8418 4621 -513 2201 4848 2050 1727 5380 4222 -824 653 6421 5326 -368
252 -368 56 4529 4001 1081 2335 3689 821 265 4552 5088 -518 -1718 3965 5717 406 -1484
268a484M120J194l369oK890j456l279K324L786k883m235K382M205k068l676J608
284E3K466j772j406K133M51k993j07L431J46l846l80L422L18k941l0K173o07j811
302a300J211J582j787j823K043J803k112j832J800J489j680j076J510M75j620
317a317j07J676k60j863L22J844n04j684N18J366o04j299R25R12j058r19J134
334i18P58j179o89J130L93j152l16J188J18j223j27J170N0j085q2Q47o0o55J90
353a642L53l13m36N82L21o70m47N27M70l80m26J39J18j9J80M1m17l16O23M09m99
374a802o07L49N46j32l38K0l6n9L37K34l76n38L06O80%n78l57M64L24Q2l38k05
396b024O5L52K72k57l09mM64K32j85k09k26K46M62K58n06m36L21Q39j2o78j69
$$ plain form
268 -1484 2636 3830 461 455 3345 1889 -1390 934 4720 1837 -2398 -16 4189 2121 -1555 53
284 53 2519 747 -659 1474 1925 -1068 -1175 2256 2402 -1444 -1824 1598 1916 -1025 -1055 1118 511 -1300
302 -1300 -89 1493 -294 -2117 -74 1729 -383 -2215 -415 1074 -606 -1682 -172 303 -1317
317 -1317 -1424 252 -8 -1871 -1549 295 -209 -1893 -1375 -9 -613 -1912 -987 -75 -1133 -2052 -918
334 -918 -160 -1339 -2028 -898 -505 -1657 -1973 -785 -667 -1890 -2017 -847 -797 -1882 -1964 -1117 -1177 -1832 -1642
353 -1642 -1289 -1602 -2038 -1456 -1135 -1805 -2252 -1725 -1255 -1635 -2061 -1922 -1804 -1823 -1643 -1602 -2019 -2335 -1712 -1303 -1802
374 -1802 -2409 -2060 -1514 -1646 -1984 -1964 -2000 -2059 -1722 -1488 -1864 -2402 -2096 -1416 -1416 -1994 -2351 -1887 -1563 -1481 -1819 -2024
396 -2024 -1959 -1607 -1335 -1592 -1901 -1905 -1441 -1209 -1394 -1603 -1829 -1583 -1121 -863 -1369 -1805 -1484 -645 -657 -1335 -1504
417a504O20K86k41j42K21p7N4M62J40m79k64O39N51l06n72K78N58R9l32J15L4
438A40N4L00K72k31m38L52P13j13n05L8N26J42k34J27J77j99lN47J57p19j40Q99
460A862M23q33m49P99M86n75k62N11K27m48J49O65k84q84M70J087l78j206K85
479A645J211j50r75J21P39k62m28N30K46r52k81J291L42j373o86J323P91j206
497A926o73P19L36p24K64O44p73j083R11J513r89j925P21J845n45j603L68Q79
515A811o27n05J160n8j830j07K269L56k598q21K268P68j757p16J155j27r40R84
533F85J019j815j767K189K144j993k689J486K278j042j662J005M85j399Q7K265
549A276n97l234L18L654J98l647p78K961O16j966j37J190j132r07K236J222l041
$$ plain form
417 -1504 -884 -598 -839 -981 -760 -837 -783 -321 -181 -660 -924 -285 266 -40 -612 -334 224 323 -9 106 140
438 140 194 494 766 535 97 449 1162 1049 544 582 1108 1250 1016 1143 1320 1121 1118 1665 1822 1103 963 1862
460 1862 2285 1452 1003 1802 2288 1713 1451 1962 2189 1741 1890 2555 2271 1387 1857 2944 2566 1360 1645
479 1645 2856 2706 1731 1852 2591 2329 1901 2431 2677 1725 1444 2735 3077 1704 1018 2341 3132 1926
497 1926 1253 1972 2308 1584 1848 2492 1719 636 1547 3060 2071 146 867 2712 2167 564 932 1811
515 1811 1184 679 1839 1781 -49 -156 2113 2469 -129 -950 1318 2086 329 -387 768 641 -299 685
533 685 1704 -111 -1878 311 2455 462 -2227 -741 1537 495 -1167 -162 323 -1076 -989 1276
549 1276 679 -2555 -2237 1417 1615 -2032 -2810 151 767 -1199 -1336 -146 -1278 -2185 51 1273 -1768
566a768j900L048K364k489k407J742J499j213l32J467j128k315K070L454k317
581b25m377J807M696j226m123P96L062j272j869K321J260l671j479M811K311n325
597b503l056M664L513l573l026K474J694j953M5K156j474l013K057M080j833m371
613d119J028L820m38k352O07M67j568R55L253j506m862J101N880k76n812k45M844
630G77J15l637J059K817k802k760M404L675n396m758N347N490m360n365L287M181
646B074k628k258K895M68l946O43N446p54o311J61O442N07n320o64L699j47k088
663a781J889J610m059j689N533K761n967l554N304L950m086k931K990J318k707
678a419R02L395k468m472L027N825k599n928J626N198r67l228J361J246k775N90
$$ plain form
566 -1768 -3668 -620 1744 -745 -3152 -1410 89 -1124 -1456 11 -1117 -3432 -1362 2092 -225
581 -225 -4602 -2795 1901 675 -3448 -2652 410 -862 -2731 -410 850 -2821 -4300 511 2822 -2503
597 -2503 -5559 -895 2618 -955 -3981 -1507 187 -1766 -1721 435 -1039 -4052 -1995 2085 252 -4119
613 -4119 -3091 729 291 -2061 -1454 -987 -2555 -1600 1653 147 -4715 -3614 2266 1990 -3822 -4067 777
630 777 892 -2745 -1686 1131 -1671 -4431 -27 3648 -1748 -6506 -1159 4331 -29 -5394 -2107 2074
646 2074 -554 -2812 83 551 -3395 -2752 2694 1940 -4371 -4210 2232 2739 -2581 -3245 454 307 -1781
663 -1781 108 1718 -2341 -4030 1503 4264 -1703 -5257 47 3997 -89 -3020 -30 1288 -1419
678 -1419 -517 2878 410 -4062 -1035 4790 2191 -3737 -2111 3087 2120 -1108 253 1499 -1276 -686
694f86M665q56o535N98P554L23p298p13O378K74m969J259M392l332m521N097N755
711G385n960o940N728P875m653p518L428O265k773m211L056K476m073j411N389
726D063J334n925j977N643K375m087k264K267J018o19J118l08l212J2M933N76
742D947n519j252N286J110m674r5M127j692m387L457N335m721o967M953Q108m460
758C556q489L420P954k929o711L047N001m018l983N167L546o230l910O416M203
773F040n842m457M623L635l476k238K607K25k597J395L062k516l787K671L797
788C142k486l325K122J977k344n11K942q22m202J469N285j604o117J273O037j136
804A700n412J270M425k229l588L307L216m573l416N357L693n587l852N108L661
$$ plain form
694 -686 3979 3123 -3412 -2814 4740 5063 -2235 -2948 3430 3704 -1265 -6 4386 1054 -3467 1630 7385
711 7385 1425 -5515 213 8088 3435 -4083 -655 5610 2837 -1374 1682 4158 85 -1326 4063
726 4063 5397 -528 -2505 3138 5513 1426 -838 1429 2447 1828 2946 2638 -574 -562 4371 4947
742 4947 -572 -1824 3462 4572 -102 -197 3930 2238 -2149 1308 6643 1922 -5045 -92 8016 3556
758 3556 -4933 -1513 6441 3512 -3199 -152 4849 831 -3152 2015 5561 -669 -4579 1837 6040
773 6040 198 -4259 364 3999 523 -1715 892 1117 -1480 -85 2977 461 -3326 -655 3142
788 3142 656 -2669 -547 1430 -914 -1425 1517 695 -3507 -2038 3247 1643 -4474 -3201 2836 1700
804 1700 -3712 -2442 1983 -246 -3834 -527 2689 -1884 -5300 57 3750 -1837 -5689 -581 3080
819C080m607k887M244J639m249m55M514l45n074P40N385p06n303O49M650q12l626
836c163J089K784j962j974K862J640l633j424L840J439l775j036L423L75l048
851b563N03L017j575l066K403L370k905l500L054L563l049l204L197K598l359
866a516j884L634J462m033j033M404O78m176o83M065M15l706P8L287n36k935J123
883a356K669j684k392K083K147k269j783K519J359k600r14K887L07k964J07L205
899A321m49l265P60L326j119l190J478L036j668k931J982K875k179k591K305K292
915A983k225j925K309J511k322j043K479O45k489l37K530J84k335R9K058l33j629
932h40Q30J330j298j041J798R77k023r43K170R81k127o06J939L05j829L42J946
$$ plain form
819 3080 -1527 -4414 -170 1469 -2780 -3235 1279 934 -4140 -3400 1985 1279 -4024 -3375 1275 463 -3163
836 -3163 -2074 710 -1252 -3226 -364 1276 -2357 -3781 59 1498 -2277 -3313 110 485 -2563
851 -2563 -2060 957 -618 -3684 -1281 2089 -816 -4316 -1262 2301 -748 -3952 -755 1843 -1516
866 -1516 -3400 234 1696 -2337 -3370 1034 1712 -2464 -3147 918 1333 -2373 -2295 992 456 -2479 -1356
883 -1356 1313 -371 -2763 -680 1467 -802 -2585 -66 1293 -1307 -2221 666 973 -1991 -1884 1321
899 1321 872 -2393 -1633 1693 574 -2616 -1138 1898 230 -2701 -719 2156 -23 -2614 -309 1983
915 1983 -242 -2167 142 1653 -669 -1712 767 1412 -1077 -1414 1116 1300 -1035 -936 1122 789 -840
932 -840 -10 1320 22 -1019 779 1756 -267 -1210 960 1941 -186 -792 1147 1452 -377 -35 1911
949A911p50k116J059K469j123k499J090K466r35k016R07J535r56j063J401Q87
965B267j795q17K184R73k165j044J869J002j343o84R39K06q53M84R84q65j327
982A5J149J442q53j478M93J105k50n73L53q7o54M69J099n50j590L69J736j11j547
1001E37k01J054N9o26L71L12r36m54J357P08j602j168J271J363r03j201K92P06
1019I39j02j80J60m66n51M90J005m51j264L7J043J96p05l62M2KL64M41n71j047
1039i80K83J275J20j361n65Q75O91m61n85R3j0j36L45M29p70p48N68J070k68j235
1059a370k84R20O67m74p10k00L59N20O9n00n31K64N54Q7l40l75o9K72M74J43p08
1080a232o63O03J040j51j186l28J058N86n29p42J85M52RO0j4k72l00M09N57j00
$$ plain form
949 1911 1161 -955 104 2573 1450 -1049 41 2507 1572 -444 463 1998 1042 -21 1380 2267
965 2267 472 -345 1839 2812 647 -397 1472 2474 1131 447 1386 1592 739 1223 2207 1342 15
982 15 1164 2606 1753 275 768 1873 1623 1050 1403 1316 662 1131 2230 1680 90 459 2195 2084 537
1001 537 336 1390 1449 823 1194 1506 570 116 1473 2181 579 -589 682 2045 1142 -59 233 939
1019 939 837 657 817 351 -200 290 1295 844 -420 -383 660 856 151 -211 -169 -167 197 638 67 -980
1039 -980 -697 578 698 -663 -1228 -353 338 -123 -708 -615 -625 -761 -416 13 -757 -1505 -937 133 -135 -1370
1059 -1370 -1654 -734 -67 -541 -1251 -1451 -1092 -572 -503 -1003 -1534 -1270 -716 -629 -969 -1344 -1413 -1141 -667 -524 -1232
1080 -1232 -1895 -1292 -252 -403 -1589 -1917 -859 -273 -802 -1544 -1359 -907 -898 -838 -852 -1124 -1424 -1015 -458 -558
1100e58o93k35O57N97l11p13j16N93O12k63p52r4O90M31m09m08J84J51Q8J21J71
1121b57l84l93M29P56k42r17m3J026L33p70m92L83M61Q0l57q5N2J7L38J08l86
1142c43k29K25M83p2l82n1Q4K03L01j48n12o3O35M87o64o30M76O69j42o41Q9M31
1164B06j50j19L39Lm68m0P10J21o75k95O28M65m90l73K44J98J9J40Om47p8N94
1186E38M14p63m95P07O15n01n27M79K40l94PO12j08r32K28J141m2j301m2J219
1206A095L67j040l21O90L10m76J22L55l67m83O55N70o80o44O18O91l52m27J22
1225H05J54k78M56M48p73q04R44J105q62j276N40J338m82j008M71P51p82m46J112
1244A413L94j474n98J676Q88j649j101J363J051j071p14P54J69o88K52Q11o81
$$ plain form
1100 -558 -1251 -1486 -829 -232 -543 -1256 -1372 -779 -167 -430 -1182 -1276 -586 -155 -564 -972 -788 -637 -549 -428 -257
1121 -257 -641 -1034 -605 151 -91 -1008 -1051 -25 308 -462 -954 -571 -110 -30 -387 -472 -420 -403 -65 43 -343
1142 -343 -572 -347 136 64 -318 -369 -285 -82 219 71 -441 -504 131 618 -46 -676 -200 469 327 -314 -225 206
1164 206 56 -63 276 279 -189 -229 481 602 -73 -368 260 725 235 -138 106 304 323 463 469 22 -56 538
1186 538 952 189 -306 401 1016 515 -12 467 707 313 320 932 824 -108 120 1261 1219 -82 -124 1095
1206 1095 1462 422 101 791 1101 625 747 1102 735 252 907 1477 797 153 771 1462 1110 683 805
1225 805 959 681 1137 1585 812 8 952 2057 1195 -81 459 1797 1315 307 778 1529 747 301 1413
1244 1413 1807 333 -265 1411 2299 650 -451 912 1963 892 178 932 1101 413 665 1476 795
1261G95j136O86J329o41j308M08R62l68n07L88J8q98K72J341l99j853J98K006
1279A293N2j936l04J612l2j194L48R13j013j025J376J268j629j720J577J651j148
1296H9j631Q47J007p19m88Q59j57j331L90J766m69k129L08K042k29j667J84J086
1314b42n49o75J088O22j853p55K322R41k323j274K061J231j638r90J412L16j354
1331a660L15J632q39j954R50K203q08k164O60J773m45j120N94M61j104j0J716
1348B00o7k183p5K586J82k337k64K078M3j706N42J612j233j620J732K032j938
1365d16k381J957K553j615k361J374J927j294j145J416O08j780k83K246L24k435
1381a305l71K330M62j879k88J339j89o85Q06N83j618n64K153P78k287q47K219
$$ plain form
1261 795 -341 345 1674 1033 -275 133 1095 727 220 608 626 -272 0 1341 942 -911 -713 1293
1279 1293 1345 -591 -895 717 685 -509 -161 752 -261 -1286 90 1358 -271 -1991 -414 1237 89
1296 89 -1542 -695 312 -407 -895 -36 -193 -1524 -1134 632 163 -1966 -1658 384 155 -1512 -1328 -242
1314 -242 -791 -1466 -378 244 -1609 -2364 -42 899 -1424 -2698 -637 594 -1044 -2034 -622 -306 -1660
1331 -1660 -1345 287 -552 -2506 -1556 647 -161 -2325 -1665 108 -337 -1457 -863 -402 -1506 -1516 200
1348 200 133 -2050 -2125 461 643 -1694 -1958 120 163 -1543 -1001 611 -622 -2242 -510 1522 -416
1365 -416 -2797 -840 1713 98 -2263 -889 1038 -256 -1401 15 623 -1157 -1440 806 1130 -1305
1381 -1305 -1676 654 1116 -763 -1051 288 99 -586 220 803 -815 -1379 774 1552 -735 -1582 637
1398F37P22j973l33J959l17j952Q76K347j298k672J360L082j334l030J187K793
1414B054j069k375J259J842j524j493J957J423k400j334K491J399k383j180J980
1429F47R36j662m04J441j72j468P67J583j082j735J228J654j188j390J243R69
1445A367j277n35J604Q4j913J78K310l46k480L79K469m24k307O22K143j014j860
1462a000J463J752j826j741K131J741k255j698K315J462k150j229K134Q59k189
1477b31m23K226J54k263L9K272q9k294K51K127n42j725P71J391j027j196J333
1494G74R06j452q21J649N22j702k25J722j13j743L84J769p60j840J075J776j269
1511F52j795J430J711j643j587J745J366j862j297J933J172k157q67J961P16k015
$$ plain form
1398 637 1359 -614 -947 1012 695 -1257 -381 1966 668 -2004 -644 2438 1104 -1926 -739 2054
1414 2054 985 -1390 -131 1711 187 -1306 651 2074 -326 -1660 831 2230 -153 -1333 647
1429 647 1583 -79 -483 958 786 -682 85 1668 586 -1149 79 1733 545 -845 398 1367
1445 1367 90 -445 1159 1243 -670 -492 1818 1472 -1008 -629 1840 1416 -891 -269 1874 860 -1000
1462 -1000 463 2215 389 -1352 779 2520 265 -1433 882 2344 194 -1035 1099 1958 -231
1477 -231 -654 1572 1726 -537 -498 1774 1685 -609 -358 1769 1227 -498 273 1664 637 -559 774
1494 774 1680 228 -593 1056 1578 -124 -349 1373 1260 -483 -99 1670 910 -930 145 1921 652
1511 652 -1143 287 1998 355 -1232 513 1879 17 -1280 653 1825 -332 -1199 762 1478 -537
1527e37m83J924J11j842K3J765l54j577M03J492o54j325Q10R30j029q56J376M84
1545F61j583l50J710K11j850k75K004j13j829K00J793n17j789Q06J670r51j897
1562b099J094J847j039j825R30J560r55j179R31Q38j049o28J296L00j408k07J377
1579b16J81j360N7J088k93q29O53O23r93n69J390N92j517o68J573O95j516n62
1597a671J295M16j253j18J491k26j470K99J801m20j761K84J714j06j371J78R71
1614E3l36n97O56M24q75m46J127O38j165o70J158M81p63k46O50r9p05O31Q75q58
1634f7j046R68J232p49j206M97J000k89o32M21L51o73r9R90J24j169j91J165L62
1653I89r24m26O57K43l45J31K46n44k00Q62L92r27o44R06O84p48m99M38M00n53
$$ plain form
1527 -537 -1020 904 1015 -827 -804 961 607 -970 -567 925 271 -1054 -244 686 -343 -1199 177 661
1545 661 -922 -1272 438 649 -1201 -1476 528 415 -1414 -1214 579 62 -1727 -921 749 -202 -2099
1562 -2099 -1005 842 -197 -2022 -1092 468 -487 -1666 -735 103 -946 -1574 -278 22 -1386 -1593 -216
1579 -216 -35 -1395 -1338 -250 -543 -1372 -719 -96 -1089 -1658 -268 324 -1193 -1861 -288 407 -1109 -1671
1597 -1671 -376 40 -1213 -1331 160 -66 -1536 -1237 564 144 -1617 -1333 381 275 -1096 -918 53
1614 53 -283 -880 -224 200 -675 -1121 6 644 -521 -1191 -33 448 -315 -561 89 -10 -715 -84 791 -67
1634 -67 -1113 -145 1087 338 -868 -371 629 340 -292 129 480 -193 -292 698 822 -347 -538 627 989
1653 989 65 -361 296 539 194 325 571 27 -173 689 1081 154 -490 416 1100 352 -147 291 691 138
1673A38P6P00k92r56L06J248j94j405K9J252K06j014k64O36J11l79J64L93n53
1692B02l45N87N05n44n77L08O23j32l56j04L8P5L54J78o88l37O28N42m83n80K31
1713A25M39j27j38J46L4m98J19P27l8q88j13R37K33p21m02M90L04k32j55R3m7
1734B88j62L36K67m09m88L41N53j04m78k4K50r3J50O9k15l98L71N02k26o82J35
1755a7N29L9l35k02L10n2p4J29P6l26j64M26K45l42m21J48L65O4l07j75M4J75
1777A35J45o8l07j44K55K26j84k37N2J26l8l2Q6j46k21K03K99j62n40P4N04J7
1799D3m94j33L51J58k17k22J62p9j5R9L0j22k31J23K02J6k74k1J7J31K9n6k41
1822g44LK84J0k56j31K98J39k28j95J74J26j87K2J47L7k94P4L09m0l28m7M21L5
$$ plain form
1673 138 214 914 622 -334 -28 1220 1026 -379 -350 902 1108 94 -170 466 577 198 362 755 202
1692 202 -143 444 949 405 -172 136 759 627 271 167 205 280 634 812 124 -213 415 957 474 -106 125
1713 125 564 437 299 445 479 -19 100 827 789 -99 -212 725 958 237 -165 325 629 397 242 335 288
1734 288 126 462 729 320 -168 173 726 622 144 120 370 277 427 496 281 -117 254 756 530 -152 -17
1755 -17 512 551 216 14 324 272 198 327 403 77 -87 339 584 242 -179 -31 334 398 91 -84 -40 135
1777 135 280 212 -95 -239 16 242 58 -179 -127 -1 -39 -71 15 -131 -352 -149 150 -12 -552 -478 26 43
1799 43 -451 -584 -233 -75 -292 -514 -352 -431 -446 -347 -317 -439 -670 -547 -345 -329 -603 -624 -607 -476 -447 -503 -744
1822 -744 -741 -457 -447 -703 -834 -536 -397 -625 -820 -646 -520 -707 -685 -538 -501 -795 -721 -412 -452 -780 -827 -406 -371
1845c71k82j36K99M6j13k2Q8j17O2J99L9k47m6K18O0j09m8J46j2n9J31J36k50
1868c88j10L33K36l25l33M10L72k74l01K00J46r0m5K98j9l87P7N33p9m90Q8M15
1890B67P5l11n8K38j4j04K56R1m13j53N26L01n96k41N10K39l32j74K37J70l58
1911A56J99L06l07l80K73N34j93n58M7N60j5k71n2J59j93%L79j2o24N2O15J24
1933G99o16j54M90R0l92J28K10l12k71M90M21o96m83O19O63n78o66M29M99m23
1953B47k48N06M9o91O1P61j01q14k1Q63J09p47o3M79l3l44K45K32m78j91N46L69
1975G36o90l98O60L98n59k99M62L9m57J98N57m46o39M42Q73m79q81M60P02m23
1995B56n40M56L47n64k23P34J60q27k80R89L07j008l09Q31K25o34o3N36j82n84
$$ plain form
1845 -371 -653 -789 -490 -444 -557 -579 -491 -608 -546 -347 -308 -555 -601 -383 -323 -432 -480 -334 -346 -405 -274 -138 -388
1868 -388 -498 -165 71 -254 -587 -177 195 -79 -380 -180 -34 -124 -169 129 110 -277 -200 333 254 -236 -148 267
1890 267 342 31 -27 211 197 93 349 440 27 -126 400 701 105 -136 374 613 281 107 344 514 156
1911 156 355 661 354 -26 247 781 588 30 77 637 622 351 299 458 265 265 644 632 8 60 675 799
1933 799 183 29 519 609 217 345 555 243 -28 462 883 187 -296 323 986 408 -258 171 670 247
1953 247 -1 505 554 -137 -76 685 584 -230 -251 612 721 -26 -89 390 357 13 258 490 12 -179 367 736
1975 736 46 -352 308 706 147 -152 310 349 -108 90 647 201 -438 4 877 398 -483 -23 679 256
1995 256 -284 172 519 -45 -268 466 626 -201 -481 508 815 -193 -502 329 554 -80 -143 393 211 -373
2015c73M46O11n99o35M78P89n53o84M70M98m57l23N71L7o73K6Q68j20r73K6J031
2036D61j22q53Q8P43k70n64M74N03q32m23Q63N61r70o76J011N48q91m54P72K01
2056A70q02O2P34j83r25L08R96l74j002K98R50l40p77M68M71n94l65P73L23q99
2076g08k77R40K27r67j81Q64J26p76K9P71k91p50M00P87n57q45P11Q36o95p76
2096a132O72O44p17m73P93L27q19j88R35P4r41k4J019p9r08J63Q75k49q15M62
2116c81P68o52o23P64O30q15n58Q74M78q25l40R30K69r66j30R82J8r43J32J018
2136F30k09j014L88Q56l44p48M23P14m99n76N57N51o59l97P34K71p32j43Q16K3
2156F42p23qQ69j74q41L07Q21m30o89N33O42o56n26O93O60r52m40Q23M90q64l77
$$ plain form
2015 -373 73 684 85 -550 -72 717 164 -520 -50 448 -9 -332 239 276 -397 -371 497 377 -596 -570 461
2036 461 339 -514 -426 317 47 -517 -43 460 -372 -795 68 629 -341 -1017 -6 542 -349 -803 -31 170
2056 170 -632 -570 164 -19 -944 -636 360 -14 -1016 -718 232 -108 -885 -417 54 -540 -905 -132 191 -708
2076 -708 -985 -45 182 -785 -966 -102 24 -752 -723 48 -243 -993 -593 194 -363 -1208 -497 339 -356 -1132
2096 -1132 -460 184 -533 -1006 -213 114 -705 -893 42 116 -825 -849 170 91 -817 -654 221 -28 -843 -381
2116 -381 387 -265 -888 -124 506 -309 -867 7 485 -340 -680 250 519 -447 -577 405 423 -520 -388 630
2136 630 421 -593 -205 651 307 -441 -18 696 197 -379 178 729 70 -327 407 678 -54 -197 619 642
2156 642 -81 -89 780 606 -235 72 893 463 -226 307 949 293 -233 460 1120 168 -272 551 1041 177 -200
2177b00Q79K14q30j44Q19L5q72k2J012j70q73R1Q98k19p47L37N07l90n03N84L62
2198G68o80l13P58K37p11l00P85K3o81J03P08l21p20M87O57n48q33P10P80p07
2218B02o86N69N43m80m79N77K00o81r0P76J03q89j34Q67J29q25m9O53Rn49K17
2239a7L58m08l89N85M68p07n21O68N82o53l92N57K20n34jN07r6p30J77R02k18
2260C58r14K00P67j15o78J56N55k63m37M03L62n36l96O29M34o48l98N46L02m33
2280a06k43M37n6l64L02L58l52n47L87O05l84n35L33L75k59k93L65N0m75M8O26
2301B72n0o67j46P81J23p25j16M81P3m18R8L56l13l20L63L62l45n61M39M77l02
2322a38m37K11L20l46l8L35l1m56k7N99m2o62R4N39Ql73l8L30j37k59L08K30l58
$$ plain form
2177 -200 679 893 63 -81 738 773 -99 -121 891 721 -152 -61 837 618 -129 208 715 325 -178 406 768
2198 768 88 -225 533 770 59 -241 544 567 -114 -11 697 376 -344 143 800 252 -581 129 909 202
2218 202 -484 85 628 148 -331 246 446 -235 -325 451 554 -335 -469 398 527 -298 -347 306 315 -234 -17
2239 -17 341 -67 -456 129 597 -110 -631 37 619 -34 -426 131 351 -183 -184 323 227 -503 -326 576 358
2260 358 -556 -356 411 296 -382 -226 329 66 -371 32 394 -142 -538 91 525 -123 -521 25 327 -106
2280 -106 -349 88 32 -332 -30 328 -24 -571 -184 421 37 -498 -165 210 -49 -342 23 73 -402 -354 272
2301 272 222 -445 -591 190 313 -412 -528 -47 26 -392 -294 62 -251 -571 -208 154 -191 -752 -313 164 -138
2322 -138 -575 -364 -44 -390 -428 -93 -124 -580 -607 -8 -50 -712 -618 -79 -71 -444 -482 -152 -289 -548 -240 -10 -368
2345c68l57M87L48l93l48L75J71k17j66K68L0k39O1L25j51l97J74M13j14l79J76
2366c01K71o8k71K94Qk56K4L06N2l54o4M25J52m28o5K29J38k20K5K48j20k33K19
2389A1L14k65k90J88L87j91k55P8K80j36o7K25K2k87M4L78m2l47%L42K2k33K2
2412B00J26k6j14J59J26k50j29K78J61k91j46J94K05k03j22J84O5j70L6J29j05
2433C07j51Q2K89j53k08M0J98m4j67J20P1j07j32J68N6j90o9J95Q5k67jJ81m7
2456B56j58M5J17q6j06Q9J12j35j98K29O7j46l8M8J01j22q3L6J01j64j1J77n1
2479H0j61K3K16r3k08R6R9K7j53n9J43m9l9P2O8j83q1K09N2j74j54K03O7j03l6
2504a38O9rj18J80Qr2j75J70K24j85j88R1J27Jj47Q9P4j30L6J46o3k22O3L27j08
$$ plain form
2345 -368 -725 -238 110 -283 -631 -256 -85 -302 -468 -200 -170 -409 -348 -23 -174 -571 -397 16 -98 -477 -301
2366 -301 -30 -98 -369 -75 -67 -323 -299 7 59 -295 -359 66 218 -210 -275 -46 92 -128 -103 145 25 -208 11
2389 11 325 60 -230 -42 345 154 -101 -23 257 121 54 279 301 14 58 436 394 47 47 389 411 178 200
2412 200 326 300 186 345 471 221 92 370 531 240 94 288 493 290 168 352 417 247 283 412 307
2433 307 156 238 527 374 166 206 404 360 193 313 384 277 145 313 369 179 110 305 390 123 122 303 256
2456 256 98 143 260 174 68 157 269 134 -64 165 232 86 48 96 197 75 -8 28 129 -35 -46 131 80
2479 80 -81 -58 158 65 -143 -47 52 79 -74 -133 10 -39 -78 -6 62 -121 -202 7 59 -115 -269 -66 1 -102 -138
2504 -138 -69 -78 -196 -16 -8 -100 -275 -105 119 -66 -254 -163 -36 -35 -182 -93 -19 -149 -113 33 -30 -252 -189 138 30
2529C0l07L7K07O6j61mR5j36N4J16P0k10j04K51J31k13j49J69L9j6j01K7n1l5
2553a95J53P4j32k05J42K29j19k10J83M2o7K6rj45l5M5K91j18k19j17L75p5j16
2576b02k1J14r1m5J98q8k09QK32J46k80j13K10J52k58%N7rj10R1K45k67k22K11
2600b51K76p4l02j6K81J6j99%J14q7l1K18Q5k75q7K70P0j64j20J51Oo5J20O1k29
2625b32j2L05R7k34k72L52J39j74j37J86N6j37O3J87m7l36J24L85j05l63N4L55
2647B54L6k24k6K20j04r4J35J19k04j21K60J59j98k17K62O6j85R0J44j45j52J76
2669B51J96k42j74K38K38j66l23K06K73k35p9K05M9l48ML94M7m10q7L00K25l68
2691A94j02K10J29k74K2K31j99k36K33K15k56j47J75J84j90j45K20J9k46P9K08
$$ plain form
2529 30 -277 -240 -33 33 -128 -132 -37 -173 -119 -3 67 -143 -247 4 135 -78 -227 -58 -19 -35 -136 -109 -160 -195
2553 -195 -42 32 -100 -305 -163 66 -53 -263 -80 -38 -105 -79 -88 -233 -268 -223 68 -50 -269 -386 -11 -86 -202
2576 -202 -223 -109 -200 -245 -47 -135 -344 -336 -104 42 -238 -351 -141 11 -247 -247 -190 -199 -309 -218 27 -240 -462 -251
2600 -251 25 -49 -351 -367 -86 -70 -269 -269 -155 -242 -273 -55 30 -245 -332 -62 8 -156 -276 -125 -119 -184 -64 -3 -232
2625 -232 -244 61 158 -76 -348 4 143 -31 -168 18 74 -63 0 187 140 -196 -72 313 208 -155 -101 254
2647 254 290 66 40 260 156 62 197 316 112 -9 251 410 212 -5 257 323 138 228 372 227 75 251
2669 251 447 205 31 269 507 341 18 224 497 262 183 388 437 89 93 487 534 124 37 337 562 194
2691 194 92 302 431 157 179 410 211 -25 208 423 167 20 195 379 189 44 264 283 37 116 324
2712C24q4l19J44L34k07m11J55M30j67l83K79J40j94k48K84K10m07j42M10J86
2732C34m10j50L35R7l49q9K46J3j87M8K33j11l44J64K98j43l10J92K16j88j52
2753b57J98O3k49j7K34M8k86j5L22J8m62J94L01j60k63K10J96k34k06K17K31k13
2775a30l31L58L64m32j84L42J86l81j27L55J34m34m5M29J6m32J1L85r6k44O0L24
2797A28j40k68K07J52k22r3J87R9k59n4M17j22k58j7L94j1m37J8M30j55l03J79
2819a28L55k68l25K90K62l09j77K15K19k56k54L66J50l69l7K49O0l03JL95n8l40
2841b62J04K64j33j75R8K21k82j64L66N5l65NL20P9l95l7L18J72m45q8M28o0l74
2864c50J00M00j37l31J57L65j45l42J10L20j46k01J53P9j02j49L06P0l41ML39
$$ plain form
2712 324 240 -79 65 399 192 -219 -64 366 199 -184 95 235 41 -207 77 287 -120 -262 148 334
2732 334 -76 -226 109 206 -143 -232 14 27 -160 -112 121 10 -334 -170 128 -15 -325 -133 83 -105 -257
2753 -257 -59 4 -245 -262 -28 20 -266 -281 41 59 -403 -209 92 -68 -331 -121 75 -159 -365 -148 83 -130
2775 -130 -461 -103 261 -171 -355 -13 173 -208 -335 20 154 -280 -325 104 120 -312 -301 84 -12 -256 -196 128
2797 128 -12 -280 -73 79 -143 -236 -49 50 -209 -263 154 32 -226 -243 151 140 -297 -279 151 -4 -307 -128
2819 -128 227 -41 -366 -76 186 -123 -300 -85 134 -122 -376 -10 140 -229 -266 -17 43 -260 -259 136 78 -262
2841 -262 -158 106 -27 -202 -104 117 -165 -329 37 92 -273 -268 52 131 -264 -301 17 189 -256 -344 84 24 -350
2864 -350 -250 150 13 -318 -161 204 59 -283 -173 147 1 -200 -47 32 -70 -219 87 157 -184 -180 159
2885A59m1k98P6K51j00j74J68J67j75k54L37K93l74l19M06K94l03k94L38J58k55
2906F0j61K67J59l57%L59J19m60OL59M6k61q1K67r7m8N4M9j17m7K07K5k04r2L35
2931C87J0k19l3K32j22k06J90K49k27m00L29L38k69l20K24K37j66k70J78K11k35
2952A18j35K59R7k31j25J50L28l60j82K04J61k48MJ48p0j35R4J33j19j73J53R1
2974A62o5j23P9P2j75JJ79o5k07M7K35r4l35J14L16q2l31J61J97j47j94J78J38
2997F1j79j96K95J97k87k14J72J85j52j07J22J41k90L1J69J9k46J04J36o4j72
3018b75K7J53l8q3N8J03j28m1K14l4j47oK48p4k27n0K82M0k38P4J95j20j89J97
3042e9J16r4k52J46K67j26k02R6J73j22p1P2J51j78r5K27m4j47k0K02l8j25K6
$$ plain form
2885 159 118 -180 -104 147 47 -127 41 208 33 -221 116 409 35 -284 122 416 113 -181 157 315 60
2906 60 -101 166 325 -32 -32 327 446 -14 -8 351 397 136 55 322 225 177 231 280 163 116 323 348 144 52 387
2931 387 397 178 145 377 255 49 239 488 261 -139 190 528 259 -61 163 400 234 -36 142 353 118
2952 118 -17 242 339 108 -17 133 461 101 -81 123 284 36 40 188 118 -17 77 210 91 -82 71 162
2974 162 97 -26 53 125 -50 -49 130 65 -142 -95 140 46 -289 -175 141 59 -272 -111 86 -61 -255 -77 61
2997 61 -118 -314 -19 178 -109 -323 -151 34 -118 -225 -103 38 -252 -221 -52 -33 -279 -175 -39 -103 -275
3018 -275 -248 -95 -133 -216 -158 -55 -183 -224 -10 -44 -191 -197 51 -23 -250 -300 -18 22 -216 -142 53 -67 -256 -59
3042 -59 57 -37 -289 -143 124 -2 -204 -108 65 -57 -128 -56 95 -83 -178 49 5 -142 -162 40 2 -123 -97
3065i7J41j52K0RJ07j44n1J83J11j80j57K02J54j75j16K41l7j56oJ64j5j87O7
3088g4K20n5k54J02J06L2k20l1K23p2j16P2J11j38p5J57jn1k4J22l7j00M5L4K0
3113dq2P4J39j86j55J83J52j94r2J08K02j69j76J47J26j05j04J42P5j57p1J66
3135A9J08k11o4J53J44j14j31J52k0o1J5O9oo4Q3Jn6J3M3N4j36Q9M7o2k4J24O2
3162B27j66j22J83J34j52j11J05J78j53r7J07Q4n5r1J33N1j74j5J48J06j37j56
3184B7J91P2j12m4R0j7j13O1Pq6p2K04N3j61o0J50J3n2k9Q5o2J7qM6Jj72P4O8
3212A71j3j65RJ32K6n4m7Q6j07n0J21l1m0m2P1J0p2K8n1K6m3L8N9k07J8J67P4
3239A14j11k21J72N6o9r7J09K2j62J18O8N5k50l9K47n2j65mR0J38j65L2K1m4k8
$$ plain form
3065 -97 44 -108 -88 -79 28 -116 -167 16 127 -53 -210 -8 146 -29 -145 96 59 -97 -103 61 46 -141 -74
3088 -74 146 91 -163 -61 45 77 -143 -174 49 -23 -139 -67 44 -94 -169 -12 -13 -64 -88 34 -3 -103 -58 -24 -4
3113 -4 -86 -12 127 -59 -214 -31 121 -73 -165 -57 145 -24 -200 -53 73 -32 -136 6 81 -76 -147 19
3135 19 127 -84 -148 5 149 35 -96 56 36 -25 -10 59 53 -11 72 73 17 30 73 127 -9 80 127 65 41 165 227
3162 227 61 -61 122 256 104 -7 98 276 123 26 133 217 162 71 204 255 81 66 214 320 183 27
3184 27 218 290 178 134 224 207 94 155 162 76 4 208 261 100 40 190 203 151 122 207 145 162 154 200 201 29 103 171
3212 171 158 -7 2 134 160 106 59 145 38 -12 109 78 38 -4 67 77 5 33 -18 8 -35 3 62 -145 -127 40 114
3239 114 3 -218 -46 10 -59 -156 -47 -25 -187 -69 -1 54 -196 -235 12 -40 -205 -209 -119 19 -146 -114 -93 -137 -165
3264a65O8MJ5j34R1P5j23k5KQ8m6M7l9r7K6J87j0q6j04J58R6j38l9K5N6n4rO6
3292f5R0j99p3K49N4k03p2J62P4o0n8J07j5j21N6R9n5r4N3J52l9j24NN4K3k8k0
3319d8K5k2N9J07j01j20J44J4rj64J26L5j6r1O3J37j73o8J62O6j85p1J93O6j38
3344ij19J29L1m2oL5Kl2j5J25o2q2j3J30n3m6R7k9k3j3k3P1j70N3J64q6j58J11
3372c3J27o7q4K0J04l0j46R8J08j40n0M9J37j57o0J45Qq0n9J13P2n8m0Q4L1j41
3398d9M2Q8n6j07J12L9Ll9M1kp3o8J53L5j18qJ25j8k0j00J45k0p2k6J74m3j00
3425C8L3R4l2j33R2J23j50mL1Q2r4q8J43N2j52o3J84M2j40n7K21m8q8k0J22l3
3451A55r9M9K4m9o6K3J41p3r4J02N8p9n1J30j5r2p6J72m2o7n9J32j17l1J26L6
$$ plain form
3264 -165 -97 -93 -78 -212 -121 -46 -169 -194 -192 -104 -150 -103 -142 -239 -213 -26 -36 -122 -226 -68 28 -110 -149 -124 -68 -122 -131 -65
3292 -65 25 -174 -247 2 56 -147 -219 -57 17 -43 -101 6 -9 -130 -74 25 -30 -124 -71 81 42 -82 -77 -23 0 -28 -48
3319 -48 -23 -45 14 121 20 -100 44 58 49 -115 11 46 30 -61 2 139 -34 -102 60 126 -59 -130 63 129 -9
3344 -9 -128 1 32 -10 -16 19 21 -11 -26 99 37 -45 -58 72 19 -27 70 41 18 5 -18 53 -117 -64 100 14 -144 -33
3372 -33 94 27 -57 -37 67 37 -109 -11 97 -43 -93 -44 93 -64 -124 21 29 -51 -110 3 75 17 -23 61 92 -49
3398 -49 -7 81 25 -82 30 69 72 33 74 72 -1 -69 84 119 1 -7 118 100 80 -20 125 105 33 7 181 138 38
3425 38 71 165 133 0 92 215 65 61 92 174 80 -8 135 187 35 -28 156 198 58 1 222 174 86 66 188 155
3451 155 56 105 129 80 14 37 178 105 11 113 171 92 41 171 156 64 -12 160 118 51 -8 124 7 -24 102 138
3477A38j51o6P3J49p7j79J85pj08o3J34P1j69o5J49J7q9k0Q1qq1o7J35N0j66O6
3503f8Q3j04j8L7Q0j21q2L1J97k63K3Q3R3j50L9J33j38j11R5J29k1j86P1J56j07
3528a19j04Q2O2p4KL7J15j27r7K01o8j29M3J70j2j52jK06j17j22J01J19n7j70
3552b11J35Q8n8j54P4J51o9q5O9O8q1n6J60L1j42O0Q1l9k3q7R7J8o5KO9q8m4J71
3580G2J6r1j14J59O8j04r8J99P6k65R3J21J5j81N6J93q7k16K3J58Q4k03OJ23m9
3605E4o6J7J49j22p8P6J21j54oN0O7j10j2J02k4q9P2N3p2j22R8J21p6j71J22J64
3631A64j72p1J48pj05J5J25Jj58L2J65m1j60l1J71n1j45K01pm7j18J55P8j31p8
3656f7N7J57j46j48J51P9o7q4J06P4j14l1J79rk09L2J73j4j25k0J66o5q1L2P6
$$ plain form
3477 138 -13 -79 -6 143 66 -113 72 65 -43 -106 28 99 -70 -135 14 31 -58 -78 3 -5 -86 -153 -18 32 -134 -68
3503 -68 15 -89 -107 -70 10 -111 -193 -162 35 -228 -205 -122 -29 -179 -140 -7 -145 -256 -161 -32 -53 -239 -168 -12 -119
3528 -119 -223 -141 -79 -153 -151 -114 1 -126 -223 -22 -90 -219 -176 -6 -18 -170 -171 35 -82 -204 -103 16 -41 -211
3552 -211 -76 12 -46 -200 -126 25 -44 -129 -60 8 -73 -129 31 62 -80 -20 61 22 -1 -88 9 27 -38 -36 33 -55 -99 72
3580 72 88 -3 -117 42 110 6 -92 107 183 -82 11 132 147 -34 22 215 128 -88 -65 93 177 -26 -20 103 54
3605 54 -12 5 154 32 -46 30 151 -3 -9 41 108 -2 -14 88 64 -25 47 100 28 -94 4 125 49 -122 0 164
3631 164 -8 -79 69 62 -43 -28 97 98 -60 -28 137 96 -64 -95 76 25 -120 81 74 27 -91 64 142 11 -67
3656 -67 -10 147 1 -147 4 83 16 -68 38 112 -2 -33 146 137 -72 -40 133 119 -6 -26 140 75 -6 26 102
3681A02j07K9M8mJ7o0O7L0o6k8O9lj23O5J51j12q9P9J19j04o9J20R7j28r5Q7J17
3708B09q4k18K16L3j49n2K00L3j67n8J23R0j44o2R5L6j13N3O3q4m4R2M7p7j16
3733g8J27jn8l5R5k7j15J12Km0l7jQ9r9k1P1N2j39m7J37N4j53J5J16k9j62J0R6
3761f6O9j37oP9J5n0RL5l3m1QJ37j48o6J16Q5n2r0k5J17l6r2L9Q0q3PP7J3r7n3
3791a89J21l6K8j4M2J3n7j4J5J4q0N1P4j03J8J11n2n9M6K3Q2j19l3R8K2j29J17
3818a0N8m7j34J8K21j59n4R5M6m7n9N2J09l1o2M5J18j93J7Q9J1o2n8R8k1%NKK
3847D9m7J6P0l2n8L8M3m5j9R6q8M4K2R2p0p1jL0N7j65L0R2l9j11J13k8j2n8K13
3876A61j23p8N8K9O1j38kQ6J4q7L6P5n8o3O1M2J8j41l6J10K5q4K7J21n5j24P1
$$ plain form
3681 102 -5 24 72 68 85 25 92 122 56 28 97 94 -29 36 187 75 -14 65 184 80 11 131 228 100 5 92 209
3708 209 125 -93 123 156 7 -45 155 188 21 -37 86 176 32 -30 65 101 -12 41 104 20 -24 68 115 38 -78
3733 -78 49 48 -10 -45 50 23 -92 20 22 -18 -55 -56 33 -66 -87 -16 36 -103 -150 -13 41 -112 -97 19 -10 -172 -162 -66
3761 -66 3 -134 -140 -61 -46 -96 -87 -52 -85 -126 -118 19 -129 -195 -79 6 -46 -136 -161 -44 -80 -172 -133 -53 -136 -129 -52 -39 -136 -189
3791 -189 -68 -104 -76 -90 -48 -35 -92 -106 -91 -77 -157 -106 -32 -135 -117 -6 -58 -117 -71 -48 34 -85 -118 -20 2 -127 -10
3818 -10 48 1 -133 -115 106 -53 -107 -12 34 -13 -72 -20 89 58 -4 41 159 -34 -17 72 83 21 -37 61 40 40 45 47 49
3847 49 2 18 88 56 -2 36 79 34 15 111 23 67 89 181 111 40 39 69 126 -39 -9 83 44 -67 46 18 6 -52 161
3876 161 38 -40 18 47 108 -30 -32 54 68 -19 17 92 34 -29 32 74 92 -49 -85 25 50 -34 -7 114 59 -65 6
3903FP8j08j9J19m6Lj07O7R6p6p2O8M7p4Q5n9K5m3M9K4j05O3L1k2p2J0Q1l5j1
3932CK5P4Oj27L9N3J4m7l7N0Q3j39J6Q1l4j24K7J88j79j7N8Q5p0o2K2J13m9l2
3960B0K7lJ3kL1J8p5j6J0M4o3K2K4K5j23J51j7o4k8rJ08j38L7K2J5L9o5N1o4l8
3990d8L2K6qn6P6L3q7n8R8K3k7j15Q1J3m6n3R0m0m1%J08m6k3k4J4P7r2L1l7J3
4020h6l9J7J2k3j1L0l2N6m3J4M8j1p0P7kq1O0MQm8PQ5o8k5j0O4Rr2J74m0q1MN2
4053d1J9j3r9Q5P0j04J4M1O4j32K8L9J8m2pP7m9l8O3O1j36Kk3J40r3l5J14j0q9
4082g6N0O6J9j15M4K7K7Mk1R4m8l9K0Q6q8l2KN9k7m0J01p5m1ML8M6rl2N0N6p4
4113G6m0M2j1Lo2kK3K3M1J8o8k4M0Ql7N8K7o6l8nN6oj16P8R1j37j6L2N0mj4n0
$$ plain form
3903 6 84 -24 -43 76 30 33 -74 -7 89 13 -59 9 56 -18 67 8 33 -10 39 63 -42 21 52 30 -42 -32 49 14 3
3932 3 28 102 108 -19 20 73 87 40 3 53 136 -3 13 94 60 -64 -37 151 -28 -45 13 98 28 -34 -12 101 52 20
3960 20 47 44 57 55 86 104 29 13 23 67 4 26 50 75 -48 103 86 22 -6 -15 93 -45 -8 14 29 68 3 54 -10 -48
3990 -48 -16 10 2 -54 22 55 -32 -90 8 31 4 -111 -30 -17 -63 -116 -26 -66 -107 -107 1 -45 -68 -92 -78 -1 -93 -62 -99 -86
4020 -86 -125 -108 -96 -119 -130 -100 -132 -76 -119 -105 -57 -68 -138 -61 -63 -144 -84 -80 -72 -120 -113 -28 -96 -121 -131 -67 -58 -150 24 -16 -97 -93 -41
4053 -41 -22 -35 -134 -49 21 -83 -69 -28 36 -96 -68 -29 -11 -53 -60 17 -32 -70 -7 54 -82 -80 -103 37 -56 -91 23 13 -76
4082 -76 -26 40 59 -56 -12 15 42 46 25 119 71 32 52 138 50 18 20 79 52 12 113 38 -3 1 39 85 76 44 94 150 76
4113 76 36 78 67 70 8 6 29 52 93 111 43 19 59 67 30 88 115 49 11 6 62 56 -60 18 109 -28 -44 -12 38 34 20 -30
4145c0P9rq3J13kn7M5l9L0j08K5J00n4n7k0O7R3j30M4jN1j30M2P7p0JK4L4l7q4
4175h6Q3P3j51N7k6Q4p6LQ7j5o8O4L5j02j7R2Q1j09k2K4P8j15l3M8P3r1K0mP3
4204F0j00O6Q2k3j06RO9r3J7L8K4m7rQ2nJr7R2K7p5mO8m3q3Q5N2p0l1jN6J3j20
4236f6P0K7M4r8N6QLj34J32M3j27J7O2j9j41J07lM6m8j9O9n1j58J75l3k9K1j2
4264e8J08m2j21M9K5%p8N3Mj5m0J11o0n9oO8j2l0k8J10m1lK2J2r0J3L9O9j40L5
4294a05Q3Rq6POM1Mq7Q8j3j41M0J38o8mM3L9m7l5j5J40j2j77Q4J25p2j00R3O3
4323D1r8L0L1L3m7j1N3N1j70J24ok4mJ0K2l0J2j2L9l4L4M3n0Pm3J29r4j1O1N7
4353A43o2n5l7K10r4j55J50kJ0j12N5J03r7r2J15N7n4j30J32N0j29O0j3J1l9P5
$$ plain form
4145 -30 49 40 -43 70 68 11 56 17 47 -61 -36 64 10 -47 -67 0 93 -37 7 6 57 -73 -31 46 -24 -23 1 35 -2 -86
4175 -86 -3 70 -81 -24 -50 34 -42 -39 48 33 -35 29 64 -38 -55 37 118 9 -13 11 89 -26 -59 -11 62 -29 -9 -13 60
4204 60 -40 26 108 85 -21 -12 57 -36 -19 19 43 -4 -13 69 64 65 -32 60 87 12 8 76 33 -50 35 87 17 -14 -15 41 54 -66
4236 -66 4 31 75 -23 33 41 44 -90 42 85 -42 -25 37 18 -123 -16 -19 27 -21 -40 29 -22 -180 -5 -38 -67 -46 -58
4264 -58 50 8 -113 -64 -39 -39 -117 -64 -60 -75 -115 -4 -64 -123 -129 -61 -73 -103 -131 -21 -62 -65 -43 -31 -121 -108 -69 0 -140 -105
4294 -105 -22 -13 -99 -92 -86 -45 -41 -128 -40 -53 -194 -154 -16 -84 -88 -45 -6 -53 -88 -103 37 25 -152 -68 57 -15 -115 -22 41
4323 41 -57 -27 4 37 -10 -21 32 83 -87 37 31 7 3 13 35 5 17 5 44 10 44 87 37 44 1 130 36 25 86 143
4353 143 81 26 -11 199 105 -50 100 98 108 -4 51 154 57 -35 80 137 83 -47 85 135 6 66 53 64 25 100
4379A00K7j08J4L9m1M5j14J41n6r3Q8k4M7m4pR0q5p1L2O8K3j12O2Rj8J7L7l3j7
4408A6m4nj0O4o9K7j4kM7nN9k00O7J23o0r5J18Q0r8r4J00M2p5r1J12R9q0m0L1
4437CK6m4m9L8O6q0k3M3P7o1o6J40q6m7P7J0k0qJ1J5%l0M4k9l3L4k4OlkP0K1j28
4470e2J4J52p8q9M8R3r4k0l6J37Oo8J19q2q3K1K6M2n6%K4L0q2K1K7j4k8L8k1Q
4500Co0l3J47r8L1qN1n3j8O7o4M3o4O3J5o4l0R5k5q2L8J9%j1o5J42j39J7N3K8
4530bl9j9k4J15o9ok4M0K4q7N7O9n0p0O4L4j81O0N9M9r1l3R2j4km5Q2K1r2l0J18
4561Fn0Ol0k0N7p6Q0l7RpK0O3p9L4K4m6K1K2P1o1o6L7M2L4r7J04o2l8L9L8K1l4
4593B5K8k1M8j02lO7Kl0k1J74r0n0M0l2L2k4k1Mn4N2L7j9j0l0K3mnJ2K3K7m8M3
$$ plain form
4379 100 127 19 33 72 31 76 -38 103 47 -46 42 18 65 21 14 104 19 -52 -20 48 71 -41 21 30 12 29 66 33 16
4408 16 -28 -33 -43 21 -48 -21 -35 -37 10 5 64 -136 -69 54 -6 -101 17 97 -1 -95 5 47 -28 -119 -7 92 12 -28 3
4437 3 29 -15 -64 -26 40 -40 -63 -20 57 -4 -70 70 -16 -63 14 24 4 -4 7 22 22 -8 36 7 -26 8 -16 -10 -13 -15 55 76 -52
4470 -52 -38 114 36 -53 -5 88 -6 -26 -62 75 81 13 132 50 -33 -12 14 56 0 0 24 54 -28 -7 20 6 -22 16 -5 3
4500 3 -57 -90 57 -41 -10 -18 33 -20 -38 29 -35 8 -56 7 22 -42 -72 23 -2 -84 -46 -27 -27 -38 -103 39 -100 -83 -30 -2
4530 -2 -41 -60 -84 31 -38 -44 -68 -28 -4 -91 -34 35 -15 -85 -21 13 -168 -108 -49 0 -91 -124 -32 -46 -48 -93 -11 10 -82 -112 6
4561 6 -44 -38 -68 -88 -31 -107 -27 -64 -55 -62 -42 21 -58 -24 0 -46 -25 -3 68 7 -59 -22 20 54 -43 61 -1 -39 0 38 59 25
4593 25 53 32 80 -22 -25 42 44 14 -7 167 77 27 67 35 67 43 22 26 -28 24 61 42 32 2 25 21 16 28 51 78 30 73
4625G3m1L0j7M8J7K4j21Q5r7M8n7P9M0j00J1N2p8j2K2K5O7q0k4N9O1j35JO0k0
4654B0o6O3L4o0J5N1jm0j06P2J4KJ0P3m2m3l3Q1K2q1m4N0O4n3N0m7n1KNM6M1n3
4686eK0Qq3j2P1l7QK5K5m7O7n5N2j3l3K1M4q7M5p6O1m6O3L2J6r3k5K9M2l8rKP5
$$ plain form
4625 73 32 62 45 93 110 134 13 98 1 49 -8 71 111 11 22 74 -4 -16 6 31 98 18 -6 53 114 -21 -20 40 20
4654 20 -46 17 51 -9 6 57 56 16 -90 -18 -4 -2 8 81 39 -4 -37 44 66 -15 -59 -9 55 2 52 5 -46 -44 -39 7 48 -5
4686 -5 15 23 -60 -72 -1 -38 -30 -5 20 -27 40 -15 37 24 -9 12 56 -31 14 -62 -1 -47 16 48 64 -29 -54 -25 17 -21 -30 -28 47
$$ [...]
8191a2
##END NTUPLES=NMR FID
##END=
