##TITLE=1H_EtBisCarb_d6TFA
 DMSO-d6
 8 sc, 
 7.5.2024
##JCAMPDX= 6.0         $$ Bruker NMR JCAMP-DX V2.0
##DATA TYPE= NMR FID
##DATA CLASS= NTUPLES
##ORIGIN= UXNMR, Bruker Analytische Messtechnik GmbH
##OWNER= root
$$ XWIN-NMR		Version 3.5
$$ Tue May  7 14:42:40 2024 Russian Standard Time (UT+4h)  she@DPX200
##.OBSERVE FREQUENCY= 200.1309
##.OBSERVE NUCLEUS= ^1H
##.DELAY= (6, 6)
##.ACQUISITION MODE= SIMULTANEOUS
##.ACQUISITION SCHEME= undefined
##.AVERAGES= 8
##.DIGITISER RES= 18
##SPECTROMETER/DATA SYSTEM= spect
##.PULSE SEQUENCE= zg30
##.SOLVENT NAME= CDCl3
##.SHIFT REFERENCE= (INTERNAL, CDCl3, 0, 15.7039)
##AUDIT TRAIL= $$ (NUMBER, WHEN, WHO, WHERE, WHAT)
$$ ##TITLE= Audit trail, XWIN-NMR		Version 3.5
$$ ##JCAMPDX= 5.01
$$ ##ORIGIN= Bruker BioSpin GmbH
$$ ##OWNER= she
$$ F:/spectra/data/she/nmr/H-F/1/audita.txt
$$ ##AUDIT TRAIL=  $$ (NUMBER, WHEN, WHO, WHERE, WHAT)
(   1,<2024-05-07 14:41:28.50 +0400>,<she>,<DPX200>,
      <created by zg, POWCHK disabled, PULCHK disabled
       configuration hash MD5:
       00 E9 B6 7A A2 85 ED C7 34 08 36 98 17 FE 4E 26
       data hash MD5: 16K
       B0 7F C6 64 A8 54 5F D1 FE 3C E3 65 C7 78 76 FC>)
$$ ##END=
$$ 
$$ hash MD5
$$ EB F5 A9 84 3C 39 B8 E7 AD 02 D0 98 02 E0 59 6D
##$RELAX= 
##$RELAX= 
##$RELAX= 
##$RELAX= 
##$RELAX= 
##$RELAX= 
$$ Bruker specific parameters
$$ --------------------------
##$DU= <F:/spectra>
##$EXPNO= 1
##$NAME= <H-F>
##$PROCNO= 1
##$TYPE= <nmr>
##$USER= <she>
##$AMP= (0..31)
100 100 100 100 100 100 100 100 100 100 100 100 100 100 100 100 100 100 
100 100 100 100 100 100 100 100 100 100 100 100 100 100 
##$AQSEQ= 0
##$AQ_mod= 1
##$AUNM= <au_zg>
##$AUTOPOS= <>
##$BF1= 200.13
##$BF2= 200.13
##$BF3= 200.13
##$BF4= 200.13
##$BF5= 200.13
##$BF6= 200.13
##$BF7= 200.13
##$BF8= 200.13
##$BYTORDA= 1
##$CFDGTYP= 0
##$CFRGTYP= 5
##$CHEMSTR= <none>
##$CNST= (0..31)
1 1 145 1 1 1 1 1 1 1 1 1 1 1 1 1 1 1 1 1 1 1 1 1 1 1 1 1 1 1 1 1 
##$CPDPRG= <>
##$CPDPRG1= <>
##$CPDPRG2= <>
##$CPDPRG3= <>
##$CPDPRG4= <mlev>
##$CPDPRG5= <mlev>
##$CPDPRG6= <mlev>
##$CPDPRG7= <mlev>
##$CPDPRG8= <mlev>
##$CPDPRGB= <>
##$CPDPRGT= <>
##$D= (0..31)
0 1.2 0 0 0 0 0 0 0 0.06 0 0.03 0 0 0 0 0.0002 0 0 0 0 0 0 0 0 0 0 0 0 
0 0 0 
##$DATE= 1715078487
##$DBL= (0..7)
120 120 120 120 120 120 120 120 
##$DBP= (0..7)
150 150 150 150 150 150 150 150 
##$DBP07= 0
##$DBPNAM0= <>
##$DBPNAM1= <>
##$DBPNAM2= <>
##$DBPNAM3= <>
##$DBPNAM4= <>
##$DBPNAM5= <>
##$DBPNAM6= <>
##$DBPNAM7= <>
##$DBPOAL= (0..7)
0.5 0.5 0.5 0.5 0.5 0.5 0.5 0.5 
##$DBPOFFS= (0..7)
0 0 0 0 0 0 0 0 
##$DE= 6
##$DECBNUC= <off>
##$DECIM= 32
##$DECNUC= <off>
##$DECSTAT= 4
##$DIGMOD= 1
##$DIGTYP= 9
##$DL= (0..7)
0 120 120 120 120 120 120 120 
##$DP= (0..7)
150 150 150 150 150 150 150 150 
##$DP07= 0
##$DPNAME0= <>
##$DPNAME1= <>
##$DPNAME2= <>
##$DPNAME3= <>
##$DPNAME4= <>
##$DPNAME5= <>
##$DPNAME6= <>
##$DPNAME7= <>
##$DPOAL= (0..7)
0.5 0.5 0.5 0.5 0.5 0.5 0.5 0.5 
##$DPOFFS= (0..7)
0 0 0 0 0 0 0 0 
##$DQDMODE= 0
##$DR= 18
##$DS= 0
##$DSLIST= <SSSSSSSSSSSSSSS>
$$ [...]
##$SUBNAM2= <"">
##$SUBNAM3= <"">
##$SUBNAM4= <"">
##$SUBNAM5= <"">
##$SUBNAM6= <"">
##$SUBNAM7= <"">
##$SUBNAM8= <"">
##$SUBNAM9= <"">
##$SW= 18.0517689322627
##$SWIBOX= (0..15)
0 0 2 0 0 0 0 0 0 0 0 0 0 0 0 0 
##$SW_h= 3612.71676300578
##$TD= 16384
##$TD0= 1
##$TE= 0
##$TE2= 300
##$TE3= 300
##$TEG= 300
##$TL= (0..7)
0 120 120 120 120 120 120 120 
##$TP= (0..7)
150 150 150 150 150 150 150 150 
##$TP07= 0
##$TPNAME0= <>
##$TPNAME1= <>
##$TPNAME2= <>
##$TPNAME3= <>
##$TPNAME4= <>
##$TPNAME5= <>
##$TPNAME6= <>
##$TPNAME7= <>
##$TPOAL= (0..7)
0.5 0.5 0.5 0.5 0.5 0.5 0.5 0.5 
##$TPOFFS= (0..7)
0 0 0 0 0 0 0 0 
##$TUNHIN= 0
##$TUNHOUT= 0
##$TUNXOUT= 0
##$USERA1= <user>
##$USERA2= <user>
##$USERA3= <user>
##$USERA4= <user>
##$USERA5= <user>
##$V9= 5
##$VALIST= <valist>
##$VCLIST= <CCCCCCCCCCCCCCC>
##$VD= 0
##$VDLIST= <DDDDDDDDDDDDDDD>
##$VPLIST= <PPPPPPPPPPPPPPP>
##$VTLIST= <TTTTTTTTTTTTTTT>
##$WBST= 1024
##$WBSW= 4
##$XGAIN= (0..3)
0 0 0 0 
##$XL= 0
##$YL= 0
##$YMAX_a= 153428
##$YMIN_a= -176003
##$ZGOPTNS= <>
##$ZL1= 120
##$ZL2= 120
##$ZL3= 120
##$ZL4= 120
##$ABSF1= 10
##$ABSF2= 0
##$ABSG= 5
##$ABSL= 3
##$ALPHA= 0
##$AQORDER= 0
##$ASSFAC= 0
##$ASSFACI= 0
##$ASSFACX= 0
##$ASSWID= 0
##$AUNMP= <proc_1d>
##$AZFE= 0.1
##$AZFW= 0.1
##$BCFW= 1
##$BC_mod= 2
##$BYTORDP= 1
##$COROFFS= 0
##$CY= 11.3945322036743
##$DATMOD= 1
##$DC= 2
##$DFILT= <>
##$DTYPP= 0
##$F1P= 15.6554695791079
##$F2P= 12.8336369535428
##$FCOR= 0.5
##$FTSIZE= 0
##$FT_mod= 4
##$GAMMA= 1
##$GB= 0.15
##$INTBC= 1
##$INTSCL= 1
##$ISEN= 128
##$LB= 0.24
##$LEV0= 0
##$LPBIN= 0
##$MAXI= 10000
##$MC2= 0
##$MEAN= 0
##$ME_mod= 0
##$MI= 1.114404
##$NCOEF= 0
##$NC_proc= 0
##$NLEV= 6
##$NOISF1= 3.799351
##$NOISF2= 2.8
##$NSP= 1
##$NTH_PI= 0
##$NZP= 0
##$OFFSET= 15.70392
##$PC= 1
##$PHC0= -25297.75
##$PHC1= 6.387491
##$PH_mod= 1
##$PKNL= yes
##$PPARMOD= 0
##$PSCAL= 0
##$PSIGN= 0
##$REVERSE= no
##$SF= 200.130013532006
##$SI= 16384
##$SIGF1= 3
##$SIGF2= 2
##$SINO= 400
##$SIOLD= 16384
##$SREGLST= <1H.CDCl3>
##$SSB= 0
##$STSI= 0
##$STSR= 0
##$SW_p= 3612.71676300578
##$SYMM= 0
##$S_DEV= 0
##$TDeff= 0
##$TDoff= 0
##$TI= <>
##$TILT= no
##$TM1= 0
##$TM2= 0
##$TOPLEV= 0
##$USERP1= <user>
##$USERP2= <user>
##$USERP3= <user>
##$USERP4= <user>
##$USERP5= <user>
##$WDW= 1
##$XDIM= 8192
##$YMAX_p= 0
##$YMIN_p= 0
$$ End of Bruker specific parameters
$$ ---------------------------------
##NTUPLES= NMR FID
##VAR_NAME=  TIME,          FID/REAL,        FID/IMAG
##SYMBOL=    X,             R,               I
##VAR_TYPE=  INDEPENDENT,   DEPENDENT,       DEPENDENT
##VAR_FORM=  AFFN,          ASDF,            ASDF
##VAR_DIM=   8192,          8192,            8192
##UNITS=     SECONDS,       ARBITRARY UNITS, ARBITRARY UNITS
##FACTOR=    0.0002768,     1,               1
##FIRST=     0,             0,               0
##LAST=      2.2672688,     0,               0
##MIN=       0,             -176003,         0
##MAX=       2.2672688,     153428,          0
$$ Real data points
##PAGE= N=1
##DATA TABLE= (X++(R..R)), XYDATA
0@%%%%%%%%%%%%%%%%%%%%%%%%%%MqRj1J2j1J1j2J3j6J9k0K2k5K9l1L2l6M1m5M8
$$ 0 0 0 0 0 0 0 0 0 0 0 0 0 0 0 0 0 0 0 0 0 0 0 0 0 0 0 4 -4 5 -6 6 -5 6 -6 7 -9 10 -10 12 -13 16 -15 17 -19 22 -23 25
47B5n3O0o6P2q1Q9r7J08j20J34j51J71j96K25k63L14l82M81o37R02j431K829j0290
$$ 25 -28 32 -34 38 -43 46 -51 57 -63 71 -80 91 -105 120 -143 171 -211 270 -367 535 -896 1933 -8357
70h357k9001N0856k742j6618R4345O4945k9923J451j242m6657K58o869n6046M2027
$$ -8357 -37358 13498 10756 -5862 88483 153428 123505 124956 123714 77057 77315 70446 14400 56427
84E6427Q3602m7242n4504L5095k2854p6691j7611n613M185M7912p807m1038L9939
$$ 56427 140029 92787 38283 73378 50524 -26167 -43778 -49391 -45206 2706 -5101 -46139 -6200
97f200O364r5386k2729M9518j6621j1046M6864J1218l592J2289l8402k3027M4337
$$ -6200 164 -95222 -117951 -68433 -85054 -96100 -49236 -38018 -41610 -29321 -67723 -90750 -46413
110d6413k836k3401P0020N1976l5733P358L4371k7800j3111K5640K380K6310M0806
$$ -46413 -49249 -72650 -2630 49346 13613 20971 55342 27542 14431 40071 42451 68761 109567
123A09567k2230j0515L5184l6700o2783K6010J9558l7002N195K1617k3707j6960
$$ 109567 87337 76822 112006 75306 12523 38533 58091 21089 26284 47901 24194 7234
135G234j8833m6052J312K0994l3260q92N6392q718m4322J3023M519k9879N591
$$ 7234 -11599 -57651 -56339 -35345 -68605 -69497 -13105 -21823 -66145 -53122 -48603 -78482 -72891
148g2891J7714Q435L6435J4158k6477J5535K1891m1118j1841N0747J3028p874
$$ -72891 -55177 -46742 -10307 3851 -22626 -7091 14800 -26318 -38159 12588 25616 17742
160A7742L1293J4358j2927j485j9065j8601K7866R080k1890K8386L3515l6294
$$ 17742 49035 63393 50466 48981 29916 11315 39181 48261 26371 54757 88272 51978
172E1978k8962R577k0558k6383N961J178N535J7042k1159k7559J1827j4666m5414
$$ 51978 23016 32593 12035 -14348 -8387 -7209 -1674 15368 -5791 -33350 -21523 -36189 -81603
185h1603J0605L3793p492J755K4094j797r089l200j8030O616L1442l74R69M3213
$$ -81603 -70998 -37205 -44697 -42942 -18848 -20645 -29734 -32934 -50964 -44348 -12906 -13280 -12311 30902
199C0902J2540l0135Q12J2079j3755q86J5856Q980J7887Q234k3789o707R687k7819
$$ 30902 43442 13307 14119 26198 12443 11557 27413 36393 54280 62514 38725 32018 41705 13886
213A3886k3266K4868J3823j3846M732O000j5697j3821j7051j6917J1439R676j5273
$$ 13886 -9380 15488 29311 15465 20197 26197 10500 -3321 -20372 -37289 -25850 -16174 -31447
226c1447Q214K3701j7844k6605N894K73j0752Q081J4203J1439J6660l088j4348
$$ -31447 -23233 468 -17376 -43981 -38087 -37814 -48566 -40485 -26282 -14843 1817 -1271 -15619
239a5619J0365M481j9530O613L1748P249j902J2435K520q482o601j0563R32J7334
$$ -15619 -5254 -773 -20303 -13690 18058 25307 23405 35840 38360 29878 23277 12714 13646 30980
253C0980M57p940J4786M829k6965j5615K925p877p800N803N438O090n09j7746
$$ 30980 31437 23497 38283 43112 16147 532 3457 -4420 -12220 -6417 -979 5111 4602 -13144
267a3144j0757L828j0958j4527J4910J7280l847m36O001l548p238n822j534J4138
$$ -13144 -23901 -20073 -31031 -45558 -30648 -13368 -17215 -17651 -11650 -15198 -22436 -28258 -29792 -15654
281a5654J5200n61N990J6980m005j6546O41P203n76L644R870R627O055o763j3248
$$ -15654 -454 -1015 4975 21955 17950 1404 2045 9248 8672 12316 22186 31813 37868 31105 17857
296A7857p43J37j2439k122J4908N178q382l890k889r665j1879q908K110R803J767
$$ 17857 17114 17251 4812 2690 17598 22776 14394 10504 7615 -2050 -13929 -22837 -20727 -10924 -9157
311i157m252N336K785j3927j2344K476M479N42M913J0253Q781j66q303k773M871
$$ -9157 -13409 -8073 -5288 -19215 -31559 -29083 -24604 -24062 -19149 -8896 -115 -281 -8584 -11357 -6486
326f486l0j860J0758J5770L727l377J4R2n657p119M15R834O981j349l65K947n710
$$ -6486 -6516 -8376 2382 18152 21879 18502 18516 18608 12951 5832 6247 16081 23062 21713 21348 24295 18585
343A8585j4077p499J792J835k071J059N985n87j0896j0135k311j310l531J595
$$ 18585 4508 -2991 -1199 636 -1435 -376 5609 5022 -5874 -16009 -18320 -19630 -23161 -21566
357b1566Q952P796j409n923o17m12o267k945Q981J0901L566K023L979Q29m266
$$ -21566 -12614 -4818 -6227 -12150 -12767 -13179 -19446 -22391 -13410 -2509 1057 3080 7059 7888 3622
372C622n731J7Q964N488J184N921O947m700j0262k653l31k424J40L677N175K334
$$ 3622 -2109 -2092 6872 12360 13544 19465 26412 21712 11450 8797 8466 6042 6182 9859 15034 17368
388A7368o552q917j846l917r543k28Q541J774k155k8k225n008n513m889K204R210
$$ 17368 10816 1899 53 -3864 -13407 -13635 -5094 -3320 -5475 -5503 -7728 -12736 -18249 -23138 -20934 -11724
404a1724K647J34Q435K718q228m444L072Q6K353O661N132O046L268o283m195L261
$$ -11724 -9077 -8943 -508 2210 -6018 -10462 -7390 -7304 -4951 1710 6842 12888 16156 9873 5678 8939
420H939l108m209Q580P537j658j50k39n939m915l878n017L932O453l149j306M960
$$ 8939 5831 1622 10202 17739 16081 15931 15692 9753 4838 960 -4057 -125 6328 3179 1873 6833
436F833n979j1437j263m92k505L303L868M26L166j542q783j30L578m645K116J1976
$$ 6833 854 -10583 -11846 -12338 -14843 -11540 -7672 -7246 -4080 -5622 -14405 -14535 -10957 -15602 -13486 -1510
452a510L944j159L858r65m921J078j244k03R585M943l072L609L598r301n197L552
$$ -1510 2434 1275 5133 4168 -753 325 -919 -1122 8463 13406 10334 13943 17541 8240 3043 6595
468F595k046k56N708M60j565J562o707r041K301j005n826M963O873l692j882J207
$$ 6595 4549 4293 10001 10461 8896 10458 3751 -5290 -2989 -3994 -9820 -4857 2016 -1676 -3558 -2351
484b351o791l904J540l019J981R517m40l371N517j006q845K420M769j030N408
$$ -2351 -9142 -13046 -11506 -14525 -12544 -3027 -3467 -6838 -1321 -2327 -11172 -8752 -3983 -5013 395
499C95P276j220J738K191p369k611N844k173r43R177K402m939J270j725q083k52
$$ 395 7671 6451 8189 10380 3011 400 6244 4071 3128 12305 14707 9768 11038 9313 1230 978
515I78J076l634M315N130n824j939K471q072o527M098n75j709O662J930l745K529
$$ 978 2054 -1580 2735 7865 2041 102 2573 -5499 -12026 -7928 -8503 -10212 -3550 -1620 -5365 -2836
531b836j891p974K061M680l463L987Q787j932k117L690l661l671M899Q24j41Q468
$$ -2836 -4727 -12701 -10640 -5960 -9423 -5436 3351 1419 -698 2992 -669 -4340 559 1383 1242 9710
547I710K338n317K803K75q151m13M349k293J443N777k885l127J758o112o164M499
$$ 9710 12048 6731 9534 9809 1658 1245 5594 3301 4744 10521 7636 4509 6267 155 -6009 -1510
563a510l10m083O010K175o315m72J96o910m0M536k254K351P470k792k865L977
$$ -1510 -1820 -5903 107 2282 -4033 -4505 -4309 -11219 -11259 -6723 -8977 -6626 844 -1948 -4813 -836
579h36l067n212N371L280j703N637L682m179J443J634o168R56N786j965L58O788
$$ -836 -3903 -9115 -3744 -464 -2167 3470 7152 2973 4416 6050 -118 838 6624 4659 5017 11805
595A1805k300m967J987l089n519L303J650k870L821K190o246j146Q12o243j321
$$ 11805 9505 4538 6525 3436 -2083 1220 2870 0 3821 6011 -235 -1381 -569 -6812 -8133
610h133M878j666m40M921k066m460K185k039m100M840L531k081M363L960m305
$$ -8133 -3255 -4921 -5361 -440 -2506 -6966 -4781 -6820 -10920 -6080 -2549 -4630 -267 3693 -612
625f12p75K794l751l82N758K28K24N443j130m593K393r19m592L377L242k704K112
$$ -612 -1387 1407 -2344 -2726 3032 3260 3484 8927 7797 3204 5597 4678 86 3463 6705 4001 6113
642F113J969n176j986P87m590j470M276p03j295L848j760n291J180p64m354K816
$$ 6113 8082 2906 920 1707 -2883 -4353 -77 -780 -2075 1773 13 -5278 -4098 -4862 -9216 -6400
658f400L262j826K173L142m489j367K706k345o98N596J578m52L984n30l552J648
$$ -6400 -3138 -4964 -2791 351 -4138 -5505 -2799 -5144 -5842 -246 1332 880 4864 4334 782 2430
674B430K66l341L101L658j658J417K569l846k339J627k595j486L937r9k377K536
$$ 2430 2696 -645 2456 6114 4456 5873 8442 4596 2257 3884 1289 -197 3740 3641 1264 3800
690C800j287n121J82m38l303J797K931k092J035J919l415k230J919j779o66M547
$$ 3800 2513 -2608 -2426 -2864 -6167 -4370 -1439 -3531 -2496 -577 -3992 -6222 -4303 -6082 -6748 -2201
706b201J154j489K863M73l423R72J389j351K485L459p87P52J938k540k046K145
$$ -2201 -1047 -2536 327 800 -2623 -1651 -262 -1613 872 4331 3544 4296 6234 3694 1648 3793
722C793j453j193L927K69j559J201k69m191k95P08k591O79K567j610q96Q47k408
$$ 3793 2340 1147 5074 5343 3784 4985 4716 525 230 938 -1653 -974 1593 -17 -913 -66 -2474
739b474l180J472q19j253L055J586j477J432O9l042M11J082n82J642L211mk03
$$ -2474 -5654 -4182 -5001 -6254 -3199 -1613 -3090 -1658 -1589 -4631 -4220 -3138 -3720 -2078 1133 1129 926
756I26J908j296j832J919J71j90K909J069j255P76l3l141k92O33j145K68K210
$$ 926 2834 1538 -294 1625 1796 1606 4515 5584 4329 5105 5072 1931 1639 2272 1127 1395 3605
773C605r73j335P86k105k512M01r5j205J693P47j194l84P8k203m56J150l96J059
$$ 3605 2632 1297 2083 -22 -2534 -2133 -2228 -3433 -1740 -993 -2187 -2571 -2493 -4696 -5152 -4002 -4398 -3339
791c339K265K55l82Q74n22j673J371J125j39K207J503p09L89L34j525m98J369
$$ -3339 -1074 -819 -1201 -327 -849 -2522 -1151 -26 -165 2042 3545 2836 3225 3559 2034 1536 2905
808B905k94N72J665l88j530M5j028k159%n7m97R48Q97j756m35j66j898j122R90
$$ 2905 2611 3183 4848 4460 2930 2975 1947 -212 -212 -269 -766 182 1079 -677 -1112 -1278 -3176 -4298 -3308
827c308l05M35J278M0p31J88n45r59P11J235N55J161J810l07k23Qo89j26J069
$$ -3308 -3613 -3178 -1900 -1860 -2591 -2403 -2948 -3907 -3196 -1961 -1406 -245 1565 1258 1035 1043 354 228 1297
846A297N43N25J534J64o46l05n92r71l18O45J5O99K14j104r85o77j586r98L40
$$ 1297 1840 2365 3899 4063 3417 3112 2520 1549 1231 1876 1891 2590 2804 1700 715 38 -1548 -2546 -2206
865b206J99O0P87R9r82n83o01o04K43M75O36J027O52j0p31K49k07J93J110J080
$$ -2206 -2007 -1947 -1160 -1061 -2043 -2626 -3227 -3831 -3588 -3113 -2477 -1450 -798 -808 -1539 -1290 -1497 -1304 -194 886
885H86O90Q14P67n81m60k93m65k7J015K96O04k4l34r91p89q33l43J27K90L17l09
$$ 886 1576 2390 3157 2576 2116 1823 1358 1331 2346 2642 3246 3222 2888 1897 1108 275 -68 59 349 666 357
906C57k73j096o66r82l59k10L99O78N48R7m8k71o97M3M06L12Q86R74L59M59J09
$$ 357 84 -1012 -1678 -2660 -3019 -3229 -2830 -2152 -1604 -1507 -1555 -1826 -2523 -2480 -2074 -1762 -876 98 457 916 1025
927A025o09l58P15L52K98J291O21k24j32k67q78m84P6j18l06J272n60o65K8j144
$$ 1025 416 58 773 1125 1423 2714 3335 3111 2979 2712 1834 1350 1426 1308 1002 2274 1714 1049 1077 -67
947f7j295k9j4j73M28L68n69k33k21j018p51R18K88L09J460J79r3j14j2o87P11
$$ -67 -1362 -1391 -1405 -1578 -1150 -782 -1351 -1584 -1805 -2823 -3574 -2656 -2368 -2059 -599 -420 -513 -627 -639 -1326 -615
968f15N06K16J161Q62l38l69P31q51l8K80K77K91Q24m8q32r2q68j200L31k45n6
$$ -615 -109 107 1268 2130 1792 1423 2154 1303 1265 1545 1822 2113 2937 2889 2057 1965 1097 -103 228 -17 -73
989g3J24N83q87n55m29p91l64N11j87J3J160k13r13N88j87p08K30Q55L10Q01Q79
$$ -73 51 634 -253 -808 -1237 -2028 -2392 -1881 -2068 -2055 -895 -1108 -2021 -1433 -1620 -2328 -2098 -1243 -933 -132 747
1010G47l52J8N95r36j35J245L30j46R04K59q79L11o36o42M28L51m50M26N42j111
$$ 747 395 413 1008 72 -63 1182 1512 1366 2270 2529 1650 1961 1325 683 1111 1462 1012 1438 1980 869
1030H69o62o4r89o26R28m02r1N09o9r91R2m71p32N95P39k33M11R03n78l05L39
$$ 869 207 143 -846 -1472 -544 -946 -1037 -528 -597 -1588 -1496 -1967 -2699 -2104 -1365 -1598 -1187 -284 -862 -1167 -828
1051h28l37K42J257J85J67J028J58j020J58M74q28M41O93j75l0P85q89o80K28
$$ -828 -1165 -923 334 519 686 1714 1872 852 1010 1484 656 1097 1790 1615 1585 2370 1481 801 1029
1070A029o44n10O19o0Om9j36j162k13J26r92J34P57l30J40R04r91j19L98k78l53
$$ 1029 385 -125 494 434 440 391 255 -907 -1120 -994 -1986 -1852 -1095 -1425 -1285 -381 -1372 -1491 -1093 -1371 -1724
1091a724N50P75j00P19L70q54J09L04j32K24J175Kj55J168p84o89K44n1o06M72
$$ -1724 -1174 -399 -499 220 590 -264 -155 149 17 241 1416 1418 1263 2431 1647 958 1202 1151 545 1017
1111A017M83p13L32Qj352n2M58r34j55N85r2k87K33m25j164N27j06l92O58P28
$$ 1017 1500 787 1119 1127 -225 -277 181 -753 -908 -323 -415 -702 -469 -894 -2058 -1531 -1637 -2029 -1371 -643
1131f43o44O93L14p19M0N09l01K20J045L1J81L89j87m79L17K34n80J003N15q11
$$ -643 -1287 -594 -280 -999 -959 -450 -751 -531 514 545 726 1115 928 449 766 1000 420 1423 1938 1127
1151A127L77M69j175k42L97p49k48M94r9k22J60l46r44R4Q7l18K47P06o83j07
$$ 1127 1504 1973 798 556 953 204 -44 450 351 129 289 -57 -1001 -907 -820 -1138 -891 -185 -868 -975
1171i75K14o23k44N94j95j03R50L07j47O10k95o07Q33J05m05O11Q08m14m8M62
$$ -975 -761 -1384 -1628 -1034 -1229 -1332 -382 -75 -222 388 93 -514 319 424 19 630 1438 1024 976 1438
1191A438p74o3M43l00l2N79Lo76J87k51r23J15p0k64j47O11n69l75L40n28j43
$$ 1438 664 601 1044 744 712 1291 1294 618 805 554 -369 -254 -324 -588 -735 -124 -693 -1068 -728 -1256 -1399
1212a399K40j00L27L15J08k97K77j08n39K42N57o4L28R17l30J35K64k76k23L99
$$ -1399 -1159 -1259 -932 -617 -509 -806 -529 -637 -1176 -934 -377 -441 -113 804 474 609 873 597 374 773
1232G73K06j99Q23k34k89o9j07m95J3L70p29L35K99o12j92J35n83n88M35j63j80
$$ 773 979 780 1603 1369 1080 1011 904 409 422 792 63 398 697 85 -107 28 -555 -1143 -708 -871 -1051
1253a051N97J88p37L59L8o65M9P71m17J26O43M9k83K25Rk33O54O8J7L77P23j115
$$ -1051 -454 -266 -1003 -644 -606 -1271 -1222 -451 -868 -742 -99 -50 -333 -108 -99 -332 322 390 407 784 1507 392
1275C92L27M65n72j88L85O4j68M3l26rK24k39p39J66j54k72N28r4l60j64J79m88
$$ 392 719 1184 612 424 809 873 705 748 422 413 637 398 -341 -175 -329 -601 -73 -167 -527 -691 -512 -1000
1297a000m20P04m06L13L63N7m64M37k21o7N50R9J59M00P0n03J0L55m7Q0N11j79
$$ -1000 -1420 -716 -1122 -809 -446 -389 -853 -416 -637 -704 -154 -55 104 504 574 71 81 436 389 469 980 801
1319H01j08P80o60j36p0j53l19R1K12l57K08J17l01m92L26n38Q5j73K73m28M68
$$ 801 693 1473 813 677 607 454 135 226 438 81 289 406 105 -387 -61 -599 -514 -687 -414 -842 -374
1340c74k58k93M5Jj39L22J77j64N16K95k66L1M23m15J91O11k12n3J86J02k30k6
$$ -374 -632 -925 -880 -879 -1018 -696 -519 -683 -167 128 -138 -107 316 -99 92 703 491 438 624 726 496 470
1362D70J92k98L24J37J6j10Ol08k82n1k63L0L09j49k39J02j75l76K02k2j54k74
$$ 470 662 364 688 825 841 731 737 429 147 96 -167 -137 172 23 -216 -114 -289 -665 -463 -485 -639 -913
1384i13J14K47J49o6j25J49K26j25n10N66M02J32L50j97J12M3j18j51j0M69j48
$$ -913 -799 -552 -403 -469 -594 -445 -219 -344 -854 -288 114 246 596 399 511 554 436 285 275 744 596
1405E96M5O6j41O5p0n50K47K01j73L56k47n07r1J53l75Q8j72j20L04l46M96j00
$$ 596 641 707 566 631 561 11 258 459 286 642 395 -112 -203 -50 -425 -337 -509 -629 -325 -671 -175 -275
1427b75l62J86q9j79L42J64R7J41l71J60J61j75K05K82j68N28k77K32j12J6J62
$$ -275 -637 -451 -540 -719 -377 -213 -116 25 -346 -186 -25 -200 5 287 119 647 370 602 490 506 668
1448F68j63j76j43M11j74M7q8k23k97nJ27Q0o4j0n5J87m33k06n5Mj99L63M1J7
$$ 668 505 329 186 597 423 470 382 159 -138 -143 -16 64 0 -10 -65 122 -311 -517 -572 -568 -767 -404 -363 -346
1472c46K28k32p5k8p3L71K41k65Q6J28K04l05LO40l49J40N0K18j61N9j86j4J83
$$ -346 -118 -350 -425 -453 -526 -155 86 -179 -93 35 239 -66 -63 577 228 368 418 636 475 534 348 334 517
1495E17l69J20k68K99j89J00k19k05O7k74K05k46J36L9m3n7j52j2K34l90L73j02
$$ 517 148 268 0 299 110 210 -9 -214 -147 -421 -216 -462 -326 -287 -330 -387 -539 -551 -317 -707 -334 -436
1517d36K24L88k57m1P9N6l4k8R3J20R5J80j05qo9k6j91L23j9rj34R5qq6j01Q5
$$ -436 -212 176 -81 -122 -43 13 -21 -49 44 164 259 439 334 326 257 231 40 363 344 335 201 296 288 202 101 186
1543A86j29j62M9j10J56r3k3l54K98k61m7K74M0l21L66j18j34n1J98J53k68L61
$$ 186 57 -105 -56 -166 -10 -103 -126 -480 -182 -443 -490 -216 -176 -497 -131 -249 -383 -434 -236 -83 -351 10
1565A0j18O4M13l13l86L99QJ66K37k05J84Jn04J07K98j75j45M60m76K29Q8j82
$$ 10 -108 -44 369 56 -330 69 77 243 480 275 459 460 -44 63 361 186 41 501 25 254 342 160
1587A60k87rm8j82L97M9k27O4l8k9j46K6P2j99L13J79l94J72K03l84L75j97K41
$$ 160 -127 -136 -184 -366 31 80 -147 -83 -121 -150 -296 -270 -198 -397 -84 95 -299 -127 76 -308 67 -130 111
1610A11j97N46j33j42o6o4K04J04k08J27l2n8J2N3J17l51j49K50k45J67r6Rj18
$$ 111 -86 460 327 185 119 55 259 363 155 282 250 192 204 257 374 23 -126 124 -121 46 -50 -41 -159
1633a59j15J26k57P9J27j48K00M4k82K83k19K14j93jK45m7J60n8K16j52k91K6
$$ -159 -274 -148 -405 -326 -199 -347 -147 -103 -385 -102 -321 -107 -300 -301 -56 -103 57 -1 215 63 -228 -202
1655b02J27L12j52J95Q9r5J60K1k8l55J57o2k13L3M54m83l04K24J4kj0J84j44
$$ -202 -75 237 85 280 369 274 434 455 427 72 229 167 -46 -13 441 -42 -346 -122 -108 -110 -120 64 -80
1678h0M5m44N76q2k88o4K38J1k17N0J25o6J62j18j67M97p1Jk9J5J8Pj91K07m0
$$ -80 -35 -479 97 15 -273 -337 -99 -88 -305 -255 -130 -196 -34 -152 -319 178 107 108 79 94 112 119 -72 135 95
1703I5L8P4M2rJ8j80n9K43j0l06K6R4j5k43K17l3J63o88P5J69j7M0n1K66r8k71
$$ 95 133 207 249 240 258 78 19 262 252 -54 -28 66 51 -192 25 -8 155 -533 -458 -289 -306 -266 -317 -51 -149 -420
1729d20K30j33K4J84J32j21mR8j30M66k11j94Q0j6j62L55L02k97J09j19l11M05
$$ -420 -190 -323 -299 -115 17 -104 -108 -10 -140 326 115 -79 1 -15 -177 178 480 183 292 173 -138 267
1751B67R4m36L23JK13l92k36p3O5J3J10J30J3n1j89R4j43J28j41J31k9p4J22j93
$$ 267 361 -75 248 249 462 70 -166 -239 -174 -161 -51 79 92 41 -148 -54 -197 -69 -210 -79 -108 -182 -60 -253
1775b53K45j31j14J69N6N6j23L09K67n54J49L92j57m0j39p7l8J67m4k94N01m7
$$ -253 -8 -139 -253 -84 -28 28 -95 214 481 -73 76 468 311 271 132 55 17 184 140 -154 347 300
1797C00m18l9L94l65J77j51R2j27o3n5Q4L10l97K5l7J56l3k03K73q3l7J18O7J81
$$ 300 -118 -157 237 -128 49 -102 -10 -137 -200 -255 -171 139 -258 -233 -270 -114 -147 -350 -77 -160 -197 -79 -12 169
1821A69j76k39O2L29N6j80o0K44q6n6lK12k9j44J26nJ75l06J92n4Nm86L22n2J60
$$ 169 -7 -246 -184 145 201 21 -39 205 119 63 60 272 243 99 225 220 395 89 281 227 232 -254 68 16 176
1846A76k89J55O8K12k99k57L82l56J38j50J17j19l7%J51j15Q2K0M1p9M2J44J67
$$ 176 -113 42 110 322 23 -234 148 -208 -70 -220 -103 -222 -259 -259 -108 -223 -141 -121 -80 -159 -117 27 194
1869A94RK4l16R7j18J89j08J43L40l77j46K52MK0l45L46j65k76L87k10jk35J84
$$ 194 203 227 -89 8 -110 79 -29 114 454 77 -69 183 187 207 -138 208 43 -233 154 -56 -57 -292 -108
1892a08m0o2N8K7K23l61K29m2k71J31K01j61J74k9K90n68M41j14l5J77j40K40
$$ -108 -148 -210 -152 -125 98 -263 -34 -76 -347 -216 -15 -176 -2 -31 259 -309 132 18 -17 160 20 260
1914B60j08K1k87L77j30J79k83M6J38q1RJ20k83P0j40K51j9p4R6k31oJ49j56K73
$$ 260 152 173 -114 263 133 312 29 75 213 132 141 261 -22 48 -92 159 140 66 162 -69 -75 74 -82 191
1938A91j98l32L49q8p1j8J18j27R5J45r2k6R0N0j18j29M66l07K49j18j54j07p5
$$ 191 -7 -339 10 -78 -149 -167 -49 -176 -81 64 -28 -54 36 86 -32 -161 305 -2 247 129 -25 -132 -207
1961b07L68j55L5J19m1Q6j45K33k14N4J00k54j6O0k14K3J33J22J12k1n02J24K61
$$ -207 161 6 41 160 119 205 60 293 79 133 233 -21 -37 23 -191 -168 -35 87 199 178 -324 -200 61
1984F1j02J70l30M05l81j2J62O4k9q9J49J9l86L07O7k4j7j49M05l82K78k2M8n0
$$ 61 -41 129 -201 204 -177 -189 -27 37 8 -81 68 87 -299 8 75 51 34 -115 290 -92 186 164 212 162
2008A62q2J71l44K86J14m25J40J16k22L13j97j20Q8Q8n8j51O5n1mj29O7L58k02
$$ 162 80 251 -93 193 307 -118 22 138 -84 229 32 -88 0 88 30 -121 -56 -107 -111 -240 -173 185 -17
2031a7j77j04L91n07K22P3K52m7l44L79O3k16J61k22K64q3P7k83J17P5J66K24
$$ -17 -194 -298 93 -414 -192 -119 133 86 -258 121 184 -32 129 -93 171 88 165 -118 -1 74 240 464
2053D64l96J67m15K47j79p6%m1L30j19p3J91J4m23K13j21k9L65J4j90J11j41j87
$$ 464 68 235 -180 67 -112 -188 -188 -229 101 -18 -91 100 114 -309 -96 -217 -246 119 133 -57 54 -87 -274
2076b74J89o3j24K24l5K53M5r4J66l74J49k63K61pl2R8l6M7J69k29p5j45P9R0
$$ -274 -85 -148 -272 -48 -83 170 215 121 287 -87 62 -201 60 53 21 119 83 130 299 70 -5 -150 -71 19
2100A9N1j1qK43l27%o8L22l49p7J57k11J44K36r9J59n50K64K33m04J41K09O1j20
$$ 19 70 59 51 294 -33 -33 -101 221 -128 -205 -48 -259 -115 121 22 181 -369 -105 128 -276 -135 74 135 15
2124A5j29J86N7m5p2O8l8j03N9M5J26j56j6O1%k4j26M0K86j15R3l64O9K86j31
$$ 15 -114 72 129 84 12 80 42 -61 -2 43 169 13 -3 58 58 34 -92 -52 234 119 212 -152 -83 203 72
2149G2j61M8K7J80j59jo1L7M2o8k3k4N8M7m5k4k78q5N42j45L0N9j16P2p6J86m02
$$ 72 -89 -41 -14 166 7 6 -55 -18 24 -44 -67 -91 -33 14 -31 -55 -333 -418 124 -21 9 68 -48 24 -52 134 -268
2176b68L10J27j17N8l27K02Q6L3l51n2L54j11R8j43J44k01J0j41K58o7K5o5J34
$$ -268 42 169 52 110 -217 -15 71 104 -247 -299 55 -56 42 -101 43 -158 -148 -289 -31 -98 -73 -138 -4
2199dj76J48O0m54L59p6j89L72P3j93m4o1K98k79K26k29J09J7Q2N1l4n1J31j06
$$ -4 -180 -32 28 -426 -67 -143 -332 40 113 -80 -124 -185 113 -166 60 -169 -60 -43 39 90 56 5 136 30
2223C0P1j4J26m76O3K62j78l30K50L18k84J70l21L27K7j96J7J27j46j6L9K2p4
$$ 30 101 87 213 -263 -200 62 -116 -446 -196 122 -162 8 -313 14 41 -155 -138 -11 -157 -173 -134 -112 -186
2246a86J36k8Q3K9j95P2J10P2p5J11k32M06j44j74L33j62k82j6L88j7k06L5j96
$$ -186 -50 -78 5 34 -161 -89 21 93 18 129 -103 303 159 -15 318 156 -126 -142 246 229 23 58 -138
2269a38j2m7K08k20L30q8j3Q2j58n4p3K79k40j11J40p2j87K91J34k5k61J72P0
$$ -138 -150 -197 11 -209 121 33 20 102 -56 -110 -183 96 -144 -255 -115 -187 -374 -83 51 26 -235 -63 7
2292Gj53J30L7j31J90o3K40k64Q7m8j9K34rj32k83L17j44j24o8K21Q8j44J03k6
$$ 7 -146 -16 21 -110 80 17 257 -7 80 32 13 247 238 106 -177 140 -4 -128 -196 25 113 -31 72 46
2316D6q5j5RK4j93K08K1k1L1Nr8RJ28k14j30L62J83m12K34J05M6j9m34J53J20
$$ 46 -39 -54 -45 -21 -214 -6 15 -6 25 30 -68 -59 69 -145 -275 87 270 -142 92 197 243 224 -210 -57 63
2341F3L6L72n01j4n5J55L0k28R3P8Q3L7L6k54O7P6q5J64j99K01k58j23K56l8k96
$$ 63 99 471 -30 -44 -99 56 86 -142 -49 29 112 149 185 -69 -2 74 -11 153 -46 155 -103 -226 30 -8 -304
2366c04J91J05N3q8j52J5J25J7L46j95j21m18N08k11J82K73l45K15l84L26p3m6
$$ -304 -113 -8 45 -43 -195 -180 -55 -38 308 113 -8 -426 82 -129 53 326 -19 196 -188 138 65 19
2388A9J71k42J00K15k56Q9k87L20j43N5J48r3m47L32M5j32Q4P2q1Q1j0j54J9p2
$$ 19 190 -52 48 263 7 96 -191 129 -14 41 189 96 -351 -19 26 -106 -22 50 -31 50 40 -114 -95 -167
2412a67QJ84j39l6J56k17K62k04K97M1j63rK0Q3J7k01K71L1J8n1k51m0J25J60
$$ -167 -159 25 -114 -150 6 -211 51 -153 144 185 22 13 33 116 133 -68 203 234 252 201 -50 -90 35 195
2436A95L3r8r0k4M4k42K36j08J35K8l53J40L3j01J71j7j61N6r9J64j2J21j09O4
$$ 195 228 130 40 16 60 -182 54 -54 81 109 -244 -104 -71 -172 -1 -18 -179 -123 -222 -58 -70 51 -58 6
2460FM6k24J14m5K90q2kj86J25O9p1Q6l7k9N9r9J62j36n5R6k67K2K39j72J31l36
$$ 6 52 -172 -58 -103 187 105 103 -83 42 111 40 126 89 60 119 20 182 46 -9 87 -180 -158 81 -91 40 -296
2486b96K62r9r9K79p7KJ20J05k84j31k1J29J30l35O02m3k98R6J51j07k09J60J7
$$ -296 -34 -133 -232 47 -30 -28 92 197 -87 -218 -239 -110 20 -315 287 244 -54 42 193 86 -123 37 54
2509E4p7m3J88l81M66Lr7j44O4O9O1j68o9L6j99K98j58P5r3R6J24o5jl42J91J24
$$ 54 -23 -66 122 -259 207 210 113 -31 33 102 163 -5 -74 -38 -237 61 -97 -22 -115 -19 105 40 39 -303 -112 12
2535A2rK50j30k25O3m0O0j21Q6K05o7j57J97J23j99K58l03j26K05N8l38R0k0L00
$$ 12 3 253 123 -102 -39 -79 -19 -140 -54 151 84 -73 124 247 48 306 3 -123 82 140 -198 -108 -128 172
2559A72o5Qk36K27k6p5K9K3k8k47L35j30r4M4j93K12r2k5J7m2L9R9K49m24J05
$$ 172 107 115 -121 106 80 5 34 57 29 -218 117 -13 -107 -63 -256 -44 -136 -161 -144 -186 -147 -48 201 -223 -118
2584a18k1L08k93K66k62o4K2K54l06K40J28l69K48j6K53j15k14J21j9l7M4p1k
$$ -118 -139 169 -124 142 -120 -184 -162 92 -214 26 154 -215 33 17 270 155 -59 62 43 6 50 -21 -23
2607b3j21J79J13k93J15j68K23p1j8P7RK49n05j22L50k77M08K5p4j41J51k51j1
$$ -23 -144 35 148 -145 -30 -198 25 -46 -64 13 22 271 -234 -356 -6 -283 125 150 76 -65 86 -165 -176
2630a76K59l9J1M5L07m20j14K4J79L1Q1O9k89K27J1k39O1k13J56q0J62k09J90
$$ -176 83 44 55 100 407 -13 -127 -103 76 107 188 257 -32 195 206 -33 28 -185 -29 -109 53 -156 34
2653C4p4j44O9k17M3L59j25P0rO0K5l48J80jk96L67l11M34J70k37J68r9J6k55
$$ 34 -40 -184 -115 -332 -289 70 -55 15 6 66 91 -257 -77 -78 -374 -7 -318 116 286 49 217 118 134 -121
2677a21L39kj21q7p5J89o2j42K41j09j41L4j97L51j73O0M1J16l42J64l8r9K43
$$ -121 218 216 95 8 -67 122 60 -82 159 50 -91 -57 -254 97 -76 -16 25 141 -201 -37 -75 -174 69
2700F9j38O2j12K5pJ96k89L00j41j75Q7J98j38M9K48m49L55p9J43j31r8L16l59
$$ 69 -69 -7 -119 -94 -101 95 -194 106 -35 -210 -123 75 -63 -14 234 -215 140 61 204 73 -25 291 -68
2723f8K11m0m3J55k87R1j44L73l00j16M9J24n9j13K51l7J7j96j25J13Q6m0LK06
$$ -68 143 103 60 215 -72 19 -125 248 -52 -168 -119 5 -54 -167 84 47 64 -132 -257 -144 -58 -98 -95 111
2747A11j66J56p2R9r9j42J56j61K86m74P1O4N90k00j14K5k76j39L09l1K89q4p3
$$ 111 -55 101 29 128 29 -113 43 -118 168 -306 -235 -171 419 219 105 130 -146 -285 24 -7 282 198 125
2770A25j96J63l55J7K75k28L91O4m75K04m2K78l02j32R5K06k74J24n0n7O6J18
$$ 125 -71 92 -263 -246 29 -199 192 256 -219 -15 -57 221 -81 -213 -118 88 -186 -62 -112 -169 -103 15
2792A5j90p3qK01J0J64k90O8m9k8K67j26k8L28k25K28p0K10m44l2J66J41p1k22
$$ 15 -175 -248 -256 -55 -45 119 -171 -103 -152 -180 87 -39 -67 261 36 264 194 404 -40 -72 94 235 164 -58
2816e8L35j77K1l87L00p7N9J25l19j4M2J30k78K51L0j71M09j41l06J67P4J56j35
$$ -58 277 100 121 -266 34 -43 16 141 -178 -192 -150 -20 -298 -47 -17 -188 221 80 -226 -59 15 171 36
2839C6k59K91j27L3J17j39k8n9J06J18J36j78N2j27K29k04k4p3K15J84o7j82K23
$$ 36 -223 68 -59 -26 91 -48 -76 -135 -29 89 225 47 99 -28 201 -3 -27 -100 115 299 232 50 273
2862B73j26j87q2K60O0m51K31j86N47m40K00M9j72p9j03J33l9J7J78j5j2J83l14
$$ 273 147 -40 -122 138 198 -253 -22 -208 339 -101 99 148 -24 -103 -206 -73 -112 -95 83 68 56 239 -75
2885g5J51n5J17m6k81L9J73qJ35K53m01J85o1n7J12L2J73l95Lj82l3LK21j59L12
$$ -75 76 21 138 92 -189 -150 23 15 150 403 2 187 126 69 181 213 386 -9 -6 -188 -221 -218 3 -156 156
2910A56m13N3K87q6k08J58K05k67R3j55J69k6L21k94j49P3J02QJ7l47L74J75j6
$$ 156 -257 -204 83 -3 -211 -53 152 -115 -22 -177 -8 -34 287 -7 -156 -83 19 27 44 -303 71 246 230
2933B30k74L4K01k12Or0K87j88L4r2L11M8k48j4m2K0N6k13on0R0K14p0o6J2J68
$$ 230 -44 -10 191 -21 -15 -105 182 -6 28 -64 247 295 47 33 -9 11 67 -146 -152 -202 -112 102 32 -34 -22 146
2959A46k62L21l68J19l7K04k09J37k15K49j63lJ9j37L49j17k4J42r9oM1j99L6
$$ 146 -116 205 -163 -44 -81 123 -86 51 -164 85 -78 -81 -62 -199 150 33 9 151 52 46 87 -112 -76
2982g6L59j09k87K24j00p3J55j9j25o3Q9l8n6Q9l7P5k33J98L4j31r5N4J62n3Q
$$ -76 283 174 -113 111 11 -62 93 74 -51 -114 -25 -63 -119 -30 -67 8 -225 -27 7 -124 -219 -165 -3 -56 -48
3007d8K73m16J92J72pk72L25j77J15q0l65L85o8Kj69J18j69L25p0r2J33K7k51
$$ -48 225 -191 1 173 166 -106 219 42 157 77 -288 97 29 31 -138 -20 -189 136 66 -26 107 134 -117
3030a17J90K9l42L06k73M5q9J76N1k26J00K26L42n57j08K53N2l7j89Q4K49k40
$$ -117 73 102 -240 66 -207 -162 -251 -75 -24 -250 -150 76 418 -139 -247 6 58 21 -168 -84 165 -75
3052g5n9J68k84L1R2J72K10j97n2J81j05N9j72m0K84k24j34J28J11k5L4j97m3
$$ -75 -134 34 -250 -219 -127 45 255 58 6 187 82 141 -31 -71 213 -11 -145 -17 94 69 103 -94 -137
3075a37J84P7l02K58l28M82r1j48J9j63J09M0L1M1jj43J46j61L86k39p2k66K21
$$ -137 47 124 -178 80 -248 234 143 -5 14 -149 -40 0 31 72 71 -72 74 -87 299 60 -12 -278 -57
3098e7J23j41M39k70K96m77L00o5j7j60jP4j91K15P2oj47o6K38j76j05K89o1q2
$$ -57 66 -75 364 94 390 -87 213 148 131 -29 -30 44 -147 68 140 134 -13 -79 159 -17 -122 167 106 24
3122B4J63k52m9M4j4K10k16p0J59j52j0J96M6K9J6j37JJ55k25K45n07L93o3N9
$$ 24 187 -65 -114 -70 -84 126 -90 -160 -1 -153 -163 33 79 108 124 -13 -12 143 -82 163 -344 49 -14 45
3146D5r9n2L13j83L36n63K13j14J93pq9k33L73K0l14K96j92j40M22q6J40m88K97
$$ 45 -54 -106 207 24 360 -203 10 -104 89 82 -7 -240 133 153 -161 135 -57 -197 225 139 279 -209 88
3169H8j22m23N46l4k13J29J80j07k03J24j59L02k09K05j62K41L3p8O7j33M8N5
$$ 88 -34 -457 89 55 -158 -29 151 44 -159 -35 -194 108 -101 104 -58 183 216 138 205 72 120 175
3191A75j42L0r1L65l73M4M6k36n1M39p8R9M9l23j08p5K68j40J25n2QQq8M6j6J84
$$ 175 33 63 -28 337 -36 8 54 -182 -233 206 128 227 276 -47 -155 -230 38 -102 23 -29 -21 -13 -101 -55 -71 113
3217A13K0m8Q3k40J35J8j47M01j22j32M4P6k04l2J4j6L75n30L15p4j73K43j44
$$ 113 133 85 168 -72 63 81 -66 335 213 81 125 201 -3 -35 -21 -37 338 -192 123 49 -124 119 -25
3240b5J86J17l35R1P9o3K5k25J5K40P4l53p7L48o2j4j39J43oJ18j95j72N83m29
$$ -25 161 278 -57 34 113 50 75 -150 -135 105 179 -174 -251 97 35 21 -118 25 19 137 -58 -230 353 -76
3264g6k81M90j58k9K11k07J34j29J39k35R8J55j02k11K96K2k30L25k71K65m6j65
$$ -76 -357 133 -25 -54 157 -50 84 -45 94 -141 -43 112 10 -201 95 117 -113 212 -59 206 160 -5
3286ePJ7K04j57k47R7K28j11j5j38N7J08q0j77J1N0J60j97J74j28K11p1K7K79
$$ -5 2 19 223 66 -181 -84 144 33 18 -120 -63 45 -35 -212 -201 -151 9 -188 -14 -142 69 -2 25 304
3310C04%l68M73n56K03k32M25m04L43k36r5J28K04Kk41j9r9M94l24j4R6l0Qj20
$$ 304 304 -64 409 -147 56 -176 249 -155 188 -48 -143 -15 189 191 -50 -69 -168 326 2 -12 84 54 62 -58
3334e8q1K89k84K16k95K57J44k58r2M8P6J94k02K96l43N5p8K44j53K29l58R6N3
$$ -58 -139 150 -134 82 -213 44 188 -70 -162 -114 -38 156 -46 250 -93 -38 -116 128 -25 204 -154 -58 -5
3357ej8J62m26K33J22R7p1j00j53K99J5p2J96k54l19N45l37j35K28j32J10q8r8
$$ -5 -23 139 -287 -54 68 165 94 -6 -159 140 155 83 279 25 -294 251 -86 -221 7 -125 -15 -103 -201
3380b01J64j61K25J85O3j53j68J15k01L35j48n6J64j08qM9j16J38p8k5k5j11J04
$$ -201 -37 -198 27 212 275 122 -46 69 -132 203 55 -1 163 55 47 96 -20 118 40 15 -10 -121 -17
3403a7K66k16K25k71L81k74k18L91m02M87k44j02J20j11J50k20j48%J21J28K10
$$ -17 249 33 258 -13 368 94 -124 267 -135 352 108 6 126 15 165 -55 -203 -203 -82 46 256
3424B56l82O9l9J51K21l15m7K73P1k58j94nO3n6L33p3l2M0J46k05p2l9J89J15
$$ 256 -126 -57 -96 55 276 -39 -86 187 258 0 -194 -199 -136 -192 141 68 36 76 222 17 -55 -94 95 210
3448B10J3j84q3J59j78j63J95J44k9J1k04O0l9j10K40j07o3J41L5K9k83M7L65
$$ 210 223 39 -44 115 -63 -226 -31 113 84 95 -109 -49 -88 -198 42 -65 -128 13 48 77 -206 -159 206
3471B06k63j90M53l16J22j06P6K87j36k72K00J4r9j92R2j15J22K25q2P7M4o3q
$$ 206 -57 -247 206 -110 12 -94 -18 269 133 -139 61 75 -24 -216 -124 -239 -117 108 26 103 147 84 76
3494G6qK56k52N7rk79J28n8m9K01k30J39j68J02M08o32K34J75J38l22lP7m7K07
$$ 76 68 324 72 129 120 -159 -31 -89 -138 63 -167 -28 -196 -94 314 -318 -84 91 229 -93 -96 -19 -66 141
3518A41j76j04K05j68OL10k64j1p2P1K28j61m6M1Q2k31j09M70n20L08j53K48K2
$$ 141 -35 -139 66 -102 -96 214 -50 -61 -133 -62 166 5 -41 0 82 -149 -258 212 -308 0 -153 95 117
3541A17k86K08K3j77N0j02J45J04j13R9k65K07J79n5K2m22J15j2M00j42l42K12
$$ 117 -169 39 62 -115 -65 -167 -22 82 -31 68 -197 10 189 134 156 -266 -151 -163 237 95 -247 -35
3563c5j33M11l84m2R6L10k13M6K5O5n4j06J59k79L20k85r1K13P6Kl77L79Q8o7
$$ -35 -168 243 -141 -183 -87 223 10 56 81 146 92 -14 145 -134 186 -99 -190 23 99 101 -276 103 191 124
3587A24j03Q2n22K99l8R6l7J02k50J98J26o7j8J29k50j2M11n10L91l40J52J28
$$ 124 21 103 -419 -120 -158 -62 -99 3 -247 -49 77 10 -8 121 -129 -141 270 -240 151 -189 -37 91
3609I1L8N1r0j87k2j74P3N13j66l2k08j8K29J76k49J16l0R3k67k9N8J1j97K02
$$ 91 129 180 90 -97 -119 -293 -220 293 127 95 -113 -131 98 274 25 141 111 204 -63 -92 -34 -23 -220 -18
3633a8O4%j78N3k0Lj68J04J72j21K2K09k26J33K9j39j26M28K3l10K30m7j89l3
$$ -18 46 46 -132 -79 -99 -96 -264 -160 12 -109 -87 122 -104 29 58 -81 -207 221 244 -66 164 117 -72 -105
3657a05O8j79K31N6J4n3K24k69j09J27RJ70j37j48K38k29M1m9R3j09J67R1j60
$$ -105 -37 -216 15 71 85 32 256 -13 -122 5 14 184 47 -101 137 -92 -51 -100 -7 -116 51 142 -18
3680a8j24J41QJ8j1j15K23K6l30K69l26M85n6j54Q5o0l67K83J85j58K15k01j3
$$ -18 -142 -1 7 25 14 -101 122 148 -182 87 -239 246 190 36 121 61 -306 -23 162 4 219 18 5
3703EK20K3k30j10j8j99J52R0R4P2o1k30M5K71l26J47J35j26L54k3n77K98K4j30
$$ 5 225 248 18 -92 -110 -309 -157 -67 27 99 38 -192 -147 124 -202 -55 80 -46 308 285 -292 6 30 -100
3727a00K42j35K49j58j06K79j27j60j01J68O4r3j67M25o5m25O3M9K59j20k23K80
$$ -100 142 7 256 98 -8 271 144 -16 -117 51 115 22 -145 280 215 -210 -147 -98 161 41 -182 98
3749I8K6j82j26Q9R1K1j43J91j20m2K14k68K18l95K18p5M56j20k40K07j79J39
$$ 98 124 -58 -184 -95 -4 17 -126 65 -55 -97 117 -151 67 -328 -110 -185 271 151 -89 118 -61 78
3771G8n30M83L0m5p0r7J53J65mk89J77k19K29k99L99Nr4M8j50j51L68j16Q9P6
$$ 78 -452 31 61 16 -54 -151 2 167 163 -126 51 -168 61 -238 161 166 72 120 -30 -181 187 71 160 236
3795B36m14N6M2J10k74K20P8L5j78m1J34l2j38l6J03j01N8j4J59n2j08J67J0L5
$$ 236 -178 -122 -80 30 -244 -24 54 89 -89 -130 4 -28 -166 -202 -99 -200 -142 -156 3 -49 -157 10 20 55
3819E5mJ49k3k83o1O8J40J31j03j12K61k87P5j51J64P5j22k09K60r4J31r4r7J45
$$ 55 51 200 177 -106 -167 -99 41 172 69 -43 218 -69 6 -145 19 94 -28 -237 23 -71 60 -34 -131 14
3843A4m1K5J72l79M9Q4k25J57L04k88Pn6J31j35L58k36J38j76L54k03k25J27j6
$$ 14 -27 -2 170 -209 -160 -76 -301 -144 160 -128 -121 -177 -46 -181 177 -59 79 -97 257 54 -171 -44 -60
3866f0L2NR8l2O5n7K7J13l72J42PK25p7j66l5L03l36M46k04k91J63m7J16N6j25
$$ -60 -28 -23 75 43 108 51 78 191 -181 -39 -32 193 116 -50 -85 218 -118 328 124 -167 -4 -51 65 121 -4
3891dK8K7r2j88K95k09M46l12O4j29J51J04l2j85j01L58l28K15j15O3j40R2r9
$$ -4 24 51 -41 -229 66 -143 303 -9 55 -74 77 181 149 -36 -137 221 -107 108 -7 56 -84 8 -91
3914i1O2j8J20l00K84j02r8J75j44L05k80o0K66k29J15O6Qj49J3p1J94k14K00
$$ -91 -29 -47 73 -227 57 -45 -143 32 -112 193 -87 -147 119 -110 5 71 79 -70 -57 -128 66 -148 52
3937E2j37l8K20k18K96j89L48l45O5m9Q8k55K36k54L17k95K35r1j14J79k12L7
$$ 52 -85 -123 97 -121 175 -14 334 -11 54 5 93 -162 74 -180 137 -158 77 -14 -128 51 -161 -124
3959a24j65J42p5L46q4L02k20R0j28J43l91j20M40n65M84K2l83K26K55l59L64
$$ -124 -289 -147 -222 124 40 342 122 212 84 227 -164 -284 156 -409 75 97 -286 -60 195 -164 200
3980B00k02m6R5r0j13J26Q3lj44K50J31m32O9O5n5o5M37k73j3J7j92J23l1J02
$$ 200 -2 -48 47 -43 -156 -30 53 50 -94 156 287 -145 -76 -11 -66 -131 306 33 20 37 -155 -32 -63 39
4004C9k23L38n9m3j67j64N41m64J52m9K3l8K03Nk10L99n19N97l4m38K4N1m3J14
$$ 39 -184 154 95 52 -115 -279 262 -202 -50 -99 -76 -114 89 94 -116 283 -236 361 327 -111 -87 -36 -79 35
4028C5j03K14j70QN6j4K3r7j51K20K40k87q5J42J42N1j16k4N9J18m95K20j59J68
$$ 35 -68 146 -24 -16 40 26 49 -48 -199 21 261 -26 -111 31 173 224 108 84 143 261 -234 -14 -173 -5
4052ej67R1N8j1o5J44r9K20k08K6n2J24K05l31J80N3p6k33J64O6J27j20j2R4j2
$$ -5 -172 -81 -23 -34 -99 45 -54 166 -42 -16 -68 56 261 -70 110 163 87 -146 18 84 211 91 79 173 161
4077A61nk44J60ol6l28L52p1j48Q0J01O9j06j69L57k33O4M4o2K25m24L05k81L8
$$ 161 156 -88 72 66 30 -298 54 -17 -165 -85 16 85 -21 -190 167 -66 -2 42 -20 205 -219 86 -195 -157
4101a57K15qL0P4k33K07m75K26K25j62J95j78J57Lk63J31M5R3j08K3K48m36K36
$$ -157 58 50 80 154 -79 128 -347 -121 104 -58 137 -41 116 119 -144 -13 32 125 17 40 288 -148 88
4124H8m4q2k4J37l0J90j60l0m6j33J28Pk29L11k83l2J88k06K74o4K7k75K80O1
$$ 88 44 -38 -62 75 45 235 75 45 -1 -134 -6 1 -228 83 -200 -232 -44 -250 24 -40 -13 -288 -8 53
4148E3j4j18K1R6O3m1j02P4j66Q6L16m43J46R5P8k12qM00k81J64l82L00k93j8
$$ 53 39 -79 -58 38 101 60 -42 32 -134 -48 268 -175 -29 66 144 -68 -76 324 43 207 -175 125 -168 -186
4172a86N4M3n3L68k12j8J55k33J99k9K2k49L38j81m2Q6j77L1M3j49K58k80J90
$$ -186 -132 -89 -142 226 14 -4 151 -82 117 88 110 -139 199 18 -24 62 -115 -84 -41 -190 68 -212 -22
4195b2Q0n9o6j24Q3k3J55j59J85K8l23M02j56k4N4n1J2O7L1K11l53n7J10Mq5Q4
$$ -22 58 -1 -67 -191 -108 -131 24 -135 50 78 -245 157 1 -23 31 -20 -8 59 90 301 -52 -109 1 5 -80 4
4221DN4m9j30R4N3j52K67j46j04J5K33j52k1r8L24Kl61K00n6l7n3J13k3k9r0N3
$$ 4 58 9 -121 -27 26 -126 141 -5 -109 -94 139 -13 -34 -132 192 194 -167 33 -23 -60 -113 0 -23 -52 -142 -89
4247h9q3K27l25L06n3j24K20k70K09k05K75j52jJ82m3n7P9j18L5R3j53m7J17j91
$$ -89 -172 55 -270 36 -17 -141 79 -191 18 -187 88 -64 -65 117 74 17 96 -22 13 106 -47 -94 23 -168
4271a68K96k69O4p0QJ71k06J85l6o1j49K53L0M2K98m82J21k20L94k9P3q7j68K2
$$ -168 128 -141 -77 -147 -139 32 -174 11 -25 -86 -235 18 48 90 388 -94 27 -193 201 172 245 158 -10 12
4295A2L9j39Q3k70K27j32L40k00J8J77j17Lk13R7N2K66l84m1J65m3J06M1l84J56
$$ 12 51 -88 -5 -275 -48 -180 160 -40 -22 155 38 41 -172 -75 -23 243 -141 -182 -17 -60 46 87 -297 -141
4319a41J67N7l4j21m2K09o6j01nK5j1rm4K54k54L38l76L5J66k58K12O0P8j92L09
$$ -141 26 83 49 -72 -114 95 29 -72 -77 -52 -63 -72 -116 138 -116 222 -154 -119 47 -211 1 61 139 -53 256
4344B56J7j43j29p0J26J70l14O6j13K74l27l1mJ06L52j96K5nk53M52m13L47j77
$$ 256 273 130 1 -69 57 227 -87 -21 -134 140 -187 -218 -222 -116 236 40 65 60 -193 259 -154 193 16
4367A6o0J74%r6J84l55J31p9K16j75PJ37k99K75j5J08n6Q6j46l96L09J29k62M07
$$ 16 -44 130 130 34 218 -137 -6 -85 131 -44 -37 100 -199 76 61 169 113 199 53 -343 -34 95 -167 240
4391B40l53J02J02o5j30M36m01J16J4m0J09q8K91l29J64J71k48k74O8j1L3J55
$$ 240 -113 -11 91 26 -104 332 -69 47 61 21 130 42 333 4 168 339 91 -183 -115 -126 -93 62
4413F2o1j05K09O5j40q1q6L16j08j09n4L35k90M4J10j01qL9N0j83L26n56L53N4
$$ 62 1 -104 105 170 30 -51 -137 179 71 -38 -92 243 -47 -3 107 6 -2 37 87 -96 230 -326 27 81
4437H1j89N2K66k11q2K68j54k49J82k84L69J73j09j30K00k01j04M1N7K6k05K14
$$ 81 -108 -56 210 -1 -83 185 31 -218 -36 -320 49 222 113 -17 183 -18 -122 -81 -24 2 -203 11
4459A1k28Q7M6K23l18J57J6p2J80k64K3K43J6R8k08NR7k38k6n0L40j43q5N6J49
$$ 11 -217 -130 -84 139 -179 -22 -6 -78 102 -162 -139 104 120 218 10 15 112 -126 -152 -202 138 -5 -90 -34 115
4484A15r1j59J11J76p6M5k2j42Q8k51O6j37M98k63l1o5L0L49k37m3J25k78K46
$$ 115 24 -135 -24 152 76 121 99 -43 45 -206 -140 -277 221 -42 -73 -138 -108 241 4 -39 86 -192 54
4507E4n32N87J3J65l80M1N1m7r4J16J73l6j85J78l6j13P0O6J77j71j55K29k91
$$ 54 -478 109 122 287 -93 -52 -1 -48 -142 -26 147 111 -74 104 68 -45 25 91 268 97 -58 171 -120
4530a20K12k35O9K92k90j2L9j31M70k11j03j4kj40K2K34j1j28n5P3L1J93k79Q7
$$ -120 92 -143 -74 218 -72 -84 -45 -176 294 83 -20 -34 -36 -176 -154 80 69 -59 -114 -41 -10 183 -96 -9
4554ij7L6j97PJ6J07J56R3j84l7j78L68Ln6P4k02m6J70m3l08K30l4M5K29r4l9
$$ -9 -26 10 -187 -180 -164 -57 99 192 8 -29 -207 161 164 108 182 -20 -66 104 61 -247 -17 -51 -6 223 129 90
4580I0j08j40J99n1k17J28j07K05Q4jj95J43j85L38l29j04J63M8L0J25j25k5J5
$$ 90 -18 -158 41 -10 -227 -99 -206 -1 83 82 -113 30 -155 183 -146 -250 -87 -39 -9 116 -9 -34 -19
4603a9q9m3K70q9k3L9o0m7k1J42J44j19j78J55Oj37P5J00l78J47K03m2j96K55
$$ -19 -108 -151 119 30 7 46 -14 -61 -82 60 204 85 -93 62 68 -69 6 106 -272 -125 78 36 -160 95
4627I5k34K22j03mk09J54n4L18k9j41j14J53q5J04j14R1K07L5l66j6J1L01j77
$$ 95 -139 83 -20 -24 -233 -79 -133 185 156 15 -99 54 -31 73 -41 50 257 292 -74 -90 -79 222 45
4650D5j37j38L07q4l2J29k23K63l23J95m4O8j20N4J42P9j62j23J43q6J59k86J46
$$ 45 -92 -230 77 -7 -39 90 -133 130 -193 2 -42 26 -94 -40 102 181 19 -104 39 -47 112 -174 -28
4673b8p9J74K05k46j76J75J18j46j3p0J64j63J82K5k24j39K84k3K1p7L34l67J24
$$ -28 -107 67 272 26 -150 25 143 -3 -16 -86 78 -85 97 122 -102 -241 43 20 41 -36 298 -69 55
4696E5M76n49K23j79p6K04l48N40j09j67P9n12K25J57k33K82N8Q9m75J76J86k74
$$ 55 531 -18 205 26 -50 154 -194 346 237 70 149 -363 -138 19 -214 68 126 215 -260 -84 102 -172
4718a72K30l56L34o6KJ49j58k66K85p4K74j52l4J84ok14j31P7J45N7mk49L56k81
$$ -172 58 -298 36 -30 -28 121 -37 -303 -18 -92 182 30 -4 180 174 -40 -171 -94 51 108 104 -145 211 -70
4742g0q4J16j58K26R3j3j60J19p5k93j2N2K93K7N1Jj17N6k86N84j78j94J03M5
$$ -70 -154 -38 -196 30 123 110 -50 69 -6 -299 -311 -259 34 61 112 113 -4 52 -234 350 172 -22 81 126
4766A26m51N20r4j54J91j30J52k17N0L5J2j10J7J80k91J33K9P5o1K34k79k8R9
$$ 126 -325 195 101 -53 138 8 160 -57 -7 28 40 -70 -53 127 -164 -31 -2 73 12 246 -33 -61 38
4789C8kJ28m17M95l13L2J81j13j19L27j67j64K8p8J11J58n2L8R2m7o4k64K28k21
$$ 38 36 164 -253 242 -71 -39 142 29 -90 237 70 -94 -66 -144 -33 125 73 111 203 156 92 -172 56 -165
4813a65Q3O8K12j46n8J38k40M0j28L65m58K98j44K34j12p2L1R9p3J72j30J9j57
$$ -165 -82 -14 198 52 -6 132 -108 -68 -196 169 -289 9 -135 99 -13 -85 -54 45 -28 144 14 33 -124
4836a24N3J48l34M36m86j39M97RL1R2l8j86J6J8Q3j05K12l53L30p3J06m9nr6M
$$ -124 -71 77 -257 179 -307 -446 51 60 91 183 145 -41 -25 -7 76 -29 183 -170 160 87 193 144 139 43 47
4861D7j75n8L22K07m43m6J18p9K59m45K98r2Pj13K37N6j91L09j33l12L23j3j07
$$ 47 -128 -186 136 343 -100 -146 -28 -107 152 -293 5 -87 -80 -193 44 100 -91 218 85 -227 96 83 -24
4884b4Q5j16r6K51k30J80l06K67j20R7o8P0K37n23L36k91J09L39k21R0O9M4j49
$$ -24 61 -55 -151 100 -130 50 -256 11 -109 -12 -80 -10 227 -296 40 -251 -142 197 -24 66 135 179 30
4907C0N1k22N0J38q5K62m25Q0l7K85j66O9k02K65m3k48J66J54k23J68P3j81K37
$$ 30 81 -141 -91 47 -38 224 -201 -121 -158 127 -39 30 -172 93 50 -198 -32 122 -101 67 140 -41 196
4930A96k5j66M2j17K26k26K31k25K31l85K88J89j41l6r8o9q7M3J12p0Q8r1K22
$$ 196 171 5 47 -70 156 -70 161 -64 167 -218 70 259 118 82 -16 -85 -172 -129 -17 -87 1 -90 132
4953A32j80K07r4j06l7J81J76q2j42k10o3L57j71J46k81P6J32j9o3j41K32L6j66
$$ 132 -48 159 65 -41 -78 103 279 197 55 -155 -218 139 -32 114 -167 -91 41 22 -41 -182 50 86 -80
4976h0q7k6%M00j57Q8k42L7K82k00l5rP0J66k85J4J53k34K69k12R6p4k8K04j49
$$ -80 -167 -193 -193 207 50 138 -104 -67 215 15 -20 -29 41 207 -78 -64 89 -145 124 -88 8 -66 -94 110 -39
5001c9J20P4k19J25K94k99j62j66N97k58K19m11j5K59j73K21R4L5j40k17j04J47
$$ -39 81 155 -64 61 355 56 -106 -272 325 67 286 -125 -140 119 -54 167 261 296 156 -61 -165 -18
5023a8J33K2j61j32J14J78l40J95mJ72l01L47n7k08J57q1K7K61m18J59L4k73K08
$$ -18 115 137 -24 -156 -42 136 -204 -9 -13 159 -142 205 148 -60 97 16 43 304 -114 45 79 -194 14
5046A4j40J27r9j03K36o4R7n2o9L54j21K3m76M26J24n57K62j18Q3q0K87l54L27
$$ 14 -126 1 -98 -201 35 -29 68 16 -53 301 180 203 -273 153 277 -280 -18 -136 -53 -133 154 -200 127
5069A27k01K55m81L16l7K0M33m81o1K3J82o5Nm5L9J45M0j91N7M3o9k8q7J60o16
$$ 127 -74 181 -300 16 -21 -1 432 -49 -110 -87 95 30 35 -10 29 174 214 23 80 123 54 26 -61 99 -517
5094e17K14N75k27j23M70l07J07j38k15K50j52J74k67J69j91K3j87L56l3p3l7
$$ -517 -303 272 45 -78 392 85 192 54 -161 89 -63 111 -156 13 -178 -155 -342 14 -19 -92 -129
5115a29K10P3k88J37Or8J99j35M0P2J93k46j9O7j0m2l1j7K56n46O20l99O4l7J53
$$ -129 81 154 -134 3 9 -89 110 -25 15 87 280 34 15 82 72 30 -1 -18 238 -308 312 -87 -23 -60 93
5140I3J39j31l02J26o1K6m1k02J49K95k23J54k62M83j73JlLK10k52j9M8j90ON3
$$ 93 232 101 -201 -75 -136 -110 -151 -353 -204 91 -132 22 -240 243 70 71 68 71 281 29 10 58 -132 -126 -73
5165g3K36j89kJ15m2j53P2J99l41j7L08j34P4K86l43J24Rq7P6J10nk84k51L18
$$ -73 163 -26 -28 87 45 -108 -36 163 -178 -195 113 -21 53 339 -4 120 129 42 118 228 223 -61 -312 6
5189FJ52kk60N7nj23K36k42J86J62R0r7P9l13J54j60N6j08J86j34L2L09n80K88
$$ 6 158 156 -104 -47 -52 -175 61 -181 5 167 257 160 239 -74 80 -80 -24 -132 54 -80 -48 261 -319 -31
5213c1K15l38J82J47j2k85J84o4J19j87K24r4l58L20k67M60k98J21j90J85j75
$$ -31 184 -154 28 175 163 -122 62 -2 117 -70 154 60 -298 22 -245 215 -83 38 -152 33 -142
5234a42m3L09q4j85K06K14l07L30k06m57M21p5J62J1l8n8l7L2J6l49P09k63j76
$$ -142 -185 124 40 -145 61 275 -32 298 92 -365 56 -19 143 154 116 58 21 53 69 -280 429 166 -10
5257a0l9q0k1J45l4J36K37l52j09k2J48J55j42k59N1J04m5K61j10J24JL3o6J46
$$ -10 -49 -129 -150 -5 -39 97 334 -18 -127 -149 -1 154 12 -247 -196 -92 -137 124 14 138 139 172 106 252
5281B52m19J97l15L35j50q4L56k27K7J8o8J71o8N1j33R1k23M24l48N3R9lJ97k99
$$ 252 -167 30 -285 50 -100 -184 172 -55 -28 -10 -78 93 25 76 -57 34 -189 235 -113 -60 39 36 233 -66
5305f6%p7L80r1j18J71m25J32K64k64J6K03k59K46k09K02m4l12L23l37M41l20
$$ -66 -66 -143 237 146 28 199 -226 -94 170 -94 -78 125 -134 112 -97 105 61 -251 72 -265 176 -144
5327a44J64%j17j91J77r3M56j97P8l7k39J47J35p6j22k5KJ26K9Lj33K21j86r1
$$ -144 20 20 -97 -288 -111 -204 252 55 133 96 -143 4 139 63 -59 -84 -82 44 73 76 -57 164 -22 -113
5351a13L59k68K12m60K54r4o2K14q1J58l52K86Q7j58R0O2k66K93k98K52r1J60
$$ -113 246 -22 190 -270 -16 -110 -172 42 -39 119 -233 53 140 -18 72 134 -132 161 -137 115 24 184
5373A84k44j08K28q5m1nmN0L0J75k31K8K65k63Q1r8MJ10L0j65J37N3j32j18m0
$$ 184 -60 -168 60 -25 -66 -71 -75 -25 5 180 -51 -23 242 -21 60 -38 -34 76 106 -59 78 131 -1 -119 -159
5398a59p9K31Q8k90K94k03O3J28j98K54j39j37K99k06k6R9J27l59k8N1j3O6L36
$$ -159 -238 -7 81 -209 85 -118 -55 73 -125 129 -10 -147 152 -54 -80 19 146 -213 -241 -190 -203 -137 199
5421A99j46o2j02Oj39Q4K79K5l6Q5l79J85q5R3P7K7o0o3njq0K30Mpk47m7O08k42
$$ 199 53 -9 -111 -105 -244 -160 119 144 108 193 -186 -1 -86 7 84 111 51 -12 -17 -18 -98 132 136 129 -118 -165 443 201
5449B01j16q5M13l41L15n26K89l7j63LJ04j13L7J82M0j22k70J21l4Q3J15J05q2
$$ 201 85 0 413 72 387 -139 150 113 -50 -47 57 -56 -19 163 203 81 -189 -68 -102 -19 96 201 119
5472A19n5J66P6l85p1M07q5qk65k74O62m23L9J73r6r3N1K5O3M8l3l1J66j51j54
$$ 119 64 230 306 -79 -150 257 172 164 -101 -375 287 -136 -97 76 -20 -113 -62 -37 26 74 41 10 176 25 -129
5497a29J77J07j65k4K72m88K97l6o6J2J8R9l1J38m38L72R1j69lP8q6Q5j85j17
$$ -129 48 155 -10 -34 238 -250 47 11 -55 -43 -25 74 43 181 -257 115 206 37 34 112 26 111 -74 -191
5521a91J64j27L62k57K00J97j80P3j02m42L92j76j11N22m39K65k26K06o1QJ41
$$ -191 -27 -154 208 -49 151 348 168 241 139 -303 89 -87 -198 324 -115 150 -76 130 69 77 218
5542B18j7o0q5M9l68J86J19j38J17P2l31J43k3j28J85J02J86k31J8oJ11P2r1q1
$$ 218 201 141 56 105 -263 -77 42 -96 21 93 -238 -95 -118 -246 -61 41 227 -4 14 8 119 191 100 19
5566A9jK36r4j43m5L40l49J04k03J86n63M52J17j14K5J62j76Q5k55N6R1K86k08
$$ 19 18 254 160 17 -28 312 -37 67 -136 50 -513 -61 56 -58 -33 129 -47 38 -217 -161 -70 216 8
5589HM8j99l8J96J99k40k06K92R6O3j72J98n9k05j00K61P7K4j15R5o5l21J17J31
$$ 8 56 -143 -181 15 214 -26 -232 60 156 219 47 245 186 -19 -119 142 219 243 128 223 158 -163 -46 85
5613H5j87K20j2k1j43q8J55J22k18J0q8J64j8q3J47j96J92Q8o7j03J01K5J04j98
$$ 85 -102 118 106 85 -58 -146 9 131 -87 -77 -165 -1 -19 -102 45 -151 41 129 62 -41 60 85 189 -9
5637ij98J36J70l6j98K61J05n34K48LK05M6l81M21k14J39kK1k58L22l50K70k4
$$ -9 -207 -71 99 63 -135 126 231 -303 -55 -52 153 199 -182 239 25 164 162 183 -75 247 -103 167 143
5660A43l53J39K4J63q5n0J0j37K64j3R4m36j53M81j58PL16j28k49R1R2j56J86
$$ 143 -210 -71 -47 116 31 -19 -9 -146 118 105 199 -237 -390 91 -67 -60 256 128 -121 -30 62 -94 92
5683I2l9n6K66o8l26K71j23J03l63J64j9R5j63K15O6l7j17K79O6l09J06m7P1r8
$$ 92 53 -3 263 195 -131 140 17 120 -243 -79 -98 -3 -166 49 115 78 -39 240 306 -3 103 56 127 29
5707B9N6p3J46k21r9L60K3k07J67j0k22J25n0p6P2k35K09m5j47J17R3J58j00J11
$$ 29 85 12 158 -63 -162 198 221 14 181 171 -51 74 24 -52 20 -215 -6 -51 -198 -81 12 170 70 181
5731A81J06p8j66K9Q2n5j27j18J28j73K85l02L13l92l2K02J40k73K53j3J12k65
$$ 181 287 209 43 72 154 99 -28 -146 -18 -191 94 -208 105 -287 -319 -117 23 -250 3 -10 102 -163
5753a63J79j44K51o5k15J92K01l52n4J09KJ30Rn7k32L99j46K0l77K90k2p5P8J30
$$ -163 16 -128 123 58 -157 35 236 -116 -170 -61 -59 71 80 23 -209 190 44 64 -313 -23 -45 -120 -42 88
5777H8j0k64R4K02p7J7k36J20K4J65r0N1l12L03O5j34J56k14l3J4J80o1J6l8o2
$$ 88 78 -186 -92 110 33 50 -186 -66 -42 123 33 84 -228 75 140 6 162 -52 -85 -71 109 48 64 26 -36
5802c6P0Q0m1j03Lj27J07l2O8k3J67J1l16K05j63O3J63j38L03k84l3P4O4k15K47
$$ -36 34 114 73 -30 -27 -154 -47 -79 -11 -34 133 144 -172 33 -130 -67 96 -42 261 -23 -56 18 82 -133 114
5827A14oj54Q2rOo9k5j78P6J91k29P1K29l00j49M28j57Q0P1M4k14K19n7P3j71
$$ 114 108 -46 36 27 33 -36 -61 -239 -163 28 -201 -130 99 -201 -350 78 -79 1 72 116 -98 121 64 137 -34
5852c4O7Qq1K35j68j75J55j26J04N5P8J05l26K13j63O3o6L01k06J82l37J10j36
$$ -34 33 41 -40 195 27 -148 7 -119 -15 40 118 223 -103 110 -53 10 -56 245 39 221 -116 -6 -142
5875a42m9L02L8j04K5l9r7P9k13K47m5p5K7J73q9j42J87OK9J0k87L94r0j56J81
$$ -142 -191 111 149 45 70 31 -66 13 -200 47 2 -73 -46 127 38 -104 83 89 118 128 -159 235 145 -11 170
5900A70j98j73O8R7J49l6j73P1O8n0j42M8P0J35j00M86l69k54J40j16J14K22k91
$$ 170 -28 -201 -133 -36 113 77 -96 -25 43 -7 -149 -101 -31 104 4 490 121 -133 7 -109 5 227 -64
5923f4J62l70K26N04m50m5j27l3L20k22L18l63K52j12N5j8q5J63J17k41j58l9
$$ -64 98 -272 -46 458 8 -37 -164 -197 123 -99 219 -144 108 -4 51 33 -52 111 228 -13 -171 -210
5945b10J64J32O8j33j8Rj68L9n8K72j17Q3n8j95J39J1o1K35j62K81j79j25j2K07
$$ -210 -46 86 154 21 3 12 -156 -117 -175 97 -20 63 5 -190 -51 -40 -101 134 -28 253 74 -51 -63 144
5969A44j15N1l24L22l4j07J62k55K44j32L52l10o3R7R1j35K50l51L96j45l39j63
$$ 144 29 80 -244 78 44 -63 99 -156 88 -44 308 -2 -65 32 123 -12 238 -113 283 138 -201 -364
5991c64O15l92L73l07L63l96j93L98q2J89m85M46j04n4J04nN6r0J14k93K72j36
$$ -364 251 -141 232 -75 288 -108 -301 97 15 204 -281 165 61 7 111 106 162 72 186 -107 165 29
6013B9J37j74j24l4N7L0K29j02m1m1j99J49r2K54K02j89m20J19J46N8m0j28J44
$$ 29 166 -8 -132 -166 -109 -79 150 48 7 -34 -233 -84 -176 78 280 91 -329 -210 -64 -6 -46 -174 -30
6036c0k81L34K37k20kJ24k11n0K12l41L45k85J49j01Q1P6K78n19K56j68J74N3
$$ -30 -311 23 260 40 38 162 -49 -99 113 -228 117 -168 -19 -120 -39 37 315 -204 52 -116 58 111
6058A11k92j3K1J50j9q4j35J97L3j6J5J29l2l7K9p1J26RN8k74L8j78M10l18J20
$$ 111 -181 -194 -173 -23 -42 -126 -261 -64 -31 -47 -32 97 65 28 57 -14 112 121 179 -95 -57 -235 175 -143 -23
6083b3qo8J08P1J8j32K0J06o8qK9l16K40k81K17J05m4P1R8kJ20j76q8J75l5Rq1
$$ -23 -31 -99 9 80 98 -34 -14 92 24 16 45 -271 -31 -312 -95 10 -34 37 135 133 253 77 -11 164 129 138 57
6110E7j19O2J53l05K32k53j53L31P0j63k1K57k56k2J4R3K62j20p8P6J5j18j65
$$ 57 -62 0 153 -152 80 -173 -326 5 75 -88 -109 148 -108 -130 -116 -23 239 119 41 117 132 14 -151
6133a51K36n1K56l92P0NL01k39J09k73M07q1l4q7J2o4j55J56j10p3L15l41j7J36
$$ -151 85 34 290 -102 -32 -27 274 35 144 -129 278 197 163 76 88 24 -131 25 -85 -158 157 -184 -201 -65
6157f5Q2R5O5m17L95j38J5R9k32Q3r3M05l64J7j45L84j40Rl3L0k5j46k2j18J86
$$ -65 17 112 177 -240 155 17 32 131 -101 -18 -111 294 -70 -53 -198 186 46 55 22 52 27 -119 -141 -259 -73
6182g3K00j24k7K7R6k50N8q2O2O2j21K39j62J14n6J35j53jj13J48r1J02j68L62
$$ -73 127 3 -24 3 99 -151 -93 -175 -113 -51 -172 67 -95 19 -37 98 -55 -56 -169 -21 -112 -10 -178 184
6206A84j96m6j27K87J75n46M24j85m2L7n7M12k67j26j10Q8o5J82k1n9J62l34L49
$$ 184 -12 -58 -185 102 277 -269 155 -30 -72 -35 -92 320 53 -73 -183 -95 -160 22 1 -58 104 -230 119
6229A19k37L50j78j51j8K34r6K3K11m10M00j20P8j60R1k71J14l43L89m4O1q2n8
$$ 119 -118 232 54 -97 -115 119 23 46 257 -153 247 127 205 45 136 -135 -21 -364 25 -19 42 -40 -98
6252i8k7o3K81L9k06K26k0l31k8j00M28k01L40k0k99J29k28J68j73J82Ll44L46
$$ -98 -125 -188 93 132 -74 152 132 -199 -227 -327 101 -100 240 220 -79 50 -178 -10 -183 -1 2 -342 4
6275Dp7L3k06L38J14k83J59p3r4J00j63M93m76J19r7J57j18k98L19M4l8K62j84
$$ 4 -73 -40 -246 92 206 -77 82 9 -85 15 -148 345 -131 -12 -109 48 -70 -368 -49 -5 -43 219 35
6298C5k27J62mL1l07R5K87o2o8O2J08qk17n9K31M5l5n5l4j55K70k3j34J49J74
$$ 35 -192 -30 -34 -3 -310 -215 72 10 -58 4 112 104 -113 -172 59 104 69 14 -20 -175 95 72 -62 87 261
6323B61k19k32Qj29K51Qnq6L2L06K0j22J18k70N6O1j38Po4O1pj7K70m11L42n1
$$ 261 42 -190 -182 -311 -60 -52 -57 -143 -111 195 215 93 211 -59 -3 58 -80 -73 -137 -76 -83 -100 170 -241 101 50
6349E0k82J43J12J83l57J97P1Q5k10N0j20j58K77q9K48k40P8l74N2J93K74r4q7
$$ 50 -232 -89 23 206 -151 46 117 202 -8 42 -78 -236 41 -48 200 -40 38 -336 -284 -91 183 89 2
6372Br3Q2J66k63L10l08K13j00K22j40j41q3J72j09J00P2K26k91p6K9P1rj85K41
$$ 2 -91 -9 157 -106 204 -104 109 9 231 91 -50 -133 39 -70 30 102 328 37 -39 -10 61 52 -133 108
6396A08p5K94k56n9J6l28J52K30L2j66K60l0J16j69j45o7K49j27k76K96j6L13
$$ 108 33 327 71 12 28 -300 -148 82 114 -52 208 178 294 125 -20 -87 162 35 -241 55 39 352
6418C52l42j06J32p2l07M31m19M22k25K16n6K67j50k53J94M5j57l9Q2j24P5o2
$$ 352 10 -96 36 -36 -343 88 -331 91 -134 82 26 293 143 -110 84 129 -28 -67 15 -109 -34 -96
6440i6L86k66j37L1K02K8p1n5k46o7J05L88k94j74J61Q9rJ73l03K26p5n6K87r2
$$ -96 290 24 -113 -82 120 148 77 22 -224 -291 -186 202 -92 -266 -105 -16 -25 148 -155 71 -4 -60 227 135
6464A35K08m06J83p3k34j44O62k00k04q7K83k0r0L5J25k51R1n1O9J75k62K87j85
$$ 135 343 -63 120 47 -187 -331 331 131 -73 -160 123 103 13 48 173 -78 13 -38 31 206 -56 231 46
6487D6r7O3l6k3Q6j53J69j63K28l53L21J54m34L36R0j00j16J26m3m26L30k49K28
$$ 46 -51 12 -24 -47 39 -114 55 -108 120 -233 88 242 -192 144 234 134 18 144 101 -325 5 -244 -16
6510a6J48j44l41K16J56j69L29l09q6K17K30j58l10K03J60j32K13k22K7j44K14
$$ -16 132 -12 -353 -137 19 -150 179 -130 -216 1 231 73 -237 -34 126 -6 207 -15 12 -132 82
6531H2p0P5J61m49L42j98K59j09j39J36J5j79J09N9l07J15O9n5J17k9q0r4j1r
$$ 82 12 87 248 -201 141 -57 202 93 -46 90 105 -74 35 94 -213 -98 -29 -84 33 4 -76 -170 -181 -190
6555a90JK35j80K8M6k0O3J00j23m3N8J7Q0J31l0k24P4j33K33L4j39N1oo5LJ20
$$ -190 -189 46 -134 -106 -60 -80 -17 83 -40 -83 -25 -8 72 203 173 -51 23 -110 123 157 18 69 63 -2 1 121
6581A21N9rj19J18m18M74l31J07j03J46q4Q9j68J35J03k04K21J28k66o6K1j12
$$ 121 180 171 52 170 -248 226 -105 2 -101 45 -39 50 -118 17 120 -84 137 265 -1 -67 -46 -158
6603a58K21j1L2O2jk73l5M5K93q1j20M2L5j8R4o7q9r1K93j57n6J4l8m0O9o0L14
$$ -158 63 52 84 146 145 -128 -163 -118 175 94 -26 16 51 33 127 60 -29 -120 173 16 -40 -26 -64 -104 -35 -95 219
6630B19k48j42J41N9q0oM2Pq7K36r7j87L37l11K72j05K53j97j4l6j04L1L39k47
$$ 219 -29 -171 -30 29 -51 -57 -15 -8 -95 141 44 -143 194 -117 155 50 303 106 92 56 -48 -17 322 75
6654G5j15N7j64K26J34oj73M1q2J89k53J51j90J30J20J81j91K4k31L68k76l16
$$ 75 -40 17 -147 79 213 207 34 75 -7 182 -71 80 -110 20 140 321 130 154 -77 291 15 -301
6676c01J36J3L38l6j01r2Jm1L9J17K59n95J77J18j73L18l08J25j00L12k39M3L1
$$ -301 -165 -152 186 150 49 -43 -42 -83 -44 73 332 -263 -86 32 -141 177 -131 -6 -106 206 -33 10 41
6699D1j46R7M9j82k07L07K70j34j47k5K14l8k50K48q4J88j12j29P5K62m15K40
$$ 41 -105 -8 41 -141 -348 -41 229 95 -52 -77 137 99 -151 97 13 201 89 -40 35 297 -118 122
6721A22l2MK4k10L48m11l4lK01j19J85p6j22k13K58J42Lp1k42J90k39L67j13l2
$$ 122 90 94 118 -92 256 -155 -189 -192 9 -110 75 -1 -123 -336 -78 64 67 -4 -246 -56 -295 72 -41 -73
6745g3J07J85j34k83K33r6l4J22k2K5m9k10M08n47M89j07j51L57q6j63R8J2J9
$$ -73 34 219 85 -198 35 -61 -95 27 5 30 -19 -229 179 -368 121 14 -137 220 134 -29 69 81 100
6768A00lK0l10m2J34J82R6m53L20j1J29m9j66Q7p6k06L4J76QJ1j9r6N21k12l65
$$ 100 97 117 -193 -235 -101 81 177 -276 44 33 162 113 -53 34 -42 -248 -214 -38 -30 -19 -38 -134 387 175 -190
6793a90K47Q3m27N1Q5J64L2l14L41j31J55k51J77L1j0k1P6k99K38J43l06K94l
$$ -190 57 140 -287 -236 -151 13 45 -269 72 -59 96 -155 22 53 43 22 98 -201 37 180 -126 168 165
6816A65L0l23L85j04k32j18L60j61j92L16J89m56J97N4j03J52l77J65j11Q4J85
$$ 165 195 -128 257 153 -79 -197 163 2 -190 126 315 -141 56 110 7 159 -218 -53 -164 -80 105
6837A05j65K5P7J75L3m1j70j88o9L27k58K1K22j49L42m63K10j25L07k58p2J18
$$ 105 -60 -35 42 217 250 209 39 -149 -218 109 -149 -128 94 -55 287 -176 34 -91 216 -42 -114 4
6859Dk08K95j89J6K08k88M99j68k33J61K1j09K39j52m52L22P0k36K31q2l5K44
$$ 4 -204 91 -98 -82 126 -162 337 169 -64 97 118 9 248 96 -356 -34 36 -200 31 -51 -86 158
6881A58K5n4q1j17K17n9K37j08j98m6j74J63J38j95K0J2k50L86k3K02j20j81j32
$$ 158 183 129 48 -69 148 89 326 218 20 -26 -200 -37 101 -94 -74 -62 -312 74 51 253 133 -48 -180
6904a80J5K51R7m1k15J06J5P5l80L14j04J13N4q4j04R4k55K75J64m59K82k75L59
$$ -180 -165 86 183 142 -73 33 48 123 -257 57 -47 66 120 36 -68 26 -229 46 210 -249 33 -242 117
6927A17l5l4p5om6J16j69K00R0k71J19j19J94K0k03K11j95J6K97l57j38J34O6
$$ 117 82 48 -27 -33 -79 37 -132 68 158 -113 6 -113 81 101 -102 109 -86 -70 227 -130 -268 -134 -68
6950f8J65j30M1J7J80k12J84om1n6k21K48j56q0K32p0P6j91L03k26M9n5Q2NO5
$$ -68 97 -33 8 25 205 -7 177 171 130 74 -147 101 -55 -135 97 27 103 -88 215 -11 38 -17 65 70 135
6975A35j32J27k09m3K89m66L98P1k65k7L05m26K39q5j45L12m1k45K69o4K08l53
$$ 135 3 130 -79 -122 167 -299 99 170 -95 -122 183 -243 -4 -89 -234 78 37 -208 61 -3 205 -148
6997a48K31m5j35J18l2j14M5Q3L12k39j12J50j02o4J08j45J61j23J01j7K19j22
$$ -148 83 38 -97 21 -11 -125 -80 3 315 76 -36 114 12 -52 56 -89 72 -51 50 33 252 130
7019A30o4J16l92n5J06J42M9N4k3r2K5O7n6m8M7N2j65K52k60j16K9M80l48K26
$$ 130 66 182 -210 -265 -159 -17 32 86 63 -29 -4 63 7 -41 6 58 -107 145 -115 -231 -202 278 -70 156
7043A56J03j34l3j86J71m6j52M6K24j26m2P4R6n7j49R3j87J93q7pJ29j26Q0J25
$$ 156 259 125 92 -94 77 31 -121 -75 149 23 -19 55 151 94 -55 38 -149 44 -43 -50 79 -47 33 158
7067A58k70O0N9J7Nk1l53K67J44q0j01o6P9K66l4l04M85k97l32K91L8k26j83L95
$$ 158 -112 -52 7 24 29 8 -345 -78 66 -14 -115 -181 -102 164 130 -174 311 14 -318 -27 11 -215 -398 -3
7091cm8Rl1J94j55j55L58j44k3L13l46J43q7k9J01o7p7k39N35k76L9M2nM7n7k36
$$ -3 -51 -42 -73 121 -34 -189 169 25 2 315 -31 112 25 -4 97 30 -47 -286 249 -27 12 54 49 96 39 -197
7117a97l3O4K44K94n45J02l9oJ33j86L43o2K5q4M39n59P1j35J90q4j8J58j39k
$$ -197 -230 -166 78 372 -173 -71 -110 -116 17 -169 174 112 137 53 492 -67 4 -131 59 -25 -43 115 -24 -26
7141b6L37j44k31j03J55n9r9J80j15J11Lj85N4K3O8N4J43j0j50j37l6N45k77p0
$$ -26 311 167 -64 -167 -12 -71 -170 10 -105 6 9 -176 -122 -99 -31 23 166 156 6 -131 -167 378 101 31
7165C1j73K77o8k9JJ87J1k60j36k1M68m31J06j98J54J23m4m4R4O8o7j99n9K77
$$ 31 -142 135 67 38 39 226 237 -23 -159 -180 288 -143 -37 -235 -81 42 -2 -46 48 116 49 -150 -209 68
7189F8J1j06j34K06P9J4j60J21J20j49j07m6P7j34R4J04k65M8J72p7N0k17M2J91
$$ 68 79 -27 -161 45 124 138 -22 99 219 70 -37 -83 -6 -140 -46 58 -207 -159 13 -64 -14 -231 -189 2
7213BJ04l32J78Q2J77k26J27R3l81K91j35K13k51L37k54q6K18k01J87j97J75k43
$$ 2 106 -226 -48 34 211 -15 112 205 -176 115 -20 193 -58 279 25 -61 157 -44 143 -54 121 -122
7235a22K58q1l11L80J4l8j73p6L06j48J3Kk08J15rK00k7j4J74k20o0m7J80l6P9
$$ -122 136 55 -256 124 138 100 -73 -149 157 9 22 24 -184 -69 -78 122 95 81 255 35 -25 -72 108 72 151
7260A51j27l8r1n1L40l53%M16j38o3j18l3J9O5r0J97K8l37Q1K62Q1r3k42L72k24
$$ 151 24 -14 -105 -156 184 -169 -169 247 109 46 -72 -105 -86 -21 -111 86 114 -223 -142 120 201 108 -134 238 14
7285A4R1l34L82p7O5j18k6J5K71l10R8J36n05L53l1o7J36j19K91j11j2o3o0J61
$$ 14 105 -229 153 76 141 23 -3 12 283 -27 71 207 -298 55 24 -43 93 -26 265 154 142 79 19 180
7309A80j72J88j77n4J28k24qPK51r8K03K6l88RJ90k72K16k6j59L47k43K8k61J99
$$ 180 8 196 19 -35 93 -131 -139 -132 119 21 224 250 -138 -129 61 -211 5 -21 -180 167 -76 -48 -309 -110
7333a10j72J59r3K92j87J62k45N8r5J09Qj6N4J61j9r5L06l39N16o49L01k0o5J78
$$ -110 -282 -123 -216 76 -111 51 -194 -136 -231 -122 -114 -130 -76 85 66 -29 277 -62 454 -195 106 86 21 199
7357A99j40N3l1l5K1R0j09j4J47O1k04k07O5Q2J90k40%P8J59j87j40K73j80j12
$$ 199 59 112 81 46 67 157 48 34 181 242 38 -169 -104 -22 168 -72 -72 6 165 -22 -162 111 -69 -181
7381a81L09j76J14m9j64J65J61r7Oj24O7l15L50J87l86R7l5J97J8J11l38K4M04
$$ -181 128 -48 66 17 -147 18 179 82 88 -36 31 -284 66 253 -133 -36 -71 126 144 255 -83 -59 345
7404C45l54o4O3k4k17K44J30k7o0k88K48j12Q0Q4k06J05j00J85j43m0N7K62k11
$$ 345 -9 -73 -10 -34 -251 -7 123 96 36 -252 -4 -116 -36 48 -158 -53 -153 32 -111 -151 -94 168 -43
7427d3N4k28J65K09k46K10j61J53j11OQ4k57J69p4J53k02R4J89j20n4R5j46j38
$$ -43 11 -217 -52 157 -89 121 -40 113 2 8 92 -165 4 -70 83 -119 -25 164 44 -10 85 -61 -199
7450a99M48j92J6K08m81J9K64j72J1j14K04pj47j20N6QK81l91M92J71l97q2J40
$$ -199 249 57 73 281 -200 -181 83 -89 -78 -192 12 5 -142 -262 -206 -198 83 -308 184 355 -42 -124 16
7473A6k89M51k50J07j16k32L96j45J04r9J89j32J20O9m02R5N72n76K29k29L61
$$ 16 -273 178 -72 35 -81 -313 83 -62 42 -57 132 0 120 189 -213 -118 454 -122 107 -122 239
7494B39j97o6J90j96j58J57J35o0j08J42q1p6Q6j28J29j1J54j3o5J1k47L31j70
$$ 239 42 -24 166 -30 -188 -31 104 44 -64 78 -3 -79 7 -121 8 -3 151 138 73 84 -163 168 -2
7517bp6Q9j42J03L4n6r7m7J07j27J31K63k40J82j30K19l00J07j63j3L89k05J2
$$ -2 -78 11 -131 -28 6 -50 -147 -194 -87 -214 -83 180 -60 122 -8 211 -89 18 -145 -158 231 26 38
7540C8k28P8o3J13O0k03J74P7r9J78j10r4J91J9k27J6J41j2k3j53J74q0L19l80
$$ 38 -190 -112 -175 -62 -2 -205 -31 46 -53 125 15 -79 112 131 -96 -80 61 49 26 -127 47 -33 286 -94
7564i4J18J57k78K54j18j46J60j12K02j32N3J79k96J04R6j96J54P2k60L4L0k11
$$ -94 24 181 -97 157 39 -107 53 -59 143 11 64 243 -53 51 147 -49 105 177 -83 -49 -19 -230
7586b30P4J20l4N6K98k99j69L85l24j5K70m10M06o8m56M13j51L0K51J63j95nj14
$$ -230 -156 -36 -70 -14 284 -15 -184 201 -123 -138 132 -278 128 60 -396 17 -134 -104 147 310 115 110 -4
7609dj0n9j28J90j79k17M35l6n5J9o7J76K2Qq6j50m4N0R3M68n43l40P19k48j46
$$ -4 -14 -73 -201 -11 -190 -407 28 -8 -63 -44 -111 65 87 95 9 -141 -185 -135 -42 426 -117 -457 262 14 -132
7634a32J89K29j24N0k6p2q1K35m61K55q2Q8J74l93L18P7k60K47j50N1k40K65j99
$$ -132 57 286 162 212 186 114 33 268 -193 62 -20 68 242 -151 167 244 -16 231 81 132 -108 157 -42
7657d2J2K81l52j11J83P3P9j26m8j24K44q9LJ11j50N4j1J63N2K7j70N7j7J20O9
$$ -42 -30 251 -101 -212 -29 44 123 -3 -51 -175 69 -20 -17 94 -56 -2 -13 150 202 229 59 116 99 219 288
7682B88J31l24k3J15j04kK7K0l40J41L16m12P6J37j01k8q9J56N6j50o4P0K95k12
$$ 288 419 95 72 187 83 81 108 128 -212 -71 245 -167 -91 46 -55 -83 -172 -16 40 -110 -174 -104 191 -21
7706b1L9l6R1k19K52J6j20n2R7k8M1j8n1Q7k20K12j29J5p2R7j00L70m19J02J89
$$ -21 18 -18 73 -146 106 122 2 -50 47 19 60 42 -9 78 -142 70 -59 -44 -116 -19 -119 251 -168 -66 123
7731A23j47l9l9R7j57rJ19J17j33J74o7j05L32j63P6J22l2o1l75R0jOR1J78l04
$$ 123 -24 -63 -102 -5 -162 -171 -52 65 -68 106 39 -66 266 103 179 301 269 208 -167 -77 -78 -72 19 197 -107
7756a07O0q3P9l8J53%j0P6j63K2J48k78K0O3J13j73J46J66j60k59K58j10Q5j14
$$ -107 -47 -130 -51 -89 64 64 54 130 -33 -11 137 -141 -121 -58 55 -118 28 194 34 -225 33 -77 8 -106
7780a06k32L97k03j01K35ko4N1p2K52r5j31q7P0K9J80L8l19J24N9P2n6p3j18O3
$$ -106 -338 59 -144 -245 -10 -12 -76 -25 -97 155 60 -71 -158 -88 -59 121 159 -160 -36 23 95 39 -34 -152 -89
7805h9J68k45M14j93J07j82k02J37J0J48J55k53o7p4N7J57r3j31J9J3Qj07L40
$$ -89 79 -166 248 55 162 -20 -222 -85 -75 73 228 -25 -92 -166 -109 48 -45 -176 -157 -144 -136 -243 97
7828I7Q2m1o1q3J35j48O5k13L34j99j6P7j17p2O1J61k8k01J46k4p2O1j43K3J35
$$ 97 179 138 77 -6 129 -19 46 -167 167 -32 -48 29 -88 -160 -99 62 34 -167 -21 -45 -117 -56 -199 -176 -41
7853d1l2j36K2K31P3k08k47J98K21r0L5K89m33M00m86J83m6j01L16l38J49P8j87
$$ -41 -73 -209 -187 44 117 -91 -338 -140 81 -9 26 315 -118 282 -204 -21 -67 -168 148 -190 -41 37 -150
7876a50K10k66K43M2Kl00K30j20j04J96p0k11K01M8k1J07k65L43o6q1J9J09J43
$$ -150 60 -206 37 79 81 -219 11 -109 -213 -17 -87 -298 -97 -49 -70 37 -228 115 49 -32 -13 96 239
7899B39l14J0M2R5k8j48R7J28k80L53j62j04N8qJ69K33l01n3p9Q3m7j40K53L0
$$ 239 -75 -65 -23 72 44 -104 -7 121 -159 194 32 -72 -14 -22 147 380 79 26 -53 30 -17 -157 96 126
7923A26p5j50o4J57k10J31J09K99j82j41M7L5l2M0l41K77L3j89K74j73k21K04
$$ 126 51 -99 -163 -6 -216 -85 24 323 141 0 47 82 50 90 -251 26 59 -130 144 -29 -250 -46
7945d6RK35m1k62J09k46K98k02J20J95l76J15j33K70j05J11J34j19j83J48j43
$$ -46 -37 198 157 -105 4 -242 56 -146 -26 169 -207 -92 -225 45 -60 51 185 66 -117 31 -112
7966a12M05j45l75K87Q7j82L44m99J71K70j7k08l5l1J55o1P4l49J49K46Ok50j24
$$ -112 293 148 -227 60 147 -35 309 -190 -19 251 234 26 -9 -40 115 54 128 -221 -72 174 180 -70 -194
7989a94J63j2j50P8J58P3j01j3J33j88k14N33m24L13k53J64p3rJ16j83J40p9M3
$$ -194 -31 -43 -193 -115 43 116 15 2 135 -53 -267 266 -158 155 -98 66 -7 -16 100 -83 57 -22 21
8012B1J56p3j12K09j91k79L78l00J83K32n38M99k62J66N1l28K22j05M7N1jK01
$$ 21 177 104 -8 201 10 -269 109 -191 -8 224 -314 185 -77 89 140 -188 34 -71 -24 27 26 227
8034B27p9k54J54M6j21j58J41j18K91j00K00j09l32J00J33M3J31l27J65J52k8
$$ 227 148 -106 48 94 -27 -185 -44 -162 129 29 229 120 -212 -112 21 64 195 -132 33 185 157
8055A57r3j14q1K41r4M0j29n0P5L1Q7m8j46K47l00L66l72K35p6OR0o5Pk71N77
$$ 157 64 -50 -131 110 16 56 -73 -123 -48 -17 70 22 -124 123 -177 189 -183 52 -24 -18 72 7 14 -257 320
8080C20j45j78J16P3k23M0l9j03J33R8n2r5N1L8k26O6j28K36O0K17j43Q0j80L41
$$ 320 175 -3 113 186 -37 3 -36 -139 -6 92 40 -55 -4 34 -192 -126 -254 -18 42 259 116 196 16 357
8104C57n03m3L17m6o3M5o2J78L8j25j01N8Kj3l3J03j87J53m06L32J63l01R1MQ5
$$ 357 -146 -189 128 82 19 64 2 180 218 93 -8 50 52 39 6 109 -78 75 -331 1 164 -137 -46 -42 43
8129D3o4q1m7m4J33J66k15K15k03m6R9Q9k09K36j00k3J1OJ11o1J96k42j17Q9J80
$$ 43 -21 -102 -149 -193 -60 106 -109 106 -97 -143 -44 45 -164 72 -28 -51 -40 -34 77 16 212 -30 -147 -58 122
8154A22k04J0L36j07N8k54j05K85k25J74p1J88l15K20qj43K01k12J82o1RJ31k22
$$ 122 -82 -72 264 157 215 -39 -144 141 -84 90 19 207 -108 112 104 -39 162 -50 132 71 80 211 -11
8177a1m8J97p9m3q1l09L82J9R0m52N78j59p6p
$$ -11 -59 138 59 16 -65 -374 8 27 117 -335 243 84 8 1
8191A
$$ Imaginary data points
##PAGE= N=2
##DATA TABLE= (X++(I..I)), XYDATA
0@%%%%%%%%%%%jQj4J4j4K1k8L1l8M9n6O3p7R1j06J24j44J68j96K24k53K85l22
$$ 0 0 0 0 0 0 0 0 0 0 0 0 -1 7 -7 7 -7 14 -14 17 -21 28 -28 35 -42 49 -57 67 -77 91 -105 119 -134 151 -171
34a71L65m13M66n22N83o51P24q05Q93r90J098j214J340j476J626j794J975k176
$$ -171 194 -219 247 -275 308 -343 381 -424 469 -521 577 -637 703 -773 853 -941 1034 -1142
52a142K401k646K922l234L587l990M454n000N649o439P426q697J0403j2830J6585
$$ -1142 1259 -1387 1535 -1699 1888 -2102 2352 -2648 3001 -3438 3988 -4709 5694 -7136 9449
67I449k3226L8528j43630n7124J36944o2712K1964M5386J3613j3784j4293n3130
$$ 9449 -13777 24751 -118879 -176003 -39059 -101771 -79807 -34421 -20808 -34592 -48885 -102015
79a02015N5943P8737j6335O397R8469o380o0109J0260j795m2883L0196K9604m372
$$ -102015 -46072 32665 16330 22727 121196 114816 54707 64967 63172 20289 50485 80089 75717
92G5717L4753J3211n7312n810K129p1367j4584O4738j1557k9329L9510m36n2923
$$ 75717 110470 123681 66369 60559 62688 -8679 -23263 41475 29918 589 40099 39663 -13260
105a3260j7406k6485k7334L0933L666l5288M2792L5092o7652l0724L6584j7527
$$ -13260 -30666 -57151 -84485 -53552 -49886 -85174 -42382 -7290 -74942 -105666 -69082 -86609
117h6609k0867L9012K4591J8791L5359j6381j9280M1757j672m0926M6247O0205
$$ -86609 -107476 -68464 -43873 -25082 10277 -6104 -25384 16373 14701 -26225 20022 80227
129H0227j8527K537L3669j7994k2579j039k1943N680L4731j9645j8231L6278j7251
$$ 80227 61700 64237 97906 79912 57333 56294 34351 40031 74762 55117 36886 73164 55913
142E5913o7127k353J1736l2753k153K3730l478M672q36m1328q307K0292l1070
$$ 55913 -11214 -13567 -1831 -34584 -36737 -13007 -16485 -11813 -12649 -53977 -62284 -41992 -73062
155g3062j4806N4324J8595k5663J3670J1904k4721n852K052j921L5964K8589j4054
$$ -73062 -87868 -33544 -14949 -40612 -26942 -15038 -39759 -45611 -43559 -45480 -9516 19073 5019
168E019J9070L5243l1643l0312K7195Q660j2019K2608K0474J340Q181j8530l3271
$$ 5019 24089 59332 27689 -2623 24572 33232 21213 43821 64295 65635 73816 55286 22015
181B2015Q629j8l5485R665L8199j5290k3296O131j5382k9528q974j0671J907K7157
$$ 22015 30644 30626 -4859 4806 43005 27715 4419 10550 -4832 -34360 -43334 -54005 -52098 -24941
195b4941j628j4953K1886M381m0429o600K4350k393K587K6045J2877O725M464
$$ -24941 -26569 -41522 -19636 -15255 -55684 -62284 -37934 -40327 -37740 -11695 1182 7907 12371
208A2371j9563o629K0858m814j0091L5895K6177j5323k494Q691j4546j2621j523
$$ 12371 -7192 -13821 7037 2223 -7868 28027 54204 38881 36387 45078 30532 17911 16388
221A6388k321J5875J5558j4512m658J3619k1576l4247N258Q547j1593K858J0638
$$ 16388 14067 29942 45500 30988 26330 39949 18373 -15874 -10616 -2069 -13662 -10804 -166
234a66k752l901j3953k3282K280P904j4569M722L1506L908j4493M619K487j0214
$$ -166 -2918 -6819 -20772 -44054 -41774 -33870 -48439 -43717 -12211 -8303 -22796 -18177 -15690 -25904
248b5904j53M820J0772K2775P433p714J0099Q042k1246r517J7840P189j253J0130
$$ -25904 -26057 -21237 -10465 12310 19743 12029 22128 30170 8924 -593 17247 24436 23183 33313
262C3313P888j372o417j7670j1082O799k515j0957J2482J4776j3581j4365j675
$$ 33313 41201 39829 33412 15742 4660 11459 8944 -2013 10469 25245 11664 -2701 -4376
275d376q470j1698l414J395J0627R718p850o607O573p249j8945L406J5236M242
$$ -4376 -12846 -24544 -27958 -26563 -15936 -6218 -14068 -20675 -14102 -21351 -40296 -36890 -21654 -17412
289a7412M196J0599O468l8o375q499N066J1064p12M221J8884O814j1085n027N80
$$ -17412 -13216 -2617 3851 3813 -2562 -11061 -5995 5069 4357 8578 27462 34276 23191 18164 18744
304A8744m579m723J306P898J0273k41j0193k504k161j5390j2224N589P152j568
$$ 18744 14165 9442 10748 18646 28919 28678 18485 15981 13820 -1570 -13794 -8205 -1053 -2621
318b621q08K467k041r163j2914m527N827K533j079P832J1177k941r816k410J657
$$ -2621 -3429 -962 -3003 -12166 -25080 -29607 -23780 -21247 -22326 -14494 -3317 -6258 -16074 -18484 -16827
333a6827l93nQ240J3792Q320k054k078K781k750p360R92J0911Q042L22N92K970
$$ -16827 -17220 -17225 -8985 4807 13127 11073 8995 11776 9026 1666 2658 13569 21611 21933 22525 25495
349B5495l249j1704q089K208L838p17J020N245M29r478j1405m568r65m190j823
$$ 25495 22246 10542 2453 4661 8499 7782 8802 14047 14476 4998 -6407 -10975 -11940 -16130 -17953
364a7953Q156P405l258n875k076k636n375k842M565J0045O277j099K096L818n074
$$ -17953 -9797 -2392 -5650 -11525 -13601 -16237 -21612 -24454 -19889 -9844 -3567 -4666 -2570 1248 -3826
379c826p907K817Q114M114M765O945M521k05n946p150J933K731l114K994J0396
$$ -3826 -11733 -8916 -802 3312 8077 15022 19543 19338 13392 6242 8175 10906 7792 10786 21182
394B1182K24p393l480m086o020m211j234K623O947k30o855j52j697j1867n709
$$ 21182 21406 14013 10533 6447 427 -3784 -5018 -2395 4552 4322 -2533 -2685 -4382 -16249 -21958
409b1958N140K891R87N348K414j92j306o883l667O253L156r61R261R267l671l282
$$ -21958 -16818 -13927 -12940 -7592 -5178 -5370 -6676 -13559 -17226 -10973 -7817 -8778 483 9750 6079 2797
425B797J267l064j428L202K287O442Q155k372m815L203m596j0212K025N138j214
$$ 2797 4064 1000 -428 2774 5061 11503 19658 17286 12471 15674 11078 866 2891 8029 6815
440F815J860K737l835k930m434r253j755N502k689j113Q721o8q425j419j691n379
$$ 6815 8675 11412 7577 4647 213 -9040 -10795 -5293 -7982 -9095 -374 -442 -8867 -10286 -11977 -17356
456a7356J469L211J628P745N148n463k24L957o516l333R320M176M06O365J816
$$ -17356 -15887 -12676 -11048 -3303 1845 -3618 -3842 115 -6401 -9734 -414 3762 4168 10533 12349
471A2349l861L31l237n988N239N251k921M004O951o462o300N92m994m498L936
$$ 12349 8488 8819 5582 -406 4833 10084 7163 11167 18118 11656 5356 5948 954 -3544 392
486C92J39n36N912k681q225P13j302q811J214P206j256J102N163m179l602Q10
$$ 392 531 -5 5907 3226 -4999 -4286 -5588 -14399 -13185 -5979 -7235 -6133 -970 -5149 -8751 -7941
502g941m586j570R072K303j100Q344L366p164j8K080m579K683O412k7K564N742
$$ -7941 -12527 -14097 -5025 -2722 -3822 4522 7888 724 706 2786 -1793 890 7302 7275 9839 15581
518A5581n602n227L266m157n307O272L786l347L014Q58p695k148j091p125J415
$$ 15581 9979 4752 8018 3861 -1446 4826 8612 5265 8279 9137 1442 -706 -1797 -8922 -7507
533g507O476l216r6N956m229p629K200j386l795N647L604j490N361J703p400M60
$$ -7507 -1031 -4247 -4343 1613 -2616 -10245 -8045 -9431 -13226 -7579 -3975 -5465 -104 1599 -5801 -5341
549e341L344n025R06R388Q94rO120k278n019K386j477l899O629L477m106L544
$$ -5341 -1997 -7022 -6116 3272 4166 4157 10277 7999 2980 5366 3889 -10 6619 10096 5990 9534
565I534K437p781l290K073m567q00N978j544j522L783m238p198J909j257n200
$$ 9534 11971 4190 900 2973 -1594 -2394 3584 2040 518 4301 63 -7135 -5226 -6483 -11683
580a1683M825M733l342J735K943n938j579L309l158J005P606K34j514M946q64
$$ -11683 -6858 -2125 -5467 -3732 -789 -6727 -8306 -4997 -8155 -7150 456 690 -824 4122 3258
595C258o007K712J590k920M929M738k420J788K735o044k552L526l029j324O323
$$ 3258 -2749 -37 1553 -1367 3562 8300 5880 7668 10403 4359 1807 5333 2304 980 7303
610G303l60l309K198k036o977J006K97l913L314M198m405p9K454n982l212L263
$$ 7303 6943 3634 5832 3796 -3181 -2175 -1878 -5791 -2477 1721 -2684 -2763 -309 -6291 -9503 -6240
626f240j693o94O047J042k463L774o22n493K467K694k443L858N718k095q2K646
$$ -6240 -7933 -8627 -2580 -1538 -4001 -227 -849 -6342 -3875 -1181 -3624 234 5952 3857 3775 6421
642F421m064k306L725j118o08N869N17l210J945j219o002N98K014l589J799L622
$$ 6421 2357 51 3776 2658 2050 7919 8436 5226 7171 5952 -50 548 2562 -1027 772 4394
658D394l286j248J317m773l539L250r20j642M722P29l135J321k68n048J514K776
$$ 4394 1108 -140 1177 -3596 -7135 -3885 -4805 -6447 -1725 -996 -4131 -2810 -3078 -8126 -6612 -3836
674c836j889K634M751j421q42K821k573j945L519O72o02M326J311k724J001K91
$$ -3836 -5725 -3091 1660 239 -603 2218 -355 -2300 1219 1891 1289 5615 6926 4202 5203 5494
690E494m348O88K611k145R61L760k485k262J201l334l470K339j45j665K662P08
$$ 5494 1146 1834 4445 2300 3261 7021 4536 2274 3475 141 -3329 -990 -1135 -2800 -138 570
706E70l574K55j49l909N0L397j436P27L418j185j697J701j472j808K546J653l65
$$ 570 -3004 -2749 -2898 -6807 -6757 -3360 -4796 -4069 -651 -1836 -3533 -1832 -3304 -5112 -2566 -913 -1278
723a278L476K145k473Q69N95k359K11K804p63P94K790j116k509R57j825k762J819
$$ -1278 2198 4343 1870 2739 3334 975 1186 3990 3227 4021 6811 5695 3186 4143 2318 -444 1375
740A375R18j385J707P25l497p06j39l414k47J953o98J82K288j501j872Q96p64
$$ 1375 2293 908 2615 3340 -157 -863 -1002 -4416 -4663 -2710 -3408 -3226 -938 -2439 -4311 -3415 -4179
757d179j797J991J880m74K100J873k464r4R35j656Q59K862L91M67K476n21j990
$$ -4179 -5976 -3985 -2105 -2579 -479 1394 -1070 -1164 -229 -1885 -1026 1836 2227 2694 5170 4649 2659
774B659R69o91j586J339J231o85Q70P64k640j205K8k182n03J778n46l62J336j026
$$ 2659 3628 2937 1351 2690 3921 3236 4106 4870 2230 1025 1053 -1129 -1632 146 -400 -762 574 -452
792d52k590j70m49j807J148J580n30R00J169j271n60Q00p85J48K439Q93L06J696
$$ -452 -3042 -3212 -3661 -5468 -4320 -2740 -3270 -2370 -1201 -2472 -3032 -2232 -3017 -2869 -430 463 769 2465
810B465j83j527N77L0q10J347J684n6P19N70j330j410k3q52m30J233K53p28L20
$$ 2465 2282 755 1332 1362 552 1899 3583 3527 4246 4816 3486 2076 2053 1201 771 2004 2257 1529 1849
829A849p65k327k38n94j178N14J260m32O0M99j537q59K89p03J94J485R33O79O83
$$ 1849 1084 -1243 -1481 -2075 -3253 -2739 -1479 -1911 -1851 -1352 -2889 -3748 -3459 -4162 -3968 -2483 -1550 -871 -188
848a88p5p00o8N44K25Q22J507P03K60K84o24o61m25K33n2J247L24k22O2m75j381
$$ -188 -263 -963 -1031 -487 -262 560 2067 2770 3030 3314 2690 2029 1604 1837 1785 3032 3356 3134 3196 2721 1340
869A340j171l91m77J48M01k1l02l87j148q60m70j62J03J003N48M93J42o23o14
$$ 1340 169 -222 -699 -551 -150 -171 -473 -860 -2008 -2868 -3338 -3500 -3397 -2394 -1846 -1353 -1211 -1834 -2448
888b448m4k39O08J090J151P35N89K76m24n15r5P14N45P03N78L62k83p57q41n11
$$ -2448 -2492 -2731 -2123 -1033 118 853 1442 1718 1294 779 684 1398 1943 2646 3224 3586 3303 2546 1705 1194
908A194k10r4M52L28k5m27p21p33j171n46m21K69N25J17J68m60n80l96o01L9P73
$$ 1194 984 890 1342 1670 1645 1218 497 -236 -1407 -1953 -2374 -2105 -1580 -1463 -1295 -1755 -2335 -2731 -3332 -3293 -2520
929b520Q08L77Q67O54n44m52j15J74J58J552L71P78O58l28p21R1j82m31Q00M33
$$ -2520 -1712 -1335 -468 186 -358 -810 -925 -751 -593 959 1330 2108 2766 2438 1717 1808 1626 1195 1995 2428
949B428j03K33L1j164q24k19p19n31P03K33p5M7m80j480l47o5q86Q67L82J70L65
$$ 2428 2325 2558 2589 1425 601 382 -337 -868 -165 68 -7 40 -440 -1920 -2267 -2332 -3218 -2351 -1969 -1799 -1434
970a434L64q69j90L08K76q6J166R14l2Q78j93n47M4M5k92Q09J329l8j04P77j284
$$ -1434 -1070 -1939 -2129 -1821 -1545 -1631 -465 449 417 1295 1102 555 599 644 352 1161 2490 2452 2348 3125 1841
991A841m47r2m54l41P42R1m33K16m77j473p1k20q95N40O63j73k36O11j480n80
$$ 1841 1394 1302 848 507 1249 1340 907 1123 646 -827 -898 -1118 -2013 -1473 -810 -983 -1219 -608 -2088 -2668
1011b668O29o99K67J226N13k10R10j15j008M59N60l92R05J385n36L84O40p05o93
$$ -2668 -2039 -2738 -2471 -1245 -732 -942 -32 -147 -1155 -696 -136 -528 377 1762 1226 1610 2250 1545 852
1030H52N77j06l26Q59N83n13J47k51j455J39l3q53L42L68k98p28M50p98j086L28
$$ 852 1429 1323 997 1856 2439 1926 2073 1822 367 506 473 -380 -38 330 32 -696 -246 -1044 -2130 -1802
1050a802j6l67Q58O15q57N81N3j090J33O72jL43J298k98L9P17k10o05O80J25k6
$$ -1802 -1818 -2185 -1327 -712 -1569 -988 -935 -2025 -1892 -1220 -1221 -878 420 122 161 878 668 63 743 868 842
1071H42R71N38n34p6L90j444k45N62l40JQ76k56q74L21n24j255L27p4p99R21L77
$$ 842 1813 2351 1817 1741 2131 687 442 1004 664 665 1541 1285 411 732 208 -1047 -720 -794 -1593 -672 -295
1092b95p32l61K29q52k87Q00O0J53Q75k8n53N92Q5p98N59M89j48R78N61m39K63
$$ -295 -1027 -1388 -1159 -2011 -2298 -1498 -1438 -1285 -410 -438 -991 -399 -314 -1112 -553 -64 -212 766 1327 888 1151
1113A151M51q41j43J082l44l67Q84q8q44K48l48j090N24J06l13J41O13j141M4
$$ 1151 1602 761 618 1700 1356 989 1873 1785 941 1189 841 -249 275 381 68 209 822 -319 -275
1132b75j92q44o01Q50k43j58R13l58o44O12j75o85P58O48n37O12R66l55k43M18
$$ -275 -467 -1311 -1912 -1062 -1305 -1463 -550 -908 -1552 -940 -1115 -1800 -1042 -394 -931 -319 647 292 49 467
1152D67n17N1Q78o2R1O34J87o09K69j54p72L95M24l10l2J53q25l00P8o49n51O49
$$ 467 -50 1 879 817 908 1542 1729 1120 1389 1235 463 858 1282 972 940 1093 268 -32 46 -603 -1154 -505
1174e05m1j32N43l42r06M41J6p89N92K22m53O69O94n80j59P68n51k47O36L44J20
$$ -505 -546 -678 -135 -477 -1383 -942 -926 -1715 -1123 -901 -1354 -685 9 -571 -730 38 -513 -760 -124 220 340
1195C40M41L15n60J83p1m03L09R77p57M66N17p73k49J15m66o81R21m1n37N8R3
$$ 340 781 1096 536 719 648 245 554 1531 774 1240 1757 984 735 850 384 -297 624 583 46 104 197
1216A97p86K2J54o03j04P08j48k18K87k03n59M45k49k66P49K53l93O09O27o63
$$ 197 -589 -567 -413 -1016 -1120 -412 -560 -778 -491 -694 -1253 -808 -1057 -1323 -574 -321 -714 -105 522 -141
1236a41K51L73m10K09P75k47J54L05k23m00L23p1n15M14K03l92K08K30j260J39
$$ -141 110 483 73 282 1057 810 964 1269 1046 646 969 898 383 797 1000 608 816 1046 -214 -75
1256g5L55n96k50M38m24K08rl56n77M05k96j71M79L51l07K63L75n98K62K15j28
$$ -75 280 -316 -566 -128 -552 -344 -353 -709 -1286 -881 -1177 -1348 -869 -518 -825 -562 -187 -785 -523 -308 -436
1277d36J7N92J81Q2R0Q4l70N55N0l27L58O77r12M68p5n10j84J02k08k64N23k21
$$ -436 -419 173 354 436 526 610 240 795 845 518 876 1553 641 1109 1034 524 340 442 234 -30 493 272
1299B72l99J25j40n55J04K63o11N0M55l33r3M2k79k20O46l43J51P75k08K70J66
$$ 272 -127 -2 -142 -697 -593 -330 -941 -891 -436 -769 -862 -820 -1099 -1319 -673 -1016 -865 -90 -298 -28 138
1320A38l9n43N15K98j61M68K55r4j31M25o20k23L86j90l4J62J92m1k11l0l65m33
$$ 138 99 -444 71 369 208 676 931 837 706 1131 511 288 674 484 450 612 804 763 552 522 157 -276
1342b76K96o35L75J58l58p9K28l04k36p8j56K88j0L11j99L94p8l73J68N37M1L2
$$ -276 20 -615 -240 -82 -440 -519 -291 -595 -831 -909 -1065 -777 -787 -476 -675 -281 -359 -732 -564 -27 14 46
1364D6M62k33L88l6m81R4L18j09L7L85J58j80k32J96m07P9k00j72J07K38l03K6
$$ 46 508 275 663 627 146 240 558 449 486 871 1029 849 617 813 406 485 285 113 220 458 155 181
1386A81k39l52k24J76o0j95N23J47n29J84l80nj77P03l34P7M12K9k37L59qj04
$$ 181 -58 -410 -634 -458 -518 -713 -190 -43 -572 -388 -768 -773 -950 -247 -581 -504 -92 -63 -300 59 51 -53
1408e3M56j45R6L79N0n0N1k64K81o15N6J11K43J6mo1k88j55j15j20L4j0J3j31
$$ -53 403 258 354 733 783 733 784 520 801 186 242 353 596 612 608 547 259 104 -11 -131 -97 -107 -94 -225
1432b25j44J36l79j88J30P2J52J40j66L15J47k16j64K19j09M26j38J52r0J35J23
$$ -225 -369 -233 -612 -800 -670 -598 -446 -306 -472 -157 -10 -226 -390 -171 -280 146 8 160 70 205 328
1453C28p8k41M73j27L38p4j18P6r7k28o1o6LJ01O6p0l22N3j58O7l6l25J36j61
$$ 328 250 9 482 355 693 619 501 577 480 252 191 125 128 229 295 225 -97 -44 -202 -135 -171 -496 -360 -521
1477e21K96k24m5R9j99Kp5J19J90n8J96K68m2j89J31jj5L26m9K50m9K9j95oO9
$$ -521 -225 -449 -494 -395 -594 -592 -667 -548 -358 -416 -220 48 6 -183 -52 -53 -68 258 209 459 410 439 244 238 307
1502C07K8MJ84j78J15j34J74m09l37J8J21J9j43J04J22m93J95N1l56L31n1j21
$$ 307 335 339 523 345 460 326 500 91 -246 -228 -107 -88 -231 -127 -5 -498 -303 -252 -608 -277 -328 -449
1524d49k14O21k90l54J60K11L38j41k24N36j27N6Q1J34l26k26N73J70k18MK92
$$ -449 -663 -42 -332 -686 -526 -315 23 -118 -342 194 67 123 204 338 12 -214 359 529 311 315 607
1545F07j91P2l27p4m1L37k11L1k9j62M3j32j59j24K14j78k7L56j04j96j18J93
$$ 607 416 488 161 87 46 383 172 203 174 12 55 -77 -236 -360 -146 -324 -351 5 -99 -295 -413 -220
1567b20k27M7J23o3M9J03p9J27J38j29k7J27J24J58m7K98m02K13q4J30n7j8K18
$$ -220 -447 -400 -277 -340 -291 -188 -267 -140 -2 -131 -158 -31 93 251 204 502 100 313 229 359 302 284 502
1590E02j53j39J11k33K29j21m75K64p5N5J30j11k02O1J12l98P6N6K15j66L27o0
$$ 502 349 210 321 88 317 196 -279 -15 -90 -35 95 -16 -218 -157 -45 -443 -367 -311 -96 -262 65 5
1612El64J54K0r2K80n7j25K62J0J6J4r8R0l0K03j86J97j14L54o43M02k21k11M77
$$ 5 -359 -205 -185 -277 3 -54 -179 83 93 109 123 25 115 85 288 102 299 185 539 -104 298 77 -134 343
1636C43M0m01K35N9k96j06J20j01K8n0o5L6J77k69j32J60j67j92J76L21K29l81
$$ 343 383 -18 217 276 -20 -126 -6 -107 -79 -129 -194 -158 19 -250 -382 -222 -389 -581 -405 -84 145 -236
1658b36R2L54l37K53j47J06J72l77J26K80n9p5j31L6j76M31l3J19N7k39j04oK10
$$ -236 -144 210 -127 126 -21 85 257 -120 6 286 227 152 21 57 -119 312 279 398 455 216 112 106 316
1681C16k42q0K0L51m89Q5O8k63L7j42J61p1K13k81R4P3r3k47J69K16P1J67j94
$$ 316 74 -6 14 365 -124 -39 29 -234 -197 -339 -178 -249 -36 -317 -223 -150 -243 -490 -321 -105 -34 133 -61
1704f1k22N66l39j01M50m8l59R5J60N66n28J04j48JM09n81J28J77m2k58J27Om28
$$ -61 -283 283 -56 -157 293 245 -114 -19 141 707 179 283 135 136 545 -36 92 269 227 -31 96 102 -326
1727c26L75j97M9J83k86j5J47j18k19J93J22Q0l78K98R7m3o7j26q9K40R6j04M7
$$ -326 49 -148 -99 84 -202 -217 -70 -188 -407 -214 -92 -12 -390 -92 5 -38 -105 -231 -320 -80 16 -88 -41
1750d1L90k12k90K31J16p4j09K64R3l58O6M2J93l17J2J50L9j41m9K43j96N6j08
$$ -41 349 137 -153 78 194 120 11 275 368 10 76 118 311 -6 6 156 195 54 5 248 52 108 0
1773@k05J05J57k35L9m1l4l3l22M18L8j12k7j39J70K61l5j25O9P9l57K82J74K12
$$ 0 -205 -100 57 -178 -139 -180 -214 -247 -569 -151 -113 -225 -252 -391 -221 40 5 -120 -51 28 -329 -47 127 339
1797C39j33m9L9j96L20J5p0M8k76j26J84k84K51J1pj03k25M36k18j14J33j22K48
$$ 339 206 157 196 0 320 335 265 313 37 -89 95 -189 62 73 66 -37 -262 174 -44 -158 -25 -147 101
1820A01k22j01j88J75J91j22L11m5k35Q7K3Ok08J04Q1J91M2k25K16M2j89O2J6
$$ 101 -121 -222 -410 -235 -44 -166 145 100 -135 -48 -25 -19 -227 -123 -42 149 191 -34 182 224 35 97 113
1843A13j46J55nj28L58l3k28o8J38K5o6k28K76j31k46J55PP5J6k94n2K82j07p6
$$ 113 -33 122 117 -11 347 314 86 18 156 181 115 -113 163 32 -214 -59 -52 23 39 -255 -307 -25 -132 -208
1867b08P5k4j52K89q0J1K05l08K23m68N11k5l80K16J70K5j63N49k42M3o4j85P3
$$ -208 -133 -157 -309 -20 -100 -89 116 -192 31 -437 74 49 -331 -115 55 80 -83 466 224 267 203 18 91
1890I1l1M5R8J9j40j59J75m8k39J06Q1P9k69K25n2q1n6J2N7Q0n0k72J50Q3j13
$$ 91 60 105 203 222 82 -77 98 50 -189 -83 -2 77 -192 33 -19 -100 -156 -144 -87 -7 -57 -329 -179 -96 -209
1915b09J62j03P7j78K09L3M8j17J63k18J69J50r5L6j66k7K65k54K27p1K46K0o2
$$ -209 -47 -150 -73 -251 -42 -9 39 -78 85 -133 36 186 91 127 -39 -66 199 -55 172 101 347 367 305
1938C05l06N6j50MM9J71j55r9K35J99m52oj5r4j05J95K03k35L5J88r3j88R2P1
$$ 305 -1 55 -95 -91 -42 129 -26 -125 110 309 -143 -149 -164 -258 -363 -168 35 -200 -165 23 -70 -258 -166 -95
1962i5J44P8p2j00P6p0L25k53K53k81R7Q0K9J4q7J30k98L37l76K72r1N6j38l16
$$ -95 49 127 55 -45 31 -39 286 33 286 5 102 182 211 225 138 268 -30 307 -69 203 112 168 30 -286
1986b86J57J69p4r6O2J5Jn0J57rm0k56J07K60j68j31O3K43o4j91K08P9l55K20
$$ -286 -129 40 -34 -130 -68 -53 -52 -102 55 46 6 -250 -143 117 -51 -182 -119 124 60 -131 77 156 -199 21
2010B1K25K42j98k28J88R5j23R0l30K67p1j82l26L66p7j45J77jN5L23l67N3l86
$$ 21 246 488 290 62 250 345 222 312 -18 249 178 -4 -330 36 -41 -186 -9 -10 45 368 1 54 -332
2033c32Q2J57j82J32N1J60l57K70q4j21J91J47Lo5K70k45j12J16j0k08L63m03
$$ -332 -250 -93 -275 -143 -92 68 -289 -19 -103 -224 -33 114 117 52 322 77 -35 81 71 -137 226 -177
2055a77J91K68j49j85P8n0P7p7J3M39o18J19J42j21j2q8p9L26r7j05J34n0O3M1
$$ -177 14 282 133 -52 26 -24 53 -24 -11 428 -190 -71 71 -50 -62 -150 -229 97 0 -105 29 -21 42 83
2079H3k65K79k79L89l7k31R9k06J10J51l31L23l8K88l75J65p4J14j00o0J02j76
$$ 83 -182 97 -182 207 170 -61 38 -168 -58 93 -238 85 47 335 -40 125 51 165 65 5 107 -69
2101f9L09l01R9l3k5K9J8J61J4j68p9j0K38k21l20K82K11m26K71k6K90m15k23
$$ -69 240 -61 38 5 -20 9 27 188 202 34 -45 -55 183 -38 -358 -76 135 -291 -20 -46 244 -171 -394
2124c94L74J6L8j83m7K10q2k36J10K76J31k07l9K7P5Jk17L03pk54M69p7j73rr0
$$ -394 -20 -4 34 -149 -196 14 -68 -304 -194 82 213 6 -33 -6 69 70 -147 156 149 -105 364 287 114 105 15
2149A5j88J01N2pN4NJ6M6o2k23K01k97K34J73k19J31j31k66M44j52P3Q3j72n3
$$ 15 -173 -72 -20 -27 27 32 48 94 32 -191 10 -287 -53 120 -99 32 -99 -365 79 -73 0 83 -89 -142
2173a42j58M69n5j6M2K5j80M0j87K55N5q5O5N0n3K5j09J15k0j49J27j14J05J64
$$ -142 -300 169 114 98 140 165 -15 25 -162 93 148 63 128 178 125 150 41 156 136 -13 114 0 105 269
2197B69k98L00l14J31k35K17k22J53P5l92N68l09M0j97P2k1O8L8M5K91l60J58
$$ 269 -29 271 -43 88 -147 70 -152 1 76 -316 252 -57 -17 -214 -142 -163 -95 -57 -12 279 -81 77
2219G7J02k71K39k81J22j16L86o4k43J59k2o2K94j87j45N4k09J82Q3K71k93j45
$$ 77 179 -92 147 -134 -12 -128 258 194 -49 110 88 26 320 133 -12 42 -167 15 98 369 76 -69
2241f9J28l18N3J38q2N9o4K20n5q6Mm0j36K17J22n82N73J27m02L12J64n36L92
$$ -69 59 -259 -206 -68 -150 -91 -155 65 10 -76 -72 -112 -248 -31 91 -491 82 209 -193 119 283 -253 139
2264A39l4J5J41m4j83j35K34L2k28Qo1r3L10j43R3m1j5Ml31K13J05K3J54j45K6
$$ 139 105 120 261 217 34 -101 133 165 -63 -55 -116 -209 101 -42 51 10 -5 -1 -332 -119 -14 9 163 18 44
2289D4N3j12k71L43rk54K27K28k1l70J24q2J90j45J14k09P7L43k22j66M26k68
$$ 44 97 -15 -286 57 48 -206 21 249 228 -142 -18 -100 90 -55 59 -150 -73 270 48 -118 308 40
2311D0K68j18ok31K26j42N6j42p7Q7L24j49k84J04K9J20O1k54j00J96k39QJ86
$$ 40 308 190 184 -47 179 37 93 -49 -126 -39 285 136 -148 -44 -15 105 166 -88 -188 8 -231 -223 -37
2334c7l11L03q7nL69N6o4l35J57J16k99J25K36k09k25L05J2k42O27l44j19j18
$$ -37 -348 -45 -132 -137 232 288 224 -111 46 162 -137 -12 224 15 -210 95 107 -135 492 148 29 -89
2356h9L9L00o3L0j55j13J16q8l4R2l8R7l31J29k17M65P1l07J19L2l2k62J37J04
$$ -89 -50 250 187 217 62 -51 65 -23 -57 35 -3 94 -237 -108 -325 140 211 -96 23 55 23 -239 -102 2
2380BJ16o2j72K74j70J8j1J20J49j56j38M1q5L09j50O8K9j46jL39m58K32O1j60
$$ 2 118 56 -116 158 -12 6 -5 115 264 108 -30 11 -74 235 85 153 182 36 35 374 -84 148 209 49
2404D9l2j35L03k05n1m53N75J8k45J46l12L56j98J10j04J99j92J16L0K42j48j04
$$ 49 17 -118 185 -20 -71 -524 51 69 -176 -30 -342 14 -184 -74 -178 21 -171 -55 -25 217 69 -35
2426c5Q8k7j10r6J53j55K45pK96k47K08j93k88J45j3K23j63O7k27N0L23n24N19
$$ -35 53 26 -84 -180 -27 -182 63 56 352 105 313 120 -168 -23 -36 187 24 91 -136 -86 237 -287 232
2449B32l73J08j46J84J32j62K7L6j33L26l06l8K05m19M05k65J14n4mK04n3j57
$$ 232 -141 -33 -179 5 137 -25 2 38 -95 231 -75 -113 92 -327 78 -187 -73 -127 -131 73 20 -137
2471a37Q6J57p2j28j6J24N6N2Qk08J51J47j95N5j3l24L53k40J59j35J76k78L10
$$ -137 -51 106 34 -94 -110 14 70 122 130 -78 73 220 25 80 67 -257 96 -144 15 -120 56 -222 88
2494H8r6o0K15l29q0O7J94k2r2J65k36k2K05N4j65L4l4L99k52r4L90l30J58k17
$$ 88 -8 -68 147 -182 -262 -195 -1 -23 -115 50 -186 -208 -3 51 -114 -80 -114 285 33 -61 329 -1 157 -60
2518f0J39J40L2k14K90l94K09kj27J9n0Q6j62J1L7K85m90K18P0j58j04L85k44
$$ -60 79 219 251 37 327 -67 142 140 13 32 -18 68 -94 -83 -46 239 -251 -33 37 -121 -225 160 -84
2541h4J25J3j30O9l3J65Ql45K19R9j29j14k00K01L91m55J58L3L0L2k54K31m21
$$ -84 41 54 -76 -7 -40 125 133 -212 7 106 -23 -137 -337 -136 255 -200 -42 -9 21 53 -201 30 -391
2564c91K53m7r6M31k06J36J10m44J4L72K38l02O2j69mj56K21m4K1p4l14N05j24
$$ -391 -138 -185 -281 150 -56 80 190 -254 -240 132 370 68 130 -39 -43 -199 22 -22 -1 -75 -389 116 -8
2587hl4K0k85K06j15K00J1m11M85j87L11k98M9j5J92l18L81k37q5J83q2P5J41
$$ -8 -42 -22 -307 -101 -216 -16 -5 -416 69 -118 193 -105 -56 -71 121 -197 184 -53 -138 45 -37 38 179
2610A79J12j43j8j96K09k0k32J22j39Jr9L52N3k76L39n80K18k7P7n7k6J05K10
$$ 179 291 148 130 -66 143 123 -109 13 -126 -125 -224 128 181 -95 244 -336 -118 -145 -68 -125 -151 -46 164
2633A64k2l22L19j92L3N9R8k29L6O2j82J12rM5j79J86p0O9O8jj30j21K27mJ00
$$ 164 142 -180 139 -53 -20 39 137 -92 -56 6 -176 -64 -73 -28 -207 -21 -91 -22 46 45 -85 -206 21 17 117
2658A17P1r2L03n60Q4J39j38j32J82J49j91Q5K9km6J2l04K53K30k30J31k72J21
$$ 117 188 96 399 -161 -77 62 -76 -208 -26 123 -68 17 46 44 -2 10 -294 -41 189 -41 90 -182 -61
2681f1n1J51k7P5l2J30r9J06L8j6Q2k31r7N5L00k81K0Q6j18M3n7K70n28M09l88
$$ -61 -112 39 12 87 55 185 86 192 230 214 296 65 -32 23 323 42 62 148 30 73 16 286 -242 167 -221
2706b21K23j95J13j59j09L52l14K39Qj23L20K13p04L65k43K54j56J38J96r1j1
$$ -221 2 -193 -80 -239 -348 4 -310 -71 -63 -186 134 347 -357 8 -235 19 -137 1 197 106 95
2727I5q7o8K3K82j81Q0R7j30p5o3k67K49j46m3J24Q3p2K68m4m14L34N0Q1j7j95
$$ 95 8 -60 -37 245 64 144 241 111 36 -27 -294 -45 -191 -234 -110 -27 -99 169 125 -289 45 95 176 159 -36
2752c6l8K34k04q4M9O0Pj57L41j47k8J44p5J93l50L19m47l9RJ3J85L32m06L36
$$ -36 -74 160 -44 -128 -79 -19 -12 -169 172 25 -3 141 66 259 -91 228 -219 -258 -249 -236 -51 281 -125 211
2776B11l81K08j2j18J95p4j24q5M11k10m7J44k6l96K13J26j95J29j41K2K11j6
$$ 211 -170 38 26 -92 103 29 -95 -180 231 21 -26 118 92 -304 -91 35 -160 -31 -172 -150 61 45
2798D5nj69r6K75j04K43j75p4J23M1j76K68l40R1K82k88J88j17L7JK49k04O6k17
$$ 45 40 -129 -225 50 -54 189 14 -60 63 104 -72 196 -144 -53 229 -59 129 12 49 50 299 95 161 -56
2822e6K79l63K51P7l36K50K48n52J95J04l3k38J97k88qJ30J35J76k68J61n6m16
$$ -56 223 -140 111 188 -148 102 350 -202 -7 97 64 -174 23 -265 -273 -143 -8 168 -100 61 5 -411
2844d11K76Pj34K95j48J16j44J70j6J30P6j94m0J84j93L2j01J46L4M5P3k8Rl08
$$ -411 -135 -128 -262 33 -115 1 -143 27 11 141 217 23 -17 167 -26 6 -95 51 85 130 203 175 184 -124
2868a24O7m3M0J55p0M6k65K38j35O7l60K02K14q1j71J7L00k39j10L33j81K52j70
$$ -124 -57 -100 -60 95 25 71 -194 44 -91 -24 -384 -182 32 -49 -220 -203 97 -142 -252 81 -100 152 -18
2891a8O7l2K19l41J75K3j10L16k61k1O4j21l0O3J19k4j64K70lo6J72m01J50m1
$$ -18 49 17 236 -105 70 93 -17 299 38 17 81 -40 -70 -7 112 88 -76 194 191 125 297 -104 46 5
2915Ej68M32l11nK7O0p8O0k19L78j59r8J7J37r5K14k19L9j01K0N6L9J06n5j79
$$ 5 -163 269 -42 -47 -20 40 -38 22 -197 181 22 -76 -59 78 -17 197 -22 17 -84 -64 -8 31 137 82 -97
2940i7K3K20M0k55J95k44J27J51J1j7k29J94j14J17o5J01k35L7J60k54J28rr3
$$ -97 -74 146 186 -69 126 -118 9 160 171 154 -75 119 5 122 57 158 -77 -40 120 -134 -6 -15 -108
2963a08l5K11k03L1O2J03ll49M12j51J16L8N5o8j65j9J35k63J28m6K30o1o9J7
$$ -108 -143 68 -135 -104 -42 61 58 -291 121 -30 86 124 179 111 -54 -73 62 -201 -73 -119 111 50 -19 -2
2987bo2K38l3N7l04M4J03J8j08JqNK4LM2j74L6O9m3M2N9r7J59j96j56J37L5O5
$$ -2 -64 174 141 198 -106 -62 41 59 -49 -48 -56 -51 -27 -24 18 -156 -120 -51 -94 -52 7 -90 69 -127 -283 -146 -111 -46
3015d6r9P0L5j62K84j33j46K15j15Q8o5j27P5j46J57N7N2J26o9L5r1j38L37k36
$$ -46 -145 -75 -40 -202 82 -51 -197 18 -97 -9 -74 -201 -126 -272 -115 -58 -6 120 51 86 -5 -143 194 -42
3039d2O6K0j7L0k5J43k48J67j58j10J71n8q5J73J56k32J08j47J38o1J55k26r3
$$ -42 24 44 27 57 32 175 -73 94 -64 -174 -3 -61 -146 27 183 -49 59 -88 50 -11 144 -82 -175
3062a75K87l86N50k72J88k42j47J5N8L38l23K09j02J87k51O8k34L25J17q9k32
$$ -175 112 -274 276 4 192 -50 -197 -182 -124 214 -109 100 -2 185 -66 2 -232 93 210 121 -111
3083a11K7K9K0R2j87L50m19j1R3k16K82K37j9k94n1K42p8M1j22J25lm6q6J80k06
$$ -111 -84 -55 -35 57 -130 220 -199 -210 -117 -333 -51 186 167 -127 -178 64 -14 27 -95 30 27 -19 -105 75 -131
3108a31J26O2m2o8l4P0j63L65k04R4N7j76M0j17L41j40k01PK88l93k5K60m6j41
$$ -131 -5 57 15 -53 -87 -17 -180 185 -19 75 132 -44 -4 -121 220 80 -121 -114 174 -219 -244 16 -30 -171
3132a71K65j59K41k37j88L83k12J22k82mK92j82K62j69j26J83j98P5L5N3K20o1
$$ -171 94 -65 176 -61 -249 134 -78 44 -238 -242 50 -132 130 -39 -165 18 -180 -105 -70 -17 203 142
3154A42k17P1o1L41r5Pj26qn5N0j09o8J91jj28Rl3j45K03q8J36o2J87k0m7l5O8
$$ 142 -75 -4 -65 276 181 188 62 54 -1 49 -60 -128 63 62 -66 -57 -90 -235 -32 -120 16 -46 141 121 74 39 107
3181A07j77lM5Lo9r3J70k47L34k01K14R6%O2q9j17p1j00L3J15j58K17q9Q8n1J5
$$ 107 -70 -73 -28 -25 -94 -187 -17 -264 70 -131 83 179 179 241 152 35 -36 -136 -103 12 -146 71 -18 70 19 34
3207C4K7q4L0P3J6k75J82l2j07K57m5k3K0m0J36j03j97L0L7l9J01J5pJ71j79n06
$$ 34 61 -23 7 80 96 -179 3 -29 -136 121 76 53 73 33 169 66 -131 -101 -64 -103 -2 13 6 177 -2 -508
3233e08K79qJ78K92p3k07K7K16k6j98n9q4K06K0R0j19J18r7Q3l76M57r6j90J19
$$ -508 -229 -237 -59 233 160 -47 -20 196 170 -28 -87 -171 35 55 145 26 144 47 130 -246 211 115 -75 44
3257D4j72R6M3j13J19l14L30K79k39L0J37l64k24L84O3n0r2N3n7pq1l1K70j19
$$ 44 -128 -32 11 -102 17 -297 33 312 73 103 240 -124 -348 36 99 49 -43 10 -47 -54 -135 -166 104 -15
3281a5J85k35J98L2J7k99L35j90j62L84k29N2j88J79j36J21K4K25j58K30l29J
$$ -15 170 -65 133 165 182 -117 218 28 -134 250 21 73 -115 64 -72 49 73 298 140 370 41 42
3303D2k31R3j9J37J7o3J13k48J56R0j53M16j74k36r5J92q3N5R0k22J91m0J29k79
$$ 42 -189 -96 -115 22 39 -24 89 -159 -3 87 -66 350 176 -60 -155 37 -46 9 99 -123 68 28 157 -122
3327a22K26r6J05j74K8k96L61K76l52M4j47K62q9k91L92j21M4j72j7j7j42M70
$$ -122 104 8 113 -61 -33 -329 32 308 -44 0 -147 115 26 -265 127 6 50 -122 -139 -156 -298 172
3349A72k61J84k81R0J80j12r8J14kM6j21J2J37j53l2J41J58k15J61k36NQ4r7m9
$$ 172 -89 95 -186 -96 84 -28 -126 -12 -14 32 -89 -77 60 -93 -125 16 174 -41 120 -116 -111 -27 -124 -173
3373a73J03R1P0L6J24j01j17k18K81j34L04k4l18J08j14J08Lm7J39m7j66q7K02
$$ -173 -70 21 91 127 251 150 33 -185 96 -38 266 242 -76 32 -82 26 29 -18 121 74 -92 -179 23
3396B3j05M9J81j73n7r1K31j58P2j80M41p8j06Q2J27l62l9K80K8j5n00M07q8J11
$$ 23 -82 -33 148 -25 -82 -173 58 -100 -28 -208 233 155 49 131 258 -104 -143 137 165 150 -350 57 -31 80
3420H0J13k35M51n43J41m3NK62l37k3L18j62j31n2K33j96J22l2j46m37M33o0K8
$$ 80 193 -42 409 -134 7 -36 -31 231 -106 -129 189 27 -104 -156 77 -119 3 -29 -175 -612 -179 -239 -211
3443b11J98j77J78j6j71L85l16J76r8L19q8j12L1j56J55P5j12J6q9r9K32j88L
$$ -211 -13 -190 -12 -28 -199 186 -130 46 -52 267 179 67 98 -58 97 172 60 76 -13 -112 120 -68 -65
3466f5M8N4k01J34p9J21LJ1o4J51k04j7K68k83M4k52J85K76j93J61J16k28K50
$$ -65 -17 37 -164 -30 -109 12 15 26 -38 113 -91 -108 160 -123 -79 -331 -146 130 -63 98 214 -14 236
3489B36k25j73R8K9J33n1J85j08j76J62j67P2j23O9K3J5J92j85J99j83j67L63
$$ 236 11 -162 -64 -35 98 47 232 124 -52 110 -57 15 -108 -39 -16 -1 191 6 205 22 -145 218
3511B18j63k03Q8p6J80J15k04NK7Q8mm2K2K60k91j41r7K31R4m4O2j13o4J18r2
$$ 218 55 -148 -60 -136 44 159 -45 -40 -13 75 71 29 51 311 20 -121 -218 13 107 63 125 12 -52 66 -26
3536b6L0J62m3p4r0J01L7k68N9K2l0J50j90Q9K18r0J28k88L3J30L6l95N3J70k05
$$ -26 4 166 123 49 -41 60 97 -171 -112 -90 -120 30 -160 -71 147 57 185 -103 -70 60 96 -299 -246 -76 -281
3561b81J82j42O0J94k23L19j52J66Nj83Kl5k2J49j56j67J93P1k82J75j40K04J60
$$ -281 -99 -241 -181 13 -210 109 -43 123 128 -55 -53 -88 -110 39 -117 -284 -91 -20 -302 -127 -267 -63 97
3584I7K04l04J33j68KL3rj5J53j61N0Kk08M47l33K90N3j70j54o4j94J88J08q7
$$ 97 301 -3 130 -38 -36 -3 -12 -27 126 -35 15 17 -191 256 -77 213 266 96 -58 -122 -316 -128 -20 -107
3608a07K20o5J70j78k38N45l34k76K09K04k46o5p9L77k81M2J11o4J13k2M2p0L5
$$ -107 113 48 218 40 -198 347 13 -263 -54 150 -96 -161 -240 137 -144 -102 9 -55 58 36 78 8 43
3631D3N9j41m3j34K97j79J12K12j55M7J54k54l5L28k73L1k31J03Mm1j20L65o8
$$ 43 102 -39 -82 -216 81 -98 14 226 71 118 272 18 -17 311 38 69 -162 -59 -55 -96 -216 149 81
3654H1L8J21k82q7M29l12j56K57j8k65J83O5J4j9k2j6r4J11K7L6J44K6l92J67
$$ 81 119 240 -42 -129 300 -12 -168 89 71 -194 -11 54 68 49 27 11 -83 28 55 91 235 261 -131 36
3678C6k17K96k04J76kp9l0K55n52J87J05o6L28l12j31M1J62j99K97j55J18Lj48
$$ 36 -181 115 -89 87 85 6 -24 231 -321 -134 -29 -95 233 -79 -210 -169 -7 -206 91 -64 54 57 -91
3701i1J70O4l30M15p1ln1l0k93M01J8j62j54L15l25J48Oj65R0l4K02r4J4K12l55
$$ -91 79 143 -187 228 157 154 103 73 -220 181 199 37 -117 198 -127 21 27 -138 -48 -82 120 26 40 252 -103
3726a03K42l13L65k48p1K24m53K28k8kK08m2J26l28R1L25n30n7M02K06l28K94
$$ -103 139 -174 191 -57 -128 96 -357 -129 -157 -159 49 7 133 -195 -104 221 -309 -366 36 242 -86 208
3748B08k73k0p5P3K08j20j87J24K46j91k4r4K26k2j44J36j65J72l97K50j09K12
$$ 208 -65 -85 -160 -87 121 1 -186 -62 184 -7 -31 -125 101 79 -65 71 -94 78 -319 -69 -178 34
3770C4Q8r5N2m4j24j20J47J17j25K03k30J16m6o6K6R8k0O6j43J03j48M01k70K44
$$ 34 122 27 79 35 -89 -209 -62 55 -70 133 -97 19 -27 -93 -67 31 11 77 -66 37 -111 290 20 264
3794B64j30m06L93k22K52l01J53Qj27J57j21J60p9p5P2n8J73j21n3j10L83l16
$$ 264 134 -272 121 -101 151 -150 3 11 -116 41 -80 80 1 -74 -2 -60 113 -8 -61 -171 212 -104
$$ [...]
8191e3
##END NTUPLES=NMR FID
##END=
