##TITLE=1H_EtBisCarb_d6
 DMSO-d6
 8 sc, 
 7.5.2024
##JCAMPDX= 6.0         $$ Bruker NMR JCAMP-DX V2.0
##DATA TYPE= NMR FID
##DATA CLASS= NTUPLES
##ORIGIN= UXNMR, Bruker Analytische Messtechnik GmbH
##OWNER= root
$$ XWIN-NMR		Version 3.5
$$ Tue May  7 14:06:34 2024 Russian Standard Time (UT+4h)  she@DPX200
##.OBSERVE FREQUENCY= 200.1309
##.OBSERVE NUCLEUS= ^1H
##.DELAY= (6, 6)
##.ACQUISITION MODE= SIMULTANEOUS
##.ACQUISITION SCHEME= undefined
##.AVERAGES= 8
##.DIGITISER RES= 18
##SPECTROMETER/DATA SYSTEM= spect
##.PULSE SEQUENCE= zg30
##.SOLVENT NAME= CDCl3
##.SHIFT REFERENCE= (INTERNAL, CDCl3, 0, 15.7039)
##AUDIT TRAIL= $$ (NUMBER, WHEN, WHO, WHERE, WHAT)
$$ ##TITLE= Audit trail, XWIN-NMR		Version 3.5
$$ ##JCAMPDX= 5.01
$$ ##ORIGIN= Bruker BioSpin GmbH
$$ ##OWNER= she
$$ F:/spectra/data/she/nmr/H-F/1/audita.txt
$$ ##AUDIT TRAIL=  $$ (NUMBER, WHEN, WHO, WHERE, WHAT)
(   1,<2024-05-07 14:04:50.34 +0400>,<she>,<DPX200>,
      <created by zg, POWCHK disabled, PULCHK disabled
       configuration hash MD5:
       00 E9 B6 7A A2 85 ED C7 34 08 36 98 17 FE 4E 26
       data hash MD5: 16K
       6E 9B 22 02 B4 55 60 8D 5E 1B D9 6E CD FE F0 DE>)
$$ ##END=
$$ 
$$ hash MD5
$$ 26 64 35 45 2A 25 C9 73 04 36 91 46 EE 41 3E 5A
##$RELAX= 
##$RELAX= 
##$RELAX= 
##$RELAX= 
##$RELAX= 
##$RELAX= 
$$ Bruker specific parameters
$$ --------------------------
##$DU= <F:/spectra>
##$EXPNO= 1
##$NAME= <H-F>
##$PROCNO= 1
##$TYPE= <nmr>
##$USER= <she>
##$AMP= (0..31)
100 100 100 100 100 100 100 100 100 100 100 100 100 100 100 100 100 100 
100 100 100 100 100 100 100 100 100 100 100 100 100 100 
##$AQSEQ= 0
##$AQ_mod= 1
##$AUNM= <au_zg>
##$AUTOPOS= <>
##$BF1= 200.13
##$BF2= 200.13
##$BF3= 200.13
##$BF4= 200.13
##$BF5= 200.13
##$BF6= 200.13
##$BF7= 200.13
##$BF8= 200.13
##$BYTORDA= 1
##$CFDGTYP= 0
##$CFRGTYP= 5
##$CHEMSTR= <none>
##$CNST= (0..31)
1 1 145 1 1 1 1 1 1 1 1 1 1 1 1 1 1 1 1 1 1 1 1 1 1 1 1 1 1 1 1 1 
##$CPDPRG= <>
##$CPDPRG1= <>
##$CPDPRG2= <>
##$CPDPRG3= <>
##$CPDPRG4= <mlev>
##$CPDPRG5= <mlev>
##$CPDPRG6= <mlev>
##$CPDPRG7= <mlev>
##$CPDPRG8= <mlev>
##$CPDPRGB= <>
##$CPDPRGT= <>
##$D= (0..31)
0 1.2 0 0 0 0 0 0 0 0.06 0 0.03 0 0 0 0 0.0002 0 0 0 0 0 0 0 0 0 0 0 0 
0 0 0 
##$DATE= 1715076290
##$DBL= (0..7)
120 120 120 120 120 120 120 120 
##$DBP= (0..7)
150 150 150 150 150 150 150 150 
##$DBP07= 0
##$DBPNAM0= <>
##$DBPNAM1= <>
##$DBPNAM2= <>
##$DBPNAM3= <>
##$DBPNAM4= <>
##$DBPNAM5= <>
##$DBPNAM6= <>
##$DBPNAM7= <>
##$DBPOAL= (0..7)
0.5 0.5 0.5 0.5 0.5 0.5 0.5 0.5 
##$DBPOFFS= (0..7)
0 0 0 0 0 0 0 0 
##$DE= 6
##$DECBNUC= <off>
##$DECIM= 32
##$DECNUC= <off>
##$DECSTAT= 4
##$DIGMOD= 1
##$DIGTYP= 9
##$DL= (0..7)
0 120 120 120 120 120 120 120 
##$DP= (0..7)
150 150 150 150 150 150 150 150 
##$DP07= 0
##$DPNAME0= <>
##$DPNAME1= <>
##$DPNAME2= <>
##$DPNAME3= <>
##$DPNAME4= <>
##$DPNAME5= <>
##$DPNAME6= <>
##$DPNAME7= <>
##$DPOAL= (0..7)
0.5 0.5 0.5 0.5 0.5 0.5 0.5 0.5 
##$DPOFFS= (0..7)
0 0 0 0 0 0 0 0 
##$DQDMODE= 0
##$DR= 18
##$DS= 0
##$DSLIST= <SSSSSSSSSSSSSSS>
$$ [...]
##$SUBNAM2= <"">
##$SUBNAM3= <"">
##$SUBNAM4= <"">
##$SUBNAM5= <"">
##$SUBNAM6= <"">
##$SUBNAM7= <"">
##$SUBNAM8= <"">
##$SUBNAM9= <"">
##$SW= 18.0517689322627
##$SWIBOX= (0..15)
0 0 2 0 0 0 0 0 0 0 0 0 0 0 0 0 
##$SW_h= 3612.71676300578
##$TD= 16384
##$TD0= 1
##$TE= 0
##$TE2= 300
##$TE3= 300
##$TEG= 300
##$TL= (0..7)
0 120 120 120 120 120 120 120 
##$TP= (0..7)
150 150 150 150 150 150 150 150 
##$TP07= 0
##$TPNAME0= <>
##$TPNAME1= <>
##$TPNAME2= <>
##$TPNAME3= <>
##$TPNAME4= <>
##$TPNAME5= <>
##$TPNAME6= <>
##$TPNAME7= <>
##$TPOAL= (0..7)
0.5 0.5 0.5 0.5 0.5 0.5 0.5 0.5 
##$TPOFFS= (0..7)
0 0 0 0 0 0 0 0 
##$TUNHIN= 0
##$TUNHOUT= 0
##$TUNXOUT= 0
##$USERA1= <user>
##$USERA2= <user>
##$USERA3= <user>
##$USERA4= <user>
##$USERA5= <user>
##$V9= 5
##$VALIST= <valist>
##$VCLIST= <CCCCCCCCCCCCCCC>
##$VD= 0
##$VDLIST= <DDDDDDDDDDDDDDD>
##$VPLIST= <PPPPPPPPPPPPPPP>
##$VTLIST= <TTTTTTTTTTTTTTT>
##$WBST= 1024
##$WBSW= 4
##$XGAIN= (0..3)
0 0 0 0 
##$XL= 0
##$YL= 0
##$YMAX_a= 156419
##$YMIN_a= -198625
##$ZGOPTNS= <>
##$ZL1= 120
##$ZL2= 120
##$ZL3= 120
##$ZL4= 120
##$ABSF1= 10
##$ABSF2= 0
##$ABSG= 5
##$ABSL= 3
##$ALPHA= 0
##$AQORDER= 0
##$ASSFAC= 0
##$ASSFACI= 0
##$ASSFACX= 0
##$ASSWID= 0
##$AUNMP= <proc_1d>
##$AZFE= 0.1
##$AZFW= 0.1
##$BCFW= 1
##$BC_mod= 2
##$BYTORDP= 1
##$COROFFS= 0
##$CY= 11.3945322036743
##$DATMOD= 1
##$DC= 2
##$DFILT= <>
##$DTYPP= 0
##$F1P= 15.6554695791079
##$F2P= 12.8336369535428
##$FCOR= 0.5
##$FTSIZE= 0
##$FT_mod= 4
##$GAMMA= 1
##$GB= 0.15
##$INTBC= 1
##$INTSCL= 1
##$ISEN= 128
##$LB= 0.24
##$LEV0= 0
##$LPBIN= 0
##$MAXI= 10000
##$MC2= 0
##$MEAN= 0
##$ME_mod= 0
##$MI= 1.114404
##$NCOEF= 0
##$NC_proc= 0
##$NLEV= 6
##$NOISF1= 3.799351
##$NOISF2= 2.8
##$NSP= 1
##$NTH_PI= 0
##$NZP= 0
##$OFFSET= 15.70392
##$PC= 1
##$PHC0= -25297.79
##$PHC1= 6.387491
##$PH_mod= 1
##$PKNL= yes
##$PPARMOD= 0
##$PSCAL= 0
##$PSIGN= 0
##$REVERSE= no
##$SF= 200.130013532006
##$SI= 16384
##$SIGF1= 3
##$SIGF2= 2
##$SINO= 400
##$SIOLD= 16384
##$SREGLST= <1H.CDCl3>
##$SSB= 0
##$STSI= 0
##$STSR= 0
##$SW_p= 3612.71676300578
##$SYMM= 0
##$S_DEV= 0
##$TDeff= 0
##$TDoff= 0
##$TI= <>
##$TILT= no
##$TM1= 0
##$TM2= 0
##$TOPLEV= 0
##$USERP1= <user>
##$USERP2= <user>
##$USERP3= <user>
##$USERP4= <user>
##$USERP5= <user>
##$WDW= 1
##$XDIM= 8192
##$YMAX_p= 0
##$YMIN_p= 0
$$ End of Bruker specific parameters
$$ ---------------------------------
##NTUPLES= NMR FID
##VAR_NAME=  TIME,          FID/REAL,        FID/IMAG
##SYMBOL=    X,             R,               I
##VAR_TYPE=  INDEPENDENT,   DEPENDENT,       DEPENDENT
##VAR_FORM=  AFFN,          ASDF,            ASDF
##VAR_DIM=   8192,          8192,            8192
##UNITS=     SECONDS,       ARBITRARY UNITS, ARBITRARY UNITS
##FACTOR=    0.0002768,     1,               1
##FIRST=     0,             0,               0
##LAST=      2.2672688,     0,               0
##MIN=       0,             -198625,         0
##MAX=       2.2672688,     156419,          0
$$ Real data points
##PAGE= N=1
##DATA TABLE= (X++(R..R)), XYDATA
$$ [...]
1864A93lJ22l0j93K31j79j69Q3J4L20j55l05j04Q8j10n5j17J91J69j76P7k44J50
1887b02j45M32l6k55R2q8N8J37j00R9J59K73m47J29m2K13j08j77L78L5r6k48R8
1910A59L16j15j07k01P3j06j57M64l65j59J43L1l8k05J7M9J55N3j43q1L03l46
1932b60j4P5J45M9k03K4K58L91q67M01k2K30l36P5L75J95o54K71m2L33k86J73
1954C11k0r2p8j05K96j92l97N3J53K38j45j67N8J12l35J50K76k57L4k26J52J27
1976e4l13J29r1J46L79j21k25J4K10N3j30J23oj09M0L33j49o7k29L18l23J46P9
1999A53K00m7m54J47j62J98k29J81J55j13k76q0K69M74q13J77J17l35K49j37J29
2020a97J48n32O07j00j60M30j67J6M39n34P3j1O2J85j33L9k87K05J72o9K8J58
$$ y = [193, 190, 312, 282, 89, 320, 141, -28, 55, 69, 389, 234, -71, -175, -87, -197, -252, -369, -178, -9, -185, -108, -352, -202, -347, 85, 49, -206, -114, -202, -144, -7, -107, -8, 151, 424, -23, 106, 64, 277, 169, -8, 370, 405, 309, 61, 159, 475, 360, 253, 52, 125, 19, -138, 326, -39, -198, -55, -24, -62, -267, -250, -201, -46, 7, -136, -217, 86, -260, -274, -199, -54, -5, -208, -184, 74, 465, -402, -1, -23, 207, -129, -54, 321, 516, -138, 133, 91, 424, 138, 311, 291, 199, 121, 16, 312, 120, -277, -224, -71, 167, 22, -145, -87, 25, -310, -160, 116, -141, -107, -333, -181, -54, -367, -238, -329, -183, 196, 75, -150, -136, 74, 127, -3, 120, 114, 5, 45, 378, 229, 162, -67, 251, -72, 74, 153, 353, 306, -148, -1, -163, 35, -194, -13, 142, 29, -247, -327, -58, 416, -397, -220, -103, -438, -189, -326, -197, -49, -581, 26, -74, -234, 196, 29, 45, 484, -50, 23, 12, 74, 259, 126, 165, -122, 83, 255, 186, 214, 372]
2042C72j48O1j12n6k94K32M7J12l71J2R2q1j3k19K58J77k38KM2L7P9k93K05PN4
2067c6j73M42m98K60O0j4N3J61l08K37R6J54n08J74o3R7KJ21j77K86j10m50Q36
2090F42q29n8L9N21M0l71j99P2P1j68L69k41k9j85J73Q1M9k39J60J8L3n8K54j55
2114a0R1J41k41M59k73j54l8L51k51k80M49k14p9J59Q7j31lK05j49J9m5j8k49
2137a74L73Q2l22m27O05j51l80L42k6M7k03j05K90N0j12j12J02K28j57k33O4L48
2159A29J47l0k69L8lN6Q9R1l0j37J43n1K40m91j40L58K6j03j31J41O6m03L13J80
2183B29l06n2K42J6j59Q2j91k55O40k44k57K82r0RJ15j31m7K81k9M3LJ40j00j16
2207A05j3K6K7j21j91J51J8J8J10QJ9k99L32J18k47j58k2K13j43o1K14l5k06n4
$$ y = [372, 224, 285, 173, 117, -177, 55, 102, 214, -157, -145, -53, -134, -147, -366, -108, 69, -169, -167, -125, -88, -9, -302, -97, -90, -36, -209, 233, -265, -5, 55, 41, 94, 255, -53, 184, 280, 434, -74, 100, 37, 134, 136, 257, 80, 366, 256, -194, 642, -187, -245, -206, 315, 355, -16, -215, -143, -72, -240, 129, -112, -141, -326, -153, -72, -23, -262, -102, -84, -51, -109, 145, -10, 81, 222, -19, 440, 167, 13, -25, 326, 75, -205, 244, 30, -49, 110, 197, 66, 63, 268, 119, 138, 93, 75, -174, 199, 281, -41, -468, 137, -14, -394, -52, -78, -31, -234, -339, -49, 1, -111, -223, -121, 107, -50, -283, -219, 129, 276, 246, -23, 15, 12, 68, 157, 248, 218, 81, 224, 173, 413, -78, -218, 140, 166, 63, -68, 73, 139, -264, 49, 229, -77, -129, 113, 129, -30, 52, -139, -394, 246, 2, -255, 27, -63, -54, 61, -70, -117, 164, 135, 178, 181, 321, 221, 105, 92, 118, 145, 24, -167, -16, 2, 20, 130, 138, 157, -142, 190, 308, 61, -97, -119, 94, -49, -110, 104, 69, -137, -191]
2231a91J50J10j83R4k09K52N9m21J91L69k61N7N9J3J14k33L7J83J13k8l16K59
2253B18R7j69j0J02Km00J18J41J12j25j27Q6k2j07L09m80q9O1P2K84pk1q4L2m1
2278d8k25J87J05j69k7J64J54k69J82m2Q9J14j4J0j33j91K97k04J69l24M39k02
2300F2k47K63n3n5K47p2j83N9J73m15M21l99K84k45Q3K77l82j48K1M77j63rj6
2323b0l2o3m6K9Q1m4J97O8m37K33j34K24r0Q3M7J27k8j60r9J98K61k59J76m7j09
2348A56m22K21J60l6l05M01k04L99l63j41j08J71k74K00L21k0k80k76M62j34j5
2369h7k5K50j10o8J14J24m11K79k10O4J93Q1j1j54J07J1O1m56M24k43J29k49M58
2392B71l41K76j37j87J87K5j56K37l59J10j09N8L25l90J71P3j98J90J35j8r0k56
$$ y = [-191, -41, 69, -114, -20, -229, 23, 82, -339, -148, 221, -40, 17, 76, 89, 203, -30, 7, 190, 303, 275, -41, 218, 315, 146, 136, 238, 240, -160, -42, 99, 211, 86, -41, 45, 23, -84, 225, -255, -344, -283, -211, 73, 66, 45, -39, -7, -48, -273, -86, 19, -150, -177, -13, 141, -128, 54, 12, 101, 215, 201, 211, 78, -113, 184, -20, 149, -175, 264, 62, -185, 78, 25, -30, 217, 145, -38, 21, 194, -221, 200, -199, 85, -160, -77, 200, -182, -330, -309, 168, 5, -4, -20, -52, -115, -161, -132, -51, -95, 102, 170, -267, -34, -168, 56, -34, 49, 96, 223, 195, 35, -64, 134, 395, 136, 312, 265, 156, -266, -45, 115, 79, -226, 175, -29, 370, 7, -134, -242, -71, -345, -145, 176, 156, -124, -400, 62, -72, -87, -112, 138, 28, -40, 74, 198, -213, 66, -144, -80, 113, 194, 183, 29, 136, 147, 208, -248, 176, -67, 62, -187, 271, -70, 206, 69, -118, 69, 94, -62, 175, -184, -74, -183, -125, 200, -190, -19, 54, -144, 46, 181, 163, 73, -183]
2414a83K09l9Q5k51J17J9L9J85j31J35k08K9RO3L87k98j84l7J12k0k6L28k44k8
2438F8j34r7M3K21j18j60N7Q7p6j70L34k36J34k83K21K7J36k18L50j42J26k56
2460h6J57p4r3K37l1k52L4L29k87p4J34k67L67J15k22J19j13P0j40l8J73mr5k3
2484f4j35L31j01r7J52m9Q5j36r1j73P8P9o5J22J68l0r0k2R9l52L06K2j39J23
2508B1j14K37p0P3O6k21O8P4l39K47l29L18q8J50q3jj49J47n6j61O7J3J70k85
2532b45j12N06k06K53l99L37j64K0R9Jp2M4j6j72K80j20Lj87JrK49J46k11M3o1
2557HJ04k05J06j31M3K68j33k01mM9J20J28j77j29J45J16k26J00j83M02k22o0
2579h2j65K73P5j88P9J17k47K42P9k91M20l4k77j31J11J54j31j9K81j97k8rO1
$$ y = [-183, 26, -13, 72, -179, -62, -43, -4, 181, 50, 185, -23, 6, 15, 78, 465, 167, -17, -54, 58, 38, 12, 340, 96, 68, -66, -163, -120, 101, -17, -177, -120, -33, -109, -279, 55, -181, -47, -330, -109, -82, 54, -164, 186, 44, 170, -86, 71, -3, -96, 141, 110, -142, -108, 221, -66, -140, -6, -273, 94, 209, -13, 106, -7, 63, -77, -115, 58, 54, -41, -64, -199, 132, 31, -66, 86, 37, 122, -14, -105, -278, -200, -121, -186, -64, 104, 74, -16, -38, 61, -291, 15, 37, -102, 21, -93, 144, 74, 147, 213, -8, 60, 134, -205, 42, -287, 31, -57, 93, 10, 9, -140, 7, -49, -210, -143, -130, 40, -245, -357, 149, -57, 196, -203, 134, -30, -10, 89, 90, 18, 62, 46, -126, 154, 34, 37, -150, -149, -158, 91, 237, 26, 69, 8, 112, -93, 13, -118, -75, 193, 60, -141, -145, -96, 24, 152, -25, -154, -9, 107, -119, -19, -202, 200, -22, -82, -247, 26, 101, -87, -8, 109, -138, 104, 183, -108, 312, 278, 1, -130, -19, 135, 4, -15, 266, 69, 41, 32, 93]
2602I3j47J24j1k56J35p9J06j0J09j06N5j44j3L68j85p4P9j57jn5J77k22J52J36
2626G4p3Q3M1m08j4M17j45R1L1J35nk93J19jk12r7M12q4l9j73J52L2R7k51jJ90
2652G8K13m02M1Q6m0j22L94k77k27K96k79NL56j40J33m9k48J74R8q2l32L10j06
2675a20J16J71n7k47K95k11M09l33l0j36p8L77K6J02j44j59j16K65j39j53P4K28
2697A40k88K30j9jk51J68K76k55j5P1k71M30M8k24l61K92j39O7J85j51J24N8R7
2720B11k18P2m3K27k07k07K05J61k62l4J19J21j10qJ30k75L18l24K93R2n58M15
2742A18o5k09O0K14l27O2Q8J91k29J21Q0k70M16k75n8k2L2J93j21L9o2L4L4j23
2766g9R5k50K51j08Pq0K76k32j39K48R3o2k41L09j79L54P6k43j26K2J27m44J61
$$ y = [93, -54, 70, 59, -197, -62, -141, -35, -45, 64, -42, 13, -131, -144, 224, 39, -35, 44, -113, -114, -169, 8, -214, -62, 74, 1, 84, 125, -283, -297, 120, -25, 66, 97, 232, 227, -66, 53, 52, -160, -257, 155, 71, 32, -141, 11, 43, 140, -111, -112, 78, 291, -111, -70, 16, -24, -146, 248, -29, -256, 40, -239, -234, 122, -18, 115, 66, -182, -8, 90, 8, -324, -14, -120, -4, 167, 110, -137, 158, -53, 356, 23, -7, -143, -221, 156, 182, 284, 140, -19, -135, 130, -9, -162, -88, 140, -148, 82, 63, 62, -189, -21, 255, 0, -15, 56, -215, 215, 263, 39, -322, -30, -169, -102, 83, -68, 56, 114, 211, -7, 65, 22, 249, 42, -165, 40, 201, -61, -95, 24, 145, 35, 27, 157, -118, 200, -124, 169, 261, -297, 118, 53, -156, -96, 118, -209, -147, -59, 132, -97, 24, 104, -166, 250, -25, -83, -105, -73, 120, -1, 38, -24, 10, 44, -79, 16, -234, 17, -91, -84, -164, 112, -120, -259, -11, 82, 20, -221, 88, -91, 263, 339, 96, -30, -8, 119, -325, -164]
2789a64K62Lj78j59J50l2r9K48k0n5j70K48k4J88l6k68J15m6j14K28k86L29k91
2812a71n9J53K74l7j40J15J00m62J48J69N9n7L6j75J58j52j0J39R1k12l15L39
2834ij83J66n5L3j23O3p5J85j61J94n4k02M95p9n21M29j98K61k69M0j94K40L0
2857A3J89k25J36O5k65j11o5K25R2k05L8m3J56m2J98l18J48r2K61k32O7L23l51
2880c8J88R6m03K02Nj0l0j25o7L05r0N2l4k85K26k34L37N2m1j25j1J79j45J78
2904A82n0j54K1k74N45j51j22o4J14J34j75n2L86l26N3j03Rp9J92J0k48K24j59
2927h7l2j16M68k30J47j67J06j21J0R6k62K63j86J89lK17j66j2l7o9q6K63K2j39
2951F8q6l27L75J04j43M9o5N6j76L22j30j10N2J73k42J04K80j87j93oJ12o3JK17
$$ y = [-164, 98, 101, -77, -236, -86, -118, -217, 31, 11, -44, -214, 34, 10, 198, 162, -106, 9, -37, -151, 77, -209, 120, -171, -230, -77, 197, 160, 20, 135, 235, -227, -79, 90, 149, 92, 128, -47, 111, -41, -51, 88, 179, -33, -348, -9, -192, -26, -81, -48, -171, -108, -183, 2, -159, 35, -19, -221, 274, 195, -326, 103, -95, 166, -103, -63, -257, -17, 13, 202, -23, 113, 178, -87, -198, -263, -38, 54, -151, -113, -156, 0, -42, 156, -162, -14, -106, 155, -77, -10, 313, -38, 150, 246, -157, 45, 50, 40, 10, -115, -182, 123, 33, 85, 51, -234, -8, -242, 95, 147, 106, -19, -30, 149, 4, 182, 132, -22, -1, -275, 270, 119, -3, -67, 47, 181, 6, -46, 340, 14, 67, -36, -27, -106, 86, 96, -152, 72, -87, -119, -235, 233, 3, 150, -17, 89, -32, -22, 74, -188, 75, -111, 78, 75, 292, 126, 114, 77, 8, -78, 185, 207, 68, -18, -345, 30, 134, -9, 40, -25, 31, -145, 177, 47, -63, -11, 162, -80, 24, 304, 117, -76, -82, 30, -33, -32, 185]
2975A85k4l96L24J2l1k5k35J98k4Q0P3j16Jo0p1K21k2M7j45L7J11j33K6j05J56
3000H4k27j47J73mJ8j7m5k1P9N4K22k16J03l11M13Q2k47R5j02o2J01J8J4k28K79
3025A08Q0j39J21l36K50L7Qj95J34k7r1K16rj57j76P2M6J79j98K44m80J61P9j57
3049b30M38l83K54l8R6j49J03k7J3J42k08q9r8mK47o9K07l99K01o9J52r9J34j94
3073f9n7J79j5K3j29J36j50J34k12Q1J41j22R0j71n9K13K3q2K02q3k35J12J56
3096A06J89l38j00J17j47j7K24J54l2j97R4M2j97J99j91R9k06K69r7P8k39K56
3118F6j34k9K48l3j11J10m9q8Pj14O2P4j21O5J0J51k13m8k4k27M15j87K52l8J46
3143A90k69J9o0K20k73nm6L85J95k69Q3n9J58j93J03J41m00K83q0m9o7n1J34O1
$$ y = [185, 161, -235, 89, 101, 70, 45, -190, 8, -16, 64, 137, 21, 22, -38, -109, 112, 90, 137, -8, 29, 140, 7, 33, -72, 84, -143, -290, -117, -121, -103, -120, -165, -186, -107, -53, 169, -47, 56, -255, 158, 240, -7, 88, -14, -76, 25, 43, 57, -171, 108, 188, 49, 170, -166, 84, 121, 129, -66, 68, 41, -50, 166, 157, 0, -176, -104, -58, 121, -77, 167, -313, -152, -73, -230, 208, -175, 79, 41, 137, -12, 91, 64, 77, 219, 11, -78, -176, -180, 67, -2, 205, -194, 7, -62, 90, -9, 125, -69, -126, 53, 38, 61, -68, 68, -82, 52, -160, -79, 62, -60, 30, -141, -200, 13, 36, -46, 156, 73, -162, -50, 106, 295, -43, -143, -26, -173, -190, 34, 188, 156, -41, 53, 95, -102, 97, -94, 5, -201, 68, -29, 49, -190, 66, -68, -97, 151, 118, 7, 117, 68, -20, -13, -127, -65, 9, -112, -47, -37, 114, -99, -147, -171, -398, 17, -170, 82, 44, 190, -79, -60, -120, 100, -173, -178, -224, 161, 356, 87, 170, 111, 269, 76, 179, 320, -80, 203, 123, 74, 7, -44, 90, 151]
3167A51j22N2P0o1Oj56M4J6L0j05J69j84o0J7K40J5K8l21L83l33J79l44L95O1
3191A70j17o2r1P2k49J99N8R7K09m86J54K45m9j82J35j48O2Q4k01K10j14J07k31
3214a28K6K21k88M5J88k10K42P0j37o4Rj10M3j20J63k52L13L1M4m6Oj07K77k57
3238d1K75j40k43J27L9Jj21J99L3j02k82J34J65k48L94j50p7q5J61k82O40l53
3260D4l1j54P0J11j8J14N4m33l2J65Q7O2N5j28qq9J77Jjl03j11K55m4J28o4J4
3286g9K7K7J07k91M0L05l10M31j08j03j72J46j2j43L59l16P3l1Q2r9P0J86k37
3309d8J08J7p0l13K43j25K64J37k97J45K36k41J3k08j15J03J51j87K91j60K96
3330B40l54n0K93j08J02k08J40l33L25K48m9k81N2r7L8J12p0P8O3rl85L12k06
$$ y = [151, 29, 81, 151, 90, 96, -60, -16, 0, 30, -75, 94, -90, -150, -133, 107, 122, 150, -171, 212, -121, 58, -286, 109, 170, 53, -9, -100, -28, -277, -78, -20, 77, 286, -200, -46, 199, 150, -32, 103, -45, 17, 101, -100, 110, -4, 103, -128, -102, 119, -169, -124, 64, -146, 96, 166, 29, -35, -26, -136, -93, -213, -50, -302, 11, 42, 86, 40, 46, -61, 216, -41, 234, 94, -149, -22, 17, 18, -103, 96, 129, 27, -255, -121, 44, -204, 190, 40, -37, -122, 39, -243, 397, 44, 13, -141, -71, 40, 22, 136, 190, -243, -275, -110, -23, 39, 94, -34, -42, -131, 46, 47, 46, -257, -368, -113, -157, -29, -93, -79, -52, -25, 82, -209, -169, 136, -174, 257, 149, 46, -126, 20, 8, -135, 224, -92, -19, -50, 32, -67, 3, 189, -48, 60, 77, 7, -306, -63, -188, 76, 213, -84, 61, 297, 56, 69, -139, -254, -151, 0, -187, 104, -56, 240, -114, -164, 129, 21, 123, -85, 55, -278, 47, 295, 246, -35, 17, -80, -42, 70, 0, 78, 141, 132, -253, 59, -147]
3353a47J01P6j48k8J12L0l17K60k52M74p0l92M59j83J71m51K29K24l17N8MK08
3375A01J59j46j61M0O2p7J28O7k68N8K49j42oJ29r9L7k16J71o7o5L9j73j9K57
3399E8K7j80l5L13k58J27k11K1K18M7J87m51o9l7L56j98J79q7l9L4J05J85k43
3422D9j18N7L9k38N39k74j08P1J42q7Q8k01J12J3j50jk4j04Q1k23M60j02o8M1
3446fl6P1j31J99r4j55L80j85j03l2P0K49k09J2J53l6k1r7L2J73l74J6J19%k4
3471b9j7j77J50O0Qr3J29j97M6O1l2K93k82r0J95l8P8m6J54o4k21J59m1N8q9q7
3497a12K45M1j74Mj6Nj68K73Nj24K04j54j87Q2K0j49J52N6j62P1l5j0J11n4J24
3522D8Pl6n7n9J15M5l06J73L4J65j40J94j29k91K07j38k4L91k42L3Q1k50m8L74
$$ y = [-147, -46, 30, -118, -146, -34, -4, -321, -61, -313, 161, 91, -301, 158, -25, 146, -305, -76, 148, -169, -111, -107, 101, 260, 114, -47, -7, 55, -22, 106, 173, -95, -37, 212, 70, 64, 193, 94, 131, -85, 86, 19, -46, -7, -180, -199, 58, 85, -95, -130, 183, -75, 52, -159, -138, 80, 127, 314, -137, -206, -243, 113, -85, 94, 7, -32, 2, 107, 292, 49, -69, -12, 27, -211, 328, 54, -54, 17, 159, 72, 160, -41, 71, 84, -66, -67, -91, -195, -114, -337, 123, 21, -47, -6, -42, 29, -102, 97, 3, -152, 228, 43, -60, -92, -22, 227, 18, 30, 183, 147, 126, 29, 61, 234, -140, -124, -5, -5, -29, -46, -223, -73, -13, -5, -98, 31, -166, -120, -59, -91, 202, -80, -170, 25, -13, 65, 19, 173, 109, -112, 47, 6, 64, -25, -112, 133, 174, 0, 4, -12, -7, -175, 98, 103, -21, 183, 29, -158, -76, -56, -205, -53, 3, -159, -88, -123, -133, -22, -76, 48, 55, 19, -38, -97, 18, 63, -243, -70, -36, 129, -11, 183, 54, -237, -30, -168, -192, 199, -43, -10, 71, -179, -227, 147]
3546A47k23J12p9MJ06kj73J9K26j25K1J07j49r4L1L73j49k33JK27Q9l18P9N6k09
3571a56k7J63J66r2k47K55l6k98L12J69j79J23m02K48J97j91K0L2M0n5n2L6J27
3594A53k99K51l9m3O8j07L8Q3O8j50J94j27k10j23L21J01k67QK67j54k2Lj34P0
3618e0J15l59K89J04K8j64k1J09L4k42N4L7K17l20KJ10J58j3J0l26L19j74J48
3641F5q6oK46j26N1m9M5j29j79P8j00K84p5jl82L39j01J42P9k26R2K25k20k12
3665b46J87l7K77k58j78M5R9K03n8o9M9k8Q3j94k6P0q7K3j03L26J2k34J89K90
3689C35k88j54Rq9J74jj39R6N8J15j53j01K09j31J87Kj52K6J06k24J64l88N13
3712A74j2k19K3j88K94O8k6k14K06j94j56M03O5l45M08j21j52J02j44J72k84L54
$$ y = [147, -76, 36, -43, -39, 67, 65, -108, -89, 137, 12, 33, 140, -9, -103, -72, 301, 152, -81, -80, 147, 236, -82, -3, 53, -156, -183, -20, 146, 54, -193, 62, 26, -272, 40, 209, 30, 153, -249, -1, 196, 5, 25, 57, 97, 42, -10, 26, 153, -146, 105, 66, 23, 91, -16, 22, 105, 173, 23, 217, 90, -120, -243, 78, 179, -88, -80, 187, 33, 11, 14, -120, -50, 65, -294, -5, 99, 127, -37, -58, 51, 85, -157, -103, -66, 151, -169, -167, -57, 101, 88, 98, -228, 91, -83, 65, -21, -27, 219, 93, 144, 95, 140, 11, -168, -90, -190, 94, 19, 18, -364, -25, -126, 16, 95, -131, -39, 186, -34, -246, -59, -96, 181, -77, -255, -210, -111, 92, 34, -35, 14, -14, 69, -125, -151, -81, -168, -145, -248, 78, 90, -144, 45, 335, 47, -107, -98, -187, -13, -14, -153, -57, 1, 116, -37, -138, 71, -60, 127, 129, -23, 3, 109, -115, 49, -339, 174, 162, -57, -34, -222, 72, 140, 114, -100, 106, -88, -244, 159, 224, -121, 287, 166, 14, 116, -28, 144, -140, 214]
3734B14n0N1j35j89J11L81k70l29J10j03K39m08L38j71J0L13k78R8RN2j26K27
3756I4K9l21J32k2J14Mj03n0K39j61nM0p5M66l43L7l3O2k86J43j6L5j28J89J10
3781A51k09J0Q4j47R0j1j33K42l31M3K52j44J43q4j24K37j23K07k08P8J9k96J84
3804g0j07K70j63R4L1K11j16k41KN88m07l79J16P3K20N5j51L9n0q1q5P0J7P5r7
3829h6p6J18r0j32M93k88J91o0j63J14l7n8Q1j7m1K24j34j19j06L35M1j92j41
3852a43K93K4j25j5q7qK41Q7k93J74O2j90Rl0J0J52j12j57k7K36k30r2K49j81
3876a53j4O1o9J96Rm0JJ42j46Q3P8l05m9K27pP1l00J5J29K30q1lO0j23q6L29k77
3903b2J15P6p3k47l4J07J76pq5l8o9J53J43j85j91J27J20j77O3j54K21j6J17k32
$$ y = [214, 164, 215, 80, -109, 2, 383, 113, -216, -106, -209, 30, -378, -40, -211, -201, 112, -166, -68, -59, -7, -133, 94, 123, -198, -66, -88, 26, 30, -73, -123, 116, -45, -50, -10, -85, 381, 38, 75, 42, 104, -182, -39, -55, -20, -148, 41, 151, -58, -48, 36, -111, -21, -32, -165, 77, -254, -211, 41, -103, 40, -44, -168, 69, -54, 153, -55, 23, 42, -254, -70, -177, 93, -70, 24, 55, 266, 150, -91, -89, 499, 92, -287, -171, -98, 122, 177, 26, 65, 15, -66, -151, -81, -64, 11, -86, -162, -44, -134, -266, 227, -61, 130, 70, -93, 21, -16, -74, 7, -10, -51, 173, 39, -80, -186, 149, 190, -2, -143, 150, 174, 49, 34, -53, -61, 180, 267, -26, 148, 210, 20, 29, -1, 9, 161, 49, -108, -135, 101, -129, -221, 28, -153, -167, -106, -175, 21, 30, -10, -9, 133, -13, 70, 148, -157, -206, 21, 14, 85, -215, -200, -71, 159, 78, 75, 135, 12, -74, 255, -22, 93, 169, 96, -151, -185, -78, 98, 91, 6, -32, -101, 52, 195, 10, -181, -54, 66, -111, -48, -202, 19, 3, 120, -112]
3927a12P7n6J19q5K00k6K0Mk87K08j6j81J90o2J88Jk44P1j98L24j48J07j73K06
3951A27j19l2J0r3K35k81K30j62m3M4O4J0J08j37K11k64k7K9K6j0J40M4J57n02
3975b35M89j38L7k28J09l4n0Q6j51kJ42J13J29j87k81J29n2P4J73q3r9j76K28
3998gJ52k55K03m4J55k55j77N34m31K69k34P9J20k8k32J75J82j51r4O5k0J06j89
4021g7J21n7R7r5K6k6P5L00m38J14O4l34J54r9o0L23m57J42L8J66m9P5l04M08
4045A07l2ql02R9o7J37J34P8k12j49M0J4m5R7N7J00p6k04K07j08J85j36J21k53
4069b16K54k25K5L01p8j11k16L62j96O1J67lJ41l33n2N6k4L56k32j64m7K7R3J5
4093c9l6J26K36l83j41L49qk93L39J30j48k96P8K25k39n3J84r7J5K92l56Q1k43
$$ y = [-112, -35, -91, 28, -57, 143, 117, 137, 141, -146, 62, 46, -135, 55, -7, 181, 182, -62, 9, -189, 135, -13, 94, -79, 127, 8, -24, -14, -107, 128, -153, 77, -85, -128, -84, -20, -10, 98, -39, 172, -92, -119, -90, -64, -74, 66, 110, 267, -235, 254, 116, 153, -75, 34, 0, -50, 36, -115, -117, 25, 138, 267, 80, -201, -72, -124, -50, 123, 40, -59, -235, -7, 145, -110, 93, 49, 204, -51, -228, 306, -125, 144, -90, -11, 109, 81, -151, 24, 206, 55, -39, 26, 6, 112, -77, 44, -13, 84, -11, 15, -11, 64, 364, -74, 40, 104, -230, -76, -175, -235, 88, -369, -227, -189, -23, -72, 3, -301, 107, 75, 67, -235, -136, -203, -66, 68, 146, -66, -215, -175, -161, -206, -109, -52, 48, -28, -232, -25, -133, 52, -84, 37, -216, 38, -187, -162, 139, 61, -50, -266, 96, -100, -39, 128, 125, 266, -67, -119, -63, -87, 269, 37, -127, -174, -147, -54, -39, -75, 51, 287, -96, -237, 112, 104, -189, 150, 280, 132, -164, -86, 139, -100, -153, 31, -66, -51, 241, -115, -34, -277]
4116b77J07L20k7k7n0J08pJ04m12L1m1rN0K3r1L22R6m91K29L31l03Q0K95n37K17
4141D1m01J64J57N5j5R2j92K92j86r5o4J28L24l60K35k88k42K68K21n3o9o7J2
4164d3j0j0J03J05j41P5j17Jj41M11l11NJ12J09j11j66K09j26K52l71J9L6JL71
4188B62m21O5L70k09k43K41j42J39J03pl69M15o3j10K3j56%n9L32j86L48m43Q5
4211b5N8k32K21k78K12J13L8J32k71j80L03r2n8k09M82j25pm5j49j26L48k2n5
4234C3j43k0L34j89K00o8o8j75Q2K77j55J4m2j02J38k09l5J14PK25l9k35O0j87
4258a83K47k36N5L3J9k0kJ56l8L9j99J4l5R0k16K66R5Mj94O8K69k47P1nq1m0J15
4285D5n5n8M0m7J13q2j45L22j66Q5K1j2j61L5J0M9R8k68L3M88l99N0J99k94J45
$$ y = [-277, -170, 150, 123, 96, 46, 154, 147, 251, -161, -130, -171, -180, -130, -107, -198, 124, 220, -271, -42, 289, -14, 66, 361, -176, 41, -360, -196, -39, 16, 1, 93, -99, 193, 7, -88, -152, -24, 300, -60, 175, -113, -355, -87, 134, 81, 12, -55, -43, -53, -63, 40, 145, 4, 79, -38, -37, -178, 233, -78, -73, 39, 148, 37, -129, 80, -46, 206, -165, -146, -110, -109, 262, -159, -94, 276, 67, -176, 65, -77, 62, 165, 158, -211, 204, 141, 31, 54, -102, -102, -161, 171, -15, 333, -110, -25, 33, -199, 22, -256, -44, 69, 107, 239, -32, -212, 91, -1, -59, -268, 214, 89, 82, 37, -112, -238, 110, 88, 33, -110, -130, 204, 15, 215, 147, 79, -96, -14, 263, 108, 122, 80, -22, 116, -93, -128, -14, -7, 218, 179, -56, 4, -183, 64, -172, -117, -84, -65, -85, -87, 69, 31, 70, -129, -115, -150, -60, -276, -10, 85, 89, -105, -37, 232, -15, 56, 51, -30, -70, 45, -10, -68, -28, -75, 38, -44, -189, 133, -33, 52, 73, 61, -100, -65, -55, -6, 92, -176, -143, 345, -54, -4, 195, -99, 46]
4310D6m5q7j8J88p6KJ71m08K82K8n0n7J63j48k01J98j74J53K45j85p5J38k51M12
4334B51j34K0j20j48j6K26k89R1NJ17J76m17J35N3k05l1K60Q7L0n2k9N3R6k19
4358f0L53k77MJ45o5l11N05q8k35j25P3K9k4J75k78L0Q3K65n76N26l4j37Q7k45
4382a80K2M40l10l0o9n0J24k8p0K47j02j59J78q9J69j27J37j10J33m6j20N5k33
4405b18J63Jm6J26j84J61J1j24J38p7%r4L99j15k20M4l9P1K8r5l0K01lk48j37
4430b87J78J91m6M2q3O9K41l06P5P9l20N26m16J81l25L07Lk91kK20L5o6L8r0o7
4455a14J60J79n7j58j3J27j02j51K00NK7l3j41P2N6k83j09M73j80K57n8j99kJ10
4479F6j45o6K82k07J93k19M90m75K45l88J54J26k49M18l25J12K69n41M62k11N3
$$ y = [46, 1, -86, -104, 84, 8, 10, 181, -227, 55, 83, 33, -24, 139, -9, -210, -12, -186, -33, 212, 27, -48, 90, -161, 251, 117, 137, 17, -131, -147, 79, -210, -119, -114, 3, 179, -238, -103, -50, -255, -286, -26, 61, 91, 39, 10, 63, 159, -60, 293, 16, 20, 165, 100, -211, 294, 206, -29, -154, -81, -52, -76, 99, -179, -149, -66, 199, -377, 149, 115, -22, 65, -180, -158, 282, -28, -58, -127, -177, -53, -81, -151, 96, -6, -165, 13, -76, 93, -34, 103, -7, 126, 80, -40, 15, -218, -55, -54, -100, 26, -158, 3, 14, -110, 28, -49, -49, -143, 256, 141, -79, -35, -74, -3, 25, -70, -100, 101, 98, -150, -287, -109, 82, 36, 78, -5, 64, 305, -1, 74, 153, -167, 359, -57, 124, -201, 106, 109, -182, -184, 36, 71, 5, 43, -47, -114, 46, 225, 168, 10, -3, 124, 22, -129, 71, 76, 103, 70, -71, 1, 57, -226, -335, 138, -42, 215, 157, -42, -44, 66, -79, -145, 137, -70, 123, -96, 394, -81, 164, -224, -70, 56, -193, 225, -100, 12, 281, -260, 202, -9, 44]
4500D4L5j8K06j23l3n1K8K6k61O8j27N2L45j52j12k01L77j87J0K19O3p7l06K01
4524B6k24J53Q5j39MJ26J41j38p2j86K43L42l41n0J13j10K03j96O7J44p6l18K61
4547E8J90k95j32L36j05J05k26L65k56L0k02L31l09K11j09J78j06L3J80j73N2
4568A56l25O0K20nr8J37r2O8j85L4J04n8n6j66Q2M16k48j03n9P3R8L0j17R9J5
4593H0%o1j91K03J49Jq4m8j61L68n52M97k01K0j24J38k76J84l8qJ41j38O9p8l8
4618a48LJ40nM7L75l48L1j71K33j15P3j17N9M9m4Q1j9k2j86k4J28J53Lj11k27
4643a62J75M1j43L1n3Q0J11k03K3L10k11k25l1M43l64O5J62j83O8j44K72k2j55
4666a15K89k70j56R6L64k62k05L54j14K00m8l93L32K94m07J46N1j02J22j14Nn5
$$ y = [44, 79, 61, 267, 144, 111, 60, 88, 114, -147, -79, -206, -154, 191, 39, -73, -274, 103, -84, -74, 145, 208, 131, -175, 26, -198, -45, 40, -99, -95, 31, 172, 34, -38, -224, 19, 361, 20, -30, 83, -27, 176, -20, 47, 191, 115, -203, 58, 248, -47, -179, 157, 52, 157, -69, 296, 40, 70, -132, 199, -110, 101, -8, 170, 64, 97, 277, 104, 156, -169, -109, 111, 106, 8, 145, 53, 121, -64, -30, 74, 16, -40, -206, -124, 292, 44, -59, -118, -45, 53, 83, -34, 65, 80, 80, 19, -172, 31, 180, 181, 97, 49, -112, 256, -296, 201, 0, 20, -104, 34, -242, -58, -96, -104, 37, -101, -32, -110, -148, -145, -5, -10, 37, 412, 64, 95, -76, 157, 42, 115, -2, 57, 106, 62, 143, 124, 102, -84, -108, 20, 173, 176, 65, -162, 13, 54, -89, -58, -111, -31, 80, -123, -100, 210, -1, -226, -257, 186, -178, -113, 49, -134, -66, -210, 62, 40, -115, 174, -96, -252, -156, 208, -54, -259, 95, -19, 181, 133, -260, 72, 366, -41, 105, 156, 54, 176, 62, 67, 12]
4688A2J18K86k74n7k46P0r8K62j33l26L25n1M24K1j75L2l7J63l27O6j02mN2QN8
4713F7J74j00j88Q8l4p5p9J65N4k05O2j37J48l5o0M15q0K0M6p0j85J6k54J96L57
4738C06k65j4M1J62l85J04M15j08q5O0j39J9k73K94j12j6J09j25J2p2N3O2p2k3
4762e2K89m38L74k79K3J42J96k95K43j65j9j31J30L6k88M9L16j10l2J31k61K16
4784G5Q5J19l41m7q4Q9M7J62J76m51N7N22k18k66J24j31m7K77J23l72Q5o4J33
4807E3j72J83O8K10k18J82j38l15J89j38Q1KM5K65m08K46J2k54K06k26J98J46
4829B17k87J68k12k41N38k59L52l27k36K69J64k33J48n5K9j34j3NR6l7R6l9K31
4852B40m77J17Q6r1M33k77n5j78L71K14l20j29L5R3q2J04j01J35n1j19Rl6J04
$$ y = [12, 130, 416, 142, 85, -161, -91, -189, 73, -60, -386, -61, -112, 312, 333, 158, 190, 153, 316, -11, 55, -47, -51, 1, 9, 67, 241, 141, -47, 41, 7, -68, -147, 18, 72, -133, -71, -208, -60, -95, -155, 260, 180, 200, 246, 176, -9, 7, -247, -51, 306, 41, 27, 68, 230, -155, -51, 364, 256, 171, 231, 92, 111, -162, 132, 20, 4, 113, -12, 0, -72, -19, 43, -29, -52, 237, -201, 173, -106, -83, 59, 255, -40, 203, 38, 19, -112, 18, 54, -234, -185, 131, 21, -11, 120, -141, 75, 160, 279, -62, -109, -193, -104, -57, 105, 281, -170, -113, 409, 191, -75, 49, -82, -129, 148, 271, -101, -16, -80, 53, -119, 64, 132, 342, 124, 306, 168, -147, 42, -96, -15, -13, 32, 297, -111, 135, 147, -107, 99, -127, 71, 217, -70, 98, -114, -355, 183, -76, 276, -51, -287, -18, 146, -87, 61, 6, 35, -99, -112, -107, -11, -48, 48, 9, 240, -237, -120, -34, -125, 308, 31, -24, -202, 169, 383, 63, -66, -31, 62, -20, 84, -17, 118, 67, -52, -43, -79, 25]
4875B5n4M1j56J20j28J09J92l20J70R5j38O7M7k43j05L71j17j29K56j03r6J05
4897Ij77M93k43j74L15n38L15j25O1O7k40N10j69RN4k66J09J38k34n6K17k04K46
4920A17j3k14P8R7j27O0n2n0J24j93L58k6k54r6K25N9K3k55J02k5p7M82k99J7
4944F1j20rK50m19L53k12Q5J31j18k65K05M5L8K3j80N7J04j79P2K20R1o4l60o0
4968b51K34J96k33j13N2K45k03J16j83K6K19k05L60k24j47J49j5j22J89m53M05
4989D2j08k8P3K3P0j6K32o8k23lQ8n9j9O5l1k05L20j55K24k61J06j55j15L61m3
5014A15K0j81j50J77k6j31J35O5l19J79M66n75O9j59L48k5k5o6O9j94J80K32k77
5037g3K46j69K04j97k45K66J57m31J42K10j0k9L6r0r0J38K90l62j65J83j4J45
$$ y = [25, -29, 12, -144, -24, -152, -43, 149, -171, -1, 94, -44, 23, 70, -173, -278, 93, -24, -153, 103, 0, -96, 9, -168, 325, 82, -92, 223, -315, 0, -125, -64, 3, -237, 273, 104, 113, 167, -99, 10, 148, -86, -142, 75, -129, 117, 104, -110, -32, 65, -62, -2, -54, -104, 20, -173, 185, 159, -95, -191, 34, 93, 116, -139, -37, -62, -139, 343, 44, 61, -59, -68, 182, -237, 116, -96, -11, 120, 2, -263, -58, -13, 25, 48, -132, -75, 29, -150, -78, 142, 233, 169, -191, -251, -17, 179, -54, -167, -115, 130, -73, 43, -140, -114, 105, -100, 260, 36, -111, 38, 23, -99, 90, -363, 42, -66, -94, -21, 2, 72, 56, 288, 220, -3, -6, 82, 23, 4, 69, 38, -167, 153, -2, 222, -39, 67, -88, -203, 158, 115, 135, -46, -196, -19, -45, -176, -41, 24, -295, -116, 350, -225, -156, -315, 33, 8, -17, -83, -14, -208, -28, 204, -73, 173, 4, 208, 11, -234, 32, 189, -242, -100, 110, 100, 71, 107, 17, -73, 65, 355, -7, -172, 11, -3, 142]
5059A42k3j07j13o4L10m7q2J70j95j36O9M57l25q1K4QL0J13j07M6M6k12J33l2
5083B4k6L0J81R3j58k77K61m8j03K1J0Np3j87N59N6l21k0m7qj28j31L10M7pJ62
5109B25k42J41k0l8J35pj59Q8j79j8K61O1l57O0Jn7K15k00r0O54l41R7Mj37k41
5134a44K5M67l37O0J3j43n2J25J85m44L90j48l7P5j78N5J58k96J82j50J50K60
5156B16M8j96k8p7J75j28o3L3n6O1p6M3j2L09l53L89l68J16l13N12o59L87k10
5179b50P0N47m83J58J3k9L48l07k61K40Q9j66J48K56m16J03k13N83m94J18L10
5200C64k69l60K56P0K87K6o15J62M02l18j88j83N13m09J90J42Q5l17L80mn15L83
5222H2M1k08K60j11l8J7L7j10K74k83k31Q5L68l70K32o2J23j15j19R0l01P72m97
$$ y = [142, 119, 12, -101, -165, 145, 98, 16, 186, -9, -145, -76, 381, 56, -25, -1, 7, 37, 150, 43, 89, 135, -77, 56, 24, -2, 28, 209, 302, 144, -133, 128, 80, -23, -2, 8, 13, -60, -247, 312, 368, 47, 27, -20, -28, -156, -287, 23, 70, 63, 225, -17, 124, 104, 66, 201, 194, 35, 123, -56, -74, 187, 248, -109, -49, -48, -105, 110, -90, -180, 474, 133, 230, 234, 97, -144, -119, 348, 11, 71, 84, -59, -111, 14, 199, -245, 145, -3, -40, 35, -143, -88, 70, -226, -44, -194, -44, 216, 264, 68, 40, -37, 138, 10, -53, -20, -76, -15, -91, -48, -60, 249, -104, 285, -83, 33, -280, 232, -427, -40, -250, -180, 367, -116, 42, 55, 26, 374, 67, -194, 46, 135, -31, 117, 373, -43, 60, -153, 430, -64, 54, 364, 95, -265, -9, 61, 348, 374, -241, -79, 323, 5, -183, -366, 147, -262, -72, 70, 155, -162, 218, 214, -301, 82, 123, -85, 175, 64, 26, 43, 80, -30, 244, -39, -270, -185, 183, -187, 45, -17, 106, -9, -128, -38, -339, 433, -64]
5245f4nL6K08j45k10J8J4j2l4K13O1j72O5K1m9o2K02O0k64L10j30p1R7j78J59
5270F8K3o8N4j90nM6K15j68R9K9j26j05J88N4nJ3k31J85q0o7Q8j29L71p3m0K0
5296A66j36q7k8J97l61J06J59J21k08j56L63j91p4J66j11N05m64J29J39l30J57
5317F2L0P1r9K36j69l11J56j11K34J11k13P7j57J07J5Nn2Rk75k8L04j04J90lk39
5342a54K05k28M4J1J63K9k00L63j31k7k35M97m61K1L24j86K0j53mK87k22ppj92
5366b43J74o9j72L30k09L28k73L25r1j74j36j5K35NJ57j28j12K5j60N5J0k7nR3
5390g7J19o8L31l50n0mO5q9O9K22l09K57j07j36J85J58q5j79J18J47j75l0p2j43
5414b03p6M39K3m9j06n9kj89J5K37j58M0R8K62l65N3K21l7k36J95k54j8J01K00
$$ y = [-64, -69, -33, 175, 30, -180, -162, -148, -160, -194, 19, 80, -92, -27, -6, -55, -117, 85, 145, -119, 191, 61, -10, 87, -91, 68, 91, 23, 77, -113, -118, -72, 143, -25, 74, 103, -23, -128, 60, 114, 109, 122, -109, 76, -4, -71, 17, -112, 259, 186, 146, 166, 30, -57, -85, 112, -249, -143, 16, 137, -71, -227, 136, -55, -129, 37, -74, 431, -33, 96, 235, -95, 62, 92, 163, 64, 300, 131, -180, -24, -135, 99, 210, -3, 74, -83, 24, 39, 44, -8, 1, -274, -302, 2, -102, 88, 85, -154, 51, -177, -133, -122, 41, 70, -130, 233, 102, 75, -160, 337, -124, -103, 221, 35, 55, -98, -102, 185, -37, -44, -51, -243, -69, -138, -310, 20, -189, 139, -134, 191, 100, -74, -210, -225, 10, 15, 172, 44, -68, -43, -203, -148, -138, -165, -170, -77, 42, -26, 305, -45, -95, -99, -34, -123, -54, 168, -141, 116, 9, -127, 58, 216, 131, -48, 70, 217, 42, 12, -60, -203, -279, 160, 183, 134, 28, -31, -33, -222, -207, 30, -128, -88, 10, 272, -93, -40, 181, 144, -92, 103, -151, -169, -68, 132]
5438A32q6k79K32q2J10P5m3j39K01p1k31J15q1J80r9J36M7kl2m00L07L3j05j62
5462b44J99J36k01J86k80O1m6L7K41k45P6J64O3k56J16J54l05J45K7j00QJ15o7
5485a6M7K56n57L73R0j13pj77J73J9l35K55j50J70p7J97J03k15K9r6m3P6n7Q0
5509B5J65k23k2J86j82J48j31j29L25J18O2n08Q3K9J46p3p5q7K46J5j30k5N8k48
5533b27K15Qo6Q4l5O1m1K33J5l02jM3j52R3L18Jk59J42j98qLJ41p3j52K83j67
5559d1j3L01k09O4q1j47J08k63M35j33n0n3O9O2j88J68qK67k84J66j12j77K68
5582A49j94j84M68k77M7R7j52J54K24j92k98K6kP3N4J7k04K08r9K92l08P2K12
5605A83j82l20R0J87K52j34j78P7Q6q6j04L47m67L50k2j62o5m5K80Kj18J38J92
$$ y = [132, 46, -233, -1, -83, 27, 102, 59, -80, 121, 50, -181, -66, -147, 33, -66, 70, 117, 115, 83, -317, -10, 23, -82, -244, -45, 91, -110, 76, -204, -143, -189, -152, 89, -156, -80, 84, 147, -109, 7, 161, -144, 1, 28, -72, -64, 51, -16, 31, 287, -270, 103, 193, 80, 73, -104, 69, 88, -247, 8, -142, 28, -49, 148, 251, 36, 65, -31, -74, 2, -55, 25, 190, -33, -55, 131, -51, 97, -34, -163, 162, 280, 342, -166, -83, -54, 92, 19, -56, -143, 103, 118, -12, -37, 21, -227, -12, -4, -70, 14, -21, 40, -1, 232, 247, -55, -56, -13, -165, -72, 246, 247, -12, 130, -68, -76, -73, 68, -5, -157, 126, -41, -54, 247, 38, 102, 21, -126, -18, -281, 154, 21, -29, -82, -13, 49, -139, 29, 21, 288, 4, 170, 58, -119, 149, -45, -229, 239, -38, 9, 106, -46, 108, 332, 140, -158, -132, -134, -61, -7, 10, -194, 14, -85, 207, -101, -29, 183, 1, -319, -229, -42, 210, 76, -102, -25, 61, -25, -129, 218, -249, 101, 79, -83, -148, -193, 87, 89, -29, 109, 301]
5628C01l45J8k30K18l2j9J55j21q2jK44k01R0m7J47j03o0J32k16K41k28j3K04
5651E2O9j05Ll5J15J31k94M07k79j16n3K54k60K73l40M35k04K30j80n0J59j16
5673I6j99p2M31r8pk57R2J7kJ41o8q0O6K6m1j42J22k23J48J43K15q5j94m5N2R1
5699A27j41J15J6j77q1J37L6o4J97m5k14R4J54j19Q5j73J09j19J79j79rL56n10
5722b26J69J53P2M7j77o7nJ98l90K62p3J60m2oNj94J28j48K39j58J69r4J11j08
5746B5j38M64k45l11K30k02K1K71j18k46M60l12J80k52J94P4j12Mj70K40j84L82
5768B55j36%k03Q4p0qM0K13j57K51k81Q0Q9j73J02l00K27k07L48k75j45K30K45
5791B09j29j13J10R8l9l60K44n8p3J59k30J23j75L63J16k73J16j47J62j13q7K00
$$ y = [301, -44, -26, -256, -38, -70, -89, 66, -55, -137, -138, 106, -95, -5, -52, 95, -8, -68, 64, -152, 89, -139, -152, 52, 121, 16, 19, -16, 99, 230, -64, 343, 64, -52, -105, 149, -111, 162, -178, 257, 53, 283, 103, 53, 212, 96, -103, -175, 256, 158, 151, -106, -14, 3, 1, 142, 74, -6, 60, 86, 45, -97, 25, -198, -50, 93, 308, 223, 29, -16, 36, 127, -14, 101, 117, -60, -141, -4, 32, -32, 165, 120, -94, 0, 154, 35, 120, -53, 56, -63, 116, -63, -72, 284, -226, -57, 96, 168, 215, 38, -29, -34, 164, -226, 36, -37, 123, 81, 75, 80, -114, 14, -134, 105, -53, 116, 22, 133, 25, -113, 351, 106, -205, 25, -177, -156, 115, -3, -249, 211, -101, 79, -173, 21, 95, -17, -13, -183, 57, -127, 255, 119, 119, -84, 0, -70, -78, -38, 175, 18, 269, -12, 68, 157, -16, 86, -214, 13, -194, 154, -121, -266, -36, 209, 80, -33, 77, 175, 136, -224, 20, -38, -111, 48, -182, -59, -234, 129, 245, -28, 88, -59, 103, -10, -97, 103]
5813A03j59L2J13q5k7J00q1L7R4o7j36J28K0j33m6J23Or3K64k57j03QR0K25m4
5838A12k44L04l19M6K36Q0j85P4j21n7j30L36j55K03l74K1L0J92M7pJ5j18jJ22
5862A07k78K27k67J02L52k33J34j91J01j90N9M4K16j67r0K53j38j9qn3j2L42l29
5885c8j8L10j40J50l55j94NL65N5k55M9R6L6j25K37r0J10k56K40nj77Mj00J19
5909B3N0P1N6m0l87M8K14Q5j88J99k62J27o2ko0K9M39j86p8l48J15L32j64nP3
5934G9p9Rj56L66l16J83J8N3m05M21nk49M9p2K41o8k42J86k3K9J33k21K24k11
5958e6q2J5K5j52K30n8qN7Q6k15M79k55j86L44j61K39j91q0%LK0J8K5j26K27k
5984A96k66p1O7J16j84QL50l66J16J61j04k06L49l11M0P1j20K3k87L28p6J76n5
$$ y = [103, -56, -24, 89, 4, -23, 77, -4, 33, 127, 60, -76, 52, 72, -61, -107, 16, 22, -71, 193, -64, -167, -159, -69, 156, 112, -132, 172, -147, -101, 135, 215, 30, 104, -17, -74, -204, 132, -23, 180, -194, -173, -143, 49, 96, 89, 104, -14, -15, 107, -171, 56, -211, -109, 243, 10, 144, -47, 54, -136, -77, -33, 183, 16, -74, 179, 41, 22, 14, -39, -51, 291, -38, -56, 254, 114, 264, -91, -285, -280, 85, 140, -115, -66, 30, 66, -59, 178, 88, 198, -58, 182, 177, 0, 4, -96, 23, 73, 144, 200, 160, -227, -179, 35, 120, -68, 131, -131, -4, -66, -68, -128, -99, 340, 154, 76, -272, -157, 175, 11, 6, 79, 0, 9, -147, 219, -97, 86, 104, 157, -248, 173, 168, -81, -32, -104, 137, 69, -173, 13, -10, 19, 152, -69, 155, -56, -138, -123, -98, -250, -20, -78, -86, -29, 57, -158, 321, 66, -120, 224, 63, 302, 111, 31, 31, 34, 54, 72, 97, -29, 198, 196, -70, -141, -74, 42, -142, -134, 216, -150, -34, 127, 23, -183, 166, -145, -105, -34, -154, -131, -418, -90, -166, 10, -45]
6007d5O9j50K14q1k76K20J82J7L6j09J10l46R9j59J37J81L0p6O2R5k37q3J92N9
6031A41k33J7L14jj81p1j96K40J05l0k08J08m9N4k09k1k67L91J52k10L28j19L3
6054H8P2k26J60m05N79k90P6j65J72N8j24j14J52R4n1J7q2Q0j9J40j03j45j86
6077b22K48J9k71J86k52L25LJ31k55l2K7J16Mq6J69l81L03J47M2q3l35O6j56K11
6101g6L1J36pj81J59p8J19J5l5q9J88j98J3K56m70J15J95q9J0K0l5M4j36K31o6
6126G2K39j00j80O8J18m21R5M7K36k07NlN8J47l53J34J47Q4l11J71j29l2J01P6
6150F2j04k17K57p4j21m4K34j84J95j71Q0L36n03O03m56J00j7j35K15j33J21J16
6172A60r4j14J92k12K33j58k38L57P0m42K41K5L10j77M0l80L62l00J37J7M0j17
$$ y = [-45, 24, -126, 88, 7, -269, -49, 133, 150, 186, 77, 187, -159, -60, -219, -82, 99, 129, 53, 115, 210, -27, -110, 82, 141, -92, -75, 239, 238, 57, -14, -210, 30, 135, 105, -103, 5, -44, 10, -199, -220, -487, -96, 56, -154, 174, 55, 88, 160, -66, 94, -311, 268, -22, 54, -111, 61, 119, -5, -119, 33, 127, 76, 93, 11, 91, 72, 212, 109, -36, -222, 26, 45, -226, -40, -292, 33, 36, 167, -88, -120, -93, 23, 27, -59, 110, -271, 32, 179, 221, 138, -197, -131, -287, -76, -45, 91, 84, -97, 62, -16, 103, 118, 83, -6, 182, -16, -3, 253, -217, -102, 93, 4, 14, 34, -1, 43, -93, 138, 72, 311, 211, 31, 99, 217, -204, -109, -62, 174, -33, -28, -31, 27, 174, -179, -45, 102, 186, -125, 46, -83, -115, -14, 62, -42, -259, -2, -76, -197, -241, -7, -191, 4, -167, -87, 249, -254, 349, -107, -7, -24, -159, 56, -77, 44, 160, 66, -48, 144, -68, 165, 7, -231, 126, 196, -246, -5, 20, 330, 153, 193, -187, 175, -125, 12, 29, 69, -48]
6194d8k44N18l52P7J02j40rR5J53j71J53Pj62J26k02K61l96K37k1J90r1j26q0
6217a23J20K1L8jK42k73j56K42k05J43k20K11L40m45rK79j8l07M67m32j99J44
6239a41J29LK99k46J98j10j46j5J03J54j96N5J00J15m78J19M8J26k13L04j91p
6261A0J75l24K00j02R8n0M8j29J47k10K63j52P7P9j72M0J92m0j34k43L73p9j07
6284d0J01j93L05k26K43j15j82K54k80J17k9L8j15P2K29P9q8j01m7j04J64k62
6306a80Q8LL22l79K30j12o8R2m7L35o6j19j71J50m88Q01n03R2j32Q9%M3R0k87
6330b17K10J07j30KK0J06l83L13p0L0o7K08K8l26N5Q6l4K21l31N7J31k05K65o6
6354A0j84O2J62J41o9l17J00O1o3O7kJ61Q1k84l0R0K87m68M38o57P18k07p0j50
$$ y = [-48, -292, 226, -126, -49, 53, -87, -96, -1, 152, -19, 134, 141, -21, 105, -97, 164, -232, 5, -16, 174, 83, -43, -123, -3, 18, 56, 55, 297, 24, -132, 110, -95, 48, -172, 39, 379, -66, -75, 204, 186, -121, 346, -86, -285, -141, -12, -9, 290, 44, 242, 132, -14, -29, 74, 228, 32, 87, 187, 302, -176, -57, -9, 117, -96, 208, 17, 10, 185, -139, 61, -41, 57, 7, 55, -74, 73, -137, 126, -26, 51, 130, -42, -2, 190, 150, 16, -227, 146, 67, -40, 61, -132, 173, -53, 190, 75, -107, 147, -133, -16, -45, -7, -122, -50, 179, 258, 170, 69, 22, -82, 82, -180, -92, -89, 233, -146, 84, -28, -96, -4, -51, 284, 218, 99, -72, 78, -410, 391, -112, -20, -152, -63, -63, -20, 70, -217, -7, 100, -30, -28, -8, 98, -285, 28, -42, -12, -79, 129, 157, -169, -114, -28, -62, 159, -172, -115, 16, -189, 76, 10, -174, -112, 50, 191, 122, -195, -95, -34, -97, -30, -32, 129, 210, -74, -104, -14, 273, -195, 243, -414, 304, 97, 27, -123]
6378a23L03j48O6j07%L37k31j06R7l20L21r2j4J6K32k47j04J24J6J02o5j69L7
6401g5K74l44J28j6K13p7r5J10k51P4j43L68k74k4K45j52j09K23k57J46Q9r0m9
6424h6L33k3l04J65j74K57j51J39M8l95L71k21p2J65j0Q1j90J17l65L70k40l7
6446b22K24j95L14M4J5j41o6l0J86R6j76K19j19m63J95O0M3M3m7j24J79K6J15
6469A76j41K2m2j23K81k82L03l19K09j15j2K37l63Q6j45K45j65J2j05K26L27l58
6491d6P2N5k78Q4L00q4kj22P9K66m33J51L9k47J92Rl0O7J6j19J73k79K89l24L10
6516A38l7j47J22k9k35K41J2j73j24L22J0q0J91l71N9K55k76q6K8K51p7M9p7q
6540d2O5N4j96N1k0L31k05J34l6l41M37l44R2J6j26m2m5K44p0Q0q9j40O4J14j79
$$ y = [-123, 180, 32, 98, -9, -9, 328, 97, -9, 88, -232, 89, -3, -17, -1, 231, -16, -120, 4, 20, 122, 57, -112, -75, 199, -145, -17, -33, 180, 103, 8, 118, -133, -59, -202, 166, -108, -132, 113, -39, -148, 75, -182, -36, 53, -37, -86, 247, 224, -80, 85, -89, 168, 17, 156, 204, -191, 180, -41, -113, 52, 42, 123, -67, 50, -315, 55, -185, -222, 2, -193, 121, 165, 180, 39, -27, -57, 129, 225, 49, 268, 149, -314, -119, -59, -16, 27, -20, -144, 35, 61, 176, 35, 57, 15, -108, 173, -109, 194, -125, 84, -31, -43, 194, -169, -83, -228, 17, -148, -136, -241, -15, 312, -46, 26, 81, -197, -113, 187, 103, 101, -21, 58, 324, -109, 42, 81, -166, 26, 35, 5, 72, 88, -31, 142, -137, 152, -172, 138, 101, -46, 76, 47, -188, 53, 65, -108, -232, 90, 100, 20, 211, -160, -101, 154, -122, -208, -180, 71, -6, 43, -34, -42, 23, 77, -119, -68, -88, 243, 38, 172, 136, -205, 232, -112, -20, -4, -130, -172, -217, 27, -43, 37, -52, -192, -128, -14, -193]
6565a93L49j60n1J97k9J11k64j43J25r5K00r4K52k81K80j34nJ00j22J36p7o2k38
6588a98K34j14m0J81p8j04J74L6j7r8R2J01j28j13L35m01J50k5j29K79j17l00
6610b80K62l5L10k84Ql0j15J51j66M04l33K5J14J24l30J95O1nj15J39k39J46J21
6633A28r4M5J01k04Ln0K24j65l00L81K92m51J51j3l51K71n1K42r9k73M29m42K86
6656F0m4j30K49jj9k32J99k24J36K4L3J16k24K77j82J30j34K1j18j10J08jJ8K01
6680A53k21KK68k40M4l04L37K20l06J1J70j68J40l51K10j12J26j41J06o8K02K5
6702A03k29L27j02j44kn3L5k0N6J20J1k29LJ09j26K79k24Q3j5j17L65k57k0n5
6726a02L42m02J79oK4oj7o4O6o3q9Q4L28j18k33pR9N7k04K36j15L23q2k46J00
$$ y = [-193, 156, -4, -55, 142, 113, 224, -40, -183, -58, -153, 47, -47, 205, -76, 204, 70, 65, 165, 43, 179, 102, 40, -198, 36, -78, -118, 63, -15, -119, 55, 91, 74, -24, 68, 169, 41, -72, 263, -138, 12, -13, -142, 137, 20, -280, -18, -53, 257, -27, -19, -49, -164, -13, -179, 225, -108, -83, 31, 155, -175, 20, 81, 76, -39, 100, -139, 7, 128, 34, 79, 180, -24, -21, -71, 153, -12, -312, 69, 361, -90, 61, 48, -303, -32, -83, 159, 60, -213, 216, -226, 60, 16, -114, 135, 134, 115, -117, 82, -142, -6, 18, 51, 167, -57, 220, 38, 168, 34, 55, -63, -173, -65, -66, -48, 153, -68, -66, 202, -38, 6, -298, 39, 259, -47, -36, 134, -34, 106, -245, -35, -147, -21, -162, -56, -124, 78, 103, -126, 201, 99, -45, -47, -100, -65, -85, -29, 91, 102, -127, -124, -15, -141, 138, -86, -3, -18, -135, 230, -27, -47, -102, 240, -162, 17, 11, 35, 29, 12, -52, 14, -49, -138, -54, 274, 156, -77, -84, 15, 72, -132, 104, -11, 312, 230, -16, 84]
6751H4q3j1K99O9n32J87P0Q2l10k3N0K32j10o6PJ64n9J84m89Q8L18j89K94n57
6775c01K38K70k71J89r7km9n5p2Q4M4jk77N5j11M15j40M2o0K35q0p7P1j86Q3J45
6801I2k91K35m3k50L50ol48L68k4J11k69J4k7J18N2M0m3l13J00J01r6j8J8j8l5
6826a82M08l46N5M3Kj80n2L93l52L93k40K08p6N5pO7k19Lk38K95j15k22M07n1
6850D9N6q3j61L05R0Oj41R2j26j04N3k16K42j4J38k35p9K98M1j81K02k66J07n
6874F8L12m41M7n5K63k17J7m2n3M2l1O7QJ19L22l66j14K37j44J02p7j98J05Q9
6898F0k53K33o7JJ48j94k4Kj4K45j49k1m9j44J07j40K13J87j78j50K58M1o8j36
6922i2R1K47m33K00j32L17j81k9j72J84j86K10J78k70J36j57J40J5r8m7P2j03
$$ y = [84, 1, -10, 289, 358, -174, 13, 83, 165, -145, -168, -118, 114, 4, -62, -55, 109, 50, 234, -255, -167, 151, -38, 256, -301, -63, 207, -64, 125, 28, 26, -23, -78, -150, -66, -22, -23, -300, -245, -356, 59, -81, -39, -99, 136, 56, -21, 50, -136, -53, 92, -199, 36, -7, -257, 93, 87, -261, 107, 83, 194, -75, -61, -88, 30, 82, 122, 79, -234, -134, -33, -129, -147, -129, -147, -182, 226, -120, -65, -22, -20, -200, -252, 141, -211, 182, -58, 150, 74, 129, 122, 189, -30, -27, -265, 30, -85, -307, 100, 49, 105, 22, -139, 166, 256, 262, 121, 213, 87, -17, 36, -180, 62, 48, 186, -49, -128, 170, 211, 30, 232, -34, 73, 68, 380, -61, -14, -69, 194, -23, -6, -48, -101, -59, -90, -23, -15, 104, 426, 60, -54, 183, 39, 141, 64, -134, -29, 60, -193, 40, -27, -26, 122, -72, -96, -94, -108, 137, -12, -33, -82, -226, -119, -259, -46, 141, -37, -187, 71, 112, 44, -92, -1, 246, -187, 13, -119, 198, 17, -12, -184, 0, -186, 24, 202, -68, 68, -89, 51, 66, -32, -79, -7, -110]
6944a10p1M19j13l32K88o8o9K27j11p4p3j4%K54q3kK5k4K1j68K68o0k24K05K8
6969A39j2j30K07j11r6P5O1q1O1N2Q9r6j42KnR3K60m15r5L13l24J57O7j40k19
6994b90K57%J68k72K46k53L78k14p2L6L1j31J47Q3R7l09K52J28j93k80K45j29
7016g5j00Q6Q0m5k0q0j48K61O1K2j46Q8O1l17J45J04N7K5M9k28J78l01L39M9R3
7041B38k11l98L88j08J7p4J71N0m9JK08l19J27j0J17j84N9J59p6m06P3L44j70
7064e3m7Q3l9N2j98J07J45k8m8J69o6J66k96o6M7K28k83K20j98o0P8J20o0Q9k36
7089a74K32k43J64K7l5j28K2K43l06J63Q7J08k21k9j12P6K79m04K39j33j18R5
7111a68q3J07J80M1j55l0j3J04K81k64j07J09m6p5J37l80M37K6j41J93j26j1r0
$$ y = [-110, -181, 238, 125, -207, 81, 13, -56, 171, 60, -14, -87, -101, -101, 153, 70, 68, 93, 69, 90, -78, 190, 130, -94, 111, 139, 127, -3, 204, 93, -3, 72, 133, 52, 113, 165, 254, 158, 16, 18, 13, 106, 366, -49, -144, 169, -155, 2, 69, -71, -290, -33, -33, 135, -137, 109, -144, 234, 20, -52, -16, 15, -116, 31, 114, 211, -98, 154, 282, 89, -191, 54, -75, -175, -89, -9, -54, -74, -154, -302, -41, 20, 42, -104, -16, 45, -272, -127, -23, 34, 59, 108, -120, 58, -243, 96, 145, 238, 27, -371, 17, -91, -74, -148, 23, 73, 24, 25, 233, -86, 41, 31, 148, -36, 23, 182, 106, -300, -227, 117, -53, -100, -17, -56, -4, -202, -95, 50, 22, -26, 143, 77, 243, -53, -119, -72, 156, -127, 93, -105, -165, -87, 33, -27, 62, -174, 58, -185, -21, 6, -29, -157, -135, 108, -198, -35, 52, 160, -61, -90, -202, -126, 153, -251, -12, -145, -263, -168, -251, -144, 36, 77, -78, -108, -121, -17, 264, 0, -107, 2, -44, -119, 18, -362, 75, 101, -40, 153, 27, 16, -74]
7134g4O7K70j91m6Jl30K84j17M07k13j73K89j15j93J90K8l6l32L39j82NJ64j45
7157a03M26l38q6Q8P8j46j17L69j06j12p6M0L02k62K01k75O8N4m3J19k05J9kj03
7181b10K20K8l7K87k85j78r8J88M65l05j00K54l83J75j14K57rj24M9O8j93K6J4
7204eJ31j98j4K36l28M14k40l0K97l86J76Q7l87J83R2k17K9L97k68L7LJ38j31
7227A6M0k21R2N4rj81K37k07K77J49l99J60k1j18K54j41NJ51j02J22o5K3j52j5
7251e1J83l0p6L1k30L24j14j74J61k01J60o1J9M3J46k03K44k69j26L83k29m7R1
7274b6K4k0KL2p8K14j36l0j69K05K01k29J13L7k84K56l11J76q3K9K43k54K06j71
7298e3K02k44m0J57P0M8l29R9m6k4K7j07Q4P0J32j47K94J0m49L31j86l42M60o7
$$ y = [-74, -7, 263, 72, 26, 27, -303, -19, -136, 271, 58, -115, 174, 59, -134, 56, 84, 48, -284, 55, -127, -122, 42, -103, 323, -15, -101, -13, 65, -81, -198, 171, 65, -47, -123, -83, 219, -43, 158, -117, -49, 5, -38, 81, -124, -105, -107, -210, 10, 38, 1, 288, 3, -175, -273, -85, 380, 75, -25, 229, -154, 21, -93, 164, 155, 31, 80, 148, -45, -19, -5, 126, -72, -86, 150, -178, 236, -4, -34, 263, -123, 53, 140, -247, -64, 28, -189, -160, 237, -31, 6, 9, 147, 16, 56, -165, -73, -19, -28, -209, 28, -179, 98, 247, -152, 8, -13, -131, 123, -18, -13, 138, 36, 158, 93, 116, -36, -51, 132, 102, 26, 57, -173, 151, 37, -137, 24, -177, -17, -78, -59, -16, 130, -73, 171, -98, -224, 159, -70, -117, -26, -2, -22, -20, 12, -66, 148, 12, -18, -187, 18, 219, -10, 103, 140, -144, 112, -199, -23, -106, -77, 166, -88, 118, -53, 149, -95, -135, 22, 92, 140, -189, -90, -136, -160, -133, -240, -156, -86, 46, -101, 193, 203, -246, 85, -101, -443, 17, -50]
7322e0L5J98j24o6K05l27Q0kj05M70p1k56J85j63j43L77l40j3J37l07N68l00k0
7345c2m2L75j85k97J08p1K08o2p1J31%k31J30K34r3k60J08J60j00J67k71K26L
7368A35j69J07l55L51J65j10k26J85l7q5OJ95j60R3o3R3k65L6l2J67j01L15n22
7391b77L45k30L18k85o6J10J63m4j0m1k61J39Q8J55k75K80k01J57j4l1r4K19j3
7414A32q0M3j98J69j07q6p4K48j18J18k79N66L0k05j38J48Jl79K74M7J54j41J1
7437A36j13j54J76J75k03o1J37j73q9K49j45L6j13N9K29l34J75R4l99L81j20l0
7459h7nJ33K23k95K86k86L2NJ79j33q4R7K92m00k28K96j43N1K19l1j84P1j46j0
7483a48J16m5q4M29m64J38J56J6j27J17m3K9j13Q3L2R3L5k56Q4o5j25K09K00q9
$$ y = [-50, -15, 183, 59, -7, 198, -129, -49, -51, -156, 314, 243, -13, 172, 9, -134, 243, -97, -110, 27, -280, 288, -12, -32, -74, 301, 116, -181, -73, -144, 64, 2, -69, 62, 62, -169, -39, 195, 102, -158, -50, 110, 10, 177, -94, 132, 135, -34, 73, -282, 69, 234, 124, -102, 83, 46, -39, -33, 162, 2, 95, 32, 125, -140, -104, -136, 31, -70, 245, -277, 68, -162, 156, -129, -195, -85, 78, 34, 24, -17, -278, -139, -51, 104, -171, 109, -92, 65, 51, 20, -74, 145, 132, 52, 95, -103, 66, -41, -127, -201, 47, -71, 47, -232, 334, 364, 159, 21, 169, 170, -209, 65, 112, 266, 125, 136, 23, -131, 45, 220, 17, -44, 93, -80, -169, 80, -65, -29, -142, -83, 146, -188, -13, 81, -318, 63, -57, -87, -92, 41, 264, -31, 255, -31, 1, 6, 185, 52, -32, 65, 357, -43, -271, 25, -118, -67, 152, 121, -63, 8, -138, -148, -32, -77, -161, 268, -196, -58, 98, 114, -13, 104, 61, 90, -23, 60, 92, 185, 220, -36, 48, -17, -142, 67, 267, 178]
7507A78l50J25MN9l13L51j69j28J56K5L7K89k67P2j0j34P9L73l65J88j46J07j65
7530dk12M35l6p7j49J64j99p5R5J40ol57J80J20l9k26K79J26j64R2j46J02q3J87
7554A47j30k69L60l79K36L52j30j24K59k55n7L6j50M05k70K0O4Pm1k87K90m3p9
7577c8L67j54k94J30M6J7j49j24K44Km10K95L45k64j82K7J27j88J31k7J55q8k34
7600b66K83p1J97l9k01Q6K92l42k09L04J3Q3j40J97j56j11J56j91K72O1k51K5
7622hJ42n1L5j65j87R6J24M2rk64L05m1k15J71n7K12mj51K19j99k02M04o2j04
7646C1O9n4j17M40m89L5n9P7J35k03K36l5p2j96L07l83K82J6j93K12j43M3J35
7669G4m8j8n7R3j79J83k33J12m0r5O6K31J53k80l5J77k29J97k52Q0j88L23k4j35
$$ y = [178, -172, -47, -43, 16, -297, 54, -115, -243, -87, -62, -25, 264, -3, 69, 59, -75, 4, 377, 12, 200, 54, 161, -4, -216, 219, 183, 106, -43, 121, -78, -153, -58, 82, 76, -281, -101, 19, -20, -246, 33, 159, -5, 87, -59, 43, -40, 147, 17, -252, 108, -271, -35, 317, 187, 63, 322, 67, 10, 46, -104, 301, 31, 51, 115, 122, 81, -206, 84, 41, -38, 329, 175, -119, 11, 57, 74, -75, -199, 45, 47, -363, -68, 277, 13, -169, -142, -15, -203, -72, -99, 56, -32, -266, 17, -54, 143, 104, -97, -11, 281, -61, -270, 34, 47, 130, -10, 187, 31, -80, 76, -115, 157, 218, -33, -8, 134, 83, 118, -47, -234, -138, -14, 28, 19, -245, 60, 19, -196, -25, -82, 130, 126, -25, 194, -5, -207, 197, 135, 31, 100, 46, -71, 369, -120, -85, -144, -67, 68, -135, 101, 66, -6, -202, 105, -278, 4, 20, -173, 39, -104, -61, 74, 26, 8, -49, 44, -135, 48, -185, -73, -113, -208, -142, 89, 242, -38, -73, 104, -125, 72, -180, -100, -288, 35, 11, -124]
7693a24J04j2R2j80J31k78L48k73JK77J8k03J56p2J06O6o1k64J90q0K4Q9j08k4
7717g7o3Q9L41j10j45O6O6j05Q7l51J23O7J84o5m5K18k04j43K17m0j79N96q05
7740b78M73k63NJ49j20O9j83k6L11j75K48j88p5Q7p9L03m00J58p1J25N7J4K6l75
7764b08j92K18L28r5k11J30k40N10J9l60J41oj04L23k27k43M09j51k90N33l69
7785h5L0l6P2J6K07l58J78r5K21l4m8P7n10M45j62J28M8k64R9q3J69j6j95L41
7809A45l90K36j73R6L04k61Q5P6j42m7M02l87J13j14J77j38K13l44j0m9j60L09
7831e9L17k78k14L1K34N5J7j36P5n1n5J21j32J04l8K02l07l22N37r7j4k32K39
7854cmj25N47n46L10L1j73Rj96L71j15l17J35k07K33J01n3J85p5j36k4N4P8p2
$$ y = [-124, -20, -32, 60, -120, 11, -267, 81, -192, -191, 86, 104, -99, 57, -15, 91, 157, 96, -168, 22, -58, -34, 55, -53, -77, -140, -51, 290, 180, 35, 101, 167, 62, 149, -202, -79, -12, 172, 107, 62, 280, 76, -67, 150, 110, -69, 527, -278, 195, -68, -63, 86, -34, 35, -148, -174, 137, -38, 210, 22, -53, 34, -45, 258, -142, 16, -55, 70, 127, 141, 167, -208, -400, -182, 146, 51, -160, -30, -270, 240, 259, -101, 40, 34, -70, 253, 26, -217, 192, 41, -249, 284, -85, -55, -91, -19, -3, 204, -154, 24, -71, 150, 116, 68, 145, -365, 80, -82, 46, 94, -170, -71, -154, 15, -1, -196, 145, -245, -9, -182, -86, 218, -43, 42, 118, -24, -71, 331, -56, 57, -57, 120, -18, 195, -149, -159, -208, -368, -59, 258, -20, -234, -203, 31, 86, 103, -33, 42, -9, -64, 57, -75, 29, -9, 193, -114, -436, 101, 4, -10, -242, -3, -7, -132, 415, -131, 179, 210, 37, 46, -150, 221, 106, -211, -76, -283, -50, 51, -2, 183, 108, -28, -52, 2, 80, 8]
7878Hj37K15q5m4L9k2l4J36q6M5j98j66N39j73j6j5j29j2R3%o7M36k80j1l2J0
7904A4k2j81K18J0j50M07k30k42L93j00j97J7J16p0Kj84K27j29jJ27J24j29J12
7927A32j72J73k36j83L41K17k9j48l1K6k15Q8j25K90n4j16J33l52P9L09l1k19
7949a23M0j02J38j2P6OK30l47J37K19m72J99o2J81r9j33L67k88R4L3l8p4m5J17
7973D2j61J74r3j65K16J61%k80OJ44L9j68J05k30L94k80j6L09j23j6p4J38k7n9
7997C6j21J77J2l3k29J92k44O5J86j17J75j38j03O5PJ28j39L55k74O5j82J18J27
8020A28j38k50K97j75J3o9K39l45K14j12R8l3M01k79j48O4Q1J65k5j6J72l36R
8043d5O2K2R8j54Po7j1J16K30j8j91L8J35k22j45K9R6j86L36M3k64oK59j91j11
$$ y = [8, -129, 86, 1, -43, -4, -26, -60, 76, -10, 35, -163, -329, 210, 37, 21, 6, -123, -135, -42, -42, -109, 327, 47, 36, 4, 14, -8, -189, 29, 39, -111, 296, 66, -176, 217, 117, -80, -63, 53, -17, -15, -199, 28, -101, -102, 25, 149, 20, 132, -40, 133, -103, -286, 55, 272, 243, 95, 64, 90, -125, -37, -162, 128, 74, -42, 91, -261, -182, 127, 96, -123, -83, -185, -47, -59, 17, 23, 253, -94, 43, 262, -210, -11, -73, 108, 9, -124, 243, -45, 49, 82, 44, -30, -75, 42, -119, 55, -38, -203, 13, 174, 174, -106, -100, 44, 83, -85, 20, -210, 184, -96, -112, 197, 74, 58, -16, 122, 95, 36, -85, 92, 104, 71, -158, 34, -210, -145, 41, -76, 99, -39, -142, -77, -70, 58, -81, 274, 0, 65, -117, 1, 128, -10, -260, 37, -138, -125, -194, 45, -300, -86, -198, -100, -133, 268, -11, -159, -95, -14, 151, 126, 110, 282, -54, -45, 17, 39, 137, -17, -10, -77, -88, 28, 258, 240, 49, 87, 222, 0, -145, -116, -20, -206, 130, 173, -91, -97, 162, -29, -140]
8068a40J48m9r7L27j62k78J33K93k06P6K0N7j94J66l67J53J17J75j81J96J00k53
8090C4Q7mj02k00K20p4k0K1o1J96K13k70J46j50L2K56p1k03J10j01k06J70K02
8113B25j24j70kK3q3K27J6k0p9J38j70J11j15J75m20M77l09K68k40N1L1q0J59
8136H9M9l51M0K3J79j22k5K6J85k42J3k24K70J17j68J20n3J00j73M5o0J52p4J69
8160H5J04k55j31K37k65M07k25l0j37L07j89l4K10r4j31K71k1p8M1K4q7J03m5
8183F7k18R7OK14q6j4L5r6
$$ y = [-140, 8, -41, -138, 189, 27, -251, -118, 175, -31, 45, 65, 122, -72, 94, -273, -120, -3, 172, -9, 187, 287, 34, 121, 117, 15, -185, 35, -39, -59, -38, -99, 97, 310, 40, 186, 36, 68, 324, 253, 50, 160, 59, -147, 23, 225, 101, -69, -71, -48, -131, 96, 112, 92, 13, 151, -19, 92, -23, 152, -268, 209, -100, 168, -72, -21, 10, -70, 89, 138, -213, -173, -150, 29, -93, -118, -92, 93, -149, -136, -360, -90, 27, -141, -21, -74, 26, -147, -102, -162, -10, -84, 85, 189, -66, -197, 40, -225, 182, -43, -73, -210, 97, -92, -126, 84, -10, -141, 130, 109, 31, 72, 96, 9, 112, 67, -151, -54, -48, 166, 80, 66, 101, 5]
8191E
$$ Imaginary data points
##PAGE= N=2
##DATA TABLE= (X++(I..I)), XYDATA
0@%%%%%%%%%%%%Qj6J6j6K2l0L2m0M8n6P2q7R8j14J35j52J75k03K29k62L01l41
34a81L85m34M87n45O11o83P60q45R39j041J152j273J406j551J709j883K074k285
52a198K518k776L065l391L760m184M673n244N928o758P792r126J0916j3464J7410
67I921k4402M0562j52086p2620J29352m9603N5050M0439k7033j9158K2472l6481
79h3587L9804N8103j5684L5811J21972k2358p9494J7627M00n5241L4955M6317
91I8625K044K7530k667o1966J2837R660r3066k6589P5501n390k6502M4440o995
104D7462o3788k1506l1049k4697M3369J972m6538M3545L8117p1110k7650L6825
116g5048l0808k3319N0023L0538K1387L5730k5121k2260M8409j871l8779N8178
$$ y = [0, 0, 0, 0, 0, 0, 0, 0, 0, 0, 0, 0, 0, 8, -8, 8, -8, 14, -16, 16, -24, 24, -32, 40, -47, 51, -63, 72, -80, 95, -108, 121, -141, 160, -181, 204, -230, 257, -288, 323, -360, 400, -445, 494, -547, 605, -668, 738, -813, 896, -987, 1087, -1198, 1320, -1456, 1609, -1782, 1978, -2206, 2467, -2777, 3151, -3607, 4185, -4941, 5975, -7489, 9921, -14481, 26081, -126005, -198625, -69273, -118876, -63826, -23387, -50420, -69578, -47106, -83587, -43783, 14320, -1364, 34447, 156419, 134061, 54567, 72194, 72594, 17353, 52308, 98625, 100669, 128199, 125532, 63566, 76403, 86063, -7003, -33592, 41909, 36519, 10017, 54457, 47462, -16326, -37832, -68881, -93578, -50209, -48237, -94775, -51230, -13113, -84223, -111873, -75048, -105856, -129175, -79152, -48614, -27227, 8503, -16618, -38878, 9531, 7660, -31119, 27059]
128B7059N8661k6670R128M3068k1422k6357l168k4188J3015M1198k3242j6581
140E0501L8043k9693p2603P603J3866l9311p96K4008n035O890n383m7257o961
153f6128J7899l6407n402O3438R630l2159J6373Q009k7985k294K279j14L9987
166a2874K5424j4874K6524K9972m3265k5177L6173P305p716L0335J8576r76O845
179G6272k2193k8202J4299n330l4307K3428L7783k4977k1893O026k3921l0262
191c3277m911q361O252K4494j0645j3828K4066q617m4827K942K4519o957Q357
204d0793K8886P492K961j311k1413J434K2588r038j505M3561J6797j9800L932
217C3791O659j8820q244L752M618K0856J0707j8191Q74R627l0320k6401J5566
$$ y = [27059, 85720, 59050, 68178, 111246, 89824, 63467, 60299, 36111, 49126, 90324, 67082, 50501, 88544, 58851, -13752, -6149, 7717, -31594, -32390, -8382, -13417, -6527, -11910, -59167, -66128, -48229, -84636, -90038, -26600, -16970, -49129, -32756, -24747, -52732, -55026, -52747, -52861, -12874, 12550, -2324, 24200, 54172, 10907, -14270, 21903, 29208, 21492, 51827, 70403, 69427, 76272, 54079, 25877, 40176, 34846, 539, 23967, 61750, 36773, 14880, 20906, -3015, -33277, -38188, -46549, -40297, -15803, -26448, -40276, -16210, -24827, -69654, -66712, -42193, -49150, -40793, -11907, -4415, -1454, -2765, -24178, -22744, -156, -9194, -10699, 32862, 49659, 29859, 33791, 40450, 21630, 13386, 17138, 21756, 42612, 53319, 35128, 36002, 45629, 15309, -11092, 4474]
230D474M451j2391Q472Q273p027q686k0128k0657P562L437j4409J3813K6419j0362
244a6759j5633O794l047j1255L681Q152J5091K0828k08o824J3101j374k2216M398
258e271K3193L763K058J3961M146m763q876j5713j713J0272n167l418J8790M468
272C5730k1122j0642j261j0908r045R44N419R661J251j3331m381K152j6240j3603
286d5376J2755J2886o75M955Q506j92n326q490k853J1470R133m56J1226J7394
300B4957l660j2044J72K180l317J281Q527J1199O825o361q834l54n758j4650j305
315a142J1682K835l377l64j234q180j3097r637J678O347r52N65Q317J757j2147
330a6949r404Q88R57p59M402J1789J0682m2n507o98K132m227j556J0304J3027
$$ y = [4474, 8925, -3466, 5006, 13279, 6252, -2434, -22562, -43219, -35657, -32220, -46629, -32816, -6397, -16759, -32392, -25598, -28645, -39900, -36219, -28067, -12976, 7852, 7644, 820, 13921, 12547, -9669, -5271, 17922, 21685, 23743, 37704, 41850, 37087, 28211, 12498, 10785, 21057, 15890, 12472, 31262, 35730, 14608, 3966, 2705, -8203, -17248, -16304, -10885, -1224, 27, -13304, -17685, -15533, -31773, -45376, -32621, -19735, -20410, -15455, -6949, -7141, -12467, -20957, -23810, -12340, -3207, -3663, 7563, 24957, 21297, 9253, 9425, 11605, 8288, 9569, 18096, 29295, 36120, 29759, 20925, 20571, 14813, 163, -1142, 10540, 13375, 9998, 9634, 8400, 220, -12877, -22514, -20836, -14489, -15441, -14876, -6559, -4802, -16949, -26353, -25465, -24508, -25267, -20865, -9076, 1606, 1564, -3943, -4641, -2509, -6736, -8292, 2012, 15039]
345A5039L923o84K052Q32p485q874J343P809L860N78L624K258o512j2486p085
360a808M46p81k913L437Q316j558r970n937l201n234m131K229Q230O968j671l840
376a1418J453k411q981j108R617P166L312N828N123K6m448n711M50P496K270J265
392I929R725O391o866o320j249l908k816J196L603N514K350p301o189j086q077
407e104r557L492O668j002J129J959l569m810n418n817L555O634k18L194R558
422F94j537q470r5Q25k208L870O628M583P889J339o650K78J864p202l07J0411
438A1912L439j190L853j597n654l353n381l481O115K675m609M411K606j1240p344
453h838P83m759j985N501J508J812M137n679o810L094j171o162P754R172j135
$$ y = [15039, 18962, 18278, 20330, 21162, 13677, 4803, 6146, 13955, 17815, 18393, 22017, 24275, 17763, 5277, -1808, -1362, -2143, -5056, -1619, 6697, 5139, -4831, -10768, -13969, -19203, -23334, -21105, -12875, -5907, -7578, -11418, -9965, -12376, -21357, -22465, -12848, -5682, -2370, 3458, 8581, 8607, 4159, -1552, -1102, 6394, 8664, 9929, 19654, 26045, 19179, 12859, 11610, 7702, 4886, 6082, 9685, 15199, 17549, 10248, 4059, 2973, -5104, -14661, -11169, -4501, -5503, -4374, -2415, -5984, -10794, -16212, -22029, -18474, -11840, -12058, -8864, 694, -843, -9313, -9408, -8583, -10791, -6921, -293, 4290, 12179, 13518, 6868, 7146, 9010, 1808, 1501, 11912, 15351, 14161, 18014, 16417, 10763, 7410, 2029, -1452, 4663, 7338, 2729, 7140, 9746, -1494, -8838, -8055, -12814, -14799, -9298, -7790, -5978, -1841, -7520, -14330, -11236, -12407, -18569, -10815, -1643, -2778]
468b778K582L975m911k588J442l032L835R973L72l17P546k527r593J265J288l965
484B567M589M987j732K150K75j0005l397L138o293j997Q785N99m715J965l122
499b206q427m13j051l564P194N261m504K596M101q203l930N393r60P88R077K352
515C504r35M654l124o891L962K552l915O526Q105l656jK380p184m246L052k931
531A852l11Q056j230m782L410l356r799N74K303l972L304N560m555m51J309p913
547a0001l176M899j897r48Q810J980m032L098n25o104K585L545k027N928O671
562H806m061M35L722n967l733N897j62p38O458J014m612J539j996q036J552K881
578B999m659K995N308n270l123J897n691l930M195r11j211O677m60n332K312l79
$$ y = [-2778, -196, 3779, -1132, -3720, -2278, -5310, -1475, 8498, 8870, 8553, 16099, 13572, 3979, 5244, 6532, 2567, 7156, 12143, 10411, 12561, 12836, 2831, -566, 2572, -3721, -5718, 3067, 3666, -1049, 916, -2206, -10633, -11046, -12097, -15661, -8467, -3206, -7710, -5114, -1013, -9216, -13146, -7753, -8713, -7925, 1152, 3504, 2569, 7223, 4099, -2792, 1170, 3722, -193, 6333, 14438, 10782, 10781, 13161, 5977, 1731, 4783, 1852, 1541, 9597, 8367, 3585, 6995, 3639, -6160, -5586, -3283, -7255, -3951, 1609, -2946, -3397, -2088, -10001, -13177, -8278, -10175, -11123, -2313, -333, -4365, -1267, -1792, -7896, -5311, -1766, -3793, 2135, 8806, 4745, 5180, 8902, 2935, -798, 5099, 4937, 4199, 10657, 11671, 7059, 8598, 6602, -1434, 118, 2999, -1660, 1335, 6643, 1373, -1750, 147, -5544, -9474, -5279, -6190, -7401, -724, -1184, -6516, -4204, -4583]
594d583o755K290N081j752L247N685l052j173L500m323k204O525N74j097O713
609H676Q34n036J288l2n406J922L873k289K241L822m505l540J758m774m042M537
625f73J42k566M099l3n763P00m19n606J790M752k356J709M966l869k833K944k625
642e641j730N323K325j077N179J120m488J250J039l798J836N038j559J012L735
657I564l401l161J504k608k838M678N87k429L180m28n869q03L21m257O59L688
673a613j663L79K854l730k873K022j920j943M930J698j487L139J269m258P31J769
689f96k950K311N051q63P85L551k506l153K326p18k266M059J377k113J897M2m501
706A633q27Q52k998Q00L257j888m53J341l357l498J111j025j745L348J492j979
$$ y = [-4583, -11338, -9048, -3967, -5719, -2472, 3213, 161, -1012, 2488, -1835, -4039, 2486, 3060, 1963, 8676, 9510, 4474, 5762, 5730, 324, 2246, 6119, 3830, 6071, 9893, 5388, 1848, 3606, -1168, -5210, -673, -531, -3097, 1002, 969, -4794, -4094, -4513, -10119, -8329, -3577, -5933, -4224, 742, -3127, -5960, -3016, -5641, -7371, -2048, 277, -800, 4379, 5499, 1011, 2261, 3300, -498, 1338, 6376, 4817, 5829, 9564, 6163, 3002, 4506, 1898, -940, 3738, 4325, 1896, 5076, 4648, -1221, -2024, -1703, -5960, -5301, -1613, -3276, -2897, -43, -3773, -6646, -4624, -6544, -8487, -3557, -1859, -3346, -207, 1062, -3196, -2465, -696, -3646, -1335, 3716, 2853, 3638, 7189, 4683, 1530, 3856, 3138, 872, 4931, 6308, 4195, 6092, 6134, 1633, 806, 1658, -1340, -540, 2717, 829, 376, 1717, -1640, -5138, -4027, -5052, -6797, -3449, -1957, -3936]
722c936J628M92l444l04K065j519J283M368n85n6K232j635k223K202M87q90L704
739C869J765j133Q82N33l440l49J368j928Q45K916j485j142J071k875k927J058
755i72k93j785K545R56k282J64m19l200l36Q40q36R56L035m32n67J257j105j777
773d251J703P89J31K962J464j173N93O37k365l3K130j99Q58K528n85j039N64j761
791B953k292Q67K74q83J688K16k003o62m82k853k69J158p25L83J379n21j356L69
809b759j539j492J572P95J45K035J212o83k92M56q17o0J840N02J115J634J34r64
827B834K59q43j095J097Q91r7J115M59j376q44p30j868n44Q67k71J30O25q77j329
846a597n61q88j209P23O15K58O33M73o19o42k28o54L59J439R95P65J416k4n98
$$ y = [-3936, -2308, -1816, -5260, -5564, -3499, -5018, -3735, 633, 48, -8, 2224, 589, -1634, 568, 1055, 165, 3869, 5634, 4501, 5383, 5916, 2476, 2127, 3495, 1567, 2412, 5328, 3843, 2701, 3772, 897, -2030, -972, -1265, -3050, -505, 451, -1831, -1667, -2086, -5286, -5622, -4782, -5618, -4662, -1627, -2059, -2626, -1369, -2474, -4251, -2548, -1759, -1628, 1334, 2798, 1625, 2218, 2855, 490, 457, 2587, 2388, 3246, 5774, 5189, 4150, 4714, 2953, 661, 1528, 1802, 919, 2607, 2823, 820, 158, -324, -3177, -3446, -2288, -3013, -2630, -1251, -1772, -3128, -2759, -4298, -5790, -4218, -3423, -3278, -1243, -31, -714, -1006, -550, -1367, -1427, 413, 915, 2030, 3664, 3798, 2834, 3093, 2250, 1155, 2252, 3143, 3046, 4161, 4620, 3244, 2400, 1670, -198, -742, 125, -146, -16, 609, -268, -1597, -2158, -3046, -4255, -3532, -2917, -2659, -2026, -1553, -2172, -2814, -3042, -3696, -3337, -1898, -903, -138, 1278, 1254, 656]
865F56k35l5j86J109J247N58P34K91q18p85r06l40k02R27O31j04k3p85j060j032
885c58r53o14r5P71m1K36k52o16j181n95M2K22Q90O67R02mj58m44m36J54O77O46
907e40R00J271N63J05j9o99j50j83O40O39N05M63k38q82n21q76k63j67l4L53M40
928A307k97j212l28j108r57n0K61L1O24N3j28l45j95r31M22N89O57O32Q16L16
948A57l99nq8m6P79N90L90J396L84m01m80j91o21l61O71L00k56N46l0j028o75
969F32p73r73L35O06o80L71M65j186n90k22r02o40J183j2N16R26k24q00N05l9
989a502m04P11J144Q5N44Q65q5p24K79j81k27J438K27L06M38J22j176m01K69j439
1009B89N89P76r16P2N51j268r68M20j163k96R10R8m32M36J6j566k4L16p88P92
$$ y = [656, 421, 386, 200, 1309, 2556, 3114, 3848, 4139, 3321, 2536, 1630, 1290, 1088, 2015, 2646, 2542, 2519, 1734, 674, -358, -1311, -1925, -2020, -1249, -1290, -1054, -1306, -1922, -3103, -3698, -3656, -3434, -2544, -1877, -975, -979, -1137, -1581, -2017, -1863, -1186, -540, 360, 1631, 2194, 2299, 2280, 1581, 1431, 1248, 1888, 2527, 3032, 3495, 3257, 2375, 1854, 978, 715, 548, 514, 867, 1307, 1010, -202, -530, -1638, -2595, -2645, -2384, -2353, -1729, -1676, -1804, -2149, -2344, -3275, -2853, -2264, -1607, -975, -159, 157, -242, -247, -335, -381, 398, 988, 1378, 2774, 3158, 2757, 2277, 2086, 1465, 1104, 1775, 2075, 1819, 2365, 2335, 1307, 632, -141, -1114, -779, -173, -853, -482, -17, -1203, -1793, -2015, -2917, -3557, -2374, -2386, -1870, -944, -1168, -1968, -1463, -1502, -1906, -1195, -51, 34, 578, 1443, 1358, 634, 913, 732, 505, 1943, 2170, 2476, 2914, 3036, 1860, 1459, 1728, 289, 878, 1654, 738, 810, 1361, 93, -875, -455, -1618, -1914, -1004, -906, -1338, -902, -886, -2452, -2476, -2160, -2948, -2156]
1029b156J113q2M01M35m60n19Q62l43K29J516M77l04J030j20j342M58L43o70O41
1048A509R96m18j57P03j106j071J65o46l83J051nj096N14l25j428j26L57p89L68
1067a887J273r42j09J026j137o93Q74l17q3J551M42l36N21P23j190K60Q22l86
1085D12O46J255n90J32O18j223n98P62r1n28J019L0q43M20m54j389j33M25o09
1104g39n2P77o83n29J80n26q87O22M6k43J095J35m41L25J76q44K37P16j50O66
1124a19J351m16R0N24o18o92J095J39l9P02K00n17k37K52r85k63P73o98p9R62
1144A425q02j126N37q35p77L90O5m78R84P8r73L1M14j016K23Q15k14L07R42k75
1164b85l92O35p43l4J119L90m63J284M75p82R6J60r64M00Q51l77J82O43q12j042
$$ y = [-2156, -1043, -1125, -724, -289, -749, -1268, -406, -749, -520, 996, 1473, 1169, 2199, 2079, 737, 1195, 1538, 868, 1509, 2505, 2087, 1930, 2633, 1527, 456, 621, -25, -408, 643, 638, -458, 56, -269, -1697, -1823, -1466, -2255, -1887, -614, -1556, -1665, -639, -1776, -2469, -1595, -1912, -1995, -444, -2, -338, 183, 906, -284, -24, 798, 412, 1058, 2313, 1723, 1855, 2473, 1250, 652, 1414, 1323, 795, 1814, 1844, 1001, 1421, 967, -422, -555, -130, -739, -791, -14, -697, -1226, -1046, -1572, -2459, -1837, -1791, -2034, -939, -804, -1245, -920, -744, -1588, -1351, -635, -785, -119, 1232, 816, 906, 1430, 812, 120, 1215, 1354, 1315, 2017, 2217, 1700, 1463, 1715, 730, 467, 1240, 542, 463, 1425, 623, -503, 34, -801, -1578, -1188, -1123, -1601, -617, -539, -1512, -1481, -1067, -2083, -1860, -1045, -1259, -952, -10, -285, -677, -42, -785, -819, 300, 690, 227, 1511, 1986, 1204, 1300, 1460, 496, 896, 1747, 1370, 1552, 2195, 1383, 341]
1184C41M93l95j124R09J71o84M26J04q71l58Rj177J14P99k06J00Q95n43q98J188
1204g07p76l35R35R96m47L76P31q64M0Q05r39O63O53K03M1P06n55n41L56j75p20
1225D46P44M06p12L35m1j061k99M57j170k18J261p45l08Q60o92p04K84l49n45
1244b051Q44M38n43Q67J11o07J44O98o87L67R18l6J35Q60p27m61Q66j73l08P3
1264G28Q46k77Q9J20o88j24J02m04l75Q13k74l89K21r13m78K41K1o29L26O30p29
1285a143R6K10n86k30O40k35N4Q27J89j06L24M5m74M36L32j34Q08L05j88M3J40
1306A353o06j17N50m67J18K99J04m62J42l70l81l93K17j57l4q3M4j81n1n93j59
1327a227J02q9K53J55J92m4J94k57p02M91L18K50K85M97m2O9K59k24j26M15L12
$$ y = [341, 834, 439, -685, 224, 395, -289, 137, 241, -630, -988, -979, -2156, -2042, -1243, -1449, -1349, -454, -997, -1895, -707, -1483, -1818, -883, 113, -334, 42, 773, -91, -51, 754, -185, 478, 1131, 1334, 1375, 2081, 1526, 985, 1341, 1166, 446, 1190, 1596, 884, 1219, 1178, 117, -182, 275, -895, -1113, 148, -597, -905, -45, -737, -1441, -1157, -1506, -2051, -1207, -769, -1312, -445, -334, -941, -797, -99, -786, -419, 499, 463, 598, 1458, 731, 270, 1136, 963, 655, 728, 1574, 1297, 1386, 1506, 818, 694, 796, 392, 17, 830, 556, 167, 388, -525, -1003, -762, -741, -1370, -1044, -414, -1143, -1047, -837, -1423, -1653, -1013, -1248, -1194, -367, -178, -284, 40, 85, -389, 47, 379, 245, 1053, 1358, 1170, 1213, 1353, 747, 630, 1180, 713, 831, 1130, 1234, 772, 914, 544, 163, -230, -13, -170, -204, -287, -243, -424, -475, -1068, -1227, -1125, -1214, -961, -806, -614, -658, -464, -721, -1423, -932, -614, -364, -79, 418, 376, 445, 704, 480, 354, 769, 1081]
1348A081k18K70K08m04L32m80j99j91K87q9K0J69m60l38j39on67J69n8j7J17K2
1370d91l28j70j1n22M73L24o0Q8K70J52j32J89N2k00N17K91p3K28M65l95k6K0
1392F61j36J77K85j60J4M58n71j20K42o19n6O5nq1r7M90o98j02m77Mj45P9J49
1415f43j35N11n87J7j19J77n7J77J02K71J40K14N7l35L22J0L69J66n9R2L54l52
1437F92q9L8J40l57J94l33L05J58o7l52k94k33K49k02j13k15J41J62m84q8j87
1458i35J3l4K02L83j22L8J73r6k04Q4J22Q4K97L28J85k33r1J72J86k29Q4J50K06
1481G63O9j30J19k73o0l26M81o54R6K65j06j46j10k01l02J24j53O7k5nQ2k21P2
1504e74r5l61N24o7M24j6K04j31k4J22j8k71K70M37r5M62l10k78J50j2p5L01J47
$$ y = [1081, 863, 1133, 1341, 937, 1269, 789, 590, 399, 686, 597, 617, 786, 326, -12, -151, -157, -724, -555, -613, -630, -513, -491, -819, -989, -1000, -1522, -1049, -725, -785, -697, -427, -275, -407, -218, -166, -366, 151, 442, 369, 597, 1062, 667, 641, 661, 525, 702, 987, 827, 841, 1299, 728, 608, 850, 231, 175, 240, 235, 154, 57, 547, -151, -253, -730, -726, -871, -792, -643, -778, -267, -854, -837, -956, -779, -836, -659, -557, -286, -146, 68, 125, -210, 112, 122, 491, 657, 598, 690, 1044, 692, 603, 641, 781, 424, 618, 285, 590, 748, 681, 329, 35, -198, 51, -151, -264, -479, -338, -176, -660, -748, -935, -922, -956, -754, -371, -493, -455, -282, -378, -582, -498, -376, -292, 5, 333, 518, 285, 194, 366, 552, 323, 407, 557, 763, 832, 702, 821, 548, 488, 162, 643, -11, 85, 350, 244, 98, -12, -213, -515, -391, -544, -477, -502, -507, -425, -646, -574, -669, -1030, -506, -573, -149, -165, 39, -92, -116, 6, -12, -283, -13, 424, 329, 791, 481, 203, 353, 341, 266, 567, 714]
1527G14n2K67k37j25j83r2k57L09l26J30n8j5k07n95K05J24j46o7P0m4P9J98j01
1550d09l39L14j25J09L08K33j40J41J84l30J29M8l8K78J69p5K34m4m33KL57m4
1572E29m09L30o7j24O7%m00M6p9l64J47p3k48K98M6k95O3P9j93J85M68k56k26
1595d76L60j62k56L94J44Jj36N07k02J06K9j30N2J93k68q7P52k36j86R3j06r3
1617B93nj97O7N5k80q5K81O0n13k31N76m12l52J36J82QQ7l02L09m24L08l27M48
1640c18L09j53KM35l93k4K29l6K71P5J48j08L17j39m40J33J70j35m5O2q9k70J32
1663A33l31L41Q1l28l28M22p9k15K37j37k54j12K53K1j47j8p9M98L1m77M5M26
1685a7J5j64N78j28j13Q3k35M4L20J73n02K28M29k11j46L32l74r7q6J08K82r2
$$ y = [714, 662, 929, 692, 567, 384, 292, 35, 344, 18, 148, 90, 75, -132, -727, -522, -398, -544, -611, -541, -585, -506, -308, -409, -748, -434, -559, -450, -142, 91, -49, 92, 276, -54, 75, 123, 85, 363, 532, 457, 691, 647, 214, 216, 573, 529, 120, 450, 383, 259, 326, 326, -74, -28, -107, -471, -324, -397, -645, -347, -301, -596, -533, -454, -647, -462, 6, -250, -476, -116, -278, -534, -140, 4, 5, -131, 376, 174, 280, 309, 179, 231, 424, 156, 69, 821, 585, 399, 492, 386, 293, 288, 91, 158, 213, -67, -152, 129, 189, -324, -555, 21, -391, -743, -607, -425, -417, -330, -632, -323, -747, -439, -766, -318, -9, -162, -160, 275, -118, -142, 87, 51, 322, 397, 545, 437, 754, 615, 175, 308, 478, 343, 298, 360, 271, 1, 133, -198, 143, 224, -104, -432, -10, -89, -304, -67, -204, -458, -570, -317, -296, -443, -461, -540, -42, -11, -488, -443, -17, -2, -166, 412, 284, 171, 254, 19, 63, 383, 556, 54, 282, 711, 500, 354, 686, 312, 215, 129, 237, 519, 427]
1707D27l48j20O20p89k96N8K93k13p4J77r1L5j51k97L73J03l55J04M27L35m34
1728b16J78J58k78J10J58j30K86j60Q5j13N20n24l4K89M13n56J59R7K8l3k93n2
1750I2P0m1m73K52L21l25n11J63K20m1k44K05m2J07j1j79N9K31l71L34K62k68
1772a90J76J41K28l20k9J01K72p7k39K53L66l74M1k64K40n7%P6k80J39R6m18L92
1795B73l5l36k10K8K34k67J51k96LJ72l26J68M1P0j07J87K63j29j23j14K78j04
1817a79L5J23J27J02k29K98J28L3k39K33K04l80j70K17n4L25l94l12N65n2j92
1838A89k61L16n9l82j35M54j72k40r3j6K80j38J93j98K0n5k70M19J13j37K6J89
1860D3j9j1k53J92j0L12k76J13M63k45j68J52K33n28J5J22P7j03j79J47K75K4
$$ y = [427, 79, -41, 579, -210, -506, -448, -155, -368, -442, -265, -356, -321, -472, -769, -396, -293, -648, -544, -117, 218, -216, -38, 120, -158, -48, 110, -20, 266, 106, 191, 78, 598, 74, 40, 329, 742, 186, 345, 442, 470, 437, 144, 92, 162, 121, -352, -100, 221, -104, -615, -452, -232, -273, -517, -312, -354, -247, -258, -437, -378, -147, -518, -184, 78, -190, -14, 127, 355, 35, 6, 107, 379, 302, 63, 316, 682, 308, 349, 85, 325, 268, 268, 344, 64, 203, 299, -119, 273, 238, -98, -308, -280, -46, -313, -162, -458, -455, -283, -609, -441, -400, -330, -437, -250, 13, -116, -239, -353, -75, -179, -144, -21, 106, 208, -21, 277, 405, 438, 199, 432, 636, 256, 86, 303, 249, 574, 180, -132, 433, 381, 189, -72, 244, 185, -197, -332, 122, -50, -290, -383, -399, -119, -257, -64, -262, -242, -297, -567, -148, -35, -172, -146, 43, 24, 13, -240, -48, -58, 254, -22, 91, 554, 309, 141, 293, 526, -2, 13, 135, 212, 109, -70, 77, 352, 376]
1882C76n26K17M8m8k60j18O8L16k65O7p4J31k36j3K5K36l35K15R6p8J81k90O0
1905b07L86l4l28J87M19o07R3K71K49m33r8N91k56ok68J84P8L2l13J63J8q4J82
1928B19k28K85j58m56K88n1K64m09LJ60n5j77qP2K64m50L60P3m2j09l27M99K55
1951B72j61l07K92L8j49q1M02q8k5r1J68O0j88o0J38O9N1l22J48n5N0j38r9L61
1975B85m10K24l68L07j97j17J44%k77p4K49n7L3R0J41Q6j51j90j4M38N2j65k62
1998b33L55j09J0m2M40k47l3j58J53L10j26k93J66O0l25J08R0J53m48L14k34L06
2020B17m77L08j61J08n5j21N4J81j42j38m6J49j24J39L2K95l22N9P4K8o1M0j3
2043B4l6K98j69N0n9J85k60J03j50J71RJ7j04J60r7k71K20J22l22J22j5R0j25
$$ y = [376, -150, 67, 115, 67, -193, -311, -243, 73, -192, -125, -199, -68, -304, -317, -292, -56, -391, -176, -80, -158, 23, -267, -207, 179, 145, -183, 4, 423, -184, -91, 180, 429, -4, -102, 489, 233, 227, -41, 143, 221, 253, -60, 103, 121, 37, 219, -9, 276, 118, -338, -50, -101, 163, -246, -243, -83, -138, -315, -323, -251, 13, -437, -77, -4, -46, -155, -482, 17, 272, 111, -196, 96, 134, -15, -96, 306, 218, 193, 102, 270, 330, 142, 82, 220, 289, 340, 18, 166, 111, 161, 23, -76, 285, -125, 99, -269, 38, -159, -276, -132, -132, -409, -483, -234, -291, -258, -168, -27, 59, -92, -282, -296, 142, 194, 29, -233, 122, 13, 23, -19, 421, 174, 141, -17, 136, 446, 320, 27, 193, 253, -72, 36, 126, 279, -169, 145, -89, 217, -260, 48, -113, -5, -60, -181, -127, 54, -88, -226, -272, -123, -247, -108, -76, 219, -103, -44, 30, 58, -3, 37, 24, -12, 286, 117, 167, 108, 293, 33, 136, -14, 157, 166, 183, 79, 239, 142, -129, 91, 213, -109, 13, -2, 88, -37]
2066c7l77Q3L1J2J74j91M33k64q1P6K26j73N5q9L52k88K1j29K79J79l52j50L22
2089A12L01p71O82N8l29N0J35j23l0l0l15L32l6L06o10M12m8k86p7K32j39j94
2111c68N8M0M78m35R2K00%k36Oo8L01k24J99J4j45K2J01p2k6M12k32m0K65r1k57
2136fL3K45P5m05N30k02p7j78L07j06k28k41M84j33R0k30j86L00l89P7k9M02k53
2159a20j20K53k9k35L20J76l43j62N19m22J03L4L07m51J78j02J29J6K99j57k51
2180e8j2L07j20o8nJ39J30j87j77j26J45j12M0k03K88l9j74M49k09j44o8k32L58
2203g8J92k61rR3R1j66J23K11j90l07J14M53m51L36l41K88K01k66n7K44m0l2j4
2226A34R3j06m0K3l74M25l16N4Q3J90j46J6o8J9j84j66L71q9l75K87J09j9k18
$$ y = [-37, -414, -331, -300, -288, -114, -305, 128, -136, -217, -141, 85, -88, -33, -122, 230, -58, -37, -166, 113, 292, -60, -210, 112, 413, -358, 324, 382, 53, 103, 238, 115, 85, 55, -260, 72, 36, 342, -268, 144, 96, -190, -267, -35, -174, -368, -310, -270, 208, -227, -135, 65, 65, -171, -165, -233, 68, -156, 43, 57, -88, -66, 35, -37, -63, 349, 117, 77, 342, 251, -6, 27, 272, 347, -58, 472, 270, 193, 15, 322, 216, -12, -253, 231, 98, 188, -42, -228, 72, -317, -240, -269, 133, -120, -240, 13, -16, -251, 69, 245, -98, -260, 259, -163, -60, -26, 281, -170, 8, -94, 35, 51, 350, 193, -58, -70, 237, 117, 49, 44, 183, 313, 126, -51, -177, -32, -144, -104, -307, -19, -58, -232, 217, 8, -136, -204, -436, -78, 114, -147, -156, -63, 28, -138, -15, 196, 6, -301, -187, 266, -185, 151, -190, 98, 299, 33, -24, 220, 180, 148, 134, 227, 121, 81, 104, -270, 155, -161, -107, -24, 166, 20, 36, -32, -13, -197, -363, 8, -81, -456, -169, -60, -79, -297]
2249b97L75J75k02j84L5J19j2J32j18mM2rk30Q1L07J26k42j6K1j71R7K14j94j16
2273g1j83M42r1j87O3j38Q9J57j52j99J18J25K9r5j56K54J17k06m2L6j46KJ09
2296a25J41m3L19k76r3J27O6K6j70J72j41J00R3P4k21J19j74J42k21K56k59K48
2318A60j17k29K56l2o2m4k9k95K20l9J68J4p9r4n6Q8J95j46K5K64q4j43K45k15
2342b9O7N7J2j50J33p8N5M5J6k99K95j12j5R7Kj38j23L74l17k0J96k73P2J14Q0
2367F1k60K29j01J12j24K5j98L57l17K7Q9K7J82k92K47q5jQ4l0k49J07L72l54
2390i2J88K36j55Q1k18N2j60M7J21J85l23j6K01j32j78N5p7K04k64J21K7O3M6
2413A2j7m8J15j20j67J91l7j05j19K38j30L69j70L5Oq5R1j2m8J65j69J38M9Qj89
$$ y = [-297, 78, 253, 51, -133, -98, 21, 9, 141, 23, 19, 61, 52, -178, -97, 210, 336, 94, 78, 99, -72, 25, 239, 45, -71, -254, 188, 97, -90, -27, -165, -76, 81, -71, -270, -152, -27, 2, -93, -249, 5, 122, -84, -126, -90, -236, -234, -125, 16, -27, 292, 16, -77, 50, 116, 142, -28, 144, 3, 103, 196, 270, 49, 168, -6, 136, -85, 171, -88, 160, 43, -186, 70, 38, -24, -68, -97, -392, -172, -211, -43, -29, -108, -202, -258, -170, 25, -121, -96, 168, 84, -59, 186, -29, 38, 95, 107, -43, 90, 12, 67, 112, 128, -171, 124, 12, -3, 94, 96, -42, -165, 209, -108, -128, 68, -205, -133, -19, 61, -199, 30, -71, 41, -83, -58, -256, 101, -216, -189, -100, -73, 109, -183, 64, -21, -22, 62, 32, -217, -110, 262, -92, 96, 332, 177, 258, 40, 92, -68, -21, 100, 285, -38, -54, 147, 15, -163, -108, -185, 19, -245, -124, -97, -34, 12, -5, -53, 62, -58, -225, -34, -71, -176, -295, -57, -187, 182, 12, 47, 53, -32, 59, 47, -1, 164, -5, 133, 182, 190, 1]
2438AJ88N8l47Q8J03j61r5Q6J01R3o0nj81J51p2N5K02q9k77P9K1K9J21j82O7J47
2464A21k72k77M16K09m1k91J40k08N68j55j98k8K97k85j61J39K29j08J14q0M6
2485A75K9k93J60J05l37J43o5M4LK75k46j31J34k34l1K21r3J34k82K07O0n8K02
2508A22j18R8Lj39K80j39n33M22J42J68k79O2j93J78J0Kk36L09r9j13qr6K61N
2532A09j1o6j54L39l17P5l7L1j15Q6oK48m66K58K55k44J40n92N48j62J13j86L21
2555A67k57o3L36k16M6l5KN9J69j00k7P9m7k01J38N9j67o7K14N9n1o9P2j08n7
2580f5j37K24r5j37J4n8j26K40j5J72m7L47k50j6K09m32Q9J42n0m1p1J69K38j06
2604A98j19q7j18K22J53j94J25l0r1q4l6R3n0o6j10L09l34K64P0j59O5q7j72J35
$$ y = [1, 189, 247, -100, -12, 91, -70, -165, -79, 22, 115, 55, 50, -131, 20, -52, 3, 205, 116, -161, -82, -61, -32, 89, -93, -26, 121, -151, -428, -12, 197, 156, -135, 5, -203, 365, 210, 12, -16, 281, -4, -165, -26, 203, 95, 209, 129, 175, 204, -89, 71, 176, -161, -18, -83, -39, -36, 239, -7, -138, -4, -238, -269, -48, -141, -7, -289, -82, -22, -80, 122, 4, 102, 105, -34, 246, 107, -426, -4, 138, 306, 27, 89, -104, 74, 84, 86, -150, 159, 60, -53, -61, -157, 104, 109, 98, 32, -122, 217, -100, -25, -62, -31, -146, -60, -66, 182, -284, -26, 229, -15, 125, -467, 81, -81, 32, -154, 167, -90, -153, 183, -33, 13, -22, -20, 39, 208, 108, 81, 160, 113, -88, 50, 109, -58, -125, 89, 148, 97, 28, 100, -8, -65, -202, 22, -73, -210, -196, -254, -380, -140, -155, 17, -30, 317, 67, 51, 260, -172, -83, 59, 9, -32, -103, 66, 304, 198, 79, -8, -126, 96, 249, 55, 180, 150, 59, -25, -61, 32, -18, -84, -194, 115, -219, 45, 115, -44, 21, -66, -238, -103]
2628a03O9Q3l24L57J66l17l5R8K53k92q5j9L84n01L84j13j09K81j65k58J80K8
2650c8M5L12l24J88j40m3j42J33k5J7j11M02k34q2R8J82k73kj26O1K81k11J39
2673A07j03J20j36J03m36L94j24l0K8K01j74O7Q1L2o8j67K97Q5j51P5l58J23K7
2696gm6N7k14oJ80j5M7j04j31J51O9j18j7K01k3Q1q9Pp2r6K5J51j08L01m82J42
2722a16J65J6m0l90L47Q5o8J63l20J69J8M8k46J03M02k93k7j16k39L14P1j86L18
2745A78j76n1K86m4l22K54m02Q3J73K59j57k33L1P8J12l06J49J26k3k6j32R9Q3
2768C9J05q5J26kjm3o0J02m06J83J47J20K8k33Qj32K2J83j50R3j60L84k59J57
2792A66k87l40O05%k27j05L14k4r5j4m2p8R7o1K69k02j9j71K29j30R5k2J86j67
$$ y = [-103, -34, 49, -275, 82, 248, -69, -104, -6, 247, -45, -130, -149, 235, -266, 118, 5, -104, 177, 12, -246, -66, -38, 7, 319, -5, 183, 43, 0, -142, -9, -34, -17, -128, 274, 40, -42, 56, 238, -35, -37, -163, -102, 179, -32, 107, 4, 124, -12, 91, -345, 49, -75, -105, -77, 124, -50, 17, 98, 130, 62, -105, 192, 277, 126, 201, -157, -34, -7, -53, 4, -210, -216, -36, -51, -4, -108, -239, -88, -19, -137, -154, 47, 24, 105, 16, 23, -49, -145, -120, 31, -77, 224, -258, -116, 49, 65, 25, -365, -18, 67, -1, 162, -158, 11, 29, 77, -169, -66, 336, 43, 16, -100, -339, -25, 46, -140, 178, 2, -49, 237, 193, -129, 125, -277, -194, -21, 238, 81, -152, -121, -43, 69, -237, -88, 38, 15, -11, -143, -44, 39, 144, 59, 185, 183, 182, 139, 79, 181, -225, -42, 105, 225, 253, 20, 28, -104, -82, 101, -49, 44, -116, 268, 9, 166, -121, -461, 144, 144, -83, -188, 126, 102, 7, -7, -49, -127, -30, -91, 178, -24, -43, -214, 15, -115, -20, -42, 144, -23]
2816b3mL34m89J00J83j61L22j03k45J35N4k72J87l6j81N23j81j42J12j68m1L4
2838f2j27N5n9J51M8o6J08L9j8k01J96N4l36K31k4L6M2m8p7j08K46k81J25J9N7
2863@j18Q3r0J8J65n2j30Q3j85M97l53q7L53n0J19j20j96k4O1R6Qk79P0o8P2K40
2889A13j20k1L49l06j88N4J48k52J83J59j79l9J75J08k71J50n1j34O4lP5j3j24
2912a23P5m5J49K01j45j60j66L11M8J48l31Q8J42j51j76l8K29l8r6q8N4J97j9
2935F6k18K72j35l5qL9R0p0L75k72j72K97l43N3Ln7K8M7L3n8J24P5k26j22M42
2960B28n5l84P0K39k00M58l54j15J61l7q2J9K4k81L67J33k88j5J03m6j15K82j14
2983bJ21L7k30RR8J6k40L65p7l14N9J29O8j12O3j59J67o3K11J5k78K15Nk53l6
$$ y = [-23, -27, 307, -182, -82, 101, -60, 262, 159, -86, 49, 103, -169, 18, -18, -199, 324, 143, 1, 113, -55, -96, -62, -189, -134, -193, -42, 6, -60, 48, 87, 69, -132, 64, 118, -218, 13, -11, 25, 67, 19, -58, -166, 80, -201, -76, -57, 0, -118, -35, -125, -107, 58, 6, -124, -41, -226, 271, -82, -169, 184, 134, 253, 133, -63, -87, -26, 70, 78, -201, -131, -199, -127, 113, -7, -28, 321, 15, -173, -119, 29, -223, -40, 119, -60, -99, 76, 184, -87, 63, 12, -122, -58, -61, 14, 1, -123, -48, -93, 56, 257, 112, -48, -214, 97, 145, 293, -38, 50, 192, 41, -135, -173, 56, 18, -78, -166, -112, 85, 66, -152, 120, -15, -50, -58, -19, 71, 1, 376, 104, -68, 229, -114, -61, -58, -115, -87, -40, -7, -65, 59, 134, -92, -214, 228, 173, -211, -141, 98, -102, 356, 2, -113, 48, 11, -71, -52, -28, -309, 58, 191, -97, -112, -9, -55, -170, 112, -2, 119, 156, -74, -65, 33, 49, -191, 174, 97, -217, -158, -29, 39, -73, -10, -169, -2, -65, 146, 161, -117, 98, 103, -150, -186]
3008a86K59j3j28K12j29K40k54r8K60k59J87l99M11q1J04J30l31n8M7m8N4M0j56
3031a96L13j38P9j54K57l04K20m9L02k03k23r1L0L20N9k16l0J5j87L74k20m09
3053d51N63j69Mn0K0p9J64j73M3j07L19j37J14j45q4J06L9j03J02J06p8l7Nj10
3077a38M00l56J20k14K1K18Nj40J91j52K39k12O1K93l20K05k97J80j97R3k93M36
3099A43l02K63J24m17J44J03P7j69J5L8j47K26j74m4j3K69l17K13Mk32K86l83
3121b93L8O0K46j17K46j27j87J56K10j59o6L6Q2j02k67L85j18J00N4k47l4M9j12
3144a67NK89j26J08q3q0j12R0K09l3j02K5J91j50R5m03K56N0J34m15L02l3k33
3167a83J40j80K91k23L45k88L8K67ok63K45m26J91Q9O5l86K33K17k45L04l06M77
$$ y = [-186, 73, 60, -68, 144, 15, 255, 1, -97, 163, -96, 91, -308, 103, 22, 126, 256, -75, -133, -86, -134, -80, -40, -196, 117, -21, 58, -96, 161, -143, 77, 28, 330, 127, -96, -187, -157, 163, 222, 6, -24, -9, -196, 178, -42, -451, 112, -57, -53, -103, -83, -162, 2, -171, -128, -235, 84, -53, 61, -84, -168, -62, -23, -126, -24, 82, 4, -33, -28, -138, 262, -94, 26, -188, -167, 51, 56, -84, 107, -45, 194, -18, 43, 336, 16, 221, -76, 104, -93, 0, -293, 143, -159, 104, 228, -189, -45, 58, 135, -34, -19, 19, -128, 98, -76, -120, -133, 136, -181, 32, 36, -196, 90, -293, -255, -195, 51, -66, 180, 53, -134, 22, 232, 73, 7, 43, 125, 23, -244, 141, 23, 123, 177, -70, -104, -55, -167, -162, 127, 1, 109, 26, -54, -166, -76, 133, 100, -2, 23, 214, 64, 159, -244, 12, 62, 196, -219, 83, 50, -183, -43, -223, 68, -155, 190, -98, -60, 207, 201, -62, 183, -243, -52, 37, 102, -284, -51, 166, -79, 225, -81, 396]
3189C96p45J48J61J22j38K87m73J91j21J78J45k42J49j31K87k74k09L79j86J58
3209H2j46L65k41k87M89l0k21N0J87k37J39j68K04M5k75N9J31J01l36M0n7P6M5
3232A5J35n3K4k02q7J21k33J09R8j72J56M3J6R8P8J26j72k35M6Q6J34p1l8L3o
3257D9J07J55l83o4J62K35k34j39K99j56l7j05P0K01k26%p8J82K3j20R1k8L8M4
3281H6l1k34K34r0P3L7k61J94J39o8K5j27r8J88j65L5K31n0j25K10l52J13J67
3304A31l69K74l16R6J65k18K39P5k08L12k15J3n3j2J06m54O60k26j61J8J93q4
3326c4N1J4k31J92R2P9j95J08J8l1p0j46J24m5R9J25j39J16j90R2K8j60K06j64
3350f1J04j00P8O4j11J01p2kj06K06j70RL5N0j62J05L1j8j69N5L19M0k97J73n6
$$ y = [396, -349, -201, -40, 82, -56, 231, -242, -51, -172, 6, 151, -91, 58, -73, 214, -60, -269, 110, -76, 82, -64, 301, 60, -227, 262, 232, 11, 61, 248, 11, 150, -18, 186, 231, -44, 15, 146, 247, -89, -49, -106, -30, 15, 150, 97, 121, -81, -168, -47, -280, -171, -73, -245, -89, -46, -30, 68, 146, 272, 100, -135, -89, -3, 131, 60, 22, 55, 49, 156, 311, -72, -136, 26, 261, 27, -112, 187, 31, -6, -111, -41, 160, -66, -66, -144, 38, 61, -59, 32, 4, 42, 86, 55, -179, 55, -35, 38, 75, -186, 8, 147, 79, 104, -23, -121, 67, -98, -63, 168, 118, -7, 203, -149, -36, 131, -238, 36, -280, -184, -19, -237, 2, 77, -131, 181, -34, -21, -74, -86, 20, -434, 226, 0, -161, -143, 50, -34, 17, 31, -200, -8, 84, 163, -32, 76, 94, 63, -7, -153, -29, -74, 25, 150, 11, 127, -63, 29, 57, -103, 103, -61, 43, -57, 21, 85, -26, 75, 3, 1, -105, 101, -69, -60, -25, 25, -137, -32, -1, -19, -188, -133, 186, 226, -71, 102, 46]
3375D6j46J66j44J06k10r3K17J48j13J72m8j47K23j11j85K94J48k23j60Q7m7J9
3397aL3PK4q9o0j74K00K03j9j66l6J41J52q4K27j78j94k09J22M98n09O0K46Lo1
3422A36rl33J51LR1pq2K11k66M12l57J10m17O92j98j45k07J27J88K41m30K53j73
3445iR2M8k18m1j8J66L7j10J16k22M5J47j19J05k3j20J69p5n6K24l5J4j38j44
3469a65K04j79J52r0J15p3J64l34n8K57P0J92o2l46P4K81l22Q5Q1J73j63pJ36
3492A85l57L7J74j31K66k09K25j53J3o4r5J01J53j67j18K52N5j50r9J30l4m2k4
3515e2J04J58j38J38j80K72l00j55P0J51r5j41L21o6n11O51k21K36k94p0J06j03
3537a19L12l59M1J97p6O7P7q4j56J12o0M2J03k28O6k0L89j80j78K9j26J84k45
$$ y = [46, -100, 66, -78, 28, -182, -275, -58, 90, -23, 149, 101, -46, 177, 66, -119, 175, 323, 100, -60, 27, -20, -1, 32, 39, 63, -26, -86, -260, -60, 143, 124, -42, -78, 63, 215, 131, 358, 180, -14, -223, -101, 397, -112, -52, 194, 197, 136, 127, -206, -55, -52, 39, 32, -50, 161, -105, 307, -50, 60, -357, 335, 137, -8, -215, -88, 100, 341, -89, 164, -9, 83, 131, -87, -128, -146, 20, 57, -53, 63, -159, -114, 33, -86, 19, -4, -124, 45, -30, -86, 138, 103, 117, -21, -165, 39, -140, 12, -78, 37, -36, 128, -206, -264, -7, 63, 255, 193, -153, -79, 202, -120, -35, 46, 219, 56, 49, 185, -172, -135, 39, -92, 174, -35, 190, 37, 50, -14, -109, -8, 145, -22, -140, 112, 167, 17, -82, 48, 14, -28, -52, 52, 210, 72, 210, 30, 302, 2, -153, -83, 68, -27, -168, 153, 87, -424, 227, 6, 242, -52, -122, -16, -119, 193, -166, -125, 72, -4, 63, 140, 56, -100, 12, -48, -6, 97, -131, -65, -85, 304, 124, -54, -25, -151, 33, -212]
3560b12M15j31k32K25N5J2o5J08k49R2n8j68K11M6R5j97m29N02j48J51j73M08
3582B58l17J31k97N8nJ24K44k40J27J25n43J66M7K50K16n41L69j36jj67L16l28
3604a44q4L66l36J98k35J28L6j85K86j57n5J60J06J70k69J45M9k93J91Nk22p0
3626b10O8M5n0P7K46m33J24Q9j83R9O7j6M5j18L43k09q9l4R0J07K4N8l15J85Q
3651A8R0K49m41L01k59J42L45l59k75K66j69R4K51r6j7j42J79j44p6K1K35l99
3673a86M05m12J70j67NK98k29J59R5j31L0j17Q9lJ03j24PK15j74n9Q9j02M53l44
3697G0l2K7j89J49j30K24N2k9j84j15PJ30O7M5k6l6o2K60n9k97k5J32K66l47J6
3722h6p8J62j74O2O7J76j94m6L27j66k27n3L66k28J20k63L01k7O9k1J39l92K18
$$ y = [-212, 203, 72, -160, 65, 120, 132, 67, 175, -74, 18, -40, -208, 3, 49, 144, -53, -482, 20, -128, 23, -150, 258, -59, 72, -225, -167, -172, -48, 196, -44, 83, 208, -335, -169, -122, 128, 344, -197, 172, 36, 35, -132, 184, -144, -228, 138, -198, 0, -235, -107, -71, -256, 30, -127, -182, -22, 84, 254, -15, 130, 179, -114, 77, 82, -140, -210, -142, -97, -147, -70, 176, -257, -133, -44, -227, -128, -61, -77, -32, -150, 193, -16, -105, -139, -49, 58, 82, 140, -175, 10, 18, 108, 357, -84, 217, -42, 100, 445, 86, -189, 77, -92, 2, 253, 157, 140, -2, 177, 33, -43, -22, 213, -186, 219, -193, -23, -190, -185, 113, -116, 43, 138, 7, 37, -80, 9, 6, 109, -15, -8, 207, 33, -26, 63, -39, 414, 70, 38, 65, -124, 25, -105, 119, 171, 142, -42, -157, -150, -20, 47, 92, 66, 30, -32, 228, 169, -128, -153, -21, 245, -102, -86, -164, -2, -176, -114, -47, 129, -65, -111, 216, 50, -177, -230, 136, -92, 28, -235, 66, 39, 108, 87, 226, -166, 52]
3745E2k66K55k93L30K0k99Q4J87jk01L66m16J34%j42J70j27J43J71j82J6k2j08
3768a29QJ26J57k21J29j04K74j31j83j45R9J05r8K52k58K3P3j15O4J88k15L14
3790B13k55l8L16j36j75J15j61K51k70o7L90j88P4n1j6L5o9P9q4j57K11j78m9
3813b10J05p9L32l03J08j20J70j21jJ71j93K21jl5j19l2J04J09k02k3M10l2m11
3836a52j09M02j7k30J46j20o5J01n7M4J61k06L4J71k40K90j26J08j42M1j30L5
3858f1R3j05q7K08q6N5j25J77Oj32M3N3p3j66K70l82J39L05p5p4q2J56j60J71
3882F8O2o6j82M2Q6j21K83l67L82j95Q9O2J36l86j4Q2J92j78j12J83j02J43J36
3905B23l7J75k01j05l5Mr3J59k1p9k19M59k63j88J04J4L6J76o6n0J20l90L16k23
$$ y = [52, -214, 41, -252, 78, 98, -201, -117, 70, 69, -132, 234, -182, -48, -48, -190, -20, -147, -4, 167, -15, 1, -21, -129, -121, 5, 162, -59, 70, -34, 240, 109, -74, -219, -120, -15, -113, 139, -119, -96, -23, -138, -74, 114, -101, 213, -42, -80, 236, 100, -75, 40, -121, 130, -140, -207, 183, -5, 69, 18, 2, 37, -32, 47, -37, -194, 17, -161, -210, -105, -184, 148, -155, -47, -167, 3, -118, -119, 52, -141, 80, 79, 44, -75, -107, -3, 106, -96, -119, 291, 259, -152, -261, 141, 124, -106, 40, -80, -145, -44, -101, -57, 104, -102, -68, 103, -137, 153, 27, 135, -7, 34, -96, -61, 32, -73, -160, 48, -38, 17, -108, 69, 75, -57, -14, 39, -34, -200, 70, -312, -173, 132, 57, -17, -99, 57, -103, 68, 130, 64, -118, -76, 10, -111, 172, -195, 187, -8, 81, 143, 279, -107, -121, -39, 153, -25, -137, 46, -56, 87, 223, 186, 361, 160, 55, 20, 24, -69, 90, 69, -10, -229, 230, -33, -221, -117, -103, -67, 109, 43, -7, 113, -277, 39, -184]
3929a84J2M28k31J00L5j53P1K9k75K24K5n8L4O9l42p2J94j6q8O5K6J3Pj1J44k07
3955a61M56j35o5OJ42k91J6K14j15k03K09k2l05L19q3j49J96p8K2k21K04j24O2
3978a06K82m37L88Ro7R7l41L14k30k9K70k33L6K02N9j53p7n7K34k60K47k47J69
4001G0J03k15l59L61j69J63J6N0M3j03K0j77J39K05j89R7l4p6Q9o8L3O9R8k32
4025f6r1q7Q0L78l33j03K07rP2n9O8k96K40q3L22m60J5K06mj73L20k22j47L81
4049A56l27M62l17j13Q4p7Oj33R9J24p9q8J20J96k26J38K2J65k19j07l2K50j41
4072c7O7J58k75N6P6j08n3J16J41j47j50K88j20j38J3P9j69J64j01J47J96j49
4094E4j14J71J10j69k4R7q1k51K05j01M5jJ04R7j99J57K15l77K97j87r7J97k90
$$ y = [-184, -172, 256, 25, 125, 160, 7, 78, 107, -168, 56, 81, 23, 57, 126, -216, -288, -94, -110, -198, -133, -107, -94, -87, -98, 46, -161, 295, 160, 95, 101, 243, -48, -32, 182, 67, -136, 73, 51, -254, 65, -18, -167, 29, -49, -27, -248, -44, -168, -106, 176, -261, 127, 136, 69, 166, -175, 139, -91, -120, 150, -83, -47, 155, 214, 61, -16, -73, 161, -99, 148, -99, 70, 173, -42, -401, -40, -209, -46, -30, 20, 63, -40, -20, -197, -58, 147, -42, 55, 21, -55, 34, -34, -1, 68, 166, -66, -157, -244, -164, 214, -119, -222, -15, -24, 48, -11, 57, -239, 1, -82, 240, -220, -205, 1, -3, -176, 144, -78, -225, 156, -171, 291, -26, -139, -55, -132, -126, -259, -160, -36, -115, -203, -83, 113, -113, 25, 47, 212, -7, -114, -146, 104, -37, 30, 188, -87, -31, 45, -63, -116, 0, 141, -6, -156, 132, 12, -126, -113, -34, -203, -39, -140, 7, 203, 54, -60, 111, 221, 52, 28, 125, 44, -207, -2, -103, -58, -59, 45, 142, -57, 100, 315, -62, 235, 48, -49, 148, -142]
4117a42M49k75k13J97k52J48j78J62J17j03j38J78J17j00Km0J36L4k28m6L42j41
4139B6M6l09K45j15K5K47l17K68k73K04j49k11K3M30o2r5j26M0J21Qj11J89k48
4162a44L5K26k90K71j49J52J06j34nq9j45J60k24L03k92M35m11K97j97O6L8k21
4184b12J31J08r9J28J04j04M6n1Kj18K84l87R9J60Q6k25L8K7o4j11L97k59j7K48
4208B11m84L13o4j48K60r3J78J50k78L13l37k19K64k15J22L77j31j73j06k3L6
4229d7r9N13k41J0l52J27J27p7Q9%j20K20l1j59L2j02J74p2J15j25%j67L19q4
4253E0j87J78m0n2O2m0K2K64k23p3k2j7N6Q9m2q5J5Q5J5k19l5L71n0k7k41L5L36
4280B25k03p6K07j75L3k17P8k5J22R8Ok51L5p3J14k09L54J28j05J80k23N7k3J97
$$ y = [-142, 307, 32, -181, 16, -236, -88, -266, -104, 13, -90, -228, -50, 67, -33, -31, -71, 65, 99, -129, -175, 167, 26, 72, -237, 8, -107, -82, 165, -152, 116, -157, 47, -102, -313, -290, 140, 78, -17, -143, -103, 18, 26, -85, 104, -144, -109, 117, -173, 98, -51, 101, 207, 73, 68, -21, -166, -6, -230, 73, -219, 216, -195, 102, -95, -29, 9, -212, -81, 27, -72, 56, 160, 56, 102, 51, 53, -65, 219, -168, -69, 91, 177, -48, -10, 17, -47, -158, 239, -20, -37, 211, -273, 40, -24, -172, 88, -5, 173, 323, 45, 358, 21, -198, 66, -149, -27, 350, 219, 46, -60, -83, -47, -146, 367, 126, 136, -216, -89, 38, -39, 50, 50, -70, 150, 119, -40, -8, -110, 64, -8, 107, -18, -18, -185, 134, 50, -137, 41, 1, -51, 11, -29, -7, 257, 34, -39, -61, -78, -22, 67, 25, -60, -45, 40, 55, -164, -199, 172, 122, 95, -146, -111, 225, 22, -54, 153, -22, 11, -206, -128, -153, -31, 67, 73, -178, -143, -216, -102, -311, 43, 171, 66, 246, 23, 80, 57, 254]
4304B54p3l75k8K70j92K42J15j62rL19n08K26k08J93j12K07l98K81p2m2j19M33
4326B42p5j63J38j44j29J01n4M85m62j79M11k02n7J21J7N3J27q8K6N8l09M2J18
4349G7j18J88j70K1k90J15M7K26m9J21j30J5k10r9J02n3L91l77J55K43n09L04
4371@m6J98j41l03K81M1k17M36l59O3K14k17K34n2j79J21k28K88k47N5R7j59%
4394a20M5O1q6L3j64J03j7o5J90J32j71L0K8qL17j81l28q0K76O6j20j07l5K25
4418B4J18l58K29q6J84k58L15qj87J57j22J96m39M02r7r3K17r8k29R8k4J80m98
4441c77K20K1J14j87n2K84j45L37m48J9Q8J15J14l41K94J23j29q8L04l00K13k37
4463e8Q2J13n6j42J72r8J59l55K75j75j52K22k61N23m75L12j0k81K05j20K20M7
$$ y = [254, 181, -194, -222, 48, -144, 98, 213, 51, 42, 361, -147, 79, -129, 64, -48, 159, -239, 42, -30, -72, -191, 242, 167, 4, 142, -2, -131, -30, -84, 401, -61, -240, 171, -31, -88, 33, 50, 103, 230, 142, 168, 226, -83, -41, 77, -41, 147, -23, -2, -292, -177, -130, 96, 47, 168, 38, 53, -157, -256, -154, -207, 184, -193, -38, 205, -304, 0, -46, 152, 11, -292, -11, 30, -187, 249, -110, -47, 167, -50, 184, 132, -47, 74, -154, 134, -113, -58, 39, -120, -120, -75, -14, -100, -67, -231, -128, -145, -210, -20, 112, -59, -29, -1, -9, 308, 127, -201, -281, -5, 61, -59, -166, -201, 24, 142, -216, 13, -73, 111, -147, 168, 160, -27, 130, 8, 204, -235, 167, 70, -23, 194, 96, -133, -35, -59, 121, -377, -157, -136, -22, -209, -261, 23, -122, 215, -233, -214, -126, -11, 103, -238, 56, 179, 50, -38, 266, -34, 179, -58, 24, 137, 81, -61, 111, 13, 172, -183, 92, -83, -235, -13, -274, 249, -226, 86, 76, -205, 0, -120, 100, 147]
4485A47l47L01q3jM5j55Q2P8k6J37n18JL80k5j42K17k09J98J15q5j09m3J07j65
4509a00J17n2j20j30M49o6j50NL47l00L2J65j30j64o0J54N8oK1o2M3j85Q8l9K65
4534A80jo5l0l18qK73K20mn58L90j96K05k03K82j39K53j30k58Q6o5J3R6k7J47
4558A43J41l57M25j80q7m8j8K87q10M62J00j76Q8p3J62j00J55l75M03m88R1K28
4580b7o4k7L37l12p6L14l05n6K32k8R5P8j74J25j12J21j59J12l06M75n9j81j23
4603a20J13n6p8K86K1j47P3J9l00O2J74P0q5L1j38K23j66Q0j76j39K00J19K2j62
4627g4J81L4l66J48K59k20J83j76j82J31P2k6J59n06L64J56m3j1R4m26J92K13
4649A56R2j11l5j76k25N25k94kO6j29K30j06kO3p6J76P6j33l68L16q4J20r9J12
$$ y = [147, -200, 101, 18, 17, 62, -93, -11, 67, 41, 178, -340, -339, 41, 16, -126, 91, -118, 80, 195, 110, 1, -42, 65, -100, 17, -35, -155, -285, 164, 98, -52, -47, 300, 0, 32, 197, 67, -97, -157, -3, 55, 49, 70, 8, 51, -134, -46, -85, 180, 179, 114, 84, -234, -242, 31, 251, 247, -311, 79, -117, 88, -115, 167, 28, 281, 151, -107, -21, -86, -73, 23, -4, 143, 284, -73, 352, 172, 85, 37, 19, 306, -504, -42, 58, -118, -30, -103, 59, -41, 114, -261, 142, -346, -255, -27, -91, -118, 219, -93, -169, 145, -160, -216, 16, -12, 83, 161, -13, 112, 0, 121, -38, 74, -232, 243, 184, 3, -120, -7, -63, -141, 145, 166, 19, 92, 111, -189, -127, 47, 117, 32, 63, -75, 148, -18, 62, -114, -253, -53, 66, 88, -74, 107, 141, -225, -77, 182, -38, 145, -31, -213, -82, -10, -36, 123, -383, -19, 137, 94, 83, 177, -249, -57, 156, 248, 137, 102, -74, -299, 226, -68, -70, -4, -133, 97, -9, -11, 52, -24, 152, 228, 95, -273, 43, -41, 79, -20, 92]
4673I2k68O8J82k38K27j16J81k9l28M24k50m8J31J19l51PJ68r1K03J56p8l86K31
4696FO0k16n2L35J16k10p6j12K49L8j26j81J54k11K72J19j23K0j16J58j74K54
4718A84k30RJ07N4r9Q3j62J93j31Q7k18K23k80K39l09J31j36J90J79l88L02j55
4740a27J45J35L4l77J18j5k99L73k31M04k77J16P3l8k6k01o2P4J10L23j52l8l02
4763b40L86m2j49RK31j68J44j04k40K06j7qq7J85j29j3n8N8p4j2P3j82J7M05j59
4788C2j24Q4K10k44K49o7j98J52j2j14q8J65k43J15O0N8k91K81k31L43m8J02k36
4811d5J52k71RJ16LN7N0o8M5O0j60R8j71Q1PJ58k01K00O7k80o2K34q5o7j36K85
4837G6p2K71j72n8O9p1L4m85M85j22J63k47L37m71J25O2M92o25nM14l24J13j01
$$ y = [92, -176, -108, 74, -164, 63, -53, 128, 99, -229, 195, -55, -103, 28, 147, -204, -197, -29, -120, 83, 239, 161, -225, 6, 66, -150, -202, 133, 249, 39, -37, -149, 100, 138, 12, -169, -15, -226, 46, 165, 42, 62, -54, 104, -70, 184, -46, -37, 70, 124, 25, 108, -54, 139, 8, 95, -123, 100, -180, 59, -250, -119, -255, -65, 114, -274, 28, -127, 18, 153, 187, -190, -72, -87, -386, -13, -244, 160, -117, -1, 72, 34, 8, -193, -255, -181, -71, 252, 100, 62, -240, 146, 104, -45, -36, 195, 27, 171, 67, -173, 33, 16, 8, -79, 106, -23, -36, -94, -36, -110, -122, -49, -231, -214, 191, 32, -92, -8, 202, -42, 207, 140, -58, 94, 82, -32, -120, 45, -198, -83, -23, 35, -256, 25, -206, 137, 89, 191, -45, 107, -164, -155, -39, -36, 21, 71, 3, 48, 108, -52, 46, -125, -44, -37, 121, -80, 120, 187, -93, -155, 79, -6, -73, -209, 76, 4, 275, 103, 45, 114, 43, 77, -408, 77, -45, 118, -129, 208, -263, -138, -76, 416, -209, -214, 200, -124, -11, -112]
4860a12J19J39j24p0k2K39N9l38O6K55k5k64Q2L76m10K25k51P2J05l9k30K0K20
4883I2q6K49m35M7O6J19j30J50q7P6l7j57n3k5lJ00J57j30O0K10k38l5J69M5j61
4908c7o3J09k76K55J21l9m6j44K16j91j21Q3j6j71O39k52Q2m19J84K8J59j98R0
4931glM1l1l58M38J49l84l2K03M0j55J29n4r1K47l25K99k14j66L91k02J80n2N0
4955I3P0j01R4O2j44j18n7J40l2j08K17r2J17J14m79Q8M5J64r8J57j72J76k83
4978a47P9l3K12k78Q1M10l92M4JR9K0M5p8p0j43K00O6j48J29k73K69j13j3m13
5002d46M31r0K20l5l38L19k91K30K9K00l21j32L08j89J67j24K50m11M27j91l3
5023b0r6N7M7n8K06j41j27j8K64j71M8j7j95L98j97q0J75l8M4J41k97l8r8M79
$$ y = [-112, 7, 146, 22, -48, -70, 169, 228, -110, -44, 211, 186, -78, 4, 380, -30, 195, -56, 16, 121, 82, -148, -128, 92, 6, 255, -180, -133, -67, 52, -78, 72, -15, 61, 24, -133, -186, -211, -214, -114, 43, -87, -27, 183, -55, -90, 79, 124, -37, -100, 9, -267, -12, 109, 70, 24, -120, 96, -95, -216, -133, -149, -320, 319, 67, 149, -270, -86, -58, 101, -97, -7, -10, 31, 0, -358, 80, 229, -155, -187, 16, 56, -99, 30, -24, -115, 132, -193, 106, -108, -274, 117, -85, 95, 43, 93, 163, 62, 156, 218, 74, -44, -101, 39, 7, -101, 116, 24, 141, 255, -224, -136, -91, 73, -25, 132, -40, 136, -147, -68, -101, 111, -167, -86, 324, -68, -24, -23, 76, 96, 141, 63, -7, -150, 50, 116, -32, 97, -176, 93, -20, -33, -446, -15, -105, 115, 80, -258, 61, -230, 0, 29, 229, -92, -224, 84, -105, 62, -62, 188, -223, 204, 13, -20, -116, -59, -12, -70, 136, -5, -132, -150, 114, -57, -9, -26, -221, 177, -20, -100, 75, 37, 81, 222, -75, -113, -211, 268]
5047B68k71j4j01M9J93K5n4r1L9p3p3M94m20R0q6o7m3l1J77Oj04P7J29j34q2p1
5073a68L28k15Q4k91R2J29n2J28k2o1l13K48Q7l5p2J94j43pL9l34N60j75n8J37
5097H0j76K02j19j8l1N1j49J00R7o9M12o00K73n4R3j33L1Nr9N6L15l23J67k8k7
5122E6K9J6k00j1J68M6K5j49LJ4q6M3L0j60K24N4k10J48q0N0j89J43j05Q2j13
5147a72j2K26j34L82j89k59J51N3k70M52l56J65K0l02K78M9j75K5P0j16J7J37
5169D0k18J92k13P9K45m29K59K03j45l6j39K39k63L00j51K74k78P8P0J51l21o
5191f9K26k49N38o58L65j26j68K12k78N7K81oP2k51LJ29l6l8J35j72m8R9k47L02
5215G3r6j25J21P1P7m8j37K6j12J79m5qL8J8k48J63O5J31j49J38k48J88qN8k81
$$ y = [268, -3, -17, -118, -69, 124, 149, 95, 4, 43, -30, -103, 391, -29, 61, -25, -92, -135, -166, 11, 17, -87, -10, 119, -15, -97, -168, 160, -55, 29, -262, -170, -41, -93, 35, 13, -48, -361, -113, -26, -61, -133, 61, -82, -89, -50, -384, 176, 1, -57, 80, -96, 106, -13, -31, -62, -11, -160, -60, 37, -32, 380, -220, 53, -1, 92, -41, -10, -5, -104, -48, 267, -56, 111, 83, 56, 85, 101, -99, -110, 58, 104, 129, -20, -17, -3, -89, -46, -16, -176, 48, 102, -108, 40, -40, 10, -179, -36, -141, -59, -172, -184, 42, -92, 290, 101, -158, -7, 46, -224, 228, -128, 37, 57, -245, 33, 82, -93, -68, 2, -114, -97, 40, -178, 14, -199, -120, 125, -304, -45, 158, 13, -23, -162, 77, -186, 114, -37, 237, -41, 37, 107, 258, -63, -69, 157, -92, 446, -212, 153, 27, -141, 71, -207, -150, 131, 125, 197, -54, -51, 78, 42, 4, 139, -33, -81, 18, -229, 73, -23, -148, -27, 44, 121, 73, -64, -38, -150, 29, -16, -24, 14, 32, -216, -53, 12, 143, -6, 132, -116, 72, 64, 122, -159]
5240a59K41j91J82j12J81q9r2n8M4RK59l44J27P5j42K07l7m2Q6k10J74k12K00
5263I7k18J19J51j39r7L2L5J96k94K29j69k2m6J02m6J45R9k89K38k03J90l72J06
5286a56J48p3O8J58l34K3K48j53O6j71J79J69q1j65P5O9M3kn0j52K32j06J03q3
5310E5m48L47K43j65J75k84n6R5j57J09L2J62j82K39j95J00LL03l45Kj94K83J53
5333B75j79k51J57j9O8r2j42L44k38Q9l08K53Nj23m7K73Om2l30M12n6q5j34J57
5357gJ7J3j12J68k07L85l46L97l68qM3Jk8n3p2K99k51K47J15k47j20R4j6J79k17
5382i4R1l4l36M34Q4j25l0p0N9r1j47J79K03J4j00k6J2j07j53K60n3l56L89L4
5406C7mQ0%m16L84m3k05R9K31M1m06K00p9L18k51J11p2k69K92m1j88K41j78L51
$$ y = [-159, 82, -109, 73, -39, 142, 53, -39, -97, -53, -44, 215, -129, -2, 73, -69, 138, 101, 59, 145, -65, 109, -103, 97, -121, -2, 149, 10, -87, -55, -20, 176, -118, 111, -58, -80, -126, -24, -70, 75, 174, -115, 123, -80, 110, -262, -156, -8, -81, -13, 145, -189, -166, 82, -71, -5, -176, 3, 172, 91, -74, 1, 70, 113, 111, 61, -91, 141, 35, 138, 55, -393, -46, 197, 32, 207, -77, -133, -38, -195, -86, -54, 108, -74, 165, -30, 70, 73, 376, 31, 33, -161, 122, 275, 96, -155, 2, -17, 51, -41, -183, 161, -77, 12, -296, -43, -38, -161, -208, 65, 71, 29, -301, 111, 55, -30, -164, -7, 10, 23, -89, 79, -128, 257, -89, 308, -60, -68, -25, -24, -52, -105, -177, 122, -129, 118, 233, -14, -134, -40, -56, 123, -94, -3, -37, -373, 61, 145, 20, -10, -80, -21, -112, -259, -80, 123, 137, 37, 11, 23, -84, -237, 23, -30, -386, 3, 37, 33, 113, 113, -303, 81, 38, -167, -68, 163, 204, -202, -2, -81, 237, -14, 97, 25, -244, 48, 7, -181, 60, -118, 233]
5430B33m43K57m0k15J50K22k17q2p9K58q4k53K90K11k13k2P8j18K49j50j69o2
5452a99K28j46K72JO5k00n5k1K19k85L2K42P7m17K22r7J86j24K89l55J62l12J53
5475f3L67l27j18J35j55K96J0k53Q0P8o1N3L6J14j66o5R2k79M55j09o0n3P8n0
5499C5j26J42r3n0q5K70j34q1R8Q2J71j92j54L49l65P7J73j17Q9Q9J4j63O2M9
5523A40q9j31n1K8j5J2J48j77l0J78r8J71Q8j48kJ29P0l3j59JJ31k97K22J16k86
5548h2J36j33K0J06K5p1J04m8J49k34J3J8Q2j05j56M8Rk4J46K40P4l72j19J98
5572B4p4J86k23J08p9L6J01m4j7p7J85j72J46k43R4l7J72jP3JM1k81R9j05K25
5597A38m8l82M30j2k08K59k2m11J94J98j64j89J07J34k11J67O3k1n6j6J18J47
$$ y = [233, -210, 47, 7, -208, -58, 164, -53, -135, -214, 44, -40, -293, -3, 208, -5, -27, 51, -67, 182, 32, -137, -199, 29, -117, 155, 156, 221, 21, -34, -55, 164, -121, -89, 153, 230, -187, 35, -62, 124, 0, 289, -66, 96, -216, -63, 304, -23, -141, -6, -161, 135, 145, -108, -28, 50, -11, 42, 78, 192, 26, -39, 53, -226, 229, 120, 60, 7, 85, 35, -91, 51, -42, -92, -177, 93, -41, -122, -24, 58, 229, 37, -117, 232, -133, -56, 117, 0, 89, 178, 192, 29, 91, 140, 51, -80, -131, -103, -118, -106, 42, -135, -165, 13, -85, 86, 174, 26, 24, 153, 223, 190, 31, 32, 163, -134, 88, 204, -82, 54, -79, -59, 47, 72, 1, 105, 57, 206, -28, -15, 3, 85, -20, -176, -128, -119, -143, 3, 243, 317, -55, -174, 24, -50, 136, -87, 21, -58, -22, 79, 35, 18, -59, 126, -46, 100, -143, -49, -86, 86, 85, 158, 159, 200, -81, 18, -87, 138, 90, -292, 138, 126, -82, 177, 155, -256, -62, 136, -28, -217, -110, 24, -187, -20, 43, 22, -34, -50, 68, 215]
5619B15k49M3J86j53j40l7j70K24L8l6J82j47j12J25o0N1J53j68j0k12M56Q2j21
5642A40r2k40j5K26l3n5J95j47P5k2J70k09r9J20j74J97L17l31p6K2P6k51L58
5665A52j06q0qm0j02K86k37j7K48J31m22J89o2J93p4O8j71j66L48j98J97k34K02
5688I7j09J50j61J24Q1q0j28J3j2M8o2K10k67O1O4j68J10L3n2J31j87J9l4k5j61
5713c05J85J97l64L92j37o2K5r2NK11k5l09K92J33j68l1O1P9k78ro8M29j43Q6
5737A04k62K04j7j45K07k22L5m4M24j07J51m56J34K10k55m3K80j60M6Rk27J83
5759D9K29j14j10j83m2L63jj93kJ10J7O5l18PJ75J9J09m2j68N2Q4P4l38J75j31
5784a14L25J6r7Rl42K01k47Q7M69k68k13Q5p9J4K78k32O6R8k92J57M1K31r5j31
$$ y = [215, -34, 9, 195, 42, -98, -135, -305, -81, -43, -79, 103, -44, -156, -31, -91, -40, 113, -55, -65, -277, 179, 261, 140, 48, -192, -207, 19, -14, -69, 126, -21, 54, 32, 202, -7, -106, 14, -160, 37, 354, 23, -53, -31, 45, -206, 152, 46, -34, -42, -82, -184, 102, -135, -152, 96, 227, -195, -6, -68, 125, 51, 119, -52, -218, 130, -68, 129, -105, 97, -12, 138, -23, 101, 182, 102, -26, -13, -25, 23, -39, 171, -96, -35, 29, -139, -29, 4, -48, 83, -104, -85, -119, -144, -305, -120, 77, -287, 105, -32, -94, -69, -161, -156, 55, 30, -279, 13, 146, -22, -53, 8, 87, -191, -200, -268, 161, 18, 104, -158, 46, 29, -116, 91, -131, -96, -140, 284, 177, 328, -128, 6, 216, -39, -82, 198, 38, 84, 93, -134, 49, 278, 164, 54, -129, -171, 192, 191, -2, -4, 106, 123, 188, -130, -123, 52, 71, 180, 138, -30, 22, 106, 180, -158, 17, -114, 211, 227, 130, 139, -203, -2, -249, -162, 307, 39, -174, -89, -168, -154, 124, -108, -42, 56, -236, -79, -38, 193, 98, -33]
5808c3K2o2Q1R0k78J9J44q7P8k30L80j01o3p7J18j31N8J02j65J22J61l75P4k5
5832a78Q3%P6J91l38J77K40k98p5R6J76j29J94k22q5J73K24k59J1pp8L3L2L5k22
5857a50J74k35M31j18k68Q6q4J87rK50m10l1N47k23j16P9L9j81nJ22j30p1k7q6
5881b29K00J21J21o7m15L64m8j05k02L57k46N53l15k13N3N2L6j43N8n5J44q7P9
5904A3j4K06j6j29o2m1p5j0L9k1R6J57p7r0j01l0M02j19j30rJ65kj38P6j02N9
5930D7j3p9Q3J1J64j73j7j37K25l51L57j13k63J46n7l6L68N8k19N3j45k7J02J19
5954A03l3L4J6R0l32j86L05j55K98k73J82k52J31j82M51k63M1K79l62K0L15k35
5976hM8j54j2K25l66K46j04K36J51l85P6q3J48k2L2j10K8J58j15J75m94K23J00
$$ y = [-33, -11, -73, 8, 98, -180, -161, -17, -104, -26, -256, 124, 23, -40, -117, 1, -130, -72, 30, -135, -13, 148, -227, -153, -178, -95, -95, -19, 172, -166, 11, 251, -47, -122, -26, 150, 21, 215, -7, -92, 81, 305, 46, 57, 50, -28, 5, 37, 72, -150, 24, -211, 220, 102, -166, -80, -164, 23, 14, 264, -146, -177, 370, 147, 31, 110, 149, -32, -37, 85, -45, -116, -143, -229, -29, 92, 213, 146, -269, 95, 47, -58, -260, 97, -149, 404, 89, -124, -71, -19, 17, -126, -68, -123, 21, -66, 13, -1, 205, 189, 60, -2, -43, -118, -128, -89, -110, -14, 143, 66, -24, -125, -155, 247, 128, -2, -11, 154, 152, 14, 90, -12, 47, 34, -45, 38, 49, 213, 40, 23, -114, 111, -240, 117, 4, -259, -113, -170, -206, 162, 220, 1, 54, -91, -118, -16, 103, 70, 104, 120, 210, -122, -308, -3, -158, 140, -133, 49, -203, -72, -254, 197, -66, -25, 254, -108, -88, 227, -8, 40, -114, -126, 99, -267, -21, -125, 111, 262, -123, -47, -130, 18, -4, 28, -82, -54, 104, -11, 164, -330, -107, -7]
5999gJ00j91K30L9k37K28Pr3K1l13L32j82J6K07m3j67L62k71j01L40j25p8j3o3
6023bmJ63l36M13L6l71K81n5k84K29Qn7j6L12l41r9Q9j1k33L2J84p9p2L54N4o9
6049A26j10p4L50l21l8L7Q9k78J00K09p5m8L40m44p6K58p5J04ml67K09k15J90
6072a13J96l0j59L2r4J63K4j40K24M9k31K5l7J11J00k95L41o0k1l7l0p4P3j5J51
6097A53K3j37P4J10m86J97K10m4j61L89j26k57K48j03Pl59K77l75L40j99L48k06
6119g7K96j68R2q4m0K4L19m94j5J2j21K30q5K18j53J97j36j37Q0R4o4j06oO0m1
$$ y = [-7, 93, -98, 132, 171, -66, 162, 169, 76, 97, -216, 116, -66, -50, 157, 114, -53, 309, 38, -63, 277, 152, 74, 61, -2, -6, 157, -179, 234, 270, -101, 180, 125, -159, 70, 78, 21, 5, 317, -24, -123, -34, -45, -278, -246, -62, -141, -213, 141, 195, 126, 16, -58, 292, -29, -67, -30, 59, -219, -119, 90, 15, -33, 307, -137, -213, 45, -30, 74, 70, -297, -88, -303, -113, 83, 53, -106, -74, -168, -5, 19, -121, 103, 152, -79, -54, -91, 20, 120, -175, 166, 106, 85, 48, 18, -56, 17, 2, 153, 176, 39, 113, 223, -263, -66, 144, 100, -61, 328, 202, -55, 193, 90, 97, -262, 15, -360, -20, -219, 129, -77, 219, 51, 143, 59, 19, 43, 362, -132, -147, -135, -256, -26, -111, 107, -46, 151, 15, -122, -42, 52, -12, -118, -124, -64, -105]
$$ [...]
8191g1
##END NTUPLES=NMR FID
##END=
