##TITLE=1H_ET-1901
 CDCl3
 8 sc, 
 20.1.2022
##JCAMPDX= 6.0         $$ Bruker NMR JCAMP-DX V2.0
##DATA TYPE= NMR FID
##DATA CLASS= NTUPLES
##ORIGIN= UXNMR, Bruker Analytische Messtechnik GmbH
##OWNER= root
$$ XWIN-NMR		Version 3.5
$$ Thu Jan 20 11:58:26 2022 Russian Standard Time (UT+4h)  she@DPX200
##.OBSERVE FREQUENCY= 200.131346
##.OBSERVE NUCLEUS= ^1H
##.DELAY= (6, 6)
##.ACQUISITION MODE= SIMULTANEOUS
##.ACQUISITION SCHEME= undefined
##.AVERAGES= 8
##.DIGITISER RES= 18
##SPECTROMETER/DATA SYSTEM= spect
##.PULSE SEQUENCE= zg30
##.SOLVENT NAME= CDCl3
##.SHIFT REFERENCE= (INTERNAL, CDCl3, 0, 15.7039)
##AUDIT TRAIL= $$ (NUMBER, WHEN, WHO, WHERE, WHAT)
$$ ##TITLE= Audit trail, XWIN-NMR		Version 3.5
$$ ##JCAMPDX= 5.01
$$ ##ORIGIN= Bruker BioSpin GmbH
$$ ##OWNER= she
$$ F:/spectra/data/she/nmr/H-F/1/audita.txt
$$ ##AUDIT TRAIL=  $$ (NUMBER, WHEN, WHO, WHERE, WHAT)
(   1,<2022-01-20 11:57:03.29 +0400>,<she>,<DPX200>,
      <created by zg, POWCHK disabled, PULCHK disabled
       configuration hash MD5:
       00 E9 B6 7A A2 85 ED C7 34 08 36 98 17 FE 4E 26
       data hash MD5: 16K
       2E 8B 5E C6 BA 97 D1 90 34 9A AA 78 44 8E 31 7D>)
$$ ##END=
$$ 
$$ hash MD5
$$ EA C6 89 25 7E 4F 4A 64 C6 76 D3 68 26 77 0D 34
##$RELAX= 
##$RELAX= 
##$RELAX= 
##$RELAX= 
##$RELAX= 
##$RELAX= 
$$ Bruker specific parameters
$$ --------------------------
##$DU= <F:/spectra>
##$EXPNO= 1
##$NAME= <H-F>
##$PROCNO= 1
##$TYPE= <nmr>
##$USER= <she>
##$AMP= (0..31)
100 100 100 100 100 100 100 100 100 100 100 100 100 100 100 100 100 100 
100 100 100 100 100 100 100 100 100 100 100 100 100 100 
##$AQSEQ= 0
##$AQ_mod= 1
##$AUNM= <au_zg>
##$AUTOPOS= <>
##$BF1= 200.13
##$BF2= 200.13
##$BF3= 200.13
##$BF4= 200.13
##$BF5= 200.13
##$BF6= 200.13
##$BF7= 200.13
##$BF8= 200.13
##$BYTORDA= 1
##$CFDGTYP= 0
##$CFRGTYP= 5
##$CHEMSTR= <none>
##$CNST= (0..31)
1 1 145 1 1 1 1 1 1 1 1 1 1 1 1 1 1 1 1 1 1 1 1 1 1 1 1 1 1 1 1 1 
##$CPDPRG= <>
##$CPDPRG1= <>
##$CPDPRG2= <>
##$CPDPRG3= <>
##$CPDPRG4= <mlev>
##$CPDPRG5= <mlev>
##$CPDPRG6= <mlev>
##$CPDPRG7= <mlev>
##$CPDPRG8= <mlev>
##$CPDPRGB= <>
##$CPDPRGT= <>
##$D= (0..31)
0 1.2 0 0 0 0 0 0 0 0.06 0 0.03 0 0 0 0 0.0002 0 0 0 0 0 0 0 0 0 0 0 0 
0 0 0 
##$DATE= 1642665422
##$DBL= (0..7)
120 120 120 120 120 120 120 120 
##$DBP= (0..7)
150 150 150 150 150 150 150 150 
##$DBP07= 0
##$DBPNAM0= <>
##$DBPNAM1= <>
##$DBPNAM2= <>
##$DBPNAM3= <>
##$DBPNAM4= <>
##$DBPNAM5= <>
##$DBPNAM6= <>
##$DBPNAM7= <>
##$DBPOAL= (0..7)
0.5 0.5 0.5 0.5 0.5 0.5 0.5 0.5 
##$DBPOFFS= (0..7)
0 0 0 0 0 0 0 0 
##$DE= 6
##$DECBNUC= <off>
##$DECIM= 32
##$DECNUC= <off>
##$DECSTAT= 4
##$DIGMOD= 1
##$DIGTYP= 9
##$DL= (0..7)
0 120 120 120 120 120 120 120 
##$DP= (0..7)
150 150 150 150 150 150 150 150 
##$DP07= 0
##$DPNAME0= <>
##$DPNAME1= <>
##$DPNAME2= <>
##$DPNAME3= <>
##$DPNAME4= <>
##$DPNAME5= <>
##$DPNAME6= <>
##$DPNAME7= <>
##$DPOAL= (0..7)
0.5 0.5 0.5 0.5 0.5 0.5 0.5 0.5 
##$DPOFFS= (0..7)
0 0 0 0 0 0 0 0 
##$DQDMODE= 0
##$DR= 18
##$DS= 0
##$DSLIST= <SSSSSSSSSSSSSSS>
$$ [...]
##$SUBNAM2= <"">
##$SUBNAM3= <"">
##$SUBNAM4= <"">
##$SUBNAM5= <"">
##$SUBNAM6= <"">
##$SUBNAM7= <"">
##$SUBNAM8= <"">
##$SUBNAM9= <"">
##$SW= 18.0517287032376
##$SWIBOX= (0..15)
0 0 2 0 0 0 0 0 0 0 0 0 0 0 0 0 
##$SW_h= 3612.71676300578
##$TD= 16384
##$TD0= 1
##$TE= 0
##$TE2= 300
##$TE3= 300
##$TEG= 300
##$TL= (0..7)
0 120 120 120 120 120 120 120 
##$TP= (0..7)
150 150 150 150 150 150 150 150 
##$TP07= 0
##$TPNAME0= <>
##$TPNAME1= <>
##$TPNAME2= <>
##$TPNAME3= <>
##$TPNAME4= <>
##$TPNAME5= <>
##$TPNAME6= <>
##$TPNAME7= <>
##$TPOAL= (0..7)
0.5 0.5 0.5 0.5 0.5 0.5 0.5 0.5 
##$TPOFFS= (0..7)
0 0 0 0 0 0 0 0 
##$TUNHIN= 0
##$TUNHOUT= 0
##$TUNXOUT= 0
##$USERA1= <user>
##$USERA2= <user>
##$USERA3= <user>
##$USERA4= <user>
##$USERA5= <user>
##$V9= 5
##$VALIST= <valist>
##$VCLIST= <CCCCCCCCCCCCCCC>
##$VD= 0
##$VDLIST= <DDDDDDDDDDDDDDD>
##$VPLIST= <PPPPPPPPPPPPPPP>
##$VTLIST= <TTTTTTTTTTTTTTT>
##$WBST= 1024
##$WBSW= 4
##$XGAIN= (0..3)
0 0 0 0 
##$XL= 0
##$YL= 0
##$YMAX_a= 700323
##$YMIN_a= -811086
##$ZGOPTNS= <>
##$ZL1= 120
##$ZL2= 120
##$ZL3= 120
##$ZL4= 120
##$ABSF1= 10
##$ABSF2= 0
##$ABSG= 5
##$ABSL= 3
##$ALPHA= 0
##$AQORDER= 0
##$ASSFAC= 0
##$ASSFACI= 0
##$ASSFACX= 0
##$ASSWID= 0
##$AUNMP= <proc_1d>
##$AZFE= 0.1
##$AZFW= 0.1
##$BCFW= 1
##$BC_mod= 2
##$BYTORDP= 1
##$COROFFS= 0
##$CY= 11.3945322036743
##$DATMOD= 1
##$DC= 2
##$DFILT= <>
##$DTYPP= 0
##$F1P= 2.36226072786647
##$F2P= -0.459571619588291
##$FCOR= 0.5
##$FTSIZE= 0
##$FT_mod= 4
##$GAMMA= 1
##$GB= 0.15
##$INTBC= 1
##$INTSCL= 1
##$ISEN= 128
##$LB= 0.24
##$LEV0= 0
##$LPBIN= 0
##$MAXI= 10000
##$MC2= 0
##$MEAN= 0
##$ME_mod= 0
##$MI= 1.114404
##$NCOEF= 0
##$NC_proc= 0
##$NLEV= 6
##$NOISF1= 3.799351
##$NOISF2= 2.8
##$NSP= 1
##$NTH_PI= 0
##$NZP= 0
##$OFFSET= 15.70392
##$PC= 1
##$PHC0= -15868.26
##$PHC1= 10.20078
##$PH_mod= 1
##$PKNL= yes
##$PPARMOD= 0
##$PSCAL= 0
##$PSIGN= 0
##$REVERSE= no
##$SF= 200.130013532006
##$SI= 16384
##$SIGF1= 3
##$SIGF2= 2
##$SINO= 400
##$SIOLD= 16384
##$SREGLST= <1H.CDCl3>
##$SSB= 0
##$STSI= 0
##$STSR= 0
##$SW_p= 3612.71676300578
##$SYMM= 0
##$S_DEV= 0
##$TDeff= 0
##$TDoff= 0
##$TI= <>
##$TILT= no
##$TM1= 0
##$TM2= 0
##$TOPLEV= 0
##$USERP1= <user>
##$USERP2= <user>
##$USERP3= <user>
##$USERP4= <user>
##$USERP5= <user>
##$WDW= 1
##$XDIM= 8192
##$YMAX_p= 0
##$YMIN_p= 0
$$ End of Bruker specific parameters
$$ ---------------------------------
##NTUPLES= NMR FID
##VAR_NAME=  TIME,          FID/REAL,        FID/IMAG
##SYMBOL=    X,             R,               I
##VAR_TYPE=  INDEPENDENT,   DEPENDENT,       DEPENDENT
##VAR_FORM=  AFFN,          ASDF,            ASDF
##VAR_DIM=   8192,          8192,            8192
##UNITS=     SECONDS,       ARBITRARY UNITS, ARBITRARY UNITS
##FACTOR=    0.0002768,     1,               1
##FIRST=     0,             0,               0
##LAST=      2.2672688,     0,               0
##MIN=       0,             -811086,         0
##MAX=       2.2672688,     700323,          0
$$ Real data points
##PAGE= N=1
##DATA TABLE= (X++(R..R)), XYDATA
$$ plain form
0 0 0 0 0 0 0 0 0 8 -8 8 -8 16 -16 24 -32 34 -46 56 -72 81 -97 121 -141 169 -195 227 -267 307 -356 410
30 410 -466 531 -604 686 -775 871 -977 1096 -1227 1370 -1524 1692 -1877 2082 -2302 2542
46 2542 -2806 3094 -3412 3759 -4139 4558 -5026 5545 -6126 6782 -7522 8376 -9367 10532
60 10532 -11928 13631 -15774 18555 -22328 27761 -36311 51807 -88894 371028 122005 -401066
72 -401066 103590 -379335 -478024 304609 256599 -441364 -22591 202467 -238817 156730
82 156730 700323 3571 -306155 100680 -263808 -546972 225364 321309 -245431 42264
92 42264 248487 -330162 -98102 534916 120656 -206351 151321 -194415 -578257 104400
102 104400 409190 -58788 110223 261118 -346090 -276566 378074 139418 -157047 194305
$$ packed form
0@%%%%%%%Qj6J6j6K4l2M0n6O6q0J02j28J53j78K18k62L10l64M22m94N74o63P66
30D10q76R97j135J290j461J646j848K073k323K597k894L216l569L959m384M844
46B542n348N900o506P171p898Q697r584J0571j1671J2908j4304J5898j7743J9899
60A0532k2460K5559k9405L4329m0883N0089o4072Q8118j40701M59922k49023n23071
72d01066N04656m82925r8689P82633m8010o97963M18773K25058m41284L95547
82A56730N43593o96752l09726M06835l64488k83164P72336R5945n66740K87695
92D2264K06223n78649K32060O33018m14260l27007L57672l45736l83842O82657
102A04400L04790m67978J69011J50895o07208O9524O54640k38656k96465L51352
$$ plain form
112 194305 -57953 -521732 7037 346921 -72600 51892 291404 -246168 -327468 236331
122 236331 99870 -159834 214277 80904 -421757 -84203 248242 -72774 65565 369545
132 369545 -117400 -354505 93729 54003 -147781 236297 217535 -295478 -147266 153323
142 153323 -90053 3466 329265 -25513 -300715 40632 39724 -163734 155009 221563 -209754
153 -209754 -143325 124971 -87457 -55076 281662 56096 -229481 14247 23944 -186799 92625
164 92625 265788 -72397 -103587 88729 -111495 -129837 211540 121566 -134026 22215 21903
175 21903 -196588 14443 218201 -37917 -91523 85364 -77352 -146148 143244 117082 -113221
186 -113221 3615 43580 -153109 -24865 176176 5093 -57162 88196 -41764 -150987
$$ packed form
112A94305k52258m63779N28769L39884m19521J24492K39512n37572q1300N63799
122B36331j36461k59704L74111j33373n02661L37554L32445l21016J38339L03980
132C69545m86945k37105M48234l9726k01784L84078j8762n13013J48212L00589
142A53323k43376R3519L25799l54778k75202L41347r08k03458L18743O6554m31317
153b09754O6429K68296k12428L2381L36738k25566k85577K43728R697k10743K79424
164I2625J73163l38185l1190J92316k00224j8342L41377q9974k55592J56241l12
175B1903k18491K11031K03758k56118n3606J76887j62716o8796K89392k6162k30303
186a13221J16836L9965j96689J28244K01041j71083o2255J45358j29960j09223
$$ plain form
196 -150987 67227 103106 -55173 38586 80899 -116335 -75164 99514 5146 -39349 91111
207 91111 -396 -131213 13466 71665 -47393 11484 67329 -80566 -74160 72012 18528
218 18528 -30992 66504 7501 -107708 -2819 63191 -27387 13887 82769 -31681 -67196
229 -67196 35903 8098 -37163 49942 41315 -50170 -5946 29644 -41268 -13200 55428 -13654
241 -13654 -45689 28415 7228 -41166 22129 29927 -44257 -20852 23693 -14483 -3558 47420
253 47420 4367 -35069 6082 2492 -25683 20101 38884 -8286 -5033 17302 -14940 -17939 19262
266 19262 5817 -14361 13241 11054 -20101 -4462 9164 -17332 -13900 11025 -241 -7238 10307
279 10307 2815 -14976 -4766 -209 -10900 3019 18526 5997 1312 8690 -2255 -10894 443
$$ packed form
196a50987K18214L5879j58279R3759M2313j97234M1171J74678r4368m4495J30460
207I1111r1507j30817J44679N8199j19058N8877N5845j47895O406J46172n3484
218A8528m9520R7496n9003j15209J04889O6010r0578M1274O8882j14450l5515
229f7196J03099k7805m5261Q7105q627r1485M4224L5590p0912K8068O8628o9082
241a3654l2035P4104k1187m8394O3295P798p4184K3405M4545l8176J0925N0978
253D7420m3053l9436M1151l590k8175M5784J8783m7170L253K2335l2242k999L7201
266A9262j3445k0178K7602k187l1155J5639J3626k6496L432K4925j1266o997J7545
279A0307p492j7791J0210M557j0691J3919J5507j2529m685P378j0945q639J1337
$$ plain form
292 443 6581 4117 8521 9169 -385 -3574 -2131 -7562 -5924 3581 3607 -209 930 -560 -7689 -12220
308 -12220 -8636 -2094 1579 3672 5187 3992 -832 -6252 -6387 -593 3478 4740 7108 9282 7408
323 7408 -946 -4947 -1279 -255 -192 4535 8222 5152 -3218 -7543 -5978 -5704 -5517 -670 4931 3303
339 3303 -2577 -3820 -4791 -9770 -6645 1457 3192 6180 9133 2610 -2701 -636 -1991 -3102 5404
354 5404 8232 2404 6789 8909 -5984 -7340 3690 -5104 -8238 11754 11342 -8173 -4733 -334
368 -334 -16409 -11797 8681 2042 -1661 11314 -2585 -16202 4353 4305 -15254 5115 20666 -7968
382 -7968 -6249 22602 2603 -16121 11592 5977 -20110 7549 22534 -7485 1546 16049 -24522
395 -24522 -27240 18637 5989 -13110 24692 11371 -41818 -12692 18071 -18020 -1803 38175
$$ packed form
292D43O138k464M404O48r554l189J443n431J638R505K6l816J139j490p129m531
308a2220L584O542L673K093J515j195m824n420j35N794M071J262K368K174j874
323G408q354m001L668J024O3M727L687l070q370m325J565K74J87M847N601j628
339C303n880j243r71m979L125Q102J735K988K953o523n311K065j355j111Q506
354E404K828n828M385K120j4893j356J1030q794l134J9992m12j9515L440M399
368c34j6075M612K0478o639l703J2975j3899j3617K0555m8j9559K0369J5551k8634
382g968J719K8851j9999j8724K7713n615k6087K7659J4985l0019R031J4503m0571
395b4522k718M5877j2648j9099L7802j3321n3189K9126L0763l6091J6217L9978
$$ plain form
407 38175 -9306 -32307 20206 7471 -27238 23156 28555 -35623 -9774 33460 -12304 -5383
419 -5383 48230 -5337 -48328 12377 10113 -29895 34555 51243 -42680 -38111 18866 -27845 -21301
432 -21301 66251 22592 -52483 202 5617 -50580 17786 66111 -25961 -32089 34727 -23090
444 -23090 -38787 65918 36986 -54070 6204 22521 -60623 4731 88394 -7694 -39931 31438
456 31438 -36039 -75819 60359 71754 -36055 5291 17078 -96402 -37630 93244 18947
467 18947 -27761 47372 -30995 -105662 40659 83579 -33924 9050 48585 -85548 -58374
478 -58374 94717 31564 -35937 55798 -3458 -115515 10564 82907 -24892 19360 78044
489 78044 -82601 -106190 57477 26307 -30329 92107 41310 -136367 -48548 60623 -26703
$$ packed form
407C8175m7481k3001N2513j2735l4709N0394N399o4178K5849M3234m5764O921
419e383N3613n3567m2991O0705k264m0008O4450J6688r3923M569N6977m6711O544
432b1301Q7552m3659p5075N2685N415n6197O8366M8325r2072o128O6816n7817
444b3090j5697J04705k8932r1056O0274J6317q3144O5354Q3663r6088l2237P1369
456C1438o7477l9780J36178J1395j07809M1346J1787j13480N8772J30874p4297
467A8947m6708P5133p8367p4667J46321M2920j17503M2974L9535j34133K7174
478e8374J53091o3153o7501R1735n9256j12057J26079P2343j07799M4252N8684
489G8044j60645k3589J63667l1170n6636J22436n0797j77677Q7819J09171q7326
$$ plain form
500 -26703 23832 120009 -47803 -129176 31102 28491 -34376 99604 73847 -128623 -62796
511 -62796 65593 -27595 10408 141555 -18108 -140963 15637 22112 -66473 87899 122851
522 122851 -92288 -79450 37821 -67700 -37902 153509 48784 -106796 4286 -6614
532 -6614 -116696 58447 161824 -43158 -69966 39754 -77868 -74524 153150 94545 -92732
543 -92732 -7680 2768 -124866 28581 174216 -9520 -67643 39694 -80216 -116912 118771
554 118771 112828 -65602 13903 27355 -152858 -47467 146332 18472 -36131 81546 -53258
565 -53258 -162077 57567 112963 -37314 41517 65657 -149499 -92333 128681 40372 -23273
576 -23273 100339 -29526 -183665 19090 115092 -27060 42633 94740 -129003 -129343 88083
$$ packed form
500b6703N0535R6177j67812q1373J60278k611o2867J33980k5757k02470O5827
511f2796J28389r3188L8003J31147j59663j22855J56600O475q8585J54372L4952
522A22851k15139J2838J17271j05521K9798J91411j04725j55580J11082j0900
532f614j10082J75143J03377k04982k6808J09720j17622L344K27674n8605j87277
543i2732Q5052J0448j27634J53447J45635j83736n8123J07337j19910l6696K35683
554A18771n943j78430P9505J3452j80213J05391J93799j27860n4603J17677j34804
565e3258j08819K19644N5396j50277P8831K4140k15156N7166K21014q8309o3645
576b3273J23612j29865j54139K02755R6002j42152O9693N2107k23743l40K17426
$$ plain form
587 88083 29521 -35560 114844 28739 -163721 -24464 74582 -51611 30912 138108 -65462
598 -65462 -129123 51075 9293 -52912 122069 84211 -135797 -55493 54768 -51651 23829
609 23829 160796 -24069 -139454 13987 -383 -63829 111949 115506 -106597 -69350 38377
620 38377 -69718 -18563 148600 16758 -106152 23297 373 -99882 61155 122086 -60921
631 -60921 -41807 55121 -72356 -61376 125951 52723 -73447 25403 803 -117212 27981
642 27981 132564 -19444 -33860 43234 -82261 -93416 101289 74729 -50922 24208 10092
653 10092 -119971 -13337 108905 -6553 -27173 58263 -45387 -94422 62258 60472 -45979
664 -45979 30259 42856 -90121 -33778 82076 -1748 -20486 70908 -17605 -100666 22379
$$ packed form
587H8083n8562o5081J50404q6105j92460J39257R9046j26193Q2523J07196k03570
598f5462o3661J80198m1782o2205J74981l7858k20008Q0304J10261j06419P5480
609B3829J36967j84865j15385J53441j4370o3446J75778L557k22103L7247J07727
620C8377j08095N1155J67163j31842j22910J29449k2924j00255J61037O0931j83007
631f0921J9114R6928j27477J0980J87327p3228j26170R8850k4600j18015J45193
642B7981J04583j52008j4416P7094j25495j1155J94705k6560j25651P5130j4116
653A0092j30063J06634J22242j15458k0620Q5436j03650m9035J56680j786j06451
664d5979P6238J2597j32977N6343J15854q3824j8738R1394q8513q3061J23045
$$ plain form
675 22379 49958 -31944 37509 61397 -77212 -64298 46098 -3287 -17252 74470 7367 -89348
687 -89348 866 35716 -36667 22677 66665 -47329 -53114 43551 1603 -28400 56568 23341
699 23341 -65304 -2541 33844 -31295 10205 63841 -23500 -47865 23441 -8698 -36951 46011
711 46011 40083 -41633 -11644 16226 -40022 -10495 53120 -842 -31332 19737 -4750 -37551
723 -37551 26160 34997 -27987 -6900 23836 -21760 -11393 41231 4933 -27229 12674 1719
735 1719 -29172 16283 31987 -15390 -6244 15839 -23672 -23535 24199 8384 -15886 13680 6121
748 6121 -28858 -2492 17697 -10895 -3690 18721 -7624 -15015 16078 6759 -13234 7502 8478
761 8478 -14427 2077 18724 -2932 -3601 11073 -6908 -15428 7062 7370 -6159 5592 7979
$$ packed form
675B2379K7579q1902O9453K3888j38609J2914J10396m9385j3965R1722o7103r6715
687h9348R0214L4850p2383N9344M3988j13994n785R6665m1948l0003Q4968l3227
699B3341q8645O2763L6385o5139M1500N3636q7341k4365P1306l2139k8253Q2962
711D6011n928q1716K9989K7870n6248K9527O3615n3962l0490N1069k4487l2801
723c7551O3711Q837o2984K1087L0736m5596J0367N2624l6298l2162L9903j0955
735A719l0891M5455J5704m7377R146K2083l9511J37M7734j5815k4270K9566p559
748F121l4979K6366K0189k8592P205K2411k6345p391L1093r319j9993K0736R76
761H478k2905J6504J6647k1656o69J4674j7981q520K2490L08j3529J1751K387
$$ plain form
774 7979 -10924 -8931 2150 -5633 -4054 8368 718 -5896 3579 668 -8558 250 6006 -3144
788 -3144 -620 9090 3213 -2830 1726 248 -3647 1399 4340 2819 4234 2783 -3639 -3863 -1103
803 -1103 -3554 -3263 2629 2990 -979 -1271 -1734 -4316 -5107 -2106 1005 2145 2156 1614 222 -1740 -1865
820 -1865 -492 1567 2838 4488 4447 2377 121 -1600 -2282 -1050 595 2246 3787 2023 -1526 -2908
836 -2908 -3045 -4027 -3589 -505 1782 951 -512 -681 -1529 -3461 -4035 -335 3757 2456 1965 3183 528
853 528 -2752 -1252 1279 1825 3557 4518 1410 940 1189 -4440 -4251 1928 -145 -2674 3701 3128 -4864
870 -4864 -2927 -99 -6484 -4174 4315 154 -2017 6281 772 -8866 -478 3416 -4390 3575 12199
885 12199 33 -3633 4728 -3404 -7753 8665 7033 -6733 3913 7648 -10382 -3608 11167
$$ packed form
774G979j8903J993J1081p783J579J2422p650o614R475k911r226Q808N756r150
788c144K524R710n877o043M556j478l895N046K941j521J415j451o422k24K760
803a103k451K91N892L61l969k92m63k582p91L001L111J140J1n42j392j962j25
820a865J373K059J271J650m1k070k256j721o82J232J645J651J541j764l549j382
836b908j37r82M38L084K287q31j463j69q48j932n74L700M092j301m91J218k655
853E28l280J500K531N46J732R61l108m70K49n629J89O179k073k529O375n73p992
870d864J937K828o385K310Q489m161k171Q298n509r638Q388L894p806P965Q624
885A2199j2166l666Q361q132m349J6418j632j3766J0646L735j8030O774J4775
$$ plain form
898 11167 -5256 -11712 6178 220 -9864 9081 9056 -13705 -4654 5153 -12641 -2173 21696
911 21696 1539 -11553 8782 -1898 -19459 9346 19653 -7479 1843 15427 -14651 -14336 18270
924 18270 3092 -12946 14041 4476 -25004 3068 20261 -11293 -4583 14765 -19741 -23337 22224
937 22224 12043 -12911 14434 5060 -36931 -6206 28703 -1703 187 26566 -13227 -33508
949 -33508 14080 13430 -12674 21372 20551 -32585 -12531 24460 -10444 -8348 34717 -4500 -41420
962 -41420 7524 14467 -19747 18637 31366 -33808 -29464 17164 -8641 -5254 48171 8704 -47582
975 -47582 -3864 10046 -24621 22966 52957 -20940 -33065 16526 -12949 -21166 46754 26153
987 26153 -39545 -4065 13024 -34594 4721 54471 -9952 -33986 13917 -17684 -36791 42655
$$ packed form
898A1167j6423o456J7890n958j0084J8945k5k2761R051R807j7794J0468K3869
911B1696k0157j3092K0335j0680j7561K8805J0307k7132R322J3584l0078L15L2606
924A8270j5178j6038K6987r565k9480K8072J7193l1554O710J9348l4506l596M5561
937B2224j0181k4954K7345r374m1991L0725L4909l0406J890K6379l9793k0281
949c3508M7588o50k6104L4046q21n3136K0054L6991l4904K096M3065l9217l6920
962d1420M8944O943l4214L8384J2729o5174M344M6628k5805L387N3425l9467n6286
975d7582M3718J3910l4667M7587K9991p3897j2125M9591k9475q217O7920k0601
987B6153o5698L5480J7089m7618L9315M9750o4423k4034M7903l1601j9107P9446
$$ plain form
999 42655 42868 -30825 -9143 7536 -49286 -10758 67803 17127 -26472 13097 -20520 -55350
1011 -55350 30541 58363 -12494 -1822 16614 -50703 -29536 58696 20723 -25561 22693 -5783
1023 -5783 -64827 9952 54636 -12416 -2536 30065 -45779 -52330 40891 26788 -14462 36889
1035 36889 8614 -77516 -18964 48304 128 13830 54247 -34406 -73590 19675 28399 -10069
1047 -10069 45118 29871 -71113 -35304 40452 -2005 2656 57131 -17612 -74855 7866 24774
1059 24774 -20022 36461 46264 -55207 -45331 25724 -12434 -7591 71202 16796 -64605 -8909
1071 -8909 7579 -36507 33363 76851 -22792 -45944 11352 -25547 -24127 72676 40885 -53551
1083 -53551 -15486 5010 -44707 17906 79420 -11764 -49576 8527 -23340 -37277 59565 50722
$$ packed form
999D2655K13p3693K1682J6679n6822L8528P8561n0676m3599L9569l3617l4830
1011e5350Q5891K7822p0857J0672J8436o7317K1167Q8232l7973m6284M8254k8476
1023e783n9044P4779M4684o7052R880L2601p5844o551R3221j4103m1250N1351
1035C6889k8275q6130N8552O7268m8176J3702M0417q8653l9184R3265Q724l8468
1047a0069N5187j5247j00984L5809P5756m2457M661N4475p4743n7243Q2721J6908
1059B4774m4796N6483R803j01471R876P1055l8158M843P8793n4406q1401N5696
1071h909J6488m4086O9870M3488r9643k3152N7296l6899J420R6803l1791r4436
1083e3551L8065K0496m9717O2613O1514r1184l7812N8103l1867j3937R6842q843
$$ plain form
1095 50722 -41412 -13423 8808 -53763 -7119 75681 12699 -29208 20167 -20357 -61871 30935
1107 30935 58908 -14630 3761 20452 -58430 -35749 59540 24581 -18928 25108 -12954 -71840
1119 -71840 9736 58849 -6073 838 23307 -52543 -49002 45867 28846 -14141 30504 2438
1131 2438 -69202 -8774 46664 -5277 6579 45654 -28048 -55503 22695 17608 -17238 37767
1143 37767 27429 -55335 -23555 30211 -10365 2166 51466 -13813 -59080 7246 14091 -17897
1155 -17897 34890 36295 -47638 -33880 21274 -9931 -2326 53753 5633 -48977 466 9367
1167 9367 -26105 22598 46110 -22080 -23917 18861 -16071 -19708 41967 18871 -33607 816
1179 816 8269 -32189 6674 43867 -10766 -24098 11129 -16769 -24421 35936 26538 -25379 -3156
$$ packed form
1095E0722r2134K7989K2231o2571M6644Q2800o2982m1907M9375m0524m1514R2806
1107C0935K7973p3538J8391J6691p8882K2681R5289l4959m3509M4036l8062n8886
1119g1840Q1576M9113o4922O911K2469p5850L541R4869j7021m2987M4645k8066
1131B438p1640O0428N5438n1941J1856L9075p3702k7455P8198n087l4846N5005
1143C7767j0338q2764L1780N3766m0576J2531M9300o5279m5267O6326O845l1988
1155a7897N2787J405q3933J3758N5154l1205P605N6079m8120n4610M9443Q901
1167I367l5472M8703K3512o8190j837M2778l4932l637O1675k3096n2478L4423
1179H16P453m0458L8863L7193n4633j3332L5227k7898p652O0357r398n1917K2223
$$ plain form
1192 -3156 5494 -33406 -1350 43415 1752 -16637 15041 -9760 -29197 20529 24550 -15987
1204 -15987 3628 15455 -25154 -11545 28472 224 -15171 16563 -2298 -29522 8169 20651
1216 20651 -11555 987 13675 -22338 -18425 20255 6399 -7964 16553 1772 -28090 -473
1228 -473 17390 -6055 3338 19214 -10409 -16476 12859 4262 -10591 11086 8054 -16905 -1206
1241 -1206 13042 -7334 -3625 12188 -6687 -14296 7551 3113 -9100 8774 8602 -14751 -6295
1254 -6295 7726 -5697 -2019 15437 2435 -10315 2394 1612 -7713 5176 9759 -4856 -1297
1267 -1297 7307 -4054 -4633 7937 -99 -8626 2862 4386 -5136 418 4801 -5420 -5712 2296
1281 2296 -1831 -2654 5558 2150 -4288 433 554 -5441 -266 5499 900 273 4541 353 -3683 1065
$$ packed form
1192c156Q650l8900L2056M4765m1663j8389L1678k4801j9437M9726M021m0537
1204a5987J9615J1827m0609J3609M0017k8248j5395L1734j8861k7224L7691J2482
1216B0651l2206J2542J2688l6013L913L8680j3856j4363K4517j4781k9862K7617
1228d73J7863k3445R393J5876k9623o067K9335q597j4853K1677l032k4959J5699
1241a206J4248k0376L709J5813j8875p609K1847m438j2213J7874j72k3353Q456
1254f295J4021j3423L678J7456j3002j2750J2709p82r325J2889M583j4615L559
1267a297Q604j1361n79J2570q036q527J1488J524r522N554M383j0221k92Q008
1281B296m127q23Q212l408o438M721J21n995N175N765m599o27M268m188m036M748
$$ plain form
1297 1065 1468 -1599 1488 3260 -132 -274 1056 -1443 -2816 -685 -528 -568 1449 1000 -1920 -1686 -1644
1314 -1644 -2894 -1320 1740 1820 560 1015 1215 -987 -1725 -183 1062 1443 2064 2415 1903 166 -1167
1331 -1167 -1115 -389 362 935 1064 992 -352 -2156 -2157 -1569 -1271 -558 615 872 158 -834 -1710 -2056 -1075 -275
1351 -275 1021 2417 2147 994 514 -722 -929 404 1048 664 2440 2883 -298 -1485 -43 -1558 -2227
1368 -2227 1130 1848 -503 119 -784 -3690 -1858 367 -2025 -617 3633 -140 -2939 2452 1196 -4686
1384 -4686 -193 3311 -1610 1194 6026 284 -2378 2617 -1296 -4750 3747 4452 -2881 1900 3824
1399 3824 -7098 -4922 4690 -1448 -3512 6765 916 -9199 674 3897 -6655 -403 7421 -5023
1413 -5023 -4996 8280 1118 -4722 6939 1075 -11190 2675 8893 -4662 2605 12245 -7339 -11628
$$ packed form
1297A065M03l067L087J772l392j42J330k499j373K131J57m0K017m49k920K34M2
1314a644j250J574L060Q0j260M55K00k202p38J542J245L81O21L51n12j737j333
1331a167N2P26P51N73J29p2j344j804jN88K98P13J173K57p14r92q76l46R81Q00
1351b75J296J396k70j153m80j236k07J333O44l84J776M43l181j187J442j515o69
1368b227L357P18k351O22r03k906J832K225k392J408M250l773k799N391j256n882
1384d686M493L504m921K804M832n742k662M995l913l454Q497P05p333M781J924
1399C824j0922K176R612o138k064J0277n849j0115R873L223j0552O252P824j2444
1413e023K7J3276p162n840J1661n864j2265J3865O218j3555P267R640j9584m289
$$ plain form
1427 -11628 7482 1011 -7759 10815 8151 -13128 -3816 5470 -9857 -1564 15448 -3503 -12141
1440 -12141 7559 -568 -12814 11439 12219 -15178 -4755 10777 -8411 -2794 21464 1099 -16588
1453 -16588 5354 1330 -14487 11956 19994 -11513 -6689 9216 -14678 -11587 22369 7207 -14536
1466 -14536 7728 1521 -25083 2526 22921 -8290 -6011 14057 -14023 -18886 21459 13212 -13473
1479 -13473 7630 3937 -27878 445 29399 -2511 -5533 16991 -15500 -28110 19173 18502 -11999
1492 -11999 11098 11337 -31368 -12509 23803 -2957 -5823 24826 -7054 -33730 8708 14498 -14559
1505 -14559 13437 22397 -28284 -20745 21334 -298 -4798 31439 1286 -39034 -82 16310
1517 16310 -11387 16395 32111 -24471 -30351 14126 -1869 -9444 34246 13256 -36559 -6921
$$ packed form
1427a1628J9110o471q770J8574k664k1279R312R286j5327Q293J7012j8951q638
1440a2141J9700q127j2246K4253P80k7397J0423J5532j9188N617K4258k0365j7687
1453a6588K1942m024j5817K6443Q038l1507M824J5905k3894L091L3956j5162k1743
1466a4536K2264o207k6604K7609K0395l1211K279K0068k8080m863M0345q247k6685
1479a3473K1103l693l1815K8323K8954l1910l022K2524l2491j2610M7283o71l0501
1492a1999K3097K39m2705J8859L6312k6760k866L0649l1880k6676M2438N790k9057
1505a4559K7996Q960n0681P539M2079k1632m500L6237l0153m0320L8952J6392
1517A6310k7697K7782J5716n6582n880M4477j5995p575M3690k0990m9815K9638
$$ plain form
1529 -6921 11464 -20374 7250 37833 -12560 -28100 12515 -5928 -20581 31438 25535 -28514
1541 -28514 -8660 9912 -24987 1314 46629 2177 -26840 6626 -10792 -28265 29868 38723
1553 38723 -18599 -11085 6647 -31810 -11862 44642 11754 -22347 8734 -7130 -37643 14656
1565 14656 37292 -12455 -6870 15420 -27410 -24088 34608 17420 -15192 14584 58 -42647
1577 -42647 464 37580 -836 907 22301 -27471 -39553 22746 23355 -6983 19600 7445
1589 7445 -46293 -15626 29758 1058 1134 27253 -17746 -41748 13018 19089 -11148 18275 18889
1602 18889 -36309 -20158 23759 -836 -2118 33926 -1437 -39156 1234 12238 -13053 20518
1614 20518 33659 -23932 -28265 9553 -7704 -6268 38367 13428 -34659 -8687 5047 -18039
$$ packed form
1529f921J8385l1838K7624L0583n0393j5540M0615j8443j4653N2019n903n4049
1541b8514J9854J8572l4899K6301M5315m4452k9017L3466j7418j7473N8133Q855
1553C8723n7322P514J7732l8457J9948N6504l2888l4101L1081j5864l0513N2299
1565A4656K2636m9747N585K2290m2830L322N8696j7188l2612K9776j4526m2705
1577d2647M3111L7116l8416J743K1394m9772j2082O2299O09l0338K6583j2155
1589G445n3738L0667M5384k8700P6K6119m4999k4002N4766O071l0237K9423O14
1602A8889n5198J6151M3917k4595j282L6044l5363l7719M0390J1004k5291L3571
1614B0518J3141n7591m333L7818j7257J436M4635k4939m8087K5972J3734k3086
$$ plain form
1626 -18039 12914 36943 -13361 -27484 7290 -5933 -12054 30990 19192 -26842 -8221 7726
1638 7726 -18091 4299 36414 -1481 -20895 7214 -7862 -22145 21699 27155 -13067 -4643
1650 -4643 5433 -26094 -10698 30802 8843 -12702 7931 -7915 -29038 10863 26992 -7179
1662 -7179 -3628 8049 -21157 -14308 25898 12348 -10234 7912 -2182 -26320 4354 24810
1674 24810 -3099 -1494 13269 -15399 -21076 14267 10841 -7036 11284 6511 -23586 -7872 13820
1687 13820 -3372 -140 16780 -8107 -21735 6589 8448 -6465 10662 10262 -19337 -10742 13152
1700 13152 1000 -326 16360 -2449 -19753 2093 7848 -5086 8956 13581 -11936 -10900 6790
1713 6790 -3826 -5095 14536 4156 -13780 -10 3620 -10316 1983 13375 -5479 -8973 5289
$$ packed form
1626a8039L0953K4029n0304j4123L4774j3223o121M3044j1798m6034J8621J5947
1638G726k5817K2390L2115l7895j9414K8109j5076j4283M3844N456m0222Q424
1650d643J0076l1527J5396M1500k1959k1545K0633j5846k1123L9901J6129l4171
1662g179L551J1677k9206O849M0206j3550k2582J8146j0094k4138L0674K0456
1674B4810k7909J605J4763k8668n677L5343l426j7877J8320m773l0097J5714K1692
1687A3820j7192L232J6920k4887j3628K8324J859j4913J7127m00k9599Q595K3894
1700A3152j2152j326J6686j8809j7304K1846N755j2934J4042M625k5517J036J7690
1713F790j0616j269J9631j0380j7936J3770L630j3936J2299J1392j8854l494J4262
$$ plain form
1726 5289 -2112 -5965 11002 6666 -9487 -1402 3509 -6938 2835 13991 -1424 -8052 3375
1739 3375 -2203 -7495 7595 8832 -5645 -1905 3002 -6805 -3904 6978 -74 -4632 3685 -420
1753 -420 -7258 2754 5051 -4892 -1266 4452 -3965 -3242 6987 2484 -3544 2395 771 -5613 1421
1768 1421 6248 -263 -181 3204 -3341 -4476 2563 1386 -1898 2576 1559 -4245 -984 1868 -2694
1783 -2694 -2086 2472 -711 -2814 1944 1664 -2372 -72 1189 -1940 -205 2501 1123 487 2035 -451
1799 -451 -2327 556 1255 -169 1423 1961 -888 -1519 -53 -905 -1626 146 502 -532 11 230 -1417
1816 -1417 -1448 -710 -479 -235 858 952 274 226 -238 -306 142 800 685 1330 1870 696 -885 -446 -187 -454
1836 -454 -173 831 949 -299 -790 -541 -1049 -1534 -1345 -263 573 357 -272 -270 -466 -1148 -1085 581 1348 624
$$ packed form
1726E289p401l853J6967m336j6153Q085M911j0447R773J1156j5415o628J1427
1739C375n578n292J5090J237j4477L740M907r807K901J0882p052m558Q317m105
1753d20o838J0012K297r943L626N718q417P23J0229m503o028N939j624o384P034
1768A421M827o511Q2L385o545j135P039j177l284M474j017n804L261K852m562
1783b694O08M558l183k103M758k80m036K300J261l129J735K706j378o36J548k486
1799d51j876K883O99j424J592N38k849o31J466q52p21J772L56j034N43K19j647
1816a417l1P38K31K44J093R4o78m8m64o8M48O58j15O45N40j174j581M39K59k67
1836d54K81J004J18j248m91K49n08m85J89J082Q36k16o29Kj96o82O3J666P67p24
$$ plain form
1856 624 790 788 45 -174 -13 260 758 684 697 937 789 -875 -1269 -114 -717 -820 1093 936 -922 -618
1876 -618 -284 -2075 -1608 393 78 -67 1543 233 -1325 104 139 -1354 1410 2810 -556 -26 2466
1893 2466 -780 -2086 2193 1152 -2426 990 2457 -1287 -60 1875 -2603 -2881 1493 -1118 -1801
1908 -1801 3847 1421 -4731 -647 1531 -3991 -413 5945 -400 -2927 2944 -496 -4124 3643 3953
1923 3953 -3454 1072 4152 -3886 -1540 6256 -1200 -4950 3526 -259 -6323 3964 5677 -5026
1937 -5026 -1279 3467 -6930 -4840 8110 1776 -4409 4472 -164 -10438 1784 8099 -3004 811
1951 811 7180 -6576 -7066 8583 2663 -5357 6200 3155 -11206 498 9931 -3993 -1557 8259
1965 8259 -6940 -11072 7343 3826 -6270 7244 5538 -14113 -4915 8475 -3960 -866 13897
$$ packed form
1856F24J66kp43k19J61K73M98p4J3K40j48j664l94J155o03j03J913j57j858L04
1876f18L34j791M67K001l15j45J610j310j558J429L5j493K764J400l366N30K492
1893B466l246j306M279j041l578L416J467l744J227J935m478k78M374k611o83
1908a801N648k426o152M084K178n522L578O358o345k527N871l440l628P767L10
1923C953p407M526L080q038K346P796p456l750Q476l785o064J0287J713j0703
1937e026L747M746j0397K090J2950o334o185Q881m636j0274J2222O315j1103L815
1951H11O369j3756m90J5649n920q020J1557l045j4361J1704R433j3924K436R816
1965H259j5199m132J8415l517j0096J3514j706j9651R198J3390j2435L094J4763
$$ plain form
1978 13897 -2824 -14363 4026 3261 -7344 9839 11817 -12478 -6754 9145 -4505 -2883 16341
1991 16341 281 -16563 2837 4584 -9014 8287 14457 -12303 -10478 7271 -6604 -6470 18322
2004 18322 5446 -15708 1174 2588 -15092 4456 20562 -4857 -8433 7708 -8973 -12526
2016 -12526 17838 12268 -11701 1794 3735 -17812 809 23174 -1589 -10131 7337 -9110
2028 -9110 -17167 15628 16213 -10837 334 4803 -20596 -6471 21905 2594 -7581 11404 -5750
2041 -5750 -22752 7854 15789 -6965 5893 12550 -19547 -13866 17682 3726 -5402 16569 -647
2054 -647 -26595 1408 15941 -5057 6095 15593 -19108 -20530 13076 4790 -4908 18315 3831
2067 3831 -27630 -4658 13039 -6927 5068 21812 -10863 -20887 8673 1727 -9239 18896
$$ packed form
1978A3897j6721j1539J8389p65j0605J7183J978k4295N724J5899j3650J622J9224
1991A6341j6060j6844J9400J747j3598J7301O170k6760J825J7749j3875J34K4792
2004A8322j2876k1154J6882J414j7680J9548J6106k5419l576J6141j6681l553
2016a2526L0364n570k3969J3495J941k1547J8621K2365k4763q542J7468j6447
2028i110q057L2795N85k7050J1171M469k5399J4125K8376j9311j0175J8985j7154
2041e750j7002L0606P935k2754J2858O657l2097N681L1548j3956r128K1971j7216
2054f47k5948K8003J4533k0998J1152R498l4701j422L3606q286r698K3223j4484
2067C831l1461K2972J7697j9966J1995J6744l2675j0024K9560o946j0966K8135
$$ plain form
2079 18896 13690 -20516 -6786 9745 -10301 1030 25573 -2567 -20968 3435 -704 -12375
2091 -12375 17710 20074 -16978 -11780 5196 -12989 -2833 27337 4676 -19223 1234 -1593
2103 -1593 -16830 12098 23141 -9430 -8133 7789 -13092 -9783 22322 8951 -13133 4949
2115 4949 1075 -20354 4313 22557 -4165 -5916 8526 -14041 -17381 17179 13632 -8285 4599
2128 4599 1027 -23753 -3548 21121 1563 -3050 10522 -11243 -20189 11394 13228 -6278 6795
2141 6795 7526 -19243 -7626 16767 1101 -4015 13146 -3279 -19837 4104 10403 -5672 7036
2154 7036 11188 -15809 -13068 9436 105 -2423 16443 1589 -20677 -2542 6975 -5659 6979
2167 6979 15818 -9863 -13880 5879 -166 -3858 14243 5751 -15059 -1999 6656 -6368 3032
$$ packed form
2079A8896n206l4206J3730J6531k0046J1331K4543k8140j8401K4403m139j1671
2091a2375L0085K364l7052N198J6976j8185J0156L0170k2661k3899K0457k827
2103a593j5237K8928J1043l2571J297J5922k0881L309L2105j3371k2084J8082
2115D949l874k1429K4667J8244k6722j751J4442k2567l340L4560l547k1917J2884
2128D599l572k4780K0205K4669j9558m613J3572k1765q946L1583J834j9506J3073
2141F795P31k6769J1617K4393j5666n116J7161j6425j6558K3941O299j6075J2708
2154G036M152k6997K741K2504r331k528J8866j4854k2266J8135R517j2634J2638
2167F979Q839k5681m017J9759o045l692J8101q492k0810J3060Q655j3024R400
$$ plain form
2180 3032 14702 -5488 -11844 4630 -1156 -7398 10804 9187 -10618 -4406 3193 -8689 -1447
2193 -1447 14567 1481 -8290 2145 -3071 -9629 7609 11476 -4855 -2323 3852 -7846 -3851
2206 -3851 12296 3621 -6744 2346 120 -8271 3779 9685 -3335 -3100 3319 -6258 -5501 7985
2220 7985 3607 -4811 2609 421 -9690 -659 7482 -1299 -644 5288 -3676 -7269 3850 3492 -2513
2235 -2513 3773 3039 -6536 -1578 5782 -336 -1051 4185 -2060 -5956 2717 3618 -2186 1815 2176 -5447
2251 -5447 -3116 3603 -334 -1402 4006 18 -5009 -227 1541 -2421 1275 3904 -1729 -1947 2046
2266 2046 -659 -1627 3166 1355 -2891 434 2179 -1215 516 2932 -1536 -2790 943 36 -871 1873
2282 1873 994 -2561 -1284 208 -1448 28 2041 -86 -1111 720 -288 -1705 581 1036 -598
$$ packed form
2180C032J1670k0190o356J6474n786o242J8202j617j9805O212P599j1882P242
2193a447J6014j3086r771J0435n216o558J7238L867j6331K532O175j1698L995
2206c851J6147q675j0365R090k226q391J2050N906j3020K35O419r577P57J3486
2220G985m378q418P420k188j0111R031Q141q781O55N932q964l593J1119l58o005
2235b513O286p34r575M958P360o118p15N236o245l896Q673R01n804M001L61p623
2251e447K331O719l937j068N408l988n027M782J768l962L696K629n633k18L993
2266B046k705r68M793j811m246L325J745l394J731K416m468j254L733r07r07K744
2282A873q79l555J277J492j656J476K013k127j025J831j008j417K286M55j634
$$ plain form
2297 -598 570 1713 -296 -625 1059 342 -833 360 639 21 631 570 -621 -594 -429 -1063 -272 907
2315 907 315 -732 -161 -260 -1226 -806 425 388 199 557 420 107 -129 -235 -121 203 712 636 861 690
2335 690 -120 -562 -305 4 -26 344 367 160 -488 -663 -649 -849 -544 -54 190 146 124 -122 -725 -783 -227 195
2357 195 571 736 546 632 335 -244 -53 435 413 279 937 623 -169 -526 -600 -276 -24 -113 -47 235 -12 -1035
2379 -1035 -489 -92 -846 -623 346 134 -60 592 -98 -850 -135 231 -233 787 1639 29 -84 731 -457
2398 -457 -855 952 870 -424 644 607 -1361 -541 748 -890 -916 1334 -260 -1642 909 744 -1928
2415 -1928 -54 756 -1853 -365 2718 229 -714 1739 -432 -2782 1244 2237 -807 1284 2301 -2458
2431 -2458 -1937 2312 -227 -1438 2802 494 -3718 361 1851 -2518 -98 2855 -2465 -2933 2611
$$ packed form
2297e98J168J143k009l29J684p17j175J193K79o18O10o1j191K7J65o34P91J179
2315I07n92j047N71r9r66M20J231l7j89L58j37l13k36j06J14L24N09p6K25j71
2335F90q10m42K57L09l0L70K3k07o48j75J4k00L05M90K44m4k2k46o03n8N56M22
2357A95L76J65j90Q6k97n79J91M88k2j34O58l14p92l57p4L24K52q9O6K82k47j023
2379a035N46L97p54K23R69k12j94O52o90p52P15L66m64J020Q52j610j13Q15j188
2398d57l98J807q2j294J068l7j968Q20J289j638k6K250j594j382K551j65k672
2415a928J874Q10k609J488L083k489r43K453k171k350M026R93l044K091J017m759
2431b458N21M249k539j211M240k308m212M079J490m369K420K953n320m68N544
$$ plain form
2446 2611 235 -2052 3283 1294 -4699 -166 2730 -2027 1217 5855 -1490 -4424 1991 -7 -2749
2461 -2749 4312 4050 -4332 -1475 2092 -3680 -735 6232 -759 -4857 2405 -133 -5136 3404 5046
2476 5046 -4715 -2265 3023 -4078 -2294 7759 1768 -4997 1867 -96 -6791 3318 8504 -2154
2490 -2154 -1630 3517 -5542 -5338 7762 4155 -4198 2742 888 -9280 68 8449 -2144 -2290 5065
2505 5065 -4852 -7988 6293 4695 -4500 3291 2574 -10280 -2449 8754 -278 -756 7846 -3770
2519 -3770 -11185 3870 5650 -3277 5674 6356 -10491 -6486 7205 -397 -1160 9943 -1240 -12903
2533 -12903 1261 5116 -4823 4428 8314 -9245 -8075 6411 -678 -3141 10865 2454 -12375
2546 -12375 -641 4441 -6078 4139 13183 -4808 -8933 3900 -2671 -5487 12141 8052 -9770
$$ packed form
2446B611k376k287N335j989n993M533K896m757L244M638p345k934O415j998k742
2461b749P061k62q382K857L567n772K945O967o991m098P262k538n003Q540J642
2476E046r761K450N288p101J784J0053n991o765O864j963o695J0109N186j0658
2490b154N24N147r059K04J3100l607q353O940j854j0168R348Q381j0593j46P355
2505E065r917l136J4281j598r195P791p17j2854P831J1203r032m78Q602j1616
2519c770p415J5055J780q927Q951O82j6847M005J3691p602p63J1103j1183j1663
2533a2903J4164L855r939R251L886j7559J170J4486p089k463J4006q411j4829
2546a2375J1734N082j0519J0217R044j7991m125J2833o571k816J7628m089j7822
$$ plain form
2559 -9770 -2405 2273 -9279 1529 14742 -2209 -9242 3115 -3404 -8413 10592 9864 -9257
2572 -9257 -3189 3142 -9193 -994 14992 1148 -7890 3990 -3010 -11278 7751 11942 -5186
2585 -5186 -468 5275 -11201 -7009 12713 4172 -5146 6141 -1384 -15105 2131 11700 -2706
2598 -2706 248 6233 -11025 -10438 10655 5721 -4086 6377 87 -15635 -553 12145 -1431
2611 -1431 466 9119 -7902 -12207 7134 5251 -4071 7933 5163 -13061 -4150 7716 -3415
2624 -3415 286 11957 -3670 -12857 3196 2794 -5761 8044 8606 -11572 -7121 5455 -2905 -82
2638 -82 13247 -245 -12776 668 2250 -5317 7938 11116 -7908 -6911 4554 -3883 -3308 12080
2652 12080 3682 -9770 656 1848 -8492 2855 11066 -4042 -5797 3841 -4911 -6659 9711
$$ packed form
2559i770P365M678j1552J0808J3213j6951p033J2357o519n009J9005p28j9121
2572i257O068O331j2335Q199J5986j3844r038J1880p000q268J9029M191j7128
2585e186M718N743j6476M192J9722q541r318J1287p525j3721J7236R569j4406
2598b706K954N985j7258N87K1093m934r807J0463o290j5722J5082J2698j3576
2611a431J897Q653j7021m305J9341j883r322J2004k770j8224Q911J1866j1131
2624c415L701J1671j5627r187J6053m02q555J3805N62k0178M451J2576q360K823
2638h2J3329j3492j2531J3444J582p567J3255L178j9024R97J1465q437N75J5388
2652A2080q398j3452J0426J192j0340J1347Q211j5108j755R638q752j748J6370
$$ plain form
2665 9711 5873 -7210 159 1260 -9432 922 12109 -528 -4522 3751 -4308 -7953 7676
2678 7676 7830 -4309 918 2587 -8793 -2239 9262 191 -3235 4786 -2481 -8589 3774 5552
2692 5552 -4241 1135 4100 -7348 -4521 6698 802 -2384 5407 -700 -8824 1258 5394 -1941
2706 -1941 2305 5486 -5635 -5829 4575 1503 -1801 5308 1308 -7144 -335 3945 -2834 462 5031
2721 5031 -3223 -5100 3186 526 -3054 3484 2201 -5527 -1250 2981 -2378 280 5585 -1050 -4285
2736 -4285 1788 228 -2802 3980 4306 -3356 -1414 1892 -2295 -654 4818 452 -3317 1071 172
2751 172 -3089 1615 2720 -2772 -1498 1765 -1928 -1263 3254 337 -2835 669 500 -2553 737 2919
2767 2919 -994 -849 1816 -1203 -1850 2149 1338 -885 1125 850 -2208 -445 1714 -740 -644 1208
$$ packed form
2665I711l838j3083P369J101j0692J0354J1187j2637l994Q273q059l645J5629
2678G676J54j2139N227J669j1380O554J1501r071l426Q021p267o108J2363J778
2692E552r793N376K965j1448K827J1219n896l186P791o107q124J0082M136p335
2706a941M246L181j1121j94J0404l072l304P109m000q452O809M280o779L296M569
2721E031q254j877Q286k660l580O538j283p728M277M231n359K658N305o635l235
2736d285O073j560l030O782L26p662J942L306m187J641N472m366l769M388q99
2751A72l261M704J105n492J274L263l693O65M517k917l172L504j69l053L290K182
2767B919l913J45K665l019o47L999q11k223K010k75l058J763K159k454R6J852
$$ plain form
2783 1208 -570 -1778 965 767 -1432 -148 224 -1377 -222 1473 -106 -586 686 -495 -1321 689
2799 689 842 -343 710 923 -718 -581 584 145 -137 738 482 -469 236 114 -851 -345 121 -602 -160
2818 -160 486 -141 -673 -77 -237 -621 -202 433 203 184 515 76 -66 19 188 184 451 475 363 84 37 -303
2840 -303 69 235 -40 -97 -38 -8 -524 -405 -395 -395 -402 -198 83 23 -94 -328 -137 -72 -80 108 246 462 -16 54
2864 54 88 79 1 27 207 282 386 142 -120 -207 -186 -494 -97 294 -13 -221 -140 -308 -659 -444 40 -343 -168
2887 -168 68 163 -7 192 -332 -118 226 255 -46 493 613 -67 -131 468 -282 -518 668 503 -38 374 188
2908 188 -976 -702 76 -489 -83 888 -369 -875 162 -105 -984 456 888 -951 -149 907 -482 -238
2926 -238 1084 80 -987 522 747 -390 850 1063 -980 -732 695 -947 -620 2026 583 -1625
$$ packed form
2783A208j778j208K743j98k199J284L72j601J155J695j579m80J272j181q26K010
2799F89J53j185J053K13j641J37J165m39k82Q75k56r51P05j22r65N06M66p23M42
2818a60O46o27n32N96j60l84M19O35k30j9L31m39j42Q5J69mK67K4j12k79m7l40
2840c03L72J66k75n7N9L0n16J19J0%pK04K81o0j17k34J91O5qJ88J38K16m78P0
2864E4L4rp8K6J80P5J04k44k62q7K1l08L97L91l07k08Q1j68l51K15M84l83J75
2887a68K36R5j70J99n24K14L44K9l01N39J20o80o4N99p50k36J186j65n41M12j86
2908A88j164K74P78n65M06R71j257n06J037k67q79J440M32j839Q02J056j389K44
2926b38J322j004j067J509K25j137J240K13k043K48J427j642L27K646j443k208
$$ plain form
2942 -1625 97 129 -1919 234 1939 -567 -747 1034 -1123 -1624 1751 1334 -1196 820 1017 -1960
2958 -1960 43 2777 -182 -920 1448 -857 -2182 2112 2005 -1479 390 714 -3175 -1097 2738 166
2974 166 -1041 2056 -863 -3582 761 1848 -1221 987 2251 -2826 -2108 2411 32 -1077 3024
2989 3024 449 -3829 465 2572 -1169 1186 3188 -2743 -3621 2102 603 -1011 3554 1383 -5060
3004 -5060 -1336 1873 -1901 896 4395 -1920 -4148 1636 7 -2367 3597 3096 -3865 -1186 2313
3019 2313 -2430 -184 5572 -37 -3873 1183 1 -3209 3839 4851 -3075 -2128 1261 -3692 -1602
3034 -1602 6468 1834 -4082 391 -757 -5100 2172 6101 -1863 -2069 1786 -3890 -3219 5793 2768
3049 2768 -3374 1434 716 -5709 660 6494 -709 -1700 3232 -3244 -5562 4423 4181 -2203 1904 1263
$$ packed form
2942a625J722L2k048K153J705k506j80J781k157n01L375m17k530K016J97k977
2958a960K003K734k959p38K368k305j325M294j07l484J869L24l889K078L835k572
2974A66j207L097k919k719M343J087l069K208J264n077P18M519k379j109M101
2989C024k575m278M294K107l741K355K002n931q78N723j499j614M565k171o443
3004e060L724L209l774K797L499o315k228N784j629k374N964n01o961K679L499
3019B313m743K246N756n609l836N056j182l210P048J012p926R47L389m953K090
3034a602Q070m634n916M473j148m343P272L929p964k06L855n676O71R012l025
3049B768o142M808p18o425O369N834p203r91M932o476k318R985k42o384M107o41
$$ plain form
3065 1263 -7115 -2344 5908 291 -791 4080 -3006 -7792 2271 4235 -1673 2804 3016 -6588 -3856
3080 -3856 5055 842 -1044 5136 -646 -7376 1060 3871 -2036 2895 5096 -5371 -5138 3524 -201
3095 -201 -1524 6523 1813 -7599 -1627 2374 -2936 2119 7255 -3089 -6082 1702 -758 -2395 6512
3110 6512 4102 -6303 -1840 2403 -3472 1005 7904 -1108 -5669 1788 -417 -3819 5326 5604 -4534
3125 -4534 -2044 1877 -4684 -1522 7539 1294 -4326 1518 -1459 -6293 3180 6536 -2375 -1179 2148
3140 2148 -5250 -3368 6888 2949 -3249 1844 -510 -6189 1992 6800 -1242 -1064 2707 -4235 -4388
3155 -4388 5263 2928 -2838 2301 971 -6760 -927 4989 -996 -561 4180 -2856 -6135 2726 2295
3170 2295 -2161 3027 2640 -5984 -2343 4295 -382 -168 4952 -1293 -5844 1601 2785 -1642 2820
$$ packed form
3065A263q378M771Q252n617j082M871p086m786J0063J964n908M477K12r604K732
3080c856Q911m213j886O180n782o730Q436K811n907M931K201j0467K33Q662l725
3095b01j323Q047m710r412N972M001n310N055N136j0344k993P784k460j637Q907
3110F512k410j0405M463M243n875M477O899r012m561P457k205l402R145K78j0138
3125d534K490L921o561L162R061o245n620N844k977m834R473L356q911J196L327
3140B148p398J882J0256l939o198N093k354n679Q181M808q042J78L771o942j53
3155d388R651k335n766N139j330p731N833N916n985M35M741p036l279Q861m31
3170B295m456N188l87q624L641O638m677K14N120o245m551P445J184m427M462
$$ plain form
3185 2820 3428 -4889 -3230 3202 -312 -799 4694 98 -5455 463 1656 -2631 1710 4182 -2821
3200 -2821 -2783 2405 -1270 -1954 4339 1587 -3906 239 1502 -2872 980 4755 -1434 -2848 1624 -1040
3216 -1040 -2074 3819 2414 -3140 -519 941 -3078 214 4210 -748 -2462 1316 -900 -3063 2125
3231 2125 2449 -2288 40 1627 -2361 -863 3079 90 -1538 1636 -197 -2588 1562 2409 -1178
3246 -1178 12 1620 -2296 -1480 2473 726 -1302 1254 -131 -2935 164 1820 -914 -189 1533
3261 1533 -1613 -1531 1481 187 -1221 1309 731 -2073 129 1570 -911 -77 1504 -786 -1215 1291
3277 1291 634 -574 1084 730 -1400 -451 866 -760 -259 1410 -409 -1380 380 -15 -864 447 760
3294 760 -888 -462 691 -564 -390 794 -48 -582 479 737 -423 548 815 -382 -219 686 -366
$$ packed form
3185B820O08q317J659O432l514m87N493m596n553N918J193m287M341K472p003
3200b821L8N188l675o84O293k752n493M145J263m374L852L775o189j414M472k664
3216a040j034N893j405n554K621J460m019L292L996m958j714L778k216k163N188
3231B125L24m737K328J587l988J498L942k989j628L174j833k391M150Q47l587
3246a178J190J608l916Q16L953j747k028K556j385k804L099J656k734P25J722
3261A533l146Q2L012j294j408K530n78k804K202J441k481Q34J581k290m29K506
3277A291o57j208J658l54k130R49J317j626N01J669j819r71J760l95q49J311L13
3294G60j648M26J153j255J74J184q42n34J061K58j160R71K67j197J63R05j052
$$ plain form
3311 -366 -129 996 426 -675 -26 -99 -401 83 413 -337 -309 195 -446 -347 167 80 -373 84 344 -211 87
3332 87 440 -64 -213 122 104 6 422 277 -142 -74 9 -70 -280 219 32 16 -15 -69 -346 -324 -121 -134 3 -90
3356 -90 -52 20 -112 -261 -335 97 296 -1 273 412 52 -169 132 196 -55 292 115 233 224 -81 -168 -296 -56
3379 -56 -183 -171 73 -361 -292 28 -153 -291 40 140 -190 -41 215 -138 -274 143 67 -14 386 436 5 146
3401 146 397 -125 58 338 -112 -165 557 -42 -236 166 110 -422 -293 167 -347 -48 231 -317 -617 129 -292
3422 -292 -553 473 638 -184 88 412 -627 -211 864 337 -255 782 187 -818 510 559 -668 86
3440 86 555 -720 -614 800 -30 -774 370 -33 -1194 171 779 -605 39 813 -848 -954 989 203
3458 203 -606 1302 573 -1175 -273 805 -449 377 1633 -511 -1092 732 105 -802 1060 782 -1615
$$ packed form
3311c66K37J125n70j101O49p3l02M84L30p50K8N04o41R9N14q7m53M57K60n55K98
3332H7L53n04j49L35j8r8M16j45m19O8Q3p9k10M99j87j6l1n4k77K2K03j3J37r3
3356i0L8P2j32j49p4M32J99k97K74J39l60k21L01O4k51L47j77J18rl05q7j28K40
3379e6j27J2K44m34O9L20j81j38L31J00l30J49K56l53j36M17p6q1M00N0m31J41
3401A46K51n22J83K80m50n3P22n99j94M02n6n32J29M60n14K99K79n48l00P46m21
3422b92k61J026J65q22K72L24j039M16J075n27n92J037n95j005J328M9j227P54
3440H6M69j275J06J414q30p44J144m03j161J365O08j384O44P74j661j06J943p86
3458B03q09J908p29j748R02J078j254Q26J256k144n81J824o27r07J862k78k397
$$ plain form
3475 -1615 -394 951 -778 -219 1556 -477 -1873 365 136 -910 1439 1785 -1415 -765 687 -997
3491 -997 -415 2413 296 -1601 635 9 -1693 1189 2183 -992 -923 1068 -1331 -1272 2384 816 -1736
3508 -1736 203 -40 -2181 535 2478 -774 -957 921 -1631 -2028 2306 1724 -1281 835 893 -2651
3524 -2651 -610 2703 94 -470 1685 -1094 -2913 1440 1705 -986 1017 1062 -3261 -1559 2519 179
3540 179 -522 2057 -1241 -3708 656 2013 -607 1234 1980 -3029 -2298 2054 392 -432 2849 233
3556 233 -3489 133 1696 -1141 1143 3273 -1901 -2671 1479 -170 -1189 2979 1431 -3466 -1141
3571 -1141 953 -1674 1053 3822 -1123 -3246 505 -607 -1569 3404 2914 -2954 -1478 944 -2006
3586 -2006 138 4281 278 -2551 756 -405 -2489 2303 3368 -1824 -1012 1129 -2636 -1159 3740
$$ packed form
3475a615J221J345j729N59J775k033j396K238k29j046K349L46l200O50J452j684
3491i97N82K828k117j897K236o26j702K882R94l175O9J991k399N9L656j568k552
3508a736J939k43k141K716J943l252j83J878k552l97M334n82l005K116N8l544
3524b651K041L313k609n64K155k779j819M353K65k691K003M5m323J702M078k340
3540A79p01K579l298k467M364J357k620J841P46n009P31M352j662q24L281k616
3556B33l722L622J563k837K284K130n174p70M150j649j019M168j548m897K325
3571a141K094k627K727K769m945k123L751j112r62M973m90n868J476K422k950
3586b006K144M143m003k829L307j161k084M792J065n192Q12K141l765J477M899
$$ plain form
3601 3740 1110 -2189 752 -496 -3762 1232 3719 -718 -793 916 -3010 -2702 3578 2288 -1082 991
3617 991 -89 -3965 -122 3809 114 -356 1875 -2204 -3186 2382 2016 -1254 1285 764 -3826 -1416
3633 -1416 2938 -90 -525 2505 -1475 -4079 870 1733 -804 1843 2015 -3206 -2321 1977 203 162
3649 162 3306 -89 -3959 -85 1817 -946 1693 2933 -2384 -2729 1411 70 -860 2921 770 -3584
3665 -3584 -714 1157 -1378 966 3110 -1482 -2629 940 -565 -1470 2892 2087 -2270 -878 696
3680 696 -1918 179 3754 281 -2056 453 -529 -1868 2323 2622 -1839 -1207 947 -1919 -591 3110
3696 3110 285 -2085 374 -505 -2408 1054 2478 -1010 -487 1107 -1919 -1516 2390 1124 -900 1065
3712 1065 161 -2645 114 2455 -235 -171 1469 -1299 -1923 1757 1087 -912 554 444 -2322 -365
$$ packed form
3601C740k630l299K941j248l266M994K487m437p5J709l926L08O280j290l370K073
3617I91j080l876L843L931l695m70K231m079r82N568l66l270K539n21m590K410
3633a416M354l028m35L030l980k604M949Q63k537K647J72n221Q85M298j774m1
3649A62L144l395l870L874J902k763K639J240n317l45M140j341r30L781k151m354
3665c584K870J871k535K344K144m592j147L569j505r05M362q05m357J392J574
3680F96k614K097L575l473k337K509r82j339M191K99m461O32K154k866J328L701
3696C110k825k370K459q79j903L462J424l488N23J594l026M03L906j266k024J965
3712A065r04k806K759K341k690O4J640k768o24L680o70j999J466j10k766J957
$$ plain form
3728 -365 1995 -234 -344 1177 -1126 -2125 1009 1093 -976 671 1068 -1922 -718 1305 -177 -151 1748
3745 1748 26 -1643 566 799 -912 755 1451 -1170 -892 1017 -269 -366 1311 -11 -1799 -82
3761 -82 647 -679 407 1220 -775 -974 718 -154 -623 1091 645 -1085 -7 682 -749 3 1272
3778 1272 -97 -505 772 74 -726 542 614 -834 -1 340 -778 -226 853 24 -766 230 -271 -732
3796 -732 372 638 -451 -302 128 -483 -522 749 152 -211 566 256 -480 305 563 -291 -54 515 -85
3815 -85 -336 378 -8 -412 -96 -92 -401 67 214 -308 -10 80 -411 -440 189 43 -223 368 187 -183 267 369
3837 369 100 -47 354 156 14 92 115 -232 -2 92 -239 -155 267 2 3 2 -274 -329 21 194 -126 -60 7 -108
3861 -108 -262 59 228 -57 144 98 19 81 145 -135 -1 -62 -42 234 178 141 -118 -36 -33 -47 -38 26 -232 -110 69
$$ packed form
3728c65K360k229j10J521k303r99L134Q4k069J647L97k990J204K023j482K6J899
3745A748j722j669K209K33j711J667O96k621K78J909j286r7J677j322j788J717
3761h2P29j326J086Q13j995j99J692q72m69J714m46j730J078O89j431P52J269
3778A272j369m08J277o98q00J268P2j448Q33L41j118N52J079q29p90R96n01m61
3796g32J104K66j089J49M30o11l9J271n97l63P77l10p36P85K58q54K37N69o00
3815h5k51P14l86m04L16Ml09M68J47n22K98R0m91k9O29j46k66N91j81l70M50J02
3837C69k69j47M01j98j42P8K3l47K30R4l31Q4M22k65Jjk76n5L50J73l20O6O7j15
3861a08j54L21J69k85K01m6p9O2O4k80J34o1K0K76n6l7k59Q2Lj4RO4k58J22J79
$$ plain form
3886 69 -58 -84 -47 -284 -170 66 145 -17 56 95 -156 -116 105 -109 -137 235 156 -133 123 146 -174 -12 344
3909 344 -168 -32 189 -250 -355 223 -41 -238 341 33 -488 -9 259 -304 -211 278 -125 -294 488 221
3929 221 -191 73 254 -311 -37 662 -71 -2 642 -271 -686 273 228 -504 337 373 -635 -557 274 -467 -449
3950 -449 357 -25 -871 224 197 -759 52 682 -623 -360 526 -389 -375 895 468 -962 241 318 -715
3969 -715 476 1288 -394 -596 588 -645 -1005 847 476 -954 201 379 -1297 -32 1265 -399
3985 -399 -557 809 -422 -1214 838 1121 -741 185 722 -1210 -464 1686 108 -527 912 -338 -1856
4002 -1856 806 1177 -575 604 1019 -1643 -1230 1289 105 -790 1239 77 -2133 210 1186 -761
4018 -761 433 1374 -1339 -1515 1450 388 -638 1651 648 -2150 -122 1391 -778 310 2167 -820
$$ packed form
3886F9j27k6L7k37J14K36P9j62P3L9k51M0K21k14k8L72p9k89K56K3l20J62L56
3909C44n12J36K21m39j05N78k64j97N79l08n21M79K68n63R3M89m03j69P82k67
3929B21m12K64J81n65K74O99p33O9O44r13m15R59m5p32Q41L6j008P8Q31p41J8
3950d49Q06l82q46J095k7r56Q11O30j305K63Q86r15J4J270m27j430J203P7j033
3969g15J191Q12j682k02J184j233l60J852l71j430J155J78j676J265J297j664
3985c99j58J366j231p92K052K83j862R26N37j932P46K150j578o35J439j250j518
4002a856K662L71j752J179M15k662M13K519j184q95K029j162k210K343R76j947
4018g61J194R41k713j76K965j062j026K289j003k798K028J513k169J088J857k987
$$ plain form
4034 -820 -2070 971 -51 -1098 1733 1368 -2064 -865 701 -1382 -51 2541 -386 -2008 623
4049 623 -270 -1573 1869 2062 -1790 -900 874 -1307 -477 3053 525 -1910 562 -199 -2051 1329
4065 1329 2648 -1101 -818 916 -1814 -1458 2579 991 -1464 670 1 -2790 392 2694 -634 -419
4081 -419 1206 -1804 -2284 2278 1648 -1146 804 384 -3090 -219 3004 17 -140 1804 -1477 -2953
4097 -2953 1454 1702 -857 1183 1059 -3077 -1149 1916 -127 -425 2274 -706 -3222 444 1296 -1015
4113 -1015 1536 1707 -2549 -1970 1618 49 -139 2761 227 -3126 -126 1267 -863 1608 2531 -1743
4129 -1743 -2122 824 -269 -719 2627 1109 -2588 -446 770 -1470 389 2931 -649 -2027 704
4144 704 -568 -1501 2411 1893 -1841 -639 503 -1759 261 3353 254 -1810 300 -640 -2077 1901
$$ packed form
4034h20j250L041j022j047K831l65l432J199J566k083J331K592k927j622K631
4049F23q93j303L442J93l852Q90J774k181Q30L530k528k435K472p61j852L380
4065A329J319l749K83J734k730L56M037j588k455K134o69k791L182K302l328K15
4081d19J625l010m80M562o30k794J950m20l474K871L223k987j57J944l281j476
4097b953M407K48k559K040j24m136J928L065k043k98K699k980k516L666Q52k311
4113a015K551J71m256N79L588j569j88K900k534l353L000J393k130K471R23m274
4129a743l79K946j093m50L346j518l697K142J216k240J859K542l580j378K731
4144G04j272r33L912n18l734J202J142k262K020L092l099k064K110r40j437L978
$$ plain form
4160 1901 2539 -1105 -618 450 -1928 -770 2778 644 -1317 555 -426 -2376 770 2166 -938 -201
4176 -201 992 -1686 -1430 1946 1225 -716 1105 56 -2376 146 2209 128 279 1234 -1597 -2364
4192 -2364 1264 1141 -692 1059 427 -2338 -816 1608 -37 -194 1287 -715 -2243 562 783 -635
4208 -635 862 894 -1648 -986 1196 -160 -64 1738 -43 -1931 -62 666 -450 1066 1672 -1049 -1284
4225 -1284 560 -216 -429 1545 685 -1718 -177 239 -818 405 1442 -601 -1285 360 -206 -626 1095
4242 1095 521 -1072 -302 520 -482 174 1538 -30 -752 467 -194 -991 829 1126 -663 -197 468
4259 468 -876 -406 1015 275 -700 323 -171 -1006 307 787 -407 -218 362 -842 -398 940 325 -516
4277 -516 279 66 -661 136 986 76 113 458 -545 -818 506 352 -335 84 183 -818 -159 437 -260 -201
$$ packed form
4160A901O38l644M87J068k378J158L548k134j961J872r81j950L146J396l104P37
4176b01J193k678K56L376p21j941J821j049k432K522K063k081J51R55k831p67
4192b364L628j23j833J751o32k765J522K424j645j57J481k002j528K805K21j418
4208f35J497L2k542O62K182j356R6J802j781j888J869P28j116J516O06k721k35
4225a284J844p76k13J974q60k403J541M16j057J223J037k043o84J645n66m20J721
4242A095n74j593P70Q22j002O56J364j568p22J219o61p97J820K97j789M66O65
4259D68j344M70J421p40r75J023m94q35J313M80j194J89N80j204M44J338o15q41
4277e16P95k13p27P97Q50r10L7L45j003k73J324j54o87M19R9j001O59N96o97N9
$$ plain form
4297 -201 474 -237 -636 93 431 -319 165 385 -433 -241 552 333 49 431 -21 -390 250 466 -299 121
4317 121 406 -212 -286 202 -38 -203 379 95 -270 -191 116 -286 -82 198 -265 -199 180 71 -80 286 133
4338 133 -212 -68 80 -40 164 233 -128 -222 254 188 -48 113 175 56 -7 163 -8 -40 -85 -4 -215 -36 87
4361 87 -197 -146 84 -181 -90 116 -120 -27 8 199 -67 147 25 -109 221 214 134 -54 127 -121 21 76 -10
4384 -10 -119 124 26 -8 -97 3 -178 -211 108 73 -42 223 39 -145 -141 147 108 30 -85 -90 7 147 32 -127
4408 -127 172 184 -231 160 304 -77 -156 139 -140 -353 -18 -14 -73 77 23 -391 -172 107 -462 60 474 -81
4430 -81 -105 366 39 -233 213 308 -349 -38 270 140 -28 585 -131 -400 241 98 -454 378 279 -451 -181
4451 -181 224 -339 -366 599 130 -470 103 31 -667 -51 631 -191 55 432 -283 -281 650 203 -431 410 313 -767
$$ packed form
4297b01O75p11l99P29L38p50M84K20q18J92P93k19k84L82m52l69O40K16p65M20
4317A21K85o18p4M88k40j65N82k84l65P9L07m02K04K80m63O6L79j09j51L66j53
4338A33l45J44J48j20K04O9l61r4M76o6k36J61O2j19o3J70j71l2m5Q1k11J79J23
4361H7k84N1K30k65R1K06k36R3L5J91k66K14j22j34L30pq0j88J81k48J42N5q6
4384a0j09K43r8l4q9J00j81l3L19l5j15K65j84j84MK88l9p8j15nR7J40j15j59
4408a27K99J2m15L91J44l81p9K95k79k13L35Mn9J50n4m14K19K79n69N22M14n55
4430h1k4M71l27k72M46R5o57L11L08j30j68O13p16k69O41j43n52Q32r9p30K70
4451a81M05n63k7R65m69o00N73p2o98O16O82q22K46L77p15KR31m47o34Q41r7j080
$$ plain form
4473 -767 149 880 -148 -241 494 -421 -959 456 251 -364 481 329 -1153 -307 707 -272 -56 937 -316
4492 -316 -1075 338 412 -494 607 856 -1077 -464 939 -323 -250 1468 6 -1420 479 409 -904 614
4510 614 1137 -946 -949 700 -391 -589 1655 586 -1539 74 261 -1188 446 1641 -573 -780 721
4527 721 -558 -947 1522 1027 -1236 165 550 -1307 227 1915 -225 -744 798 -590 -1502 1099
4543 1099 1267 -1305 42 519 -2078 -721 1961 70 -746 929 -602 -2282 949 1697 -646 281
4559 281 1134 -1805 -1170 2043 573 -706 1399 -66 -2490 305 1706 -676 304 1737 -1693 -1826
4575 -1826 1405 447 -727 1526 545 -2746 -463 1328 -875 375 2351 -1162 -2329 846 376 -907
4591 -907 1967 1320 -2336 -851 1310 -830 263 2675 -497 -2147 626 185 -1404 1740 1930 -2009
$$ packed form
4473g67R16P31j028r3P35r15n38J415k05o15Q45j52j482Q46J014r79K16R93j253
4492c16p59J413P4r06J101K49j933O13J403j262P3J718j462j426J899p0j313J518
4510F14N23k083lJ649j091j98K244j069k125J613J87j449J634J195k214k07J501
4527G21j279l89K469m95k263J401L85j857J534J688k140n19J542j388r12K601
4543A099J68k572J347M77k597J357K682j891q16J675j531j680L231P48k343R27
4559B81Q53k939O35L213j470j279K105j465k424K795J401k382R80J433l430j33
4575a826L231r58j174K253r81l291K283J791k203J250J976l513j167L175m70j283
4591i07K874o47l656J485K161k140J093K412l172j650K773m41j589L144J90l939
$$ plain form
4607 -2009 -1169 881 -1251 -485 2657 273 -2114 154 -179 -1951 1130 2597 -1050 -852 898 -1524
4623 -1524 -1219 2647 1163 -1625 406 53 -2294 807 2871 -489 -850 801 -1543 -1837 2131 1329
4639 1329 -1499 438 269 -2475 -285 2375 -115 -669 1509 -1038 -2372 1223 1350 -824 1117 1101
4655 1101 -2471 -1005 2012 -39 -259 1792 -581 -2548 699 1442 -685 984 1153 -2200 -1571 1347
4671 1347 195 -457 1749 -35 -2414 31 1061 -724 737 2056 -1359 -1660 1049 -114 -549 1982
4687 1982 738 -1869 -134 647 -1088 418 2123 -683 -1478 605 -369 -869 1641 1320 -1689 -417
4703 -417 536 -1154 48 2045 -87 -1370 390 -189 -1302 1136 1258 -915 -198 628 -1215 -468 1759
4720 1759 305 -805 595 -224 -1382 643 1565 -533 -225 524 -1377 -762 1496 643 -652 444
$$ packed form
4607b009Q40K050k132P66L142k384k387K268l33j772L081J467l647J98J750k422
4623a524L05L866j484k788K031l53k347L101K064l360l61J651k344k94L968q02
4639A329k828J937j69k744K190K660k490n54K178k547j334L595J27k174J941j6
4655A101l572J466L017k051k20K051k373j967L247P43k127J669J69l353O29K918
4671A347j152o52K206j784k379K445J030j785J461J319l415l01K709j163m35K531
4687A982j244k607J735P81j735J506J705k806p95K083r74n00K510l21l009J272
4703d17R53j690J202J997k132j283J760n79j113K438J22k173P17Q26j843P47K227
4720A759j454j110J400q19j158K025R22k098L08P49j901O15K258q53j295J096
$$ plain form
4736 444 59 -1564 162 1303 -375 -210 794 -888 -1083 854 694 -661 594 333 -1014 -79 1005
4753 1005 -168 -133 709 -207 -962 372 475 -513 495 440 -1044 -496 544 -107 -227 876 -29 -1028
4771 -1028 -193 280 -386 314 646 -792 -518 529 -5 -171 638 229 -704 109 476 -207 108 576 -355
4790 -355 -503 169 -96 -409 363 154 -627 -256 -75 -335 -87 429 -29 -374 138 -88 -347 419 423 -228 -222
4811 -222 242 -161 8 353 287 -263 180 -38 -126 124 327 -53 -80 101 -153 -136 226 102 -312 -47 -176
4832 -176 -273 -45 85 -198 -131 174 56 -46 -12 166 -292 16 187 -37 -64 180 142 -42 98 -129 -151 -64
4854 -64 204 -46 -22 43 -274 -114 49 84 -165 109 -27 -119 -4 39 15 -182 61 18 -60 165 78 29 14 26
4878 26 -128 -83 325 37 -161 -71 4 -7 -45 19 14 -74 126 -24 22 -2 -243 15 125 -78 -20 112 65 -80 31
$$ packed form
4736D44l85j623J726J141j678J65J004j682j95J937j60j355J255k61j347R35J084
4753A005j173L5Q42r16p55J334J03r88J008n5j484N48J040o51j20J103r05r99
4771a028Q35M73o66P00L32j438K74J047n34j66Q09m09r33Q13L67o83L15M68r31
4790c55j48O72k65l13P72k09p81L71J81k60K48N16m58l45N12k26k59P66Mo51O
4811b22M64m03J69L45o6n50M43k18q8K50K03l80k7J81k54J7L62j24m14K65j29
4832a76r7K28J30k83O7L05j18j02L4J78m58L08J71k24k7K44l8j84J40k27k2Q7
4854f4K68k50K4O5l17J60J63L5k49K74j36r2J15M3k4j97K43m3p8K25q7m9j5J2
4878B6j54M5M08k88j98R0P5j1l8O4nq8K00j50M6k4k41K58J10k03N8J32m7j45J11
$$ plain form
4903 31 89 -118 57 200 39 -76 109 105 21 140 123 58 178 37 -254 -31 -80 -122 -85 87 71 -258 148 21
4927 21 -310 -239 66 -258 40 181 70 -45 132 -10 -175 234 276 -88 56 118 -173 -33 216 149 -164 190
4949 190 -70 -422 -29 242 -154 -11 92 -419 -220 235 86 -164 184 132 -343 -45 205 -298 85 413
4969 413 -273 -440 233 -28 -234 421 378 -359 30 246 -322 33 541 47 -650 209 -67 -558 360 540
4989 540 -430 -344 387 -394 -261 819 159 -602 108 67 -537 359 891 -428 -169 326 -346 -294 789 319
5009 319 -370 310 47 -879 157 916 -330 -227 503 -604 -819 639 375 -585 247 69 -1032 -132
5027 -132 1034 -68 -185 629 -484 -1144 732 733 -272 603 575 -947 -538 850 -54 -157 1054 -107
5045 -107 -1283 125 546 -525 534 1058 -1063 -894 592 -108 -238 1297 428 -1415 -201 602 -690
$$ packed form
4903C1N8k07J75J43j61j15J85mq4J19j7o5J20j41k91K23m9m2L7J72j6l29M06j27
4927B1l31P1L05l24K98J41j11j15J77j42j65M09M2l64J44O2k91J40K49o7l13L54
4949A90k60l52L93K71l96J43J03n11J99M55j49k50L48n2m75K98K50n03L83L28
4969D13o86j67O73k61k06O55m3p37L89K16n68L55N08m94o97Q59k76m91R18J80
4989E40r70Q6P31p81J33J080o60p61P10m1o04Q96N32j319K59M95o72N2J083m70
5009C19o89O80k63r26J036P59j246J03P30j107k15J458k64r60Q32j78j101R00
5027a32J166j102j17Q14j113o60J876Jj005Q75k8j522M09J388r04j03J211j161
5045a07j176J408M21j071J059N24k121J69J486p00j30J535q69j843J214Q03j292
$$ plain form
5062 -690 610 1437 -712 -1209 501 -220 -408 1473 770 -1369 -213 601 -799 136 1658 -222 -1208
5079 -1208 543 -315 -967 1093 1071 -952 -296 392 -1156 -348 1785 232 -829 489 -337 -1570 941
5096 941 1746 -464 -167 578 -1142 -731 1684 597 -841 563 10 -1823 321 1519 -306 -172 961
5113 961 -1181 -1240 1382 470 -608 893 287 -1976 -316 1397 -349 7 1254 -924 -1628 952 754
5130 754 -679 1121 814 -1821 -892 1188 -105 34 1623 -636 -1850 582 540 -692 919 1085 -1515
5147 -1515 -1003 825 -553 -386 1727 17 -1917 69 454 -961 756 1647 -972 -1085 584 -549
5163 -549 -402 1954 626 -1412 -10 283 -1274 572 1838 -644 -1170 498 -427 -839 1367 1140 -1277
5180 -1277 -101 606 -1282 57 1712 -165 -1151 751 -492 -1376 1170 1218 -664 183 510 -1407 -588
$$ packed form
5062f90J300Q27k149m97J710p21j88J881p03k139J156Q14j400R35J522j880r86
5079a208J751q58o52K060k2k023O56O88j548Q08K133j553j061J318q26j233K511
5096I41Q05k210K97P45j720M11K415j087j438J404n53j833K144J198j825J34J133
5113I61k142n9K622r12j078J501o06k263J660J713j746L56J247k178p04K580j98
5130G54j433J800l07k635R29K080j293J39J589k259j214K432m2j232J611J66k600
5147a515N12J828j378J67K113j710j934J986L85j415J717Q91k619j13J669j133
5163e49J47K356j328k038J402K93j557J846J266k482n26J668r25m12K206k27k417
5180a277J176P07j888J339J655j877r86J902j243q84K546M8j882Q47L27j917Q19
$$ plain form
5197 -588 1520 293 -567 637 -425 -1502 395 1142 -563 -206 692 -1359 -792 1324 259 -632 754
5214 754 14 -1335 173 1191 -395 217 1047 -676 -985 939 374 -439 1034 324 -1282 15 851
5231 851 -540 -18 977 -449 -1170 298 71 -409 708 446 -1199 -459 623 -431 47 1188 -343
5248 -343 -1003 299 346 -557 461 772 -809 -351 424 -380 -164 984 133 -866 321 237 -585 300 575
5267 575 -405 -219 168 -221 -460 791 242 -607 138 262 -618 223 717 -115 -467 279 -236 -566 536
5286 536 443 -445 28 370 -507 -46 630 -44 -259 370 -205 -496 168 140 -469 -17 207 -415 -131 354 -56
5307 -56 -48 159 -5 -445 194 275 -94 94 290 -346 -278 389 190 -205 239 -63 -321 100 213 -173 -90 259
5329 259 -160 -276 153 181 -18 -32 177 -405 -103 81 -46 -67 197 -83 -149 157 75 -72 157 -14 -120 -46
$$ packed form
5197e88K108j227q60J204j062j077J897P47j705L57Q98k051N67K116j065q91J386
5214G54p40j349J508J018j586O12Q30j723l09J924n65q13J473p10j606J297Q36
5231H51j391N22R95j426p21J468k27m80J117k62j645P40J082j054M78J141j531
5248c43o60J302M7r03J018L11j581M58P75q04K16J148q51r99J187q4q22Q85K75
5267E75r80J86L87l89k39J251n49q49P45J24q80Q41M94q32l52P46n15l30J102
5286E36r3q88M73L42q77M61O76o74k15O29n75k91O64k8o09M52K24o22K84M85m10
5307e6QK07j64m40O39Q1l69J88J96o36O8O67j99l95M44l02k58M21J13l86Q3L49
5329B59m19j16M29K8j99j4K09n82L02J84j27k1K64k80o6L06q2j47K29j71j06P4
$$ plain form
5351 -46 92 -57 130 142 -14 -16 137 -49 -111 37 -24 -67 -78 9 -82 -223 -75 -74 -205 -56 81 -50 31 97 22
5376 22 13 179 -79 -92 139 131 -26 73 191 18 37 118 -107 -274 -16 -134 -98 65 -113 -119 52 15 -16 -167 71
5401 71 -135 -72 -54 -16 -68 -203 68 -201 -213 67 123 5 128 5 -50 253 72 -151 -32 74 -9 -55 -13 112
5425 112 -208 41 -10 -189 -80 -134 -84 90 242 -210 8 196 43 -105 260 -16 -99 113 157 -16 157 343
5447 343 -147 -181 163 -108 42 107 -15 -265 -54 37 -247 -51 343 -81 -259 144 -169 -126 139 180 -221 137
5469 137 206 -227 65 464 -42 -113 125 151 -149 241 277 -245 74 153 -373 49 450 105 -154 189 -162 -441
5491 -441 156 186 -149 -161 167 -339 -181 380 52 -123 406 30 -332 57 519 -93 103 397 -270 -423 289
5512 289 95 -209 405 192 -568 -167 265 -352 107 423 -149 -384 23 -127 -256 440 416 -666 -170 334
$$ packed form
5351d6J38j49J87J2j56kJ53j86o2J48o1m3j1Q7r1j41J48Jj31J49J37j31Q1O6p5
5376B2rJ66k58j3K31qj57R9J18j73J9Q1k25j67K58j18L6J63j78oJ71l7l1j51K38
5401G1k06O3J8L8n2j35K71k69j2K80N6j18J23j23n5L03j81k23J19J06q3m6M2J25
5425A12l20K49n1j79J09n4N0J74J52m52K18J88j53j48L65k76q3K12M4j73J73J86
5447C43m90l4L44k71J50O5j22k50K11R1k84J96L94m24j78M03l13M3K65M1m01L58
5469A37O9m33K92L99n06p1K38K6l00L90L6n22L19P9n26M22M01l45k59L43l51k79
5491d41N97L0l35j2L28n06J58N61l28j75N29l76l62L89M62o12J96K94o67j53P12
5512B89j94l04O14k13p60M01M32o17M59L16n72k35M07j50j29O96k4j082M96N04
$$ plain form
5532 334 -261 -24 713 42 -399 -47 241 -385 427 701 -370 -314 184 -395 -269 645 55 -672 15 77
5552 77 -713 282 697 -416 -418 159 -527 -500 747 511 -453 163 5 -839 -8 967 -30 -271 416 -344 -678
5573 -678 636 520 -393 31 223 -866 -70 846 44 -329 511 -198 -917 183 429 -226 315 445 -802
5592 -802 -633 774 88 -248 682 7 -1116 149 587 -169 513 745 -717 -861 396 -155 -206 894
5610 894 249 -1206 -318 466 -473 167 1045 -404 -966 392 -227 -503 844 562 -724 -276 265 -609
5628 -609 133 1331 -80 -745 224 -98 -681 787 888 -698 -466 277 -643 -229 1058 264 -552 141
5646 141 -291 -935 424 969 -578 -424 345 -691 -418 1014 453 -682 233 80 -1077 83 1018 -203
5664 -203 -179 383 -609 -632 778 523 -448 431 277 -1207 -237 1036 55 -141 607 -458 -1031 449 655
$$ packed form
5532C34n95K37P37o71m41L52K88o26Q12K74j071N6M98n79J26R14n90p27O87O2
5552G7p90R95M15j113kN77o86K7J247k36r64O16j58q44Q31R75r97k41O87p60l34
5573f78J314j16r13M24J92j089P96R16q02l73Q40p09p19J100K46o55N41J30j247
5592h02J69J407o86l36R30o75j123J265M38p56O82K32j462j44J257n51n1J100
5610H94o45j455Q88P84r39O40Q78j449n62J358o19k76J347k82j286M48N41q74
5628f09P42J198j411o65R69l22n83J468J01j586K32P43r20M14J287p94q16O93
5646A41m32o44J359N45j547J54P69j036K73J432n61j135R15j53j157J160R35j221
5664b03K4N62r92k3J410k55r71Q79j54j484R70J273r81j96P48j065n73J480K06
$$ plain form
5683 655 -278 357 535 -942 -508 803 100 -91 824 -357 -919 151 414 -317 470 663 -631 -696 530
5702 530 -19 -178 894 223 -964 -219 448 -343 304 731 -447 -631 351 -156 -354 692 297 -868
5720 -868 -298 418 -414 156 1243 -321 -580 279 56 -379 619 494 -742 -244 229 -505 -162 805 95
5739 95 -475 127 -203 -851 215 618 -403 -103 293 -427 -285 549 207 -342 133 124 -385 286 704 -263
5759 -263 -7 402 -413 -293 449 152 -298 51 171 -517 46 593 -245 -297 539 -258 -517 358 186 -328
5779 -328 227 170 -731 -202 547 -143 -30 393 -153 -213 269 265 -172 107 282 -440 -327 158 -30 -162 380
5800 380 60 -491 -65 114 -162 -111 316 -238 -240 282 -162 -108 317 117 -496 -130 108 -140 -24 80 -154
5821 -154 -139 84 -86 27 144 198 -183 35 146 -180 98 60 17 -175 -40 151 -185 -45 88 -321 107
$$ packed form
5683F55r33O35J78j477M34J311p03j91R15j181n62J070K63p31P87J93j294o5J226
5702E30n49j59J072o71j187P45O67p91O47M27j178j84R82n07j98J046l95j165
5720h68N70P16q32N70J087j564k59Q59k23m35R98j25j236M98M73p34L43R67p10
5739I5n70O02l30o48J066M03j021L00L96p20J42Q34l42n49M75rn09O71M18r67
5759b63K56M09q15J20P42k97m50L49J20o88N63N47q38n2Q36p97k59Q75j72n14
5779c28N55n7r01N29P49o90J13M23n46o0M82mm37K79J75p22J13M85j88j32N42
5800C80l20n51M26J79k76N1M27n54kN22m44N4M25k00o13L66K38k48J16J04k34
5821a54J5K23j70J13J17N4l81K18J11l26K78l8m3j92J35J91l36J40J33m09M28
$$ plain form
5842 107 -29 -117 -134 183 -40 -120 -35 121 -137 70 203 -161 33 107 -9 15 133 84 -117 -8 -57 -106 25
5865 25 58 -43 -139 44 39 -161 106 131 -219 -9 -85 -386 -149 47 109 -127 -93 106 -122 36 82 19 191 173
5889 173 -48 21 43 -78 -153 21 -53 -117 -78 99 7 -27 15 -79 -160 57 -164 -110 -18 143 -235 103 28 141 -171
5914 -171 84 57 92 97 75 -33 37 -58 46 46 192 -137 118 120 -206 -67 75 -34 -287 -105 4 -210 -27 93
5938 93 -76 -89 -51 -37 -47 208 145 -23 -19 128 -70 -14 38 -92 -72 153 -111 13 67 -31 -5 46 24 -116 110
5963 110 166 -161 143 170 -130 -177 51 91 -112 203 178 -282 -150 249 -14 105 269 -20 -247 125 45 -61
5985 -61 96 331 -79 -171 160 -29 67 196 121 -470 -16 231 -191 0 138 -138 -145 194 -45 -67 310 191
6007 191 -206 121 -56 -202 105 263 21 -348 211 103 -232 259 138 -275 65 247 -264 -127 360 -43
$$ packed form
5842A07j36q8j7L17k23q0Q5J56k58K07J33l64J94P4j16K4J18m9k01J09m9m9J31
5865B5L3j01r6J83nk00K67K5l50K10p6l01K37J96O2k36L4J99k28J58M6o3J72j8
5889A73k21O9K2j21p5J74p4o4L9J77r2l4M2r4q1K17k21N4R2J61l78L38p5J13l12
5914a71K55k7L5Nk2j08P0r5J04%J46l29K55Kl26J39J42j09k53J82J09k14J83J20
5938I3j69j3L8J4j0K55o3j68MJ47j98N6N2j30K0K25k64J24N4r8K6N1k2j40K26
5963A10N6l27L04K7l00m7K28M0k03L15k5m60J32L99k63J19J64k89k27L72q0j06
5985f1J57K35m10r2L31j89R6J29p5n91M54K47m22J91J38k76pL39k39k2L77j19
6007A91l97L27j77j46L07J58k42l69N59j08l35M91j21m13L40J82n11J37M87m03
$$ plain form
6027 -43 -249 129 -233 -399 334 297 -305 116 66 -385 6 325 -170 -153 232 -70 -370 267 438 -196 7
6048 7 295 -411 -284 453 90 -276 182 43 -659 -27 281 -328 31 323 -235 -607 140 23 -121 303 91
6069 91 -545 -150 415 -95 -27 481 -35 -563 199 -18 -224 328 290 -649 -362 293 -272 23 429 174 -553
6090 -553 216 -78 -280 296 474 -286 -223 181 -229 -232 544 573 -289 24 74 -451 315 763 -223 -282 238 -238
6112 -238 -322 644 344 -623 59 -25 -727 75 459 -85 -279 284 -434 -601 369 516 -245 37 169 -568 -192
6133 -192 470 129 -177 230 -167 -598 267 478 -178 297 247 -631 -598 432 57 -46 514 -131 -684 -40
6153 -40 244 -114 124 296 -431 -617 264 132 -20 383 185 -627 -36 273 -143 113 654 -210 -465 354
6173 354 23 -90 477 194 -503 -210 15 -256 107 568 -83 -482 86 35 -243 402 403 -352 -443 156 -307
$$ packed form
6027d3k06L78l62j66P33l7o02M21n0m51L91L19m95J7L85l02l00O37J71o34K03
6048GK88p06J27P37l63l66M58j39p02O32L08o09L59K92n58l72P47j17j44M24k12
6069I1o36L95N65n10O8N08n16n28P62k17k06N52l8r39K87O55n65K95M06k55p27
6090e53P69k94k02N76J78p60O3M04m10lP76K9q62L13N0n25P66M48r86n9N20m76
6112b38q4R66l00r67O82q4p02Q02L84n44j94N63p18j67R70J47p61K82J32p37L76
6133a92O62l41l06M07l97m31Q65K11o56M75n0q78L3J030l75j03N60o45n53O44
6153d0K84l58K38J72p27j86Q81j32j52M03j98q12N91L09m16K56N41q64k55Q19
6173C54l31j13N67k83o97K93K25k71L63M61o51l99N68n1k78O45Jp55r1N99m63
$$ plain form
6194 -307 -224 480 229 -413 -35 7 -390 431 593 -208 -75 96 -241 -359 433 260 -268 44 -49 -494 -107
6215 -107 588 -97 25 188 -282 -349 298 285 -252 184 83 -449 -9 447 -141 -279 288 -170 -310 272 241
6236 241 -265 -43 118 -449 -328 288 0 -158 254 -22 -309 25 141 -156 134 242 -204 -137 265 -49
6256 -49 20 382 85 -361 -27 311 -91 168 428 -22 -206 117 -87 -13 35 98 -344 -72 172 -104 -39 237
6278 237 -101 -245 83 167 -208 235 240 -199 -91 6 -1 -87 157 108 -134 -132 14 -139 -16 105 -128 -70 120 -153
6302 -153 -155 140 176 -430 59 -60 -124 18 274 -58 -96 92 -80 -131 33 -48 -214 57 105 -106 -93 138 -95
6325 -95 56 103 -37 -126 97 9 -117 49 173 -74 -50 219 -28 -86 92 -33 -84 -45 91 -62 87 95 -88
6348 -88 -148 12 -43 -161 77 -15 -207 46 103 6 27 48 -27 -117 56 -19 64 35 31 -194 37 227 -156 49 52 -30
$$ packed form
6194c07Q3P04k51o42L78M2l97Q21J62q01J33J71l37j18P92j73n28L12r3m45L87
6215a07O95o85J22J63m70o7O47j3n37M36j01n32M40M56n88j38N67m58j40N82l1
6236B41n06K22J61n67J21O16k88j58M12k76k87L34J16k97K90J08m46O7M02l14
6256d9O9L62k97m46L34L38m02K59K60m50j84L23k04P4M8O3m42K72K44k76O5K76
6278B37l38j44L28Q4l75M43Nm39J08R7pq6K44m9k42KJ46j53J23J21k33N8J90k73
6302a53kK95L6o06M89j19o4J42K56l32l8J88j72n1J64q1j66K71M8k11J3K31k33
6325i5J51M7j40q9K23q8j26J66J24k47K4K69k47n8J78j25n1L9J36j53J49Qj83
6348h8o0J60n5j18K38r2j92K53N7r7K1K1p5r0J73p5Q3k9mk25K31J90l83K05Lq2
$$ plain form
6374 -30 -45 -9 -2 0 -154 83 47 -2 -80 -149 -132 88 94 -66 -133 197 -10 -12 -114 -94 21 122 -39 -93 -5 107 110
6401 110 -203 92 -21 -125 19 15 27 -14 -24 -7 44 -84 -136 215 97 1 40 125 -85 -97 351 147 -87 -31
6425 -31 -33 42 -118 77 -144 14 -6 -123 -171 24 107 -148 29 103 -146 -131 -31 -152 96 113 72 30 9 93 90
6450 90 61 -125 -8 -11 113 -38 -10 173 27 -2 -100 -194 -139 142 120 -146 -125 115 -61 31 17 89 55 -19 22 -89
6476 -89 179 210 -98 -11 106 33 56 78 30 -285 44 122 4 -54 75 -145 -46 164 -132 -123 132 -103 -75 167
6500 167 68 -96 43 228 -30 59 93 -86 3 247 176 -36 89 35 -283 14 155 86 -183 98 58 -167 98
6523 98 52 -14 198 203 -151 -162 177 -83 -183 171 -17 -221 76 40 -78 306 155 -79 -55 340 25 -26 318
6546 318 95 -220 97 147 -81 82 143 -25 -231 219 -19 87 198 182 -305 -52 113 -168 180 302 -18
$$ packed form
6374c0j5L6PKj54K37l6m9p8o9J7K20Oj60o7L30k07kj02K0J15J01j61n4Q8J12L
6401A10l13K95j13j04J44mJ2m1j0J7N1j28n2L51j18r6L9Q5k10j2M48k04k34N6
6425c1kP5j60J95k21J58k0j17m8J95Q3k55J77P4k49J5J00j21K48J7m1m2k1Q4l
6450I0k9j86J17lJ24j51K8J83j46k9r8r4N5K81k2k66K1K40j76R2j4P2l4p4M1j11
6476h9K68L1l08Q7J17p3K3K2m8l15L29P8j18n8J29k20R9K10k96RK55k35K8K42
6500A67r9j64J39J85k58Q9L4j79Q9K44p1k12J25n4l18K97J41o9k69K81m0k25K65
6523I8m6o6K12Nl54j1L39k60j00L54j88k04K97l6j18L84j51k34K4L95l15n1L44
6546C18k23l15L17N0k28J63O1j68k06M50k38J06J11j6m87K53J65k81L48J22l20
$$ plain form
6567 -18 -211 -13 -85 -215 102 257 -229 31 164 -271 211 280 -270 -41 151 -37 -171 150 311 -312 7
6588 7 23 -125 -10 452 43 -146 249 -3 -259 84 117 -154 132 254 -334 -93 42 42 -71 155 148 -500 -32
6611 -32 218 -39 3 332 -59 -320 213 5 29 232 121 -367 -226 143 28 -37 303 -128 -325 24 113 -220
6633 -220 313 120 -276 -84 60 -66 -41 440 -56 -353 -107 -17 -202 187 467 -308 -326 65 -110 -146 389
6654 389 -39 -249 101 33 -164 165 392 -177 -177 59 -207 -140 390 235 -156 -50 112 -252 108 389 -152
6675 -152 -106 123 -196 -335 215 278 -98 147 17 -276 -203 119 -5 7 199 -206 -240 217 152 -188 -13 266
6697 266 -218 -121 273 100 -113 169 26 -307 186 277 -288 111 119 -213 -97 211 171 -118 129 -78 -321 43
6719 43 131 -8 26 245 -221 -121 60 34 -42 277 83 -213 -50 -20 70 175 303 -121 -160 1 -5 -101 175 79
$$ packed form
6567a8j93J98p2j30L17J55m86K60J33m35M82O9n50K29J92j88j34L21J61o23L19
6588GJ6j48J15M62m09j89L95k52k56L43L3k71K86J22n88K41J35%j13K26po48M68
6611c2K50k57M2L29l91k61N33k08K4K03j11m88J41L69j15o5L40m31j97L49Q9l33
6633b20N33j93l96J92J44j26K5M81m96k97K46R0j85L89K80p75j8L91j75l6N35
6654C89m28k10L50o8j97L29K27n69%K36k66O7N30j55l91J06J62l64L60K81n41
6675a52M6K29l19j39N50O3l76K45j30k93P3L22j24J2J92m05l4M57o5l40J75K79
6697B66m84R7L94j73k13K82j43l33M93R1n65L99Ql32J16L08m0k89K47k07k43L64
6719D3Q8j39L4K19m66J00J81k6p6L19j94k96J63L0R0J05J28m24l9J61or6K76r6
$$ plain form
6743 79 -134 -89 74 -112 -130 216 -6 -229 -140 -171 -98 -152 33 -58 -31 26 -195 -72 109 96 -197 -131 -121 -69 72
6768 72 80 9 197 214 24 -163 51 136 97 126 -202 -154 31 59 -246 -161 -77 -5 -139 43 103 -89 139 -58 -197
6793 -197 -33 192 38 -99 92 -70 -213 -84 119 31 -83 162 -52 72 103 -92 -112 -123 121 -149 38
6814 38 49 -71 -75 -92 -25 -41 55 97 7 177 7 56 8 126 -112 23 92 100 136 94 -124 -140 45 112 25 10 56
6841 56 47 -20 -15 119 -101 -44 63 3 96 -118 -55 -101 24 133 23 9 -106 122 -90 0 -47 -69 44 87 -96
6866 -96 93 20 59 119 20 76 -179 -142 140 147 -140 -94 37 -18 69 -122 -72 110 -81 -32 64 -60 115 8 -51
6891 -51 55 130 -125 44 -94 12 -116 87 92 10 -54 -16 -27 -74 -40 48 28 -44 -43 -70 -18 -53 53 -47 -26 69 10
6918 10 -41 13 -18 13 -56 -179 270 -91 -7 41 99 51 -4 143 269 0 60 -17 -159 113 -186 65 -34 -8 -81
$$ packed form
6743G9k13M5J63j86j8L46k22k23Q9l1P3n4J85r1K7N7k21J23J81j3k93O6J0N2J41
6768G2Qp1J88J7j90j87K14Q5l9K9l28M8J85K8l05Q5Q4P2j34J82O0j92K28j97j39
6793a97J64K25j54j37J91j62j43J29K03q8j14K45k14J24L1j95k0j1K44k70J87
6814C8J1j20mj7O7j6R6M2r0J70j70M9m8J18k38J35O9QL6m2k18j6J85O7q7j5M6
6841E6ro7NJ34k20N7J07o0R3k14O3m6J25J09j10j4j15K28k12R0m7k2J13M3j83
6866i6J89p3L9O0r9N6k55L7K82Pk87M6J31n5Q7j91N0J82j91M9R6j24J75j07n9
6891e1J06P5k55J69j38J06j28K03Nq2o4L8j1m7L4Q8k0p2Jk7N2l5J06j00K1R5n9
6918A0n1N4l1L1o9j23M49l61Q4M8N8m8n5J47J26k69O0p7j42K72k99K51r9K6p3
$$ plain form
6943 -81 -100 -8 67 -19 -59 -159 102 -26 -3 93 57 68 10 -133 46 98 43 58 79 -31 5 -48 14 80 18 6 -25
6970 -25 -45 167 -190 61 182 -57 37 79 57 -89 78 106 5 66 19 -80 83 61 7 86 152 -72 62 145 -96
6995 -96 -68 186 53 -152 -60 -19 -3 -208 119 -90 -164 -121 -25 -95 -50 63 -40 22 -73 17 -160 65 -138 -39 76
7020 76 49 25 65 87 -55 -139 138 61 -57 46 213 -138 12 209 -103 -187 -32 22 -160 129 -139 -197 43
7043 43 100 -96 -18 29 -110 -81 104 -90 17 64 56 -51 -28 272 -66 6 -36 -55 -146 33 121 -37 -1 54 -121
7068 -121 -26 15 -118 16 145 -17 -149 -128 -24 -154 -46 38 -208 -100 268 46 -64 104 134 -282 63 224
7090 224 -261 140 71 -215 48 186 -31 14 29 -42 -70 34 280 49 44 102 -147 42 -78 -53 -66 138 230 -206
7114 -206 37 104 -40 16 152 -52 104 132 -166 -207 197 45 -53 -106 -8 -118 -4 154 -65 -94 117 -83 -136
$$ packed form
6943h1j9R2P5q6m0j00K61j28K3R6l6J1n8j43J79N2n5J5K1j10L6n3O2O6o2j2l1
6970b5k0K12l57K51J21k39R4M2k2j46J67K8j01O1m7r9J63k2n4P9O6k24J34Q3k41
6995i6K8K54j33k05R2M1J6k05L27k09p4M3R6p0M5J13j03O2r5R0j77K25k03R9J15
7020G6k7k4M0K2j42q4K77p7j18J03J67l51J50J97l12q4J55N4j82K89k68n8K40
7043D3N7j96P8M7j39K9J85j94J07M7qj07K3L00l38P2m2j9r1J79Q8j58L6N5j75
7068a21R5M1j33J34J29j62j32K1J04j30J08Q4k46J08L68k22j10J68L0m16L45J61
7090B24m85M01o9k86K63J38k17M5J5p1k8J04K46k31nN8k49J89j20K5j3K04R2m36
7114b06K43O7j44N6J36k04J56K8k98m1M04j52r8n3R8j10J14J58k19k9K11k00n3
$$ plain form
7137 -136 147 221 -159 -25 181 -129 24 255 69 -101 31 -66 -94 29 1 -9 -50 131 -201 -127 242 -75
7159 -75 -127 39 -140 -221 174 137 -126 -13 129 -193 -104 183 172 -21 81 -88 -123 -170 47 -126 -35 31 -140
7182 -140 -232 135 195 -125 88 -21 -149 -25 95 -39 -121 287 -86 -251 78 5 -120 190 32 -103 -20 175
7204 175 218 -54 106 114 21 24 190 -102 175 316 -75 -26 -106 -145 -155 126 140 -134 -40 62 -246 129 144 -152
7228 -152 -115 91 -99 -17 232 -72 -67 -19 -33 -126 95 131 -25 30 117 -193 -104 35 -91 -26 136 -57 -110 -109 -15
7253 -15 38 -22 80 -217 -101 125 -47 -84 -8 106 37 -85 131 63 71 296 113 -129 14 79 15 25 -16 -31 19
7278 19 27 -5 53 1 -140 -220 55 -32 -102 -16 89 -11 -116 81 133 -26 -92 36 -52 190 -100 5 40 -28 5
7303 5 -64 -94 -29 122 -41 23 -63 -44 52 -3 14 -65 107 -115 25 -90 -126 -94 154 -166 -128 -63 -173 81 150 56
$$ packed form
7137a36K83P4l80J34K06l10J53K31j86j70J32r7k8J23k8j0m1J81l32P4L69l17
7159g5n2J66j79q1L95l7k63J13J42l22Q9K87j1j93J02j69l5m7K17j73R1O6j71
7182a40r2L67O0l20K13j09j28J24J20j34q2M08l73j65L29p3j25L10j58j35Q3J95
7204A75M3k72J60Qr3LJ66k92K77J41l91M9q0l9j0K81J4k74R4J02l08L75J5k96
7228a52L7K06j90Q2K49l04NM8j4r3K21L6j56N5Q7l10Q9J39j26O5J62j93n3JR4
7253a5N3o0J02k97J16K26j72l7P6J14o9j22K16o8QK25j83k42J43O5o4J0m1j5N0
7278A9Ql2N8n2j41q0K75q7p0Q6J05j00j05J97N2j59o6J28q8K42k90J05L5o8L3
7303Eo9l0O5J51j63O4q6J9R6n5J7p9J72k22J40j15l6L2K48l20L8O5j10K54O9r4
$$ plain form
7329 56 1 60 41 -27 58 -21 29 209 216 -58 -30 96 12 168 58 60 -50 -118 -93 211 -174 -144 -78 0 -103 66
7355 66 98 -76 9 -25 105 -32 -11 70 110 -76 71 -1 180 183 -10 79 2 -133 -27 -15 -120 -22 -64 61 18
7380 18 -21 -16 -4 -9 15 -95 78 95 154 -109 -118 52 -81 28 22 -56 110 -17 -27 -60 -77 -136 149 26 17 -2 -38 -150
7408 -150 -20 -161 66 -83 48 59 -143 130 -76 -67 -174 11 -76 54 119 114 98 213 58 56 80 98 -52 -63
7432 -63 -34 30 3 -120 58 -51 5 86 -112 117 24 -8 -29 137 -16 73 -51 93 -76 78 36 104 -90 39
7456 39 45 -137 65 -152 59 11 148 -90 -68 -85 -98 -39 189 6 -123 107 63 -24 -93 -102 -7 7 72 -58 -126 193
7482 193 -48 -24 -20 171 103 63 34 -22 267 104 -54 -1 -3 -87 5 53 0 -107 -112 93 -18 -28 -66 -110 57 -61
7508 -61 55 154 -87 34 117 -27 80 63 47 -174 29 -6 -122 53 -27 62 41 56 -177 1 174 -124 50
$$ packed form
7329E6n5N9j9o8Q5p9N0J80Pk74K8J26q4J56j10Kj10o8K5L04l85L0O6P8j03J69
7355F6L2j74Q5l4J30j37K1Q1M0j86J47p2J81Lj93Q9p7j35J06J2j05R8m2J25m3
7380A8l9NJ2nK4j10J73J7N9k63rJ70j33J09op8J66j27j0l3j7n9K85j23rj9l6j12
7408a50J30j41K27j49J31J1k02K73k06Rj07J85q7J30O5nj6J15j55kK4J8j50j1
7432f3K9O4k7j23J78j09N6Q1j98K29r3l2k1J66j53Q9j24J44j69J54m2O8j94J29
7456C9Oj82K02k17K11m8J37k38K2j7j3N9K28j83j29K30m4q7o9rR5J4O5j30o8L19
7482A93k41K4MJ91o8m0k9n6K89j63j58N3kq4R2M8n3j07nK05j11j0l8m4J67j18
7508f1J16R9k41J21Q3j44J07j7j6k21K03l5j16J75q0Q9k1J5k33J78J73k98J74
$$ plain form
7531 50 -82 2 -34 -13 82 -77 107 -127 -23 158 -54 -123 114 121 -63 136 28 43 23 16 48 35 48 200 -28
7556 -28 81 -14 74 114 -106 -159 41 80 -32 -74 -73 89 48 -15 105 -133 117 0 -168 21 85 -52 -74 77
7580 77 -9 -85 1 -19 34 -36 37 34 -191 271 127 -241 12 -17 -142 -90 133 -161 -46 47 -110 -162 -20 37 -97
7605 -97 16 14 -157 -22 105 -97 -68 -188 0 -73 -15 44 -8 41 308 127 -72 -36 -76 -71 153 10 67 9 69
7630 69 -27 -74 -11 -82 -24 214 76 -15 98 27 -109 75 36 48 -31 -9 4 -96 18 2 71 43 77 -22 -231 25
7656 25 -81 51 106 -97 -197 -41 -100 -55 93 -108 20 62 150 -10 65 218 -108 -43 121 -79 85 160 -15
7679 -15 107 -166 11 -92 119 78 87 10 94 40 -136 175 -17 -84 4 129 -146 -25 127 110 -149 101 -97
7702 -97 -67 75 23 -43 55 7 -7 -57 59 63 -18 -113 40 -83 57 73 -98 -158 -35 -161 -17 68 -81 -48 65
$$ packed form
7531E0j32Q4l6K1R5j59J84k34J04J81k12o9K37Pj84J99j08J5k0pL2j3J3J52k28
7556b8J09r5Q8M0k20n3K00L9j12m2JJ62m1o3J20k38K50j17j68J89O4j37k2J51
7580G7q6p6Q6k0N3p0P3lk25M62j44l68K53k9j25N2K23k94J15R3j57n2J42N7j34
7605i7J13kj71J35J27k02K9j20J88p3N8N9n2M9K67j81j99L6m0NK24j43N7n8O0
7630F9r6m7O3p1N8K38j38r1J13p1j36J84l9J2p9K2J3j00J14j6O9k8L4r9k09K56
7656B5j06J32N5k03j00J56n9M5J48k01J28M2Q8j60P5J53l26O5J64k00J64P5j75
7679a5J22k73J77j03K11m1Rp7Q4n4j76L11j92o7Q8J25k75J21J52j7k59K50j98
7702i7L0J42n2o6R8m8j4n0J16Mq1r5J53j23J40J6j71o0J23j26J44Q5j49L3J13
$$ plain form
7727 65 9 -126 121 19 -115 14 -50 -165 -66 -145 -24 12 59 29 -63 -114 -27 14 31 -18 37 0 40 22 -28 22 15
7754 15 -75 10 4 -11 97 19 -83 -101 -47 -26 -133 -88 91 58 -53 44 -148 -175 -55 220 -42 18 76 -35 -33 143
7780 143 -1 -75 -65 -35 40 -47 -160 16 93 -59 -5 -156 134 -74 -66 19 70 -12 118 75 -22 101 115 -13 -179
7805 -179 -24 -32 -130 129 -42 189 -36 32 -83 -244 67 93 -110 80 102 -129 -25 -55 82 70 4 58 106 79
7829 79 -107 58 23 -28 11 -116 -46 -142 -2 6 -173 -79 91 -5 -125 -178 37 17 283 99 -116 -48 -86 134 -60
7854 -60 56 16 -7 34 117 125 29 -74 -147 57 -25 10 127 -28 145 -98 -5 -48 30 133 -38 204 -34 128 -102
7879 -102 15 -15 -9 -10 -147 150 62 26 177 66 63 29 -41 -121 39 -39 156 266 59 -84 50 -77 62 141 156
7904 156 -44 43 -109 -18 84 29 147 -80 -95 109 -8 -17 -17 -13 -62 18 107 73 98 109 74 37 33 64 -190 55 -45
$$ packed form
7727F5n6j35K47j02j34J29o4j15R9p9J21L6M7l0r2n1Q7M1J7m9N5l7M0j8n0N0p
7754A5r0Q5oj5J08p8j02j8N4K1j07M5J79l3j11R7j92k7J20K75k62O0N8j11KJ76
7780A43j44p4J0L0P5q7j13J76P7j52N4j51K90k08QQ5N1q2J30m3r7J23J4j28j66
7805a79J55qr8K59j71K31k25O8j15j61L11K6k03J90K2k31J04l0J37j2o6N4M8k7
7829G9j86J65l5n1L9j27P0r6J40Qj79R4J70r6j20n3K15k0K66j84k15O8l8K20j94
7854f0J16m0k3M1Q3Qr6j03p3K04q2L5J17j55J73k43R3m3P8J03j71K42k38J62k30
7879a02J17l0Ojj37K97q8l6J51j11ll4p0q0J60p8J95J10k07j43J34j27J39P9J5
7904A56k00Q7j52R1J02n5J18k27j5K04j17r%Mm9Q0Q9l4K5J1l5l7mL1k54K45j00
$$ plain form
7931 -45 111 121 108 -117 -10 53 -25 -23 -47 3 -198 50 -121 42 16 -22 63 -126 72 -102 93 11 42 -147 12
7956 12 18 -166 147 71 11 -139 41 52 -3 38 -40 87 120 209 -48 48 34 98 20 43 -81 105 -198 24 81 14
7982 14 -16 -158 1 149 -84 -32 86 16 88 -84 113 95 11 -49 -21 -44 -116 111 157 134 65 76 -5 -38 -2 -51
8008 -51 -20 -205 38 -181 142 -40 -79 165 -45 -62 114 131 87 -41 -139 63 45 90 20 -63 41 -44 -44 -121 18
8033 18 -47 -128 176 -88 -1 126 -134 -86 133 -46 87 -110 91 8 -15 -16 -25 -141 -42 -2 32 -19 -89 75 36 135
8059 135 -51 84 -13 131 -178 -192 23 -229 12 -74 -86 120 -21 83 72 33 5 -141 5 -259 -91 175
8081 175 51 191 -8 137 48 50 -129 45 -2 -106 -105 -23 28 71 55 -110 -56 -1 77 264 16 -27 -24 21 -44 9
8107 9 -24 -85 -19 70 40 -70 13 -41 -66 66 -83 81 60 72 -106 17 70 3 -77 -127 -75 -59 26 -54 -194 -153 -16
$$ packed form
7931d5J56J0j3k25J07O3p8Kk4N0k01K48j71J63k6l8Q5j89J98j74J95q2L1j89J59
7956A2Oj84L13p6o0j50J80J1n5M1p8J27L3Q9k57R6j4O4p8K3j24J86l03K22N7o7
7982A4l0j42J59J48k33N2J18p0P2j72J97j8q4o0K8k3p2K27M6k3o9J1q1l3L6m9
8008e1L1j85K43k19L23j82l9K44k10j7J76J7m4j28r8K02j8M5p0q3J04q5%p7J39
8033A8o5q1L04k64Q7J27k60M8K19j79J33j97K01q3k3jrj16R9M0L4n1p0J64l9R9
8059A35j86J35r7J44l09j4K15k52K41q6j2K06j41J04j1l9k8j46J46k64J68K66
8081A75j24J40j99J45q9Kj79J74m7j04JQ2N1M3j6j65N4N5P8J87k48m3LM5o5N3
8107Il3o1O6Q9l0j10Q3n4k5J32j49J64k1J2j78J23N3o7q0n0N2J6Q5q0j40M1J37
$$ plain form
8134 -16 43 87 111 2 49 34 27 47 -57 52 -121 43 120 121 -15 96 54 109 130 76 -72 -120 35 87 56 -101
8160 -101 -42 33 107 -124 43 71 -77 -63 74 135 -47 -1 91 153 -47 -48 -39 -114 0 -74 -27 -60 -57 -27 -11 -6 -122 -60
8188 -60 115 131 29
$$ packed form
8134a6N9M4K4j09M7j5pK0j04J09j73J64P7Jj36J11m2N5K1n4j48m8J55N2l1j57
8160a01N9P5P4k31J67K8j48J4J37O1j82M6R2O2k00jRp5J14p4M7l3LL0J6Nj16O2
8188f0J75J6j02
8191B9
$$ Imaginary data points
##PAGE= N=2
##DATA TABLE= (X++(I..I)), XYDATA
$$ plain form
0 0 0 0 0 0 0 0 0 0 0 0 0 -8 8 -8 8 -16 16 -24 24 -32 40 -47 56 -64 72 -85 101 -117 133 -149 171 -195 221
33 221 -248 279 -313 353 -394 439 -487 541 -599 665 -735 810 -895 988 -1086 1198 -1317
50 -1317 1450 -1601 1766 -1950 2160 -2396 2670 -2988 3361 -3809 4359 -5045 5937 -7141 8851
65 8851 -11467 15925 -24896 49727 -256715 -811086 -112648 -120825 -341926 363888 438526 -354086
77 -354086 -85011 406586 -34105 40241 533414 -112390 -610481 -44604 -47024 -368057 288772
88 288772 509091 -203802 -120327 278136 -187668 -168652 464323 94810 -448374 -53214
98 -53214 -53010 -405021 190269 583444 -36171 -135729 163077 -260088 -292504 394839 231790
109 231790 -288086 6651 24516 -392015 55325 504682 -93 -135268 186599 -183958
$$ packed form
0@%%%%%%%%%%%qJ6j6J6k4L2m0M8n6P2q7J03j20J36j57J86k18K50k82L20l66M16
33B21m69N27n92O66p47Q33r26J028j140J264j400J545j705J883k074K284k515
50a317K767l051L367l716M110m556N066n658O349p170Q168r404J0982j3078J5992
65H851k0318K7392m0821P4623l06442n54371O98438q177k21101P05814P4638p92612
77c54086K69075M91597m40691P4346M93173o45804m98091N65877k420l21033O56829
88B88772K20319p12893Q3475L98463m65804J9016O32975l69513n43184L95160
98e3214K04l52011N95290L93175o19615r9558K98806m23165l2416O87343j63049
109B31790n19876K94737J7865m16531M47340M49357n04775j35175L21867l70557
$$ plain form
119 -183958 -350503 249876 229235 -212007 47319 102561 -359716 -88718 377201 34395
129 34395 -79045 228236 -126846 -416135 97664 223239 -107887 115346 196272 -292467
139 -292467 -198831 247846 52403 -54365 235569 -23020 -352496 22622 180811 -96990
149 -96990 74347 206358 -204625 -206524 172631 34392 -85621 199224 45883 -295776
159 -295776 -44521 124793 -99955 54237 253131 -88497 -206895 74019 -7246 -105298
169 -105298 190086 146154 -182469 -58443 77434 -113254 9578 235506 -19903 -165460
179 -165460 58870 1539 -121743 122984 141460 -142683 -72104 70632 -90336 -33186 181685
190 181685 17159 -130189 31398 -5442 -132961 62363 144036 -57436 -31326 69078
$$ packed form
119a83958j66545O00379k0641m41242K59326N5242m62277K70998M65919l42806
129C4395j13440L07281l55082k89289N13799J25575l31126K23233Q0926m88739
139b92467R3636M46677j95443j06768K89934k58589l29476L75118J58189k77801
149i6990J71337J32011m10983j899L79155j38239j20013K84845j53341l41659
159b95776K51255J69314k24748J54192J98894l41628j18398K80914q1265r8052
169a05298K95384m3932l28623J24026J35877j90688J22832K25928k55409j45557
179a65460K24330n7331j23282K44727J8476k84143P0579J42736j60968N7150K14871
190A81685j64526j47348J61587l6840j27519J95324Q1673k01472K6110J00404
$$ plain form
200 69078 -86819 -81271 122970 53318 -64188 50578 20142 -118957 9984 112554 -27711
211 -27711 -29962 58407 -54106 -77893 81911 50030 -56330 18945 9418 -102751 -10577 90594
223 90594 -10062 -23747 56386 -30728 -85142 34253 42300 -32962 29486 46390 -51301 -23608
235 -23608 44977 -14731 -17299 56911 3712 -50953 24119 28778 -36934 7054 34378 -39727
247 -39727 -30199 33799 1913 -15267 30110 -1683 -51283 -5293 16153 -17376 11689 36667
259 36667 -14447 -23233 13014 -5401 -16237 22881 18219 -12253 8627 17060 -15208 -6281 16965
272 16965 -5518 -10290 16911 7931 -9930 3666 1179 -19043 -9399 3388 -5942 357 14191
285 14191 -558 -12521 -2521 -5940 -12718 1562 11121 5277 4806 5472 -2535 -4847 1472 1277 2458
$$ packed form
200F9078j55897N548K04241o9652j17506J14766l0436j39099J28941J02570j40265
211b7711k251Q8369j12513k3787J59804l1881j06360P5275r527j12169R2174J01171
223I0594j00656j3685Q0133q7114n4414J19395Q047p5262O2448J6904r7691K7693
235b3608O8585n9708k568P4210n3199n4665P5072M659o5712M3988K7324p4105
247c9727R528O3998l1886j7180M5377l1793m9600M5990K1446l3529K9065K4978
259C6667n1114q786L6247j8415j0836L9118m662l0472K0880Q433l2268Q927K3246
272A6965k2483m772K7201q980j7861J3596k487k0222R644J2787r330O299J3834
285A4191j4749j1963J0000l419o778J4280R559n844m71O66q007k312O319j95J181
$$ plain form
300 2458 10626 9654 1441 302 -483 -6018 -7557 -1710 5032 5315 2097 -629 -4532 -8663 -11215 -7916
316 -7916 -189 3492 2420 1915 1756 -944 -6313 -6896 642 5196 4991 7509 8695 3534 -3684 -5037
332 -5037 203 3672 3748 6007 7380 2356 -5363 -6801 -4939 -6690 -3549 4260 3552 299 237 -5983
348 -5983 -11123 -5901 -2149 -2176 4531 7956 503 796 4953 -5233 -7190 7691 5263 -1561 13600
363 13600 13756 -8658 -8282 3653 -6364 -5392 14676 8494 -6184 2562 -4239 -19723 -1095 7305
377 7305 -12826 -1507 17204 -8472 -15956 14243 3117 -21762 4290 13142 -14077 4703 26976
390 26976 -4813 -9356 13486 -12246 -20268 27130 22779 -13105 10532 11520 -38221 -15618 30673
403 30673 -2555 -10578 28488 -7133 -42245 11110 17911 -27706 5930 27450 -33141 -21605
$$ packed form
300B458Q168r72q213j139p85n535j539N847O742K83l218k726l903m131k552L299
316g916P727L681j072n05j59k700n369n83P538M554k05K518J186n161p218j353
332e037N240L469P6K259J373n024p719j438J862j751L141P809p08l253o2o220
348e983n140N222L752k7O707L425p453K93M157j0186j957J4881k428o824J5161
363A3600J56k2414L76J1935j0017R72K0068o182j4678Q746o801j5484J8628Q400
377G305k0131J1319J8711k5676p484L0199j1126k4879K6052Q852k7219J8780K2273
390B6976l1789m543K2842k5732q022M7398m351l5884K3637R88m9741K2603M6291
403C0673l3228q023L9066l5621l5112N3355O801m5617L3636K1520o0591J1536
$$ plain form
415 -21605 37487 476 -18840 32780 -258 -51620 11279 36296 -15848 18163 45318 -41870
427 -41870 -49664 32545 9124 -16038 53882 23293 -67408 -17968 26406 -28591 6542 61793
439 61793 -25623 -57334 27240 2489 -39457 47837 39940 -66672 -19759 39845 -32391 -4043
451 -4043 84727 -3895 -69839 18411 3063 -51370 59743 86086 -49341 -39580 22043 -57008
463 -57008 -26860 106776 34452 -65912 7915 -9655 -86218 37920 103477 -38937 -43867
474 -43867 36905 -55666 -57247 99908 52971 -68046 9451 12499 -92734 12034 115283
485 115283 -9911 -31033 51267 -59573 -100003 79376 80607 -38011 36018 31238 -131014
496 -131014 -53413 106230 17923 -15449 75351 -47154 -142854 37317 86898 -29350 39374
$$ packed form
415b1605N9092l7011j9316N1620l3038n1362O2899K5017n2144L4011K7155q7188
427d1870p794Q2209k3421k5162O9920l0589r0701M9440M4374n4997L5133N5251
439F1793q7416l1711Q4574k4751m1946Q7294p897j06612M6913N9604p2236K8348
451d043Q8770q8622o5944Q8250j5348n4433J11113K6343j35427R761O1623p9051
463e7008L0148J33636p2324j00364P3827j7570p6563J24138O5557j42414m930
474d3867Q0772r2571j581J57155m6937j21017P7497L048j05233J04768J03249
485A15283j25194k1122Q2300j10840m0430J79379J231j18618P4029m780j62252
496a31014P7601J59643q8307l3372R0800j22505r5700J80171M9581j16248O8724
$$ plain form
507 39374 52719 -130279 -79182 105211 27666 -20343 92875 -19307 -157444 15204 93148
518 93148 -31049 46137 103600 -101679 -116675 64870 10763 -30223 126478 46631 -147329
529 -147329 -35558 46808 -62648 41100 152505 -57514 -133745 33532 -7223 -55332 131279
540 131279 93081 -135827 -63675 44897 -58951 24969 170925 -16114 -133973 17492
550 17492 -9884 -76917 119036 133832 -95720 -60309 38546 -94416 -36293 168530 42269
561 42269 -98632 23614 -21057 -136044 61647 153609 -46447 -42396 44194 -110859 -85296
572 -85296 155639 80762 -76464 27344 -12134 -156251 30466 171376 -12502 -34492 59224
583 59224 -100628 -123698 120419 95818 -56067 47155 26379 -159323 -34422 128741 -7741
$$ packed form
507C9374J3345j82998N1097J84393p7545m8009J13218j12182j38137J72648P7944
518I3148j24197P7186N7463k05279j4996J81545n4107m0986J56701p9847j93960
529a47329J11771Q2366j09456J03748J11405k10019p6231J67277m0755m8109J86611
540A31279l8198k28908P2152J08572j03848Q3920J45956j87039j17859J51465
550A7492k7376o7033J95953J4796k29552L5411R8855j32962N8123K04823j26261
561D2269j40901J22246m4671j14987J97691R1962k00056M051Q6590j55053K5563
572h5296K40935p4877j57226J03808l9478j44117J86717J40910j83878k1990R3716
583E9224j59852k3070K44117k4601j51885J03222k0776j85702J24901J63163j36482
$$ plain form
594 -7741 -18603 98095 -61008 -152318 57700 76863 -48420 63537 69002 -146187 -80699
605 -80699 102547 10763 -5948 117651 -29663 -167855 16388 79191 -29275 71063 98840
616 98840 -122113 -107365 72428 2952 -21630 123342 18349 -143318 -6260 51028 -64531
627 -64531 37064 120616 -68111 -94865 54314 -18786 -58177 111725 63639 -108760 -20520
638 -20520 35333 -73402 23033 142049 -21167 -91297 27217 -28886 -68416 107264 98119
649 98119 -78683 -31723 24402 -81603 -10790 126959 6933 -73918 27906 -17440 -85282
660 -85282 58140 85246 -56563 -18887 41727 -68691 -40704 95869 22002 -51960 37343
671 37343 -2076 -92851 24415 87214 -21516 -2702 48019 -65498 -69290 67487 37570
$$ packed form
594g741j0862J16698j59103r1310K10018J9163j25283J11957N465k15189O5488
605h0699J83246r1784j6711J23599j47314j38192J84243O2803j08466J00338K7777
616I8840k20953J4748J79793o9476k4582J44972j04993j61667J37058N7288j15559
627f4531J01595Q3552j88727k6754J49179p3100l9391J69902m8086j72399Q8240
638b0520N5853j08735R6435J19016j63216p0130J18514n6103l9530J75680r145
649I8119j76802M6960N6125j06005P0813J37749j20026q0851J01824m5346o7842
660h5282J43422K7106j41809L7676O0614j10418K7987J36573p3867p3962Q9303
671C7343l9419r0775J17266O2799j08730J8814N0721j13517l792J36777k9917
$$ plain form
682 37570 -28626 42927 9616 -93156 -7625 65932 -18763 -6016 52840 -41881 -68348 45950
694 45950 29393 -36742 29753 25228 -67833 -14800 54416 -11431 -8056 52711 -18782 -60874
706 -60874 25054 23548 -26883 34476 43222 -47483 -30069 28174 -15722 -12084 51681 4726 -47246
719 -47246 7423 10439 -32668 15952 37601 -30883 -24484 25435 -9058 -18222 34572 8668 -36950
732 -36950 3935 16139 -19788 11629 36062 -14969 -19815 16425 -9342 -19104 28309 19761 -19778
745 -19778 2561 9894 -25042 -6294 23656 -5534 -12348 14135 -4434 -20099 10617 9657 -17122
758 -17122 -947 10893 -11885 -2602 18897 -1775 -11117 7937 -1145 -12462 10253 15309 -4024
771 -4024 1153 8363 -8993 -9174 7339 2060 -2738 7983 2037 -8905 -501 802 -9039 -2248
$$ packed form
682C7570o6196P1553l3311j02772Q5531P3557q4695J2747N8856r4721k6467J14298
694D5950j6557o6135O6495m525r3061N3033O9216o5847L375O0767p1493m2092
706f0874Q5928j506n0431O1359Q746r0705J7414N8243m3896L638O3765m6955n1972
719d7246N4669L016m3107M8620K1649o8484O399M9919l4493r164N2794k5904m5618
732c6950M0885J2204l5927L1417K4433n1031m846L6240k5767r762M7413q548l9539
745a9778K2339P333l4936J8748K9950k9190o814K6483j8569j5665L0716r60k6779
758a7122J6175J1840k2778R283K1499k0672r342J9054r082j1317K2715N056j9333
771d024N177P210j7356j81J6513n279m798J0721n946j0942Q404J303r841O791
$$ plain form
785 -2248 6267 -3097 -4446 5253 669 -7543 -1880 852 -2586 2330 6152 2887 1827 1101 -3396
800 -3396 -2622 2452 2269 1181 5640 4913 -1188 -2605 -1482 -3052 -2899 285 2482 1342 -945 -2362
816 -2362 -3597 -4309 -3058 -512 1260 1747 1597 816 -1459 -2659 -1927 -333 2172 4076 4439 4165 1770
833 1770 -1787 -1951 -395 177 988 2855 3892 772 -2046 -2236 -2732 -3624 -3227 282 3192 380 -2448
850 -2448 -1436 -2761 -4881 -1820 2161 2259 2533 2844 -111 -1438 448 -1730 -1307 5564 4795 81 4189
867 4189 4234 -4437 -3555 2074 -2336 -2578 5680 2070 -4459 1368 -709 -10648 -2774 5193 -2831 -43
883 -43 8157 -2728 -9777 1264 17 -5893 7788 9905 -5953 -63 8873 -6249 -4683 12516
897 12516 137 -10869 7337 7638 -7501 4921 9259 -13772 -9398 8462 -4973 -4289 17710
$$ packed form
785b248Q515r364j349R699m584q212N663K732l438M916L822l265j060p26m497
800c396P74N074j83j088M459p27o101j417J123j570J53L184K197j140k287j417
816b362j235p12J251K546J772M87j50p81k275j200P32J594K505J904L63k74k395
833A770l557j64J556N72Q11J867J037l120k818j90m96q92L97L509K910k812k828
850b448J012j325k120L061L981R8K74L11k955j327J886k178M23O871p69m714M108
867D189M5q671Q82N629m410k42Q258l610o529N827k077r939P874P967q024K788
883d3Q200j0885p049J1041j247n910J3681K117j5858N890Q936j5122J566J7199
897A2516j2379j1006J8206L01j5139J2422M338k3031M374J7860j3435O84K1999
$$ plain form
910 17710 690 -20083 910 2837 -15640 6089 21745 -8104 -9667 11379 -8953 -15168 19224
923 19224 11622 -14423 7369 10540 -19206 814 25728 -6392 -13202 13031 -8589 -19989 22952
936 22952 19443 -19468 -1365 6154 -30107 -7122 35461 3223 -15761 12472 -10442 -34284
948 -34284 14601 26874 -11970 5725 18148 -29186 -17534 32115 4015 -14755 25391 2184
960 2184 -40658 7369 32105 -11966 3155 25953 -30952 -35158 26483 12477 -10472 29495
972 29495 4218 -55822 -11041 29517 -8933 9448 42010 -25413 -49291 17663 11572 -16577
984 -16577 35476 27062 -46205 -17046 28459 -13559 -383 50256 -7427 -48802 10840 8775
996 8775 -24451 35201 43475 -41566 -32694 15801 -22255 -7417 65036 15083 -53997 -8102 -1328
$$ packed form
910A7710j7020k0773K0993J927j8477K1729J5656k9849j563K1046k0332o215L4392
923A9224p602k6045K1792L171k9746K0020K4914l2120o810K6233k1620j1400M2941
936B2952l509l8911J8103P519l6261K2985M2583l2238j8984K8233k2914k3842
948c4284M8885J2273l8844J7695J2423m7334J1652M9649k8100j8770M0146k3207
960B184m2842M8027K4736m4071J5121K2798n6905m206O1641j4006k2949L9967
972B9495k5277o0040M4781M0558l8450J8381L2562o7423k3878O6954o091k8149
984a6577N2053q414p3267K9159M5505m2018J3176N0639n7683m1375N9642k065
996H775l3226N9652Q274q5041Q872M8495l8056J4838P2453m9953o9080M5895O774
$$ plain form
1009 -1328 -36796 30612 64832 -21172 -34087 12034 -27453 -22917 62879 31541 -43033 -271
1021 -271 8382 -46367 11766 68470 -8954 -31302 18812 -26790 -44719 48698 45527 -28340 1860
1034 1860 6073 -66019 -16158 69633 14166 -17120 25417 -31429 -72132 29089 58798 -10472
1046 -10472 10926 19548 -65095 -35808 62613 23434 -15424 32175 -13745 -73461 13582 56618
1058 56618 -9930 8599 32929 -54073 -53836 41914 20349 -13771 45420 8954 -78892 -19100
1070 -19100 37458 -11235 18406 62364 -32362 -70461 14896 12040 -13885 57492 36865 -69001
1082 -69001 -33022 30561 -12045 12581 69937 -16019 -72378 6847 13480 -20917 48522 48518 -56974
1095 -56974 -40573 21379 -22403 -5325 72522 11351 -59282 -2104 -138 -44148 31413 68920
$$ packed form
1009a328l5468O7408L4220q6004j2915M6121l9487M536Q5796l1338p4574M2762
1021b71Q653n4749N8133N6704p7424k2348N0114m5602j7929R3417l171p3867L0200
1034A860M213p2092M9861Q5791n5467l1286M2537n6846m0703J01221K9709o9270
1046a0472K1398Q622q4643K9287R8421l9179l8858M7599m5920n9716Q7043M3036
1058E6618o6548J8529K4330q7002K37R5750k1565l4120N9191l6466q7846N9792
1070a9100N6558m8693K9641M3958r4726l8099Q5357k856k5925P1377k0627j05866
1082f9001L5979O3583m2606K4626N7356q5956n6359P9225O633l4397O9439mj05492
1095e6974J6401O1952m3782J7078P7847o1171p0633N7178J966m4010P5561L7507
$$ plain form
1107 68920 -22123 -30823 14955 -34812 -28035 67900 36936 -40063 -1775 149 -52168 15291
1119 15291 74435 -5383 -31955 11354 -32599 -39510 55210 44825 -31058 -2296 2751 -58034
1131 -58034 -7081 64252 5473 -20301 24737 -22936 -57167 27316 42320 -17333 12899 22957
1143 22957 -51619 -27721 47852 11347 -11084 33812 -10529 -61334 10939 41336 -9715 12764
1155 12764 27038 -48227 -41202 35370 14272 -9778 34632 1194 -59624 -6608 30035 -12350
1167 -12350 9950 39817 -24862 -39407 20240 4845 -17778 33937 22171 -40290 -10199 22378
1179 22378 -15589 2166 42519 -9342 -37816 9676 3283 -17605 29806 27522 -34688 -19420
1191 -19420 13049 -17096 -2703 42193 1799 -33676 4246 1325 -24160 17512 30711 -17993
$$ packed form
1107F8920r1043q700M5778m9767O777R5935l0964p6999L8288J924n2317O7459
1119A5291N9144p9818k6572M3309m3953o911R4720j0385p5883K8762N047o0785
1131e8034N0953P1333n8779k5774M5038m7673l4231Q4483J5004n9653L0232J0058
1143B2957p4576K3898P5573l6505k2431M4896m4341n0805P2273L0397n1051K2479
1155A2764J4274p5265P025P6572k1098k4050M4410l3438o0818N3016L6643m2385
1167a2350K2300K9867o4679j4545N9647j5395k2623N1715j1766o2461L0091L2577
1179B2378l7967J7755M0353n1861k8474M7492o393k0888M7411k284o2210J5268
1191a9420L2469l0145J4393M4896m0394l5475L7922k921k5485M1672J3199m8704
$$ plain form
1203 -17993 -10852 16063 -15091 -12867 30564 8155 -21904 8899 6746 -24182 7058 28309
1215 28309 -9665 -10995 11805 -14251 -17841 23049 13829 -15213 3674 2105 -26625 -2165 24484
1228 24484 -2159 -7032 12824 -8445 -19633 12282 11699 -11481 4888 10760 -14127 -3838 17375
1241 17375 -2193 -7709 11222 -1537 -14024 8108 9888 -8572 2642 8056 -14347 -9423 11175
1254 11175 2 -4976 10811 957 -15432 -1486 4978 -5417 2565 10081 -4704 -5347 6820
1267 6820 -1076 -5675 7416 3535 -7483 2871 7994 -3394 -1357 5507 -3360 -5656 4196 2124
1281 2124 -2564 3691 1717 -6502 -2458 793 -4337 -864 5494 367 -3297 1171 -799 -4877 336
1296 336 3156 -654 1289 3932 137 -1079 1453 122 -1190 1522 2351 945 1639 920 -2129 -1886
$$ packed form
1203a7993P141K6915l1154K224M3431k2409l0059L0803k153l0928L1240K1251
1215B8309l7974j330K2800k6056l590M0890r220k9042J8887j569k8730K4460K6649
1228B4484k6643m873J9856k1269j1188L1915n83k3180J6369N872k4887J0289K1213
1241A7375j9568n516J8931j2759j2487K2132J780j8460J1214N414k2403M924K0598
1254A1175j1173m978J5787r854j6389J3946O464j0395P982P516j4785o43J2167
1267F820p896m599J3091l881j1018J0354N123j1388K037O864q867k296R852k072
1281B124m688O255j974q219M044L251n130L473O358n127l664M468j970m078N213
1296C36K820l810J943K643l795j216K532j331j312K712Q29j406O94p19l049K43
$$ plain form
1312 -1886 -533 -1336 -242 2205 1020 -1393 -1562 -1219 -2389 -2477 -186 1431 762 713 856 0 -1248
1329 -1248 -1446 -140 1371 2007 2147 1644 1020 -244 -1341 -546 731 1075 1115 1160 622 -807 -2113 -2153
1347 -2153 -1801 -853 532 751 694 -8 -1589 -1919 -1909 -1081 584 1813 924 1675 2045 -904 -2017 527
1365 527 916 59 2644 3431 -160 -685 -262 -2391 -644 2071 -68 -766 2472 -441 -4555 -183 730
1382 730 -5050 -1504 3703 -763 -1267 3789 -568 -4924 992 834 -3245 3781 6361 -2385 -960 4129
1398 4129 -4245 -4061 7003 2839 -3450 4830 2033 -9078 -748 6415 -4459 -3072 6923 -3414
1412 -3414 -7420 6363 2625 -7936 2061 2349 -10042 660 11187 -2913 -2735 9048 -5456
1425 -5456 -12585 8545 8291 -6506 6739 9353 -12920 -6552 10207 -2677 -2977 14015 -1168
$$ packed form
1312a886J353q03J094K447j185k413j69L43j170q8K291J617o69m9J43q56j248
1329a248j98J306J511O36J40n03o24j264j097P95J277L44M0M5n38j429j306m0
1347b153L52R48J385K19n7p02j581l30J0Q28J665J229q89P51L70k949j113K544
1365E27L89q57K585P87l591n25M23k129J747K715k139o98L238k913m114M372R13
1382G30n780L546N207m466n04N056m357m356N916j58m079P026K580q746J425N089
1398D129q374J84J1064m164o289Q280k797j1111Q330P163j0874J387R995j0337
1412c414m006J3783l738j0561R997K88j2391J0702J0527j4100J78J1783j4504
1425e456p129K1130k54j4797J3245K614k2273O368J6759j2884l00J6992j5183
$$ plain form
1438 -1168 -15648 4880 5391 -11398 5615 12536 -15423 -10302 13224 -1986 -7005 15791 1441
$$ packed form
1438a168j4480K0528N11j6789J7013O921k7959N121K3526j5210n019K2796j4350
$$ [...]
8191H4
##END NTUPLES=NMR FID
##END=
