##TITLE=1H_ESa0609A
 CDCl3
 8 sc, 
 7.9.2023
##JCAMPDX= 6.0         $$ Bruker NMR JCAMP-DX V2.0
##DATA TYPE= NMR FID
##DATA CLASS= NTUPLES
##ORIGIN= UXNMR, Bruker Analytische Messtechnik GmbH
##OWNER= root
$$ XWIN-NMR		Version 3.5
$$ Thu Sep  7 14:01:40 2023 Russian Standard Time (UT+4h)  she@DPX200
##.OBSERVE FREQUENCY= 200.13135
##.OBSERVE NUCLEUS= ^1H
##.DELAY= (6, 6)
##.ACQUISITION MODE= SIMULTANEOUS
##.ACQUISITION SCHEME= undefined
##.AVERAGES= 8
##.DIGITISER RES= 18
##SPECTROMETER/DATA SYSTEM= spect
##.PULSE SEQUENCE= zg30
##.SOLVENT NAME= CDCl3
##.SHIFT REFERENCE= (INTERNAL, CDCl3, 0, 15.7039)
##AUDIT TRAIL= $$ (NUMBER, WHEN, WHO, WHERE, WHAT)
$$ ##TITLE= Audit trail, XWIN-NMR		Version 3.5
$$ ##JCAMPDX= 5.01
$$ ##ORIGIN= Bruker BioSpin GmbH
$$ ##OWNER= she
$$ F:/spectra/data/she/nmr/H-F/1/audita.txt
$$ ##AUDIT TRAIL=  $$ (NUMBER, WHEN, WHO, WHERE, WHAT)
(   1,<2023-09-07 14:00:35.48 +0400>,<she>,<DPX200>,
      <created by zg, POWCHK disabled, PULCHK disabled
       configuration hash MD5:
       00 E9 B6 7A A2 85 ED C7 34 08 36 98 17 FE 4E 26
       data hash MD5: 16K
       EC 30 9F 5B 34 B5 3A 03 35 2C F5 E6 3F 32 AB 24>)
$$ ##END=
$$ 
$$ hash MD5
$$ 28 27 7E 27 1F 5C 6E A5 95 36 7A 9C CB 9A 65 37
##$RELAX= 
##$RELAX= 
##$RELAX= 
##$RELAX= 
##$RELAX= 
##$RELAX= 
$$ Bruker specific parameters
$$ --------------------------
##$DU= <F:/spectra>
##$EXPNO= 1
##$NAME= <H-F>
##$PROCNO= 1
##$TYPE= <nmr>
##$USER= <she>
##$AMP= (0..31)
100 100 100 100 100 100 100 100 100 100 100 100 100 100 100 100 100 100 
100 100 100 100 100 100 100 100 100 100 100 100 100 100 
##$AQSEQ= 0
##$AQ_mod= 1
##$AUNM= <au_zg>
##$AUTOPOS= <>
##$BF1= 200.13
##$BF2= 200.13
##$BF3= 200.13
##$BF4= 200.13
##$BF5= 200.13
##$BF6= 200.13
##$BF7= 200.13
##$BF8= 200.13
##$BYTORDA= 1
##$CFDGTYP= 0
##$CFRGTYP= 5
##$CHEMSTR= <none>
##$CNST= (0..31)
1 1 145 1 1 1 1 1 1 1 1 1 1 1 1 1 1 1 1 1 1 1 1 1 1 1 1 1 1 1 1 1 
##$CPDPRG= <>
##$CPDPRG1= <>
##$CPDPRG2= <>
##$CPDPRG3= <>
##$CPDPRG4= <mlev>
##$CPDPRG5= <mlev>
##$CPDPRG6= <mlev>
##$CPDPRG7= <mlev>
##$CPDPRG8= <mlev>
##$CPDPRGB= <>
##$CPDPRGT= <>
##$D= (0..31)
0 1.2 0 0 0 0 0 0 0 0.06 0 0.03 0 0 0 0 0.0002 0 0 0 0 0 0 0 0 0 0 0 0 
0 0 0 
##$DATE= 1694080835
##$DBL= (0..7)
120 120 120 120 120 120 120 120 
##$DBP= (0..7)
150 150 150 150 150 150 150 150 
##$DBP07= 0
##$DBPNAM0= <>
##$DBPNAM1= <>
##$DBPNAM2= <>
##$DBPNAM3= <>
##$DBPNAM4= <>
##$DBPNAM5= <>
##$DBPNAM6= <>
##$DBPNAM7= <>
##$DBPOAL= (0..7)
0.5 0.5 0.5 0.5 0.5 0.5 0.5 0.5 
##$DBPOFFS= (0..7)
0 0 0 0 0 0 0 0 
##$DE= 6
##$DECBNUC= <off>
##$DECIM= 32
##$DECNUC= <off>
##$DECSTAT= 4
##$DIGMOD= 1
##$DIGTYP= 9
##$DL= (0..7)
0 120 120 120 120 120 120 120 
##$DP= (0..7)
150 150 150 150 150 150 150 150 
##$DP07= 0
##$DPNAME0= <>
##$DPNAME1= <>
##$DPNAME2= <>
##$DPNAME3= <>
##$DPNAME4= <>
##$DPNAME5= <>
##$DPNAME6= <>
##$DPNAME7= <>
##$DPOAL= (0..7)
0.5 0.5 0.5 0.5 0.5 0.5 0.5 0.5 
##$DPOFFS= (0..7)
0 0 0 0 0 0 0 0 
##$DQDMODE= 0
##$DR= 18
##$DS= 0
##$DSLIST= <SSSSSSSSSSSSSSS>
$$ [...]
##$SUBNAM2= <"">
##$SUBNAM3= <"">
##$SUBNAM4= <"">
##$SUBNAM5= <"">
##$SUBNAM6= <"">
##$SUBNAM7= <"">
##$SUBNAM8= <"">
##$SUBNAM9= <"">
##$SW= 18.05172834244
##$SWIBOX= (0..15)
0 0 2 0 0 0 0 0 0 0 0 0 0 0 0 0 
##$SW_h= 3612.71676300578
##$TD= 16384
##$TD0= 1
##$TE= 0
##$TE2= 300
##$TE3= 300
##$TEG= 300
##$TL= (0..7)
0 120 120 120 120 120 120 120 
##$TP= (0..7)
150 150 150 150 150 150 150 150 
##$TP07= 0
##$TPNAME0= <>
##$TPNAME1= <>
##$TPNAME2= <>
##$TPNAME3= <>
##$TPNAME4= <>
##$TPNAME5= <>
##$TPNAME6= <>
##$TPNAME7= <>
##$TPOAL= (0..7)
0.5 0.5 0.5 0.5 0.5 0.5 0.5 0.5 
##$TPOFFS= (0..7)
0 0 0 0 0 0 0 0 
##$TUNHIN= 0
##$TUNHOUT= 0
##$TUNXOUT= 0
##$USERA1= <user>
##$USERA2= <user>
##$USERA3= <user>
##$USERA4= <user>
##$USERA5= <user>
##$V9= 5
##$VALIST= <valist>
##$VCLIST= <CCCCCCCCCCCCCCC>
##$VD= 0
##$VDLIST= <DDDDDDDDDDDDDDD>
##$VPLIST= <PPPPPPPPPPPPPPP>
##$VTLIST= <TTTTTTTTTTTTTTT>
##$WBST= 1024
##$WBSW= 4
##$XGAIN= (0..3)
0 0 0 0 
##$XL= 0
##$YL= 0
##$YMAX_a= 94806
##$YMIN_a= -89945
##$ZGOPTNS= <>
##$ZL1= 120
##$ZL2= 120
##$ZL3= 120
##$ZL4= 120
##$ABSF1= 10
##$ABSF2= 0
##$ABSG= 5
##$ABSL= 3
##$ALPHA= 0
##$AQORDER= 0
##$ASSFAC= 0
##$ASSFACI= 0
##$ASSFACX= 0
##$ASSWID= 0
##$AUNMP= <proc_1d>
##$AZFE= 0.1
##$AZFW= 0.1
##$BCFW= 1
##$BC_mod= 2
##$BYTORDP= 1
##$COROFFS= 0
##$CY= 11.3945322036743
##$DATMOD= 1
##$DC= 2
##$DFILT= <>
##$DTYPP= 0
##$F1P= 15.7292609196834
##$F2P= 12.9074282941183
##$FCOR= 0.5
##$FTSIZE= 0
##$FT_mod= 4
##$GAMMA= 1
##$GB= 0.15
##$INTBC= 1
##$INTSCL= 1
##$ISEN= 128
##$LB= 0.24
##$LEV0= 0
##$LPBIN= 0
##$MAXI= 10000
##$MC2= 0
##$MEAN= 0
##$ME_mod= 0
##$MI= 1.114404
##$NCOEF= 0
##$NC_proc= 0
##$NLEV= 6
##$NOISF1= 3.799351
##$NOISF2= 2.8
##$NSP= 1
##$NTH_PI= 0
##$NZP= 0
##$OFFSET= 15.70392
##$PC= 1
##$PHC0= -21204.37
##$PHC1= 8.25271
##$PH_mod= 1
##$PKNL= yes
##$PPARMOD= 0
##$PSCAL= 0
##$PSIGN= 0
##$REVERSE= no
##$SF= 200.130013532006
##$SI= 16384
##$SIGF1= 3
##$SIGF2= 2
##$SINO= 400
##$SIOLD= 16384
##$SREGLST= <1H.CDCl3>
##$SSB= 0
##$STSI= 0
##$STSR= 0
##$SW_p= 3612.71676300578
##$SYMM= 0
##$S_DEV= 0
##$TDeff= 0
##$TDoff= 0
##$TI= <>
##$TILT= no
##$TM1= 0
##$TM2= 0
##$TOPLEV= 0
##$USERP1= <user>
##$USERP2= <user>
##$USERP3= <user>
##$USERP4= <user>
##$USERP5= <user>
##$WDW= 1
##$XDIM= 8192
##$YMAX_p= 0
##$YMIN_p= 0
$$ End of Bruker specific parameters
$$ ---------------------------------
##NTUPLES= NMR FID
##VAR_NAME=  TIME,          FID/REAL,        FID/IMAG
##SYMBOL=    X,             R,               I
##VAR_TYPE=  INDEPENDENT,   DEPENDENT,       DEPENDENT
##VAR_FORM=  AFFN,          ASDF,            ASDF
##VAR_DIM=   8192,          8192,            8192
##UNITS=     SECONDS,       ARBITRARY UNITS, ARBITRARY UNITS
##FACTOR=    0.0002768,     1,               1
##FIRST=     0,             0,               0
##LAST=      2.2672688,     0,               0
##MIN=       0,             -89945,          0
##MAX=       2.2672688,     94806,           0
$$ Real data points
##PAGE= N=1
##DATA TABLE= (X++(R..R)), XYDATA
0@%%%%%%%%%%%%%%qJ6j6J6j6K4l2L2m0M8n6O4p2Q8j04J20j36J52j74J98k24K55
$$ 0 0 0 0 0 0 0 0 0 0 0 0 0 0 0 -8 8 -8 8 -8 16 -16 16 -24 24 -32 32 -40 48 -56 64 -72 80 -94 104 -120 135
36A35k87L20l57L99m44M95n50O08o71P41q20R05r96J098j211J335j471J622j790
$$ 135 -152 168 -189 210 -234 261 -289 319 -352 389 -431 474 -522 576 -635 700 -771 851 -939
55i39J980k196K442k727L062l460L943m545N319o359P836j0110J4106k3202Q1324
$$ -939 1041 -1155 1287 -1440 1622 -1838 2105 -2440 2879 -3480 4356 -5754 8352 -14850 66474
70F6474K5848j02230J8267j9718P603k7884j0463L1919j3092j7768J3367o2268
$$ 66474 92322 -9908 8359 -11359 -3756 -31640 -42103 -10184 -23276 -41044 -27677 -89945
82h9945L9791R3691o7060r605R7936o5956l2802Q6255l2593k5952P4816k5030
$$ -89945 -50154 43537 -23523 -33128 64808 -1148 -33950 52305 19712 -6240 68576 43546
94D3546m4178K1108j2460r989R001q198J1313k6576l0210M1021j6781l0629O8786
$$ 43546 -632 20476 8016 -1973 7028 -1170 10143 -16433 -46643 -5622 -22403 -53032 15754
107A5754j2965n2593O2107p873m6757P4678N705n7670M0983Q490l3977K2030L34
$$ 15754 2789 -49804 12303 4430 -42327 32351 38056 -19614 21369 29859 -4118 17912 18246
120A8246o194R524k6677JO576k8588K2800R674m0213L1355J3572n2025L1779L0729
$$ 18246 12052 21576 -5101 -5100 1476 -27112 -4312 5362 -34851 -3496 10076 -41949 -10170 20559
134B0559m0699K8281K4753m4471J4265J7002k8852K0964J0403k3407J2469j1633
$$ 20559 -20140 8141 32894 -11577 2688 19690 -9162 11802 22205 -1202 11267 -366
146c66j7058K2372j3672l439K5332k9209k452K9601l1458L436L4698k7964N610
$$ -366 -17424 4948 -8724 -12163 13169 -16040 -18492 11109 -20349 -16913 17785 -10179 -4569
159d569K7730l0784O439K3760k7292Q809K0251k3300O046N040k4017J2529L975
$$ -4569 23161 -7623 -1184 22576 -4716 4093 24344 1044 7090 12130 -11887 642 4617
172D617j8973J6014l474j7441K0189q251j1565K8145j2445j1243K9182j5801q149
$$ 4617 -14356 1658 -1816 -19257 932 -7319 -18884 9261 -3184 -14427 14755 -1046 -9195
185i195K8521j9640n969K6474j9218k759J9335k1381n32J3557j7865O579P623
$$ -9195 19326 -314 -6283 20191 973 -1786 17549 -3832 -4364 9193 -8672 -2093 5530
198E530j8061J0511L403j6046J7551J377j7330J8909j418j6971K2462k379j8107
$$ 5530 -12531 -2020 1383 -14663 2888 4265 -13065 5844 4426 -12545 9917 7538 -10569
211a0569K1085m125j5121K0812o644j2617J6555j0601o824J4975j3736k28J2829
$$ -10569 10516 6391 -8730 12082 5438 -7179 9376 -1225 -8049 6926 -6810 -7038 5791
224E791j6962O370J2711j7729R285R275j8854J3103Q681j9173J1200N511j7037
$$ 5791 -11171 -4801 7910 -9819 -534 8741 -10113 2990 11671 -7502 3698 9209 -7828
237g828J2015L810j3868J1688j216j3311J2218k560r166J3206p784p063J5537
$$ -7828 4187 7997 -5871 5817 4601 -8710 3508 948 -8218 4988 -2796 -9859 5678
250E678r653l888J6179j2865j049J5750j4496J655J3622j5892L570J0916j4355
$$ 5678 -3975 -7863 8316 -4549 -5598 10152 -4344 -2689 10933 -4959 -1389 9527 -4828
263d828O819O649j4800P801L951j2186R852M53j1867J0398j138r270J2486l173
$$ -4828 1991 8640 -6160 1641 5592 -6594 3258 3711 -8156 2242 1104 -8166 4320 1147
277A147q896J2378m723o972J3716o913o084J2814q771l007J3195j0627j047J0995
$$ 1147 -7749 4629 -94 -7066 6650 -263 -6347 6467 -2304 -5311 7884 -2743 -3790 7205
291G205j1543K759R258j2416N079N849j2299Q163L989j1805Q673J033j0299R821
$$ 7205 -4338 -1579 7679 -4737 342 6191 -6108 2055 6044 -5761 2912 3945 -6354 3467
305C467l83r035R527k534q165J0595k629o524R168m634m538J0615o050l424J0490
$$ 3467 3084 -5951 3576 1042 -7123 3472 843 -5681 3487 -1147 -5685 4930 -1120 -4544 5946
320E946q166j101R920r350J743Q160j1488L305P357j0724N335L850j0980P197
$$ 5946 -2220 -3321 6599 -2751 -1008 7152 -4336 -1031 6326 -4398 937 4787 -6193 1004
334A004K637r299P676rp964Q267j314n971Q758k818n460Q217l692k978Q621n879
$$ 1004 3641 -5658 2018 2009 -5955 2312 998 -4973 3785 967 -4493 3724 32 -2946 5675 -204
350b04l518Q597o045j525Q161q263l26P951q709J534P244q731K901M345q347O245
$$ -204 -3722 4875 -1170 -2695 5466 -2797 -3123 4828 -3881 -2347 4897 -3834 -933 3412 -4935 1310
366A310K826q348O248J69n950P980k291o073Q247l414n304Q359l458m437P283
$$ 1310 4136 -4212 2036 2205 -3745 4235 1944 -4129 4118 704 -4600 3759 301 -4136 3147
381C147m247l591P762l574l040O131m370m33O040n367J028M480o897L908L791
$$ 3147 -1100 -4691 3071 -503 -3543 2588 -1782 -2215 3825 -1542 -514 3966 -2931 977 4768
396D768q318N750K282r638O632K361q431O350L59p345O247J34m987M881j659k531
$$ 4768 -3550 2200 4482 -5156 1476 3837 -4594 1756 2115 -5230 1017 1151 -3836 1045 -614 -3145
412c145M846k618m25M713m790m4N244n055J168N799p639J34O504o986P76O194
$$ -3145 1701 -917 -1342 3371 -1419 -1463 3781 -1274 -106 5693 -1946 -1812 4692 -2294 -1518 4676
428D676o998J024M164o372K869K390n315M102L73m108N319k543l270O532l214
$$ 4676 -2322 -1298 2866 -3506 -637 1753 -3562 540 913 -3195 2124 -419 -3689 2843 -371
443c71k068O998m190l268N533l542q79N969l888j807M342m263m26M610l684O24
$$ -371 -2439 4559 369 -2899 2634 -908 -1787 4182 294 -1513 2829 -1434 -1860 2750 -934 -310
459c10L067n273J433L282m928K741J780n164M493M59n238N226r08l733N756k565
$$ -310 2757 -2516 -1083 2199 -2729 12 1792 -3372 1121 1580 -3658 1568 660 -3073 2683 118
475A18l072O021k995k694N832l058k037M168l186q00M235k058r04J553k911Q06
$$ 118 -2954 3067 72 -2622 3210 152 -1885 2283 -903 -1703 2532 474 -430 1123 -1788 -982
491i82K385k551K449J285n233K398J156m619N697J677o625M103P62o299M494J290
$$ -982 1403 -1148 1301 2586 -2647 -249 907 -3712 1985 3662 -2963 1140 1902 -4397 97 1387
507A387l727M042l92l042J855j884K84K809k231K252J584n272J679K456m341L368
$$ 1387 -2340 1702 1310 -1732 123 -1761 -1477 1332 -899 1353 2937 -2335 -656 1800 -2541 827
523H27M137n603P4L430m776N19L985l422K01K424l573M66R79j848K484j308j418
$$ 827 4964 -639 -565 2865 -1911 -1392 2593 -829 -628 1796 -1777 -1311 -332 -2180 304 -1004 -2422
540b422M613k595j939M507l534p08N764l409r16M461l392j225L179k243j35J846
$$ -2422 2191 -404 -2343 2164 -1370 -2078 3686 277 -639 3822 430 -795 2384 141 6 1852
556A852k112J96J092k224L65L98k174K122J414k550J571o6l052L058L49k008M387
$$ 1852 -260 -64 1028 -1196 -831 -433 -2607 -485 929 -1621 -50 -116 -3168 -110 239 -1769 2618
573B618j012l298L559j974j378M675k406j638L855k716j554K642k214k76J954
$$ 2618 1606 -1692 1867 -107 -1485 3190 784 -854 3001 285 -1269 1373 -841 -1117 837
588H37j031L22O6j536Q95o54r75L471j51k707K822l67l791L643J075m175L504
$$ 837 -194 128 194 -1342 -447 -1101 -2076 1395 1244 -1463 1359 992 -2799 844 1919 -2256 1248
605A248J489m532J826J081l083J231R40J4P66j639J055m07l479L777K118m013
$$ 1248 2737 -1795 31 1112 -1971 -740 200 214 980 -659 396 -11 -3490 287 2405 -1608
621a608L296J280n946K038L454l892J063L965l084k159K404q72j637J429J186
$$ -1608 1688 2968 -2978 -940 2514 -1378 -315 3650 566 -1593 811 -61 -1698 -269 917
636I17n66j184O06N82l133R78M369l329n83M910m492k231N788j936k176M209j446
$$ 917 351 -833 -227 355 -2778 -1800 2569 -760 -1343 3567 -925 -3156 2632 696 -1480 2729 1283
653A283k626J697K45n01m08M94O49k224L74K688k583j216L659j526k772L838L64
$$ 1283 -1343 354 599 98 -310 184 833 -1391 -1017 1671 -912 -2128 1531 5 -2767 1071 1435
670A435l578K685J331l639J888J725k798J046J307r20r3q69O96K71j929K555O82
$$ 1435 -2143 542 1873 -1766 122 1847 -951 95 1402 482 389 -480 216 487 -1442 1113 1795
687A795l778J749Q54l480K721K204l042O61J169k106L53J671l36j86J61l36j35
$$ 1795 -1983 -234 620 -2860 -139 2065 -977 -316 853 -1253 -900 771 435 249 410 74 -61
704f1l49K42R97j034k41J945j731q29K350j896q98L143j518r57J931j853j43J722
$$ -61 -410 -168 829 -205 -446 1499 -232 -1061 1289 -607 -1505 1638 120 -837 1094 -759 -902 820
722H20j161P17K38j430R13o9q65J612p31j050J420m11p68J242j63j094Q93J15
$$ 820 -341 376 614 -816 97 28 -837 775 44 -1006 414 3 -765 477 314 -780 113 228
740B28p06J089k32j076J263l27o80J477q83m50J310j355J64J534j798K55Q95j593
$$ 228 -478 611 379 -697 566 239 -441 1036 153 -297 1013 -342 -178 1356 -442 -187 708 -885
758h85J063L87j624J130k39r13J140k04o25R25n88m20J101o7n04Q33j93n28R70
$$ -885 178 565 -1059 71 -168 -1081 59 -145 -770 155 -433 -853 248 181 -323 510 317 -211 759
777G59q4p50J030o25m74J240q80m59J213j517J17J176j826Q77N40j804J057L39
$$ 759 675 -75 955 330 -144 1096 216 -243 970 -547 -430 746 -1080 -203 337 -1467 -410 -71
795g1j085J183l39p54J283l04k40Q72m83k6N64k59k7N37k86n66O16j41m73P05
$$ -71 -1156 27 -312 -1066 217 -87 -327 545 62 36 600 341 314 851 565 -1 615 474 1 706
815G06p14n61R90p29k35R65j347K06Q69j264R85M35j342J028Q1q29J287k93p00
$$ 706 -8 -569 421 -308 -543 422 -925 -719 150 -1114 -129 306 -1036 -8 73 -756 531 238 -462
834d62R61o18J6J033p86j80M90l26K1L43l24N9J35m41l06R37n05n51P75q54M9
$$ -462 499 -119 -103 930 144 -36 454 128 149 492 168 227 362 -79 -385 552 47 -504 271 -583 -534
855e34J059r68K0P23j180Q05M14r83R07j21q99J230n11k33J068r21j98Q93o15
$$ -534 525 -443 -423 300 -880 -75 339 -644 263 142 -757 473 -38 -271 797 -124 -322 571 -44
874d4K41K39n08r4M63l4l08L39k41m13N22k74J21M28p77n4O83q51P33J96j309
$$ -44 197 436 -72 -166 297 263 -45 294 53 -360 162 -112 9 437 -340 -394 289 -562 171 367 -942
895i42J003M43j257J106N4j085Q30o7k06O17m18Q3R4o57Q24k8n14M95N3p84L36
$$ -942 61 504 -753 353 407 -678 152 85 -121 496 78 161 255 -402 422 394 -120 375 428 -356 -20
916b0N94p49m52R96n00o53J085k40o63O42l16QL88k27M09m77r3J124j023l55J686
$$ -20 574 -175 -627 369 -131 -784 301 61 -602 40 -276 -268 120 -107 302 -175 -268 856 -167 -522 1164
937A164j130n71J636r13n72P20l48l90M63M06n45n46M06R1o16P52M47p90k08O44
$$ 1164 34 -537 1099 186 -386 334 -14 -404 59 465 -80 -626 -220 -129 -745 7 454 -336 -544 100
957A00J22j017R92P11j380O78Q79j532O17N77r04K44L90k00m2p09L99N7p88J066
$$ 100 222 -795 197 908 -472 206 1085 -447 170 747 -157 87 477 277 235 -474 -75 -18 -806 260
977B60K11j302O19L92j030M63P98n29m21Q65J5o51N23L53r02J82N31nk18j80K56
$$ 260 471 -831 -212 180 -850 -387 411 -118 -539 326 341 -310 213 566 -336 -154 377 372 154 -26 230
998B30n99l88J431n12p63J370p51r75J302j35m11M78p6o4j37n1K63n30J93P07
$$ 230 -369 -757 674 162 -601 769 18 -957 345 210 -201 277 201 137 0 -51 212 -318 -125 582
1018E82n61l47N21m77n24M04Q04l82m03O14o72p4P36j42L6K43k77L08k86j9P31
$$ 582 21 -326 195 -282 -806 -402 402 20 -383 231 -441 -515 221 79 115 358 81 389 103 84 815
1039H15j060M7J185j201K0Q67r31m51O30p5j76r2L79k68n59P05L0m31N94M56m59
$$ 815 -245 -198 987 -214 -194 673 -258 -709 -79 -154 -330 -422 -43 -311 -870 -165 -135 -566 28 484 25
1060B5j1N70j41r55Q15O93r70O11M12j635N5P59n29L55J95p7n67p14R35R9o15
$$ 25 14 584 443 -512 303 996 26 637 1049 -586 -531 228 -301 54 249 172 -395 -1109 -174 -75 -690
1081f90J086J9j116O74K72p35L48O16j46l61L96k2r66M52O56m56L8M89m39m73
$$ -690 396 415 -701 -27 245 -490 -142 474 328 -33 363 341 -625 -173 483 27 65 554 115 -358
1101c58R6N83k20n25J077o76n99J312l57q77Q26k86k73L64Q1K0n68p1M32n95M32
$$ -358 -262 321 101 -424 653 -23 -622 690 333 -544 282 -4 -277 87 168 188 -380 -451 -19 -614 -182
1122a82P48p35j43M01m55L2M47K68j26j36O14p25r0K63j87J82L29k98L6l49l78
$$ -182 566 -169 -312 89 -366 -334 113 381 255 119 733 8 -82 181 -6 176 505 207 243 -106 -484
1143d84M99n67M76O23r77j64L25l22L26K99o1J96m62K74J89m10M75J42l98L41
$$ -484 15 -552 -76 547 -430 -594 -269 -591 -265 34 -27 169 -293 -19 170 -240 235 377 -21 320
1163C20K68l38j52P7J25n15M20L40r08P9N00o32L11J69k18L1k30K42J01n38N78
$$ 320 588 250 98 175 300 -215 205 545 -363 -284 216 -416 -105 64 -154 -123 -353 -111 -10 -548 30
1184C0J14q62Q20M40o46K80R8n09K54K03K92l36j2K31n91J53N17k84j88LK0k95
$$ 30 144 -718 102 542 -104 176 274 -235 19 222 514 178 166 397 -194 -41 476 192 4 7 27 -268
1206b68o1M15k77n02Q13q1o58P32k49l50M87R7n8J74p2J53m00K4R67p74j03N13
$$ -268 -329 86 -191 -693 120 39 -619 113 -136 -486 1 98 40 214 142 295 -105 -81 886 112 9 522
1228E22n63Q3L13k35j96N7J26k25k08N94l92l42M79j89oJ99k59R2q0K08K71m82
$$ 522 -41 42 355 120 -76 -19 107 -118 -326 268 -124 -466 13 -176 -182 17 -242 -150 -230 -22 249 -233
1250b33L32K40o64L91M30p00K70J65l56K91j15J82Rm24K71K0j59L33k92j69K50
$$ -233 99 339 -325 66 496 -204 66 231 -125 166 51 233 242 -182 89 109 -50 283 -9 -178 72
1271G2J3o7p7Q1J13n08L55O0l94L66p8l07L82j33P3J90k48K10P9j99M72l45j12
$$ 72 85 18 -59 22 135 -373 -18 42 -352 14 -64 -371 11 -122 -49 141 -107 103 182 -17 455 110 -2
1294bL42j45q2M15m31n1L3q7K08j62k08o7k09K65j05j59J75j36J43Q5r1L91n9
$$ -2 340 195 113 528 97 46 79 -8 200 38 -170 -237 -446 -181 -286 -445 -270 -406 -263 -178 -269 122 63
1317F3j72L08k34K75L35o60K77J25l84M57j60l05L29l81K3K95m17K65j71l31L14
$$ 63 -109 199 -35 240 575 -85 192 317 -67 390 230 -75 254 -127 -104 191 -226 39 -132 -463 -149
1338a49J8qJ48k76J49j5P2K52k89J66l4j92L92k50k7L01l78L6K86k83K44o3l09
$$ -149 -131 -139 9 -267 -118 -133 -61 191 -98 68 34 -158 234 -16 -43 258 -120 -84 202 -81 163 100 -209
1361b09L32p7M6J73l13R4J26l55L05o8m9j12m5lJ85j47l7m8j37L23k16J81J82
$$ -209 123 46 92 265 -48 46 172 -183 122 54 5 -107 -152 -155 30 -117 -154 -202 -339 -16 -232 -51 131
1384A31m63K48K36j34L29k06O8j64m6K64%j83J78k51j33L81k93j36N4j10Q4k5
$$ 131 -332 -84 152 18 347 141 209 45 -1 263 263 80 258 7 -126 255 -38 -174 -120 -230 -146 -171
1406a71j0O3l01K48L0j79L71l8k03K61j2mN1n4L76k69j73L88l45J17Q0l18J53
$$ -171 -181 -118 -419 -171 -141 -320 51 13 -190 71 59 55 106 52 428 159 -14 374 29 146 226 -92 61
1429F1L4k36K49k72J63J51m91L18P5m02J72J35j14K40k36j5J92j78L83j61m9K07
$$ 61 95 -141 108 -164 -1 150 -341 -23 52 -350 -178 -43 -157 83 -153 -168 24 -154 229 68 19 226
1451B26k66r3K90k3J64k80q0J86k56K42K30o07L12J0k77K43j42K4Jj30L89k72
$$ 226 -40 -133 157 134 298 18 -62 124 -132 110 340 -267 45 55 -222 21 -121 -97 -96 -226 163 -109
1473a09l68N70j98q1L60l6j49j3Q5o0OJ78J37m12J79K09l19J94J26k35j44N6K73
$$ -109 -477 93 -105 -186 174 138 -11 -24 61 1 7 185 322 -90 89 298 -21 173 299 64 -80 -24 249
1496B49k36k32M82m94l00P25k00k52N06k41k49J37J38p6k04L22L01o19L03L01
$$ 249 13 -219 263 -231 -531 194 -6 -258 248 7 -242 -105 33 -43 -247 75 376 -243 60 361
1516C61o41K16M65j50j39J86j06m94L03M82m91j51P03o85k77M68j96M0Q2J5k26
$$ 361 -280 -64 401 251 112 298 192 -302 1 483 -8 -159 544 -141 -418 50 -146 -106 -24 -9 -235
1537b35k15M69j76k86M30J64m10K09K07k92J02J87J43j27J27J39l46R2K15l67
$$ -235 -450 19 -157 -443 -13 151 -259 -50 157 -135 -33 154 297 170 297 436 90 182 397 30
1557C0l0J96j85o0l4J18r1m37M09O5m07N34j03k89J51m6N7J58J65J30k68j21L12
$$ 30 0 196 11 -49 -83 35 -56 -493 -84 -19 -426 108 5 -284 -133 -179 -122 36 201 331 63 -58 254
1580B54k35J8L50k88L8j1k43J03p8J82K4j70K02j03m45K46O8K4J82j61J08j41
$$ 254 19 37 387 99 137 126 -117 -14 -92 90 114 -56 146 43 -402 -156 -88 -64 118 -43 65 -76
1602g6k23L40Jl20O35l54k44L42j8q5P2l3Rj87K32K57n17J71K55k60N9J63j0j55
$$ -76 -299 41 42 -278 357 3 -241 101 83 -2 70 37 46 -141 91 348 -169 2 257 -3 56 219 209 54
1626E4p4J20k80N4L24l19j59M29l52j92K76L6j55P6K12j1k66K45J76m73O36J65
$$ 54 -20 100 -180 -126 198 -121 -280 149 -203 -395 -119 -83 -238 -162 50 39 -227 18 194 -279 357 522
1648E22l33R4j08j74O3J62R3l68m8K58l94mK99k08k05L24j62N1k1M6L5k98M72
$$ 522 189 283 175 1 64 226 319 -49 -97 161 -233 -237 62 -146 -351 -27 -189 -138 -159 -113 -78 -376 96
1671I6M8k16K26m6k79M14L9k15P6j10Ml9o5K77k74J4L68m39PK96l02N9M7j24K77
$$ 96 144 -72 154 108 -171 243 282 67 143 33 37 -2 -67 210 -64 -50 318 -121 -114 182 -120 -61 -14 -138 139
1696A39j79P1m7j68K46k3j52K03n1q2K5j05J85j17p0K44n9Q6M1k62K62J9k13J68
$$ 139 -40 31 -16 -184 62 39 -113 90 39 -43 -18 -123 62 -55 -125 119 60 146 187 -75 187 206 -7 161
1720A61j14J2Q5l08J94l8r4J01nj48N1j38K15m0j47J08J08j63K74j21N6J19k62
$$ 161 47 59 144 -164 30 -8 -102 -1 -6 -154 -103 -241 -26 -66 -213 -105 3 -160 114 -7 49 168 -94
1743i4L04k02K03R9m12J46K24k32J44j79n6P6j18K5Lj03J10p2p4K68j62p2R5m8
$$ -94 210 8 211 310 -102 44 268 36 180 1 -55 21 -97 -72 -69 -172 -62 -134 -208 60 -102 -174 -79 -127
1767a27N5J32j88K23n8p6J62j77J35R6l10K38n3j05K12j27N1L0k26L12j87k09
$$ -127 -72 60 -128 95 37 -39 123 -54 81 177 -133 105 52 -53 159 32 83 113 -113 199 12 -197
1789a97K99k51m7K65k73K9J6N1J50j18k1J19l11L23J07j25J48k00M8P0o3K04o8
$$ -197 102 -149 -196 69 -204 -175 -159 -108 42 -76 -97 22 -289 34 141 16 164 -36 12 82 19 223 155
1812A55p2J14k05K7K17k19j23J61k67K04j4j11J55j62rK1m1J58mk33K12n1LJ99
$$ 155 83 197 -8 19 236 17 -106 55 -212 -8 -22 -133 22 -140 -149 -128 -169 -11 -15 -248 -36 -87 -84 115
1836A15j25J69p7k64L76j58mJ61k18J38m0j01Q0m8m5J02k08L0J20j21O6j3M9Q5
$$ 115 -10 159 82 -182 194 36 32 193 -25 113 73 -28 52 4 -41 61 -147 -117 3 -118 -52 -65 -16 69
1860F9j76k0M3r4J73oj84K02o6p5K32k09K01J1j50K01n3l2J95l23J82P1j92J65
$$ 69 -107 -127 -84 -178 -5 -11 -195 7 -59 -134 98 -111 90 101 -49 152 99 67 262 -61 121 192 0 165
1884A65j44j45J65j79R8r3m5K08j48m6R3r5j7J09J1k7P8q0J77j2M4L7r6L1R4k84
$$ 165 21 -124 41 -138 -40 -133 -178 30 -118 -164 -71 -166 -183 -74 -63 -90 -12 -92 85 73 117 154 58 89 183 -101
1910a01K37p2o3J91k40J49k05l7K10j98l9J28r2p2J88k6j06R6J4J44k65J35J40
$$ -101 136 64 1 192 -48 101 -104 -141 69 -129 -168 -40 -132 -204 -16 -42 -148 -52 -38 106 -159 -24 116
1933A16j82K46o3k08K17J5q9J21j08po6P3J61l66L6K87k62R4J01l11J22J57j04
$$ 116 -66 180 117 -91 126 141 52 173 65 58 -8 65 226 -140 -104 183 -79 15 116 -195 -73 84 -20
1956b0j34o0K08l7k31M18k07n2J41n6m4J53j07J00m7L2J33k72J78M7k05M1J22
$$ -20 -154 -214 -6 -43 -274 144 -63 -115 26 -30 -74 79 -28 72 25 57 190 -82 96 143 -62 -21 101
1979A01j89J96l1j83P4j06J01j19m7K22k58K6K88j49M8Q9j47J98j46M0K13k47
$$ 101 -88 108 77 -106 -32 -138 -37 -156 -203 19 -239 -213 75 -74 -26 63 -84 114 -32 8 221 -26
2001b6M8J13j22J07L0k46J60o9J03N0k02J79qj48P9k20K8J62j58J64Pj65J97j93
$$ -26 22 135 13 120 150 -96 64 -5 98 148 -54 125 117 -31 48 -172 -144 18 -140 24 31 -134 63 -130
2025a30o1J73r0J0K63j67J12p8L2J07j92J46J33k88J31J11k58J56l3o8j25LJ94
$$ -130 -191 -18 -108 -98 165 -2 110 32 64 171 -21 125 258 -30 101 212 -46 110 77 9 -116 -113 81
2048H1j77m7K82l78J26K07k56j3J03J14q1j1Q4P6k11L13q3k48K21R9k23J63J7
$$ 81 -96 -143 139 -239 -113 94 -162 -175 -72 42 -39 -50 34 110 -101 212 129 -119 102 201 -22 141 158
2071A58j66K0J6J34l00K26K03m81J18K10l58J2J53J1j68M0L04k79j30M34j93k09
$$ 158 -8 12 28 162 -138 88 291 -190 -72 138 -220 -208 -55 -44 -212 -172 132 -147 -277 157 -36 -245
2093b45N45j82k86J55m9k8N3J13J75k76R0J61l40J00L01m23J54R4j85O1O3J13
$$ -245 300 118 -168 -13 -62 -90 -37 76 251 -25 65 226 -114 -14 287 -136 18 112 -73 -12 51 164
2115A64k37q5K18k03n3K66j90j50L17j06MJ22j47J09l8Q8L8j25K10n3j44J08n3
$$ 164 -73 -158 60 -143 -196 70 -120 -270 47 -59 -55 67 -80 29 -9 79 117 -8 202 149 5 113 60
2138F0j6K1j17N9N8k04J64j51j97K78q8J16R3k36O4q2P2P5K5J2J30k49J29J15
$$ 60 44 65 -52 7 65 -139 25 -126 -323 -45 -133 -17 76 -160 -96 -178 -106 -31 -6 6 136 -113 16 131
2162A31j51J41j08N0M4j70pJ87j34K46k30m3P7n3l8K9J3j07R3j29J81j67n5J47
$$ 131 -20 121 13 63 107 -63 -70 117 -17 229 -1 -44 33 -20 -58 -29 -16 -123 -30 -159 22 -145 -200 -53
2186e3KL0j2m7J28J1L4L1k41K51kj20J91j46o7J21j12Q3q2n7J95l41N1L03l02
$$ -53 -51 -21 -33 -80 48 59 93 124 -117 134 132 12 203 57 -10 111 -1 82 0 -57 138 -203 -152 151 -151
2211a51RK05j93N7L2Mko0K5R9j41L08k35j57K80j2j65K36j09j1L9m8R9q3L4k8
$$ -151 -142 63 -130 -73 -41 -37 -39 -99 -74 25 -116 192 -43 -200 80 68 -97 139 30 19 58 10 109 26 60 32
2237C2j36O7M6r2J05p9o2J13J6Ol4j16J64j42M4J76n9p3J39j26q0K31j52P1o1
$$ 32 -104 -37 9 -83 22 -57 -119 -6 10 16 -18 -134 30 -112 -68 108 49 -24 115 -11 -91 140 -12 59 -2
2262bK9J46j13qN5p8j3l6m9K41j75K5r6p3K65j39j02Q2j1l8L4j54K04k9L2N7p3
$$ -2 27 173 60 52 107 29 16 -20 -69 172 -3 22 -74 -147 118 -21 -123 -41 -52 -90 -56 -210 -6 -35 -3 54 -19
2289a9K4R0j89K49r0q4K18j87J6P9j64K39l6j40j6p7Q5k4o9J44j28n3J67m5K0
$$ -19 5 95 -94 155 65 -19 199 12 28 107 -57 182 146 6 -10 -87 -2 -26 -95 49 -79 -132 35 -10 10
2314A0p6q3J52N1j14J57m6j3Q1r8J51l3p7O5k06J61Kj40J24o0p9J65m0j28J02
$$ 10 -66 -149 3 54 -60 97 51 38 119 21 172 139 62 127 -79 82 84 -56 68 8 -71 94 54 -74 28
2339B8j36NK01j36rP2j47J07m8R7k2j67J43l2l2J63p8j1J22j33N3L3m6P0j5r3
$$ 28 -108 -103 98 -38 -47 25 -122 -15 -63 34 12 -155 -12 -44 -76 87 9 -2 120 -13 40 73 27 97 82 -11
2365a1Q9k1r0J74k07K7P7o8Rr2J15l9j72J93o5j4J73p8j78K64n2KQ0j23Q7nr3
$$ -11 78 57 -33 141 -66 -39 38 -30 -21 -113 2 -37 -209 -16 -81 -95 78 0 -178 86 34 36 116 -7 80 75 -18
2392a8P7k2k2N2n3R4o0p6L9l3Kl0j24P6M7r2J77j21J07m4j11J33n9M9O1j8q4K10
$$ -18 59 37 15 67 14 108 48 -28 11 -22 -20 -50 -174 -98 -51 -143 34 -87 20 -24 -135 -2 -61 -12 49 31 -53 157
2420A57j58R5r0m8J48o1j57J44K8r6Mj01K48j85L8oj12J00J6k2J9J06j08k4p2
$$ 157 -1 94 4 -44 104 43 -114 30 58 -38 -34 -135 113 -72 -34 -40 -152 -52 -36 -58 -39 67 -41 -65 -137
2445a37J14N8j08K10j21j9J55j42l3M6r0O2Q6K3L0k4j23jk3J64j08r6J43j69K8
$$ -137 -23 35 -73 137 16 -3 152 10 -23 23 -67 -5 81 104 134 110 -13 -14 -37 127 19 -77 66 -103 -75
2470g5P7j21o3K58k40J89m4j20Q2k0P1J08j28L4L0j6J13j49P4lm9O8O3j67N6r9
$$ -75 2 -119 -182 76 -164 25 -19 -139 -57 -77 -6 102 -26 8 38 22 135 -14 60 57 8 76 139 -28 28 -71
2496g1j9J10r8R3J22j68K8m7L6N1j84K11j30NR7r1KrJ05l5Q6j7k05J45J1K9n2
$$ -71 -90 20 -78 15 137 -31 -3 -50 -14 37 -147 64 -66 -61 36 -55 -53 -62 43 8 94 77 -128 17 28 57 5
2523EJ08j7j35J43oj66J21qr2O5k8m8k8k2J57o7j83K45j05K3k5K8J25r7L1N5j30
$$ 5 113 96 -39 104 98 -68 53 45 -47 18 -10 -58 -86 -108 49 -18 -201 44 -61 -38 -63 -35 90 -7 24 79 -51
2550e1K22r8j20J73qj59J47n4%ok7j10q2J65K7j6n0J35k59N4J53j22K9j3J03m0
$$ -51 171 73 -47 126 118 -41 106 52 52 46 19 -91 -173 -8 19 3 -47 88 -171 -117 36 -86 -57 -70 33 -7
2576go7J67l1j58J41m4R2j6j29l1J84q3L7O6j77J22q5LK0j39J57Rj50J38j26P7
$$ -7 -74 93 62 -96 45 1 93 77 -52 -83 101 18 55 121 -56 66 -19 -16 4 -135 22 31 -119 19 -107 -30
2602c0J04j50n5N8O4j22P7P6Pk8l4R3j83K19j26M1J77j37k4N7l5K2p7N5J41k48
$$ -30 74 -76 -131 -73 -9 -131 -54 22 29 1 -33 60 -123 96 -30 11 188 51 27 84 49 71 -6 49 190 -58
2628e8l7J81j89J08J1j03O4o3N8m4L5O9j44mK13j09o9J45O0o0k4J07o2P6j75J19
$$ -58 -95 86 -103 5 16 -87 -23 -86 -28 -72 -37 32 -112 -116 97 -12 -81 64 124 64 40 147 85 161 -14 105
2654A05j53J06n3RJ00m0j23KO3j02Q8j04J24J8j94J61m4m5R4pJ16l0o4pk5J82
$$ 105 -48 58 5 14 114 74 -49 -47 16 -86 2 -102 22 40 -154 7 -37 -82 12 5 121 91 27 20 -5 177
2680A77j58P3q1N8r5O4P2j29O0q5M0K8r8Q9j30M7L6r6J0R5M7m6P6p5O2n2L0m3
$$ 177 19 92 11 69 -26 38 110 -19 41 -44 -4 24 -74 15 -115 -68 -32 -128 -118 -23 24 -22 54 -21 41 -11 19 -24
2708b4J7Q2l9j63L23k10p8K52q3l4J7j18J32j19J02%r8j3L7k56K47q9M4J8j45
$$ -24 -7 75 36 -127 196 -14 -92 160 77 43 60 -58 74 -45 57 57 -41 -54 -17 -273 -26 -115 -71 -53 -198
2733a98J41N1k8P2j3j7Q9j04Q6J8q8j7R2j48N9p7J21NP4m0N6j49K5J7qp0m7M5
$$ -198 -57 -6 -34 38 25 8 97 -7 79 97 9 -8 84 -64 -5 -82 39 44 118 78 134 -15 10 27 19 -51 -98 -53
2761e3O9j08P2J3j6J14p3Mo0j44K26j5j14M6J56j08R8j56J27o1o8K54j40Q4m6
$$ -53 16 -92 -20 -7 -23 91 18 22 -38 -182 44 29 -85 -39 117 9 107 -49 78 17 -51 203 63 147 101
2786A01p4K8L4j31M3P1p1N4j60N5N9j50P7L6l1P0j7P0J7r7J48n0j45K22j46J6
$$ 101 27 55 89 -42 1 72 1 55 -105 -50 9 -141 -64 -28 -59 11 -6 64 81 -16 132 82 -63 159 13 29
2812B9J16j54R1M6j41Q8p6n1J98o2M7j52M1J37j42j12J09j18J7J86j66J37m9q8
$$ 29 145 -9 82 128 -13 75 -1 -52 146 84 131 -21 20 157 15 -97 12 -106 -89 97 -69 68 19 -69
2836f9L3n8Q4N5p2J16j03j2J32Rq9J12j22j6L0o%j35N7J28k3n1k3j16R6n3QQ3
$$ -69 -36 -94 -10 45 -27 89 -14 -26 106 115 26 138 16 0 30 24 24 -111 -54 74 51 0 -23 -139 -43 -96 -88 -5
2864ej39J31k4K0O4pj22J18J8K3j4j3P2q0m9P0J8Jn4j27O1Kl0M3j23R9P9o5l2
$$ -5 -144 -13 -37 -17 47 40 -82 36 54 77 63 50 122 42 -7 63 81 82 28 -99 -38 -36 -66 -23 -146 -47 32 -33 -65
2893f5J04j00R3r0P0k6o0N8O5j34J22Jn3J48j20J6jO1r5KK5J5P4j24Q6j37N1L
$$ -65 39 -61 32 -58 12 -14 -74 -16 49 -85 37 38 -15 133 13 29 28 89 -6 -4 21 36 110 -14 72 -65 -14 -11
2921a1k8J8L0m8l5j5M3Q8j76J70n2J7J15k82J56R5j65J50k9o5J33n5j21Q0q3J08
$$ -11 -39 -21 9 -39 -74 -89 -46 42 -134 36 -16 1 116 -166 -10 85 -80 70 41 -24 109 54 -67 13 -70 38
2947C8n9RN7n8m8R0r2J07q1j03K24j67J36k9j66Q4M0k5L9k5QR0j59J39Nj6L9R6
$$ 38 -21 -12 45 -13 -61 29 -63 44 -37 -140 84 -83 53 24 -142 -58 -18 -43 -4 -29 -21 69 -90 49 54 38 77 173
2975A73j69P8o6j13K06j71J01m0j22K65k78k5J85j64K31j07j75K43j13P3j3j05
$$ 173 4 82 16 -97 109 -62 39 -1 -123 142 -136 -161 24 -140 91 -16 -191 52 -61 12 -1 -106
2997a06K66j18q1M6k3J6R5j04L0J2m3N7j02K1J64j14N2o9n5n5J01k0Rnj2Lj00
$$ -106 160 42 -39 7 -16 0 95 -9 21 33 -10 47 -55 -34 130 16 68 -1 -56 -111 -10 -30 -21 -26 -38 -35 -135
3024a35J58N7j36J50r0PM5j45J27Oo8J19l8K7O1j06K4M7r1L2j02L2O3j06RJ53
$$ -135 23 80 -56 94 4 11 56 -89 38 44 -24 95 57 84 145 39 63 110 19 51 -51 -19 44 -62 -53 100
3050A00k25J52m7p5J32o1k9j6n6K32j57l0R5j34J87r4J0R0J24j30K1q5J22j07
$$ 100 -125 27 -20 -95 37 -24 -53 -69 -125 107 -50 -80 15 -119 68 -26 -16 74 198 68 89 4 126 19
3074A9j70M3J56m7L5q6J9J03k1j21O7j31R8m7N2J48j66j2J19j63M7Q5q3K16j53
$$ 19 -151 -108 48 1 36 -50 -31 72 51 -70 -3 -134 -36 -83 -31 117 -49 -61 58 -105 -58 27 -56 160 7
3099Gk0j9p7R5P5n2R7q5j19J10o6J32j16k3P8j07J31Jj3o1M5m4m5P1l9N3p5M5
$$ 7 -13 -32 -109 -14 61 9 106 21 -98 12 -54 78 -38 -61 17 -90 41 42 29 -32 13 -31 -76 -5 -44 9 -66 -21
3127b1J29k12J79l8j03J53j3q5J28q0p2M6j09K07j45l8J47j88Q4P3p6l0O4J4J62
$$ -21 108 -104 75 37 -66 87 74 -11 117 37 -35 11 -98 109 -36 -74 73 -115 -31 42 -34 -64 0 14 176
3152A76k52J04r7l3R4m2K4p3J58j09J54j24J7o3J26o1j0j2P3j99K62m9o3n0j5
$$ 176 -76 28 -69 -102 -8 -50 -26 -99 59 -50 104 -20 -3 -66 60 -1 -11 -23 50 -149 113 64 1 -49 -64
3177f4K0p0J53j06J83j35R3j12J0R1n4k2Q5j32J27j8o1J9LK6J11j04J7m7M1l9
$$ -64 -44 -114 39 -67 116 -19 74 -38 -28 63 9 -13 72 -60 67 49 -12 7 10 36 147 43 60 13 54 15
3203A5n0J38m1j78J21J4N2q3k9K8L5j6J2l4N0p4l3P2lq3R3LL3j0O4r5P4p1r3J21
$$ 15 -35 103 62 -116 5 19 71 -12 -41 -13 22 6 18 -16 34 -40 -73 -1 -4 -87 6 9 42 32 96 1 75 4 -89 32
3233C2o9J32j46Q2P1k9jj06pJ63j71M7K3L3j38J18K4K1j02j6Q3J7p3R8o2PJ8o4
$$ 32 -37 95 -51 31 102 73 72 -34 -41 122 -49 -2 21 54 -84 34 58 79 -23 -39 44 61 -12 86 24 31 49 -15
3261a5O6k2n2O3l3lK2l1J54k40O4J5kL0pL2n2l8L5O6q2N5J3r1K6L1j02J54r0J3
$$ -15 51 29 -23 40 7 4 26 -5 149 -91 -27 -12 -14 16 9 41 -11 -49 -14 52 -30 25 38 -53 -27 4 -98 56 -34 -21
3291b1J19r8K3r0j7J06RN1K2j58M3M0r2P6k3l1O4M8j85L7J37j17M2O6j10K2J0
$$ -21 98 0 23 -67 -84 22 31 82 104 -54 -11 29 -63 13 -10 -41 23 71 -114 -77 60 -57 -15 51 -59 -37 -27
3318b7P1j60N0K2P2P5j20Q7k4Q6p0n8o4J34m3p9O6n1L8L5j33J70j26MP1l2o6R0
$$ -27 44 -116 -66 -44 28 103 -17 70 46 132 62 4 -60 74 31 -48 18 -33 5 40 -93 77 -49 -45 26 -6 -72 18
3346A8r8Q3O9j29J93j91O2ko4J39M0k00J58k6j62P5%J17r4q5J97r0R3r0n9Q5q4
$$ 18 -80 3 72 -57 136 -55 7 5 -59 80 120 -80 78 52 -110 -35 -35 82 -12 -97 100 10 103 13 -46 39 -45
3373d5o7J34L3j77J77j49L6L5m8M1K3O9J9j09p4K24j77J03j3j53J95m2k8O5n2
$$ -45 -112 22 55 -122 55 -94 -58 -23 -71 -30 -7 62 81 -28 -102 122 -55 48 35 -118 77 35 7 72 20
3398B0m0O0j00J16j57L0J16k08K44p6k9M8k1o6Q5p7R8q4n4J34q1n1J52o1n0J16
$$ 20 -20 40 -60 56 -101 -71 45 -163 81 5 -24 24 3 -63 22 -55 43 -41 -95 39 -42 -93 59 -2 -52 64
3424F4k3R2j36k8N2l2L0q5K6Q7l2K6j0J8j21J57j28L3Op9P8j15N7J59j96J45q1
$$ 64 41 133 -3 -31 21 -11 19 -66 -40 47 15 41 31 49 -72 85 -43 -10 -4 -83 -5 -120 -63 96 -100 45 -36
3451c6J0R5J24k21K69j96j30R7p1J16P6j89M3Q8r5M2M6q5M6j12N5mN4J45k09K5
$$ -36 -26 69 193 -28 241 45 -85 12 -59 57 133 -56 -13 75 -20 22 68 -17 29 -83 -28 -32 22 167 -42 -17
3477a7J2kL0lMo8k3P5O1o3R6n5j76K12p8N3l0p5P9j22L8J23j13O0l7l6l3j9k3
$$ -17 -5 -7 23 20 24 -44 -67 8 69 6 102 47 -129 83 5 58 28 -47 32 -90 -52 71 -42 18 -19 -55 -88 -107 -130
3506a30J26j13J18O4r0j02J23pM6jk5J0p6R8mp7J17Q9k46J60j18n4J05qK9J2j5
$$ -130 -4 -117 1 65 -25 -127 -4 -11 35 34 9 19 -57 41 37 -40 77 166 -80 80 -38 -92 13 5 34 46 31
3533C1K7n5n7J64j34N8M1Jp2j0Q7j45l3J31r9J7P2m2jJ23j30J08p2nR4j46M2P
$$ 31 58 3 -54 110 -24 34 75 76 4 -6 81 -64 -97 34 -65 -48 24 -18 -19 104 -26 82 10 5 99 -47 -5 2
3561Br4J90Kj28M8o3j2R7j74M8K1j9N1l9j5J54j4M3n3r8J20j5k0k1r8R6j4m7J43
$$ 2 -92 98 100 -28 20 -43 -55 42 -132 -84 -63 -82 -31 -70 -85 69 55 98 45 -53 67 52 32 11 -87 9 -5 -52 91
3590I1m8j32J15R8k15J99j80O9R6q8J00o0k5L0n6nJ00j21qL8j00J44j3l2J52j08
$$ 91 43 -89 26 124 -91 108 -72 -3 93 5 105 45 20 50 -6 -11 89 -32 -40 -2 -102 42 29 -3 149 41
3616D1j9mm2J92k05N6jM2o3L8j2N2j73J00J3Q0j71L5j5j19P8M6J09j56Q0o9J92
$$ 41 22 18 -24 168 -37 19 18 60 -3 35 23 75 -98 2 15 95 -76 -41 -56 -175 -97 -51 58 -98 -18 -87 105
3643A05j59K2J24o0p0J07Q6j67o4J41k7%O7j00L8pml9r4O5k3jK4JK8n4N6l8R5
$$ 105 -54 -32 92 32 -38 69 155 -12 -76 65 38 38 105 5 43 36 32 -7 -101 -36 -59 -60 -36 -35 -7 -61 -5 -43 52
3672E2j56J33j15J69j7m1j6N1m8M9j0p4N3N6n1M2j40R7j11L3n8O1J21p3j8j33
$$ 52 -104 29 -86 83 66 25 9 60 12 61 51 -23 30 86 35 77 -63 34 -77 -44 -102 -41 80 7 -11 -144
3698a44P4M0R4p0L6j0r1O5K6m1Q7j60m7J45Q1j33R3o4J57m3q3P5j14n8J28r0L0
$$ -144 -70 -30 64 -6 30 20 -71 -6 20 -21 66 -94 -141 4 85 -48 45 -19 138 95 12 87 -27 -85 43 -47 -17
3725a7o4J19j01M7M8m8r2J00K2p8j1P3j1Rk5OJ38j44P0Jrk2l7J07K9q1J26o9k17
$$ -17 -81 38 -63 -16 32 -16 -108 -8 14 -64 -75 -2 -13 -4 -29 -23 115 -29 41 42 33 11 -26 81 110 29 155 86 -131
3754a31K26l2p0J9L4m2m5j7J52o0j5P3j76R1J1LQr3R8j14P7NL2J1K1q8J22%r0
$$ -131 95 63 -7 12 46 4 -41 -58 94 34 19 92 -84 7 18 21 29 -64 34 -80 -3 2 34 45 66 -22 100 100 10
3783A0l6N4N2m9r6L1N8j35P5k6R8l7J5l6k1l5P1kM1o8J4R9o5MP7j18M4N5j2n3
$$ 10 -26 28 80 31 -65 -34 24 -111 -36 -62 36 -1 14 -22 -43 -78 -7 -9 32 -36 -22 77 12 16 93 -25 19 74 62 9
3813IJ3n1M0P8p2J03j02n9J51j96K4O1O8p2n0O1J0N4o9k3J23j59P7k0QKoj5P5
$$ 9 22 -29 11 89 17 120 18 -41 110 -86 -62 -1 67 -5 -55 6 16 70 1 -22 101 -58 19 -1 7 9 3 -12 63
3842F3jK3n9M7oj19J34j23N1l1N8Rj64N0J92j60N9k6J8p5R5K5p1J5KK5m4p4J24
$$ 63 62 85 26 73 67 -52 82 -41 10 -21 37 46 -118 -68 124 -36 23 -3 15 -60 35 60 -11 4 6 31 -13 -87 37
3871C7Rj2L7l0p2R4ln0M4k9q9J16p4L0J8j81L49j90oL4L0l8p4R9j02K7Q8r6J0
$$ 37 46 34 71 41 -31 63 60 10 54 25 -64 52 -22 8 26 -155 194 4 -2 32 62 24 -50 49 -53 -26 62 -34 -24
3900b4o4L9Q3m8K9R8r6R0j15JJ05k48J62k8kJ15o4RM0o5J0p7K7P1o2j19R8J4N
$$ -24 -88 -49 34 -14 15 113 17 107 -8 -7 98 -150 12 -16 -18 97 33 42 82 17 27 -50 -23 48 -14 -133 -35 -21 -16
3929a6p4J16k6L1qM7o8N6K1Pk1M3j14n6J23m6K0L3RJ7j31m0J15p9k1O6N4l9k4
$$ -16 -90 26 0 31 23 70 2 58 79 86 65 108 -6 -62 61 15 35 68 77 94 -37 -77 38 -41 -62 4 58 19 -5
3958eP5Pj26K8jMJ00p5n8J20j08l2K1pL6K3j01Q5L1R9j45j4N9k3P1p1m4J11K5
$$ -5 70 77 -49 -21 -22 -18 82 7 -51 69 -39 -71 -50 -57 -21 2 -99 -14 17 116 -29 -43 16 -7 64 -7 -51 60 85
3987H5p4R8j49J02q2k1O2L7j93Q5J9Q7k9p2R4k7l3L7o0J01o1m2J36q0l1O4j42
$$ 85 11 109 -40 62 -20 -41 21 58 -135 -50 -31 56 27 -45 49 22 -11 26 -34 67 6 -36 100 20 -11 53 -89
4014h9O7m2Q1L3n2r7J40o3M0Q8j44J04K1r2P3n5k9n5j2R1M6r5J5O2L4k2j41J11
$$ -89 -22 -64 17 50 -2 -99 41 -22 18 106 -38 66 87 -5 68 13 -16 -71 -83 8 54 -41 -26 36 70 48 -93 18
4042A8L0q6P8j9L6l9k3L0MJ0Q3k41N0Q4m2k3J79k31J16J0L4qk3K4j81Q3P4j4M7
$$ 18 48 -38 40 21 57 18 -5 25 29 39 122 -119 -69 15 -27 -50 129 -102 14 24 58 50 27 51 -130 -47 27 13 60
4071F0k8o9O1N7m3l6J16j19Ko9O0L1oq8O2p8J35j39M0K8j0P7l9l7L2j6k3J09m1
$$ 60 32 -37 24 81 38 2 118 -1 1 -68 -8 23 17 -71 -9 -87 48 -91 -51 -23 -33 44 5 -32 0 -16 -39 70 29
4100B9m4QP5J4q4kJ52k19K8k3J44m1L5r4J0R5j07M0r2Q5n1J03j10j1%J09o1P4
$$ 29 -15 -7 68 82 -2 -4 148 -71 -43 -66 78 37 72 -22 -12 83 -24 16 -76 9 -42 61 -49 -60 -60 49 -12 62
4128F2j3j22O9R5j13L6J5n7O6q4P1m7J2N5l9l0L5N3m7P6j12M3p1oj3R9r7M2j34
$$ 62 49 -73 -4 91 -22 14 29 -28 38 -46 25 -22 -10 45 6 -24 11 64 17 93 -19 24 -47 -53 -66 33 -64 -22 -156
4157a56Q6J2j6M8qj3P7k9k7q5J19j5R9j11j04P6J00m9Jk2J39j01q7P6l0J09k53
$$ -156 -70 -58 -74 -26 -34 -47 30 1 -26 -111 8 -7 92 -19 -123 -47 53 4 5 -17 122 21 -66 10 -20 89 -164
4184a64K05K0j16K7L0k6M8J5M2r6n2J11n9l9K1l3L6l0J21k9j27O7Q9p3P1Mm5R2
$$ -164 41 61 -55 -28 2 -24 24 39 81 -15 -67 44 -15 -54 -33 -66 -30 -60 61 32 -95 -28 61 -12 59 63 18 110
4212A10j43O4r2J9M0j3O2j7o0K7R1o5r5J33m5j3m6M1M6k0m9O7j8Qm2%P0Kn6O7
$$ 110 -33 31 -61 -42 -2 -15 47 30 -30 -3 88 23 -72 61 16 3 -43 -2 44 24 -25 42 24 32 -10 -10 60 62 6 73
4242G3j20q3L8N2J19j04n8M6L0m6O0N1o1N9j07n4rJ08Q4o7m7P2q8N7q6J05Lj02
$$ 73 -47 -130 -92 -40 79 -25 -83 -37 -7 -53 7 58 -3 56 -51 -105 -114 -6 78 11 -36 36 -52 5 -81 24 27 -75
4270g5P7Q2j09J5J02m4L7r6l2L5J8K0j15J5j4l4J18M4n6O3j03%J39j02J9Q1k02
$$ -75 2 84 -25 -10 92 48 85 -11 -43 -8 10 30 -85 -70 -84 -118 0 44 -12 51 -52 -52 87 -15 4 85 -117
4297a17K03j74R4J4J0lJ3j09J01l9NR6q4L1L0j34J4qj0J52o6p3k9K47rj83l0J38
$$ -117 86 -88 6 20 30 27 40 -69 32 -7 -2 94 10 41 71 -63 -49 -57 -67 85 19 -54 -83 164 155 -28 -58 80
4325H0j86P5M8n8j5O7k7L2O6j15N4n8j4J35n3j10J05q7N4j9N9r2N3mN3j23N7R0
$$ 80 -106 -31 17 -41 -56 11 -16 16 82 -33 21 -37 -51 84 31 -79 26 -61 -7 -26 33 -59 -6 -10 43 -80 -23 67
4353F7n2M6j7q0M8N0Q2j28L5K3j37J32j10Q8N2j44J28m4o1O2l4L6j53O0j0j4J45
$$ 67 15 61 44 -36 12 62 144 16 51 74 -63 69 -41 47 99 -45 83 39 -22 40 6 42 -111 -51 -61 -75 70
4380G0j32J2O4j9j32K25j90P9N0N3m3j22J49Jn8RK3J9l9n4M9jJ20j11j4j4mN0
$$ 70 -62 -50 14 -5 -137 88 -102 -23 27 80 37 -85 64 65 7 16 39 58 19 -35 14 13 133 22 8 -6 -10 40
4408D0j21N6K3J6j61J30m2L3L0O8o5K7p2M2J0k1J21j03J8p8J09Lj29J12m5k6N9
$$ 40 -81 -25 -2 14 -147 -17 -59 -26 4 72 7 34 -38 4 14 -7 114 11 29 -49 60 63 -66 46 1 -25 34
4435C4q7Q4j27Q2P0o1J1Rk6nL6p1N1qO5l8r1M7l0J07k0m4Q1j25R3J8J4j39J28
$$ 34 -53 31 -96 -14 56 -5 6 15 -11 -16 20 -51 0 -8 57 19 -72 -25 -55 52 32 -12 69 -56 37 55 69 -70 58
4464E8J9j03j8O7K3j25J01o7J18Jm6j03M6%Km4%P2J2J3j24J21j11M3R1p6M0J0
$$ 58 77 -26 -44 23 46 -79 22 -45 73 74 28 -75 -29 -29 -27 -71 -71 1 13 26 -98 23 -88 -45 46 -30 10 20
4492B0m5M3Jj01J40o8rK2O4r8KJ6k1P5j58Q6L9l3k9M5RK0p7J07r3P0j23M0J60
$$ 20 -25 18 19 -82 58 -10 -19 3 67 -31 -29 -13 -34 41 -117 -31 8 -25 -54 -9 0 20 -57 50 -43 27 -96 -56 104
4521A04j42L9L8k0K2l2%L4Q6p4k5m4q0J65j44Q6q8M7K6K2rr3j2J25l2j0j3N6j86
$$ 104 -38 1 39 19 41 9 9 43 129 55 30 -14 -94 71 -73 13 -75 -28 -2 20 11 -82 -94 31 -1 -11 -24 32 -154
4550a54K41m3N5m9l7n8L9o3R5M5r1lQ4k9p1Q8k7r0MQ9j7j17J40J21k62P1%L5j13
$$ -154 87 44 99 50 13 -45 -6 -69 26 71 -20 -23 61 32 -39 49 22 -68 -64 25 8 -109 31 152 -110 -39 -39 -4 -117
4579a17P0P5m5K0K3J1L9o9j0N5q3m9J71j31M9p5Q6L4M3l8n0j7k1O9j46O4K0L5
$$ -117 -47 28 -17 3 26 37 76 7 -3 52 -31 -80 91 -40 9 -66 20 54 97 59 9 -8 -29 40 -106 -42 -22 13
4607A3J35j01k8O8j47P9K2l5N9o1P4n4l5O5j9l6j2o1J81j48P2j3%m8Q5j02j5k4
$$ 13 148 47 19 87 -60 19 41 6 65 4 78 24 -11 54 35 -1 -13 -74 107 -41 31 18 18 -30 55 -47 -62 -86
4635h6P8l7L2K2K0J5J0n0p9J70j39k0J24L3j36O8q7J10o5K8j07K51l18J72rP9
$$ -86 -8 -45 -13 9 29 44 54 4 -75 95 -44 -64 60 93 -43 25 -62 48 -17 11 -96 155 -163 9 0 79
4661G9m3j00J35j59J31j16M2k2J28r4L6j7n0M2J14j38J09p4Mo3j3R3j5m2Q5q0
$$ 79 36 -64 71 -88 43 -73 -31 -53 75 -19 17 0 -50 -8 106 -32 77 3 7 -56 -69 24 9 -33 52 -28
4687b8j2M3qjr0K6J67r7PP3q2k1Qp5Q7m1P2k8l1J52j39K8J0Rm7R3j20N7j75K30
$$ -28 -40 3 -5 -6 -96 -70 97 0 7 80 -2 -23 -15 -90 -3 -44 28 0 -31 121 -18 10 20 29 -18 75 -45 12 -163 67
4717F7q2l9O7j5L2r8O2o5J02Po3m3N5Q4l6r9M7n8K5J03p8j2J79j95K6k4Q4l2n2
$$ 67 -15 -54 13 -2 30 -68 -6 -71 31 38 -25 -68 -13 71 35 -64 -17 -75 -50 53 -25 -37 142 -53 -27 -51 33 1 -51
4746e1P6o5M1n4M8n6J25r5O9o7m6N0O7p6O4N9j39Qj6J0J24j31J24m2m4m0J5%k4
$$ -51 25 -40 1 -53 -5 -61 64 -31 38 -29 -75 -25 42 -34 30 89 -50 -42 -58 -48 76 -55 69 27 -17 -57 -42 -42 -66
4775f6K23k01O0Qj34J69L3J9j08j9j9M4J0q7J0Q7j04R2ll4k7QQ4p9k4j1M7ko1
$$ -66 157 -44 16 24 -110 59 92 111 3 -16 -35 9 19 -68 -58 29 -75 17 14 -20 -47 -39 45 -34 -58 -69 -22 -24 -85
4804h5P0J9J00q6noK6o6k6J39l8Q7p7J2j18O3l4L4j3N4p8k2L1l9J26j45J01o0
$$ -85 -15 4 104 18 13 7 33 -33 -59 80 42 129 52 64 -54 9 -25 9 -4 50 -28 -50 -19 -58 68 -77 24 -36
4832c6j1M1k4Q3R7k28O3o0J29m1qK0j4K8q8N4j3P3p8O0n9J09q2j3N5m0q4R7k9
$$ -36 -47 -6 -30 53 150 -78 -15 -75 54 13 5 25 11 39 -49 5 -8 65 -13 47 -12 97 15 2 57 17 -67 30 1
4861AmK6j7J3L6j8J6m9pL7j02R2q2O3m9N6p3j8J36o8%P7n5j02R6L9j31R8l8n9
$$ 1 -3 23 6 19 55 37 53 4 -3 34 -68 24 -58 5 -44 12 -61 -79 57 -11 -11 66 11 -91 5 44 -87 11 -27 -86
4891h6J70q8j34R1J06K7r5l3l0J19q8L7n5K5pP3J04m5o9m3J4P9q0l0M1l3L5j39
$$ -86 84 -4 -138 -47 59 86 -9 -42 -72 47 -41 -4 -59 -34 -41 32 136 91 22 -21 -7 72 -8 -38 3 -30 5 -134
4919a34K26r8J9O7p3n0J42k07O2O6j41J34k8O6o9MMn5N0NKJ9J36j61J11l0r1Q6
$$ -134 92 -6 13 80 7 -43 99 -108 -46 20 -121 13 -15 51 -18 -14 -10 -65 -15 -10 -8 11 147 -14 97 67 -24 62
4947F2ol6k9Kk6J5N8n2k01K55P1j35M5J2p6k6N4O1l9qj9q6J15l9L3l1K7j3N9q
$$ 62 56 20 -9 -7 -33 -18 40 -12 -213 42 113 -22 23 35 -41 -67 -13 48 9 1 -18 -104 11 -28 5 -26 1 -12 47 39
4977C9J3o9P0j3Mj14M7J5n4J15KJk1K2Pj43J5P3Rj16K29j18l7M9m4R2o3j4M6m5
$$ 39 52 -17 53 40 44 -70 -23 -8 -62 53 55 56 35 57 64 -79 -64 9 18 -98 131 13 -24 25 -19 73 10 -4 42 -3
5007cl9j1qJ05M3Mj55M9j2JR1n7O7O2j59K4k4O6j42J18M4j16m2k5L7jM7R0n5N
$$ -3 -42 -53 -61 44 87 91 -64 -15 -27 -26 65 8 75 137 -22 2 -22 44 -98 20 64 -52 -94 -119 -82 -83 -36 54 -1 4
5037Dk8J67j63o0%l5K31j47J01n1l8R1L3j61J21K6j13J6J2J4L3OJ3r8J34j36Q7
$$ 4 -24 143 -20 -80 -80 -115 116 -31 70 19 -19 72 105 -56 65 91 -22 -6 6 20 53 59 72 -26 108 -28 59
5064E9n5lo4O9Op9PP3k7j3Q2j06J07J4l5m8L4j7r3R8k5m2J21o4L3J4j51R3q1P2
$$ 59 4 1 -63 6 12 -67 -60 13 -14 -27 55 -51 56 70 35 -13 21 4 -89 9 -16 -58 63 -1 32 46 -105 -12 -93 -21
5094b1R4j59J19k4K5q9Q5j01J13j0K6o4J7K9N0j75Q7%j4N9n8K6k8jJ13k4N2j17
$$ -21 73 -86 33 9 34 -55 30 -71 42 32 58 -6 11 40 90 -85 2 2 -12 47 -11 15 -13 -14 99 75 127 10
5122A0o7J84j02n8J56j5r8J1o6O9J8N5o0j2m7K0M2r4J57p7P3k13J67q1N7kq0L7
$$ 10 -57 127 25 -33 123 108 10 21 -45 24 42 97 37 25 -22 -2 40 -54 103 26 99 -114 53 -28 29 27 -53 -16
5150a6J81k49O1L3K6n5L5K8R8j86M5n0N3jm3J39j04r3J4K18k56R2J08o5m6M2o3
$$ -16 165 -84 -23 10 36 -19 16 44 142 -44 1 -49 4 3 -40 99 -5 -98 -84 134 -122 -30 78 13 -33 9 -54
5177e4J21o9R5j69Q1o9L8k9R1k9r3K3J51p2n2O4j0L5q2p8LJP2K7k6Q0p6Q9j33
$$ -54 67 -2 93 -76 5 -64 -26 -55 36 7 -86 -63 88 16 -36 28 18 53 -29 -107 -104 -103 -31 -4 -30 50 -26 63 -70
5206g0N3M2J09j08O8r4p1J17m2ml8N0m9J6J6j5Q6J1l0n5k3m1J75j62P0n3R0j51
$$ -70 -17 25 134 26 94 0 -71 46 4 0 -38 12 -37 -21 -5 -20 66 77 47 -8 -31 -72 103 -59 11 -42 48 -103
5234a03J58l2m5K1j3M2o0l3P4K5o6O6l3n3Lo3J82oj71J12p1K01j16P2J9Qj39j1
$$ -103 55 23 -22 -1 -14 28 -32 -65 9 34 -32 34 1 -52 -49 -112 70 64 -107 5 -66 135 19 91 110 118 -21 -32
5262c2J57j31P2j00J2J20j2j6n1R2j39n6jJ28r2N7j24J16J7l0m6N8J8NQl4m9J5
$$ -32 125 -6 66 -34 -22 98 86 70 19 111 -28 -84 -85 43 -49 8 -116 0 17 -13 -59 -1 17 22 30 -4 -53 -38
5290c8QJ8L4Lm1l1J3L6J2p5K9Q6j03M8k1mk3P6o9J0J1K3O2l4j5O4p5k4o1N5l1
$$ -38 -30 -12 22 25 -16 -47 -34 2 14 -61 -32 54 -49 -1 -22 -26 -49 27 -42 -32 -21 2 64 30 15 79 4 -20 -81 -26 -57
5321e7J51j77J25k5Nl9K9J4Oj03J98j13K3o5P2K6o4l2J19m9j0r1L6M0r8Q%J2K9
$$ -57 94 -83 42 17 22 -17 12 26 32 -71 127 14 37 -28 44 70 6 -26 93 44 34 -57 -21 19 -79 -71 -71 -59 -30
5350c0P8k8m7J0Ln5P0o2J19j01l5K2M3Q2k4o6R4J7j46Q8L2M2j49k6J82r9N3QK4
$$ -30 48 20 -27 -17 -14 -69 1 -61 58 -43 -78 -56 -13 69 45 -21 73 90 -56 32 64 106 -43 -69 113 14 67 75 99
5379I9m5o6n8Q0k9K9P0j54O2K0OP7q6R6j03m8N4m9K0Q7r4m5J25j9n0l2M9j6n4
$$ 99 54 -12 -70 10 -19 10 80 -74 -12 8 14 91 5 101 -2 -50 4 -45 -25 62 -32 -77 48 29 -21 -53 -4 -20 -74
5408g4O4m8Q2l2J3j7J04o7j71J63JL1m7r3L6jJ38l7r7Q1o1J8l9J74j80J26k0M6
$$ -74 -10 -58 24 -8 5 -12 92 25 -146 17 18 49 2 -91 -55 -56 82 45 -52 29 -32 -14 -53 121 -59 67 47 93
5436I3k0k5p5n3M1K9k7R6k0k4n2L5J14j93O3K3k7O1m8J06j04M4j3j1K8O0L6j84
$$ 93 73 48 -27 -80 -39 -10 -37 59 39 15 -37 -2 112 -81 -18 5 -22 39 -9 97 -7 37 24 13 41 101 137 -47
5464d7L5Nl8j0MJ00o7R1j42J08m5k6M0r8O5N0N9p2KK3K8q9J7N0K6n8J06j59L2
$$ -47 -12 -7 -45 -55 -51 49 -18 73 -69 39 -6 -32 8 -90 -25 25 84 12 14 37 65 -24 -7 43 69 11 117 -42 -10
5493a0o4J02J8m3N1K1j4p5M5l7m6L0l3M2rJ4r3K5O0j7N4j10L7M1o9R0Q4k05J76
$$ -10 -74 28 46 3 54 75 61 -14 31 -6 -52 -22 -55 -13 -22 -8 -101 -76 -16 -33 21 -89 -52 -11 -80 10 94 -111 65
5522F5O6j31P4m3J2Q0p6l2n9J04j9n8Oj22J06RL2j47PO4N0m9J02K3K1q0Rn1k9
$$ 65 131 0 74 31 43 123 47 15 -44 60 41 -17 -11 -133 -27 -18 14 -133 -126 -62 -12 -61 41 64 85 5 14 -37 -66
5551f6P3J5kM8M6k20J33K2N0j12K7M8o4N8m0qN8p6k0J6R5k8n4N3j43J18q2J05
$$ -66 7 22 20 68 114 -106 27 49 99 -13 14 62 -2 56 16 8 66 -10 -30 -14 81 53 -1 52 -91 27 -55 50
5579E0j28Q8N0r6k8J15j13N4J9M9J0j82R1Lk2R7m0J2j6k0jJ47j68J8L6m4O6j9
$$ 50 -78 10 60 -36 -64 51 -62 -8 11 60 70 -112 -21 -18 -40 57 17 29 13 -7 -8 139 -29 -11 25 -19 47 28
5607B8jr1Q7j3K2q7K3K2q5J93j94R4J60k00O3M9l0k8n9Q0J17o8k0j6j40J8R9j3
$$ 28 27 -64 23 10 32 -55 -32 -10 -95 98 -96 -2 158 -42 21 70 40 12 -47 33 150 82 62 46 -94 -76 23 10
5635A0K8p7m9J28j7J6k7J7m9mJ8M1n1N8l2j7L4lp3J35j15l1M6J8p7pJ63j45J5
$$ 10 38 -39 -88 40 23 39 12 29 -20 -24 -6 35 -16 42 10 -7 27 24 -49 86 -29 -60 -14 4 -73 -80 83 -62 -47
5664d7M8k5k4O4J45j54O6j09o8J66j68J66q3j1J23k28J18N0p9k4J29o0pk4n3K0
$$ -47 1 -24 -48 16 161 7 73 -36 -104 62 -106 60 -23 -34 89 -139 -21 29 -50 -74 55 -5 -12 -36 -89 -69
5690f9L0l3M9O0j17O3O9q1QN4o5j3Q6l3k4p4P0l7Ojj5J9L3J30m3n6L1L8j52K5
$$ -69 -39 -72 -23 37 -80 -17 52 -29 -21 33 -32 -45 41 8 -16 -90 -20 -57 -51 -52 -67 -48 -15 115 72 16 47 85 -67 -42
5720d2P2l9P5n4m6R6p8K6j5P7j00N0N9r2L0m3K9LJ70j50K5k4m2n3O3j0L1Ok9o6
$$ -42 30 -9 66 12 -34 62 -16 10 -5 72 -28 22 81 -11 19 -24 5 8 178 28 53 29 -13 -66 -3 -13 18 24 -5 -71
5750g1J06L1p9R2j63J29n4N6n0l2P0J8n2L5k8j0n7J65k10J37M0k00N0M9J22j00
$$ -71 35 66 -13 79 -84 45 -9 47 -3 -35 35 53 1 36 8 -2 -59 106 -104 33 73 -127 -77 -28 94 -6
5776fQoP1m6j04J91j22L6K7j28L3M5NN6p0m9j1pJ23mj07j0L0o7J93l9l4l3P6r4
$$ -6 2 -4 67 21 -83 108 -14 22 49 -79 -46 -1 4 60 -10 -59 -70 -77 46 42 -65 -75 -45 -112 81 42 8 -25 51 -43
5806d3M8l2l6nQ7j1j07jJ85j86J54l3m4Q4m4K2j54P8OrO7p4J52q6k3J9L5j24M2
$$ -43 5 -27 -63 -68 19 8 -99 -100 85 -101 53 20 -24 60 16 38 -116 -38 -32 -41 26 -48 104 18 -5 14 49 -75 -33
5835c3M6L0O4j17n0J20o3m8Q5Rn2j2Q4m7l9L6n3J07M3q2l0L8n9L7K5pM4n4Q0k7
$$ -33 13 43 107 -10 -60 60 -3 -51 34 43 -9 -21 63 16 -23 13 -40 67 110 28 -2 36 -23 14 39 32 76 22 102 75
5865G5j09J9N1l6j1N6m1N8j44J00m6r7R9p7K5J9J59j05m5P0K8k5j09P8L0p2Q8
$$ 75 -34 -15 36 0 -11 45 4 62 -82 18 -28 -125 -26 -103 -78 -59 100 -5 -50 20 48 23 -86 -8 22 -50 38
5892C8o2MJ81j32J7o5K2r6J47q9nj5M2n2N4M4o0K2O0q9O9oj04P2L4j30O0K0PQ9
$$ 38 -24 -20 161 29 46 -19 3 -93 54 -35 -40 -55 -13 -65 -11 33 -27 -5 55 -34 35 29 -75 -3 31 -99 -39 -19 -12 77
5922G7n4kl1M3m3PM0j0N9q1O6j65J12r8O0JK0M0qm5k2J03o9O8j00n4N8o0J16j5
$$ 77 23 21 -10 33 -10 -3 37 27 86 5 71 -94 18 -80 -20 -19 1 41 33 -12 -34 69 0 68 -32 -86 -28 -88 28 13
5952A3nK1j04J71m2p8m3N1K3k2j9k7O0J6n1K2Q0no9K9l2m8K4Q7o2P7j14N5p6J24
$$ 13 8 29 -75 96 54 -24 -67 -16 7 -15 -34 -61 -1 15 -36 -14 66 61 -8 21 -11 -59 -35 52 -10 67 -47 8 -68 56
5982E6q9Q9r5R9j8p1mm7M2J5ML1mRR2r5l4O6rj23O8K0j7j28J61k3oM7j44J19k0
$$ 56 -33 56 -39 60 42 -29 -33 -80 -38 -23 -19 12 8 17 109 14 -20 46 37 -86 -18 2 -15 -143 18 -5 -11 36 -108 11 -9
6013iN4n2l9nJ16n5q4O5Q3q4q3J7K7P1K6j27K02j34l6J4K0R5j09K7P2m3N0p9j
$$ -9 45 -7 -46 -51 65 10 -74 -9 74 -10 -93 -76 -49 22 48 -79 123 -11 -47 -33 -13 82 -27 0 72 29 79 0 -1
6042aoO1j03N6m1J19j35O5j5J9O5j08m4O3J3P6m3l4J4N2j28J28q2l6L1O9n1NL
$$ -1 -7 54 -49 7 -34 85 -50 15 0 19 84 -24 -68 -5 8 84 41 7 21 73 -55 73 -9 -45 -14 55 4 9 12
6071A2m8Nj2J43j36L1Poj8l8K40n9p0j9J6j24J12q0J9m1j1Q2n4nK2J15o6l0n1
$$ 12 -36 -31 -43 100 -36 -5 2 -4 -22 -60 180 121 51 32 48 -76 36 -44 -25 -66 -77 5 -49 -54 -32 83 17 -13 -64
6100f4k3J20rM0m4N9m4j7k2M7o9O6r9N1N7k3j6nmK2R1j81J07K8r9m8L4m9J75l8
$$ -64 -87 33 24 64 20 79 35 18 -4 43 -26 40 -59 -8 49 26 10 5 1 23 114 -67 40 68 -31 -79 -45 -94 81 43
6130D3q8NM3o3N8K8L1j01J2Q0o5o2k3O6J00m3m1M9j07J01K4n4J27j15P4jj17K9
$$ 43 -45 -40 3 -60 -2 26 57 -44 -32 48 -17 -79 -102 -36 64 21 -20 29 -78 23 47 -7 120 5 79 78 -39 -10
6158a0M8m7Pj10J48j22M7j8J33j06N1PJ4k0L9oo8m7K5R8n8l2R5n1L8j35J15j23
$$ -10 38 -9 -2 -112 36 -86 -39 -57 76 -30 21 28 42 22 61 55 -13 -60 -35 63 5 -27 68 17 55 -80 35 -88
6186h8J29p7R8Nk1p1Nk2mL0k2oN5M3Kj08J22q3J5K6p9Q0q3O7n0J0rMM4j27M0Q4
$$ -88 41 -36 62 67 46 -25 -20 -42 -46 -16 -38 -44 11 54 56 -52 70 -13 2 28 -51 29 -54 13 -37 -27 -36 -32 12 -115 -75 9
6218IL7j35J35q7L7L0k0L8m1m9M8N1l5m4jK7j8n0M4J2mN5m5O9k02J95J4n2J1n9
$$ 9 46 -89 46 -41 -4 26 6 44 3 -46 2 53 18 -26 -27 0 -18 -68 -24 -12 -16 39 -6 63 -139 56 70 18 29 -30
6248c0L0N9j1j37J06q3k0J51j51R5l9j01O2Q5O3l7M6K7j58O5J8q4J6N8l0Q7L0
$$ -30 0 59 48 -89 17 -66 -86 65 -86 9 -30 -131 -69 16 79 42 88 115 -43 22 40 -44 -28 30 0 87 117
6275A17j37KJ8J5l3M7o8K6J7kq1mJ05k07J01Q2L0p5N5o1M1K6P5q8L5k7M1o4l8
$$ 117 -20 -18 0 15 -18 29 -39 -13 4 2 -79 -83 22 -185 -84 -2 28 -47 8 -53 -12 14 89 1 36 9 50 -14 -52
6304e2J5o1J36Po6k0M8n5m7N0K0q9J18jO0j2m9n6R4l3l9M6L3k5J0l2k8j5jM4o
$$ -52 -37 -98 38 45 -21 -41 7 -48 -95 -45 -25 -114 4 3 63 51 2 -54 40 7 -32 14 47 22 32 0 -28 -43 -44 0 -6
6335fO2J8q7nlL8p4O9J9m7M9K1J3j4p3o1R4j47J07M7k1N6k8n8p6K1J03Q5j23Q8
$$ -6 56 74 -13 -18 -21 17 -57 12 31 -16 33 54 67 53 -20 -81 13 -134 -27 20 -1 55 27 -31 -107 -86 17 102 -21 67
6365F7l4r0N8k6K3P8j06N5O1q7OK4q5k0Q6m7M4lM4p9L0J12j36R9m9M4j18L5j09
$$ 67 33 -57 1 -25 -2 76 -30 25 86 -1 5 29 -56 -76 10 -37 7 4 48 -31 -1 111 -25 74 25 69 -49 -14 -123
6394a23J83j18L8Ll3L4L8m6oJ6P6l0k2n9J21q4q5J03j6J23j15J66j73Mq1J02K6
$$ -123 60 -58 -20 -17 -50 -16 22 -24 -30 -14 62 32 10 -49 72 -12 -97 6 -10 113 -2 164 -9 -5 -86 16 42
6421D2j24L4O9l3N1j5k8Q6j25J27m8m7p7J02QL9k4j01J44j06J05J6q5l3M5j21
$$ 42 -82 -48 21 -12 39 24 -4 82 -43 84 36 -11 -88 14 22 61 37 -64 80 -26 79 95 10 -23 22 -99
6447i9O4L8J05j92J50l4k9l4l3J37j60R1L2l6Kk6pL5l8o0qJ98q1J0j35N5J6Q8
$$ -99 -35 3 108 -84 66 32 3 -31 -64 73 -87 4 36 0 2 -24 -31 4 -34 -94 -102 96 15 25 -110 -55 -39 49
6475D9j1p5J19N5q6j36J36j04O8k5J6N4n6o9J2J8M0l9M3K3q5M4O1k4Rj51J53j07
$$ 49 38 -37 82 137 51 -85 51 -53 15 -10 6 60 4 -65 -53 -35 5 -34 9 32 -53 -9 52 28 37 -114 39 -68
6503f8J38k0q8R5j52J46m4j4n7J64j56P8M4r6R5m4N6p6J8Lo6LK8O1l0n7R5J9j88
$$ -68 70 50 -38 57 -95 51 7 -7 -64 100 -56 22 66 -30 65 21 77 1 19 22 -44 -41 -13 48 18 -39 56 75 -113
6532a13R5J67k48R3M5j00N9p1J2O3p9N5Q6n2J8j3K1o2O7Oo5r3Q0R9J4K6j61J19
$$ -113 -18 149 -99 -6 39 -61 -2 -73 -61 2 -77 -22 64 12 30 17 38 -24 43 49 -16 -109 -29 70 84 110 -51 68
6560F8l6n0J1R2j40O3k4O9j34JJ09p0J27j05prP5j09J22l2l4O1j26P3N4NN7k12
$$ 68 32 -18 -7 85 -55 8 -16 53 -81 -80 29 -41 86 -19 -26 -35 40 -69 53 21 -13 48 -78 -5 49 54 111 -101
6588a01N8L8P5j07L6Q8q8J8n1J19l1k3Pk1q4J4J40j57J14l1l0P8j41Q5K9P2j03
$$ -101 -43 -5 70 -37 -1 87 -1 17 -34 85 54 31 38 17 -67 -53 87 -70 44 13 -17 61 -80 5 34 106 3
6615C%M6m4k9Q3J1k6l8p5O8M2k2k0O4r3k1P9j18O1K7J1Ln1O3R1j27P6m2jj3l9
$$ 3 3 49 5 -24 59 70 44 6 -69 -1 41 19 -1 63 -30 -51 28 -90 -29 -2 9 12 -39 24 115 -12 64 22 21 8 -31
6646c1j3L7K1l4LM5l6L3l1N5j20P7k0J8L1q8J5M0j6M1J7Np8rl9k7j5O3O4m9j16
$$ -31 -44 -7 14 -20 -17 28 -8 25 -6 49 -71 6 -14 4 35 -53 -38 2 -14 27 44 49 -29 -38 -77 -104 -119 -56 8 -41 -157
6677a57J33P6j12J14r6K6KN6pK7o0j0r3J65r1J27l9n5N9l1j14RN0J10r7jK1j45
$$ -157 -24 52 -60 54 -42 -16 -14 42 35 62 2 -8 -101 64 -27 100 61 6 65 34 -80 -71 -21 89 -8 -9 12 -133
6705a33Q5n7J02k7J7Moj1J15k5n5n8J81k00M0Q7p2P1n3r3M9j0J7l8rR5j23J13
$$ -133 -48 -105 -3 -30 -13 -9 -15 -26 89 64 9 -49 132 -68 -28 59 -13 58 5 -88 -39 -49 -32 -70 -79 16 -107 6
6733FM0j15J25k3p6rJ04k0m7L2j00M6p0O8J8n3J31q3P1o8N3J4l1J10j06Q0j31
$$ 6 46 -69 56 33 -43 -52 52 32 -15 17 -83 -37 -107 -39 -21 -74 57 -26 45 -23 30 44 13 123 17 97 -34
6760c4j1K6J96k04M2P7p9oj01R0j1R8l6J9pp1P3p0n0R3o6J26j44Q0kl7K6L5q0
$$ -34 -45 -19 177 -27 15 92 13 7 -94 -4 -15 83 47 66 59 -12 61 -9 -59 34 -32 94 -50 30 28 -9 17 52 -28
6789b8N4k7K3o5K4K2j2J18j30n3L1K4P1p5K9N5O6j71l1N8J6mN4Lq6O7j61J74j09
$$ -28 26 -1 22 -43 -19 3 -9 109 -21 -74 -43 -19 52 -23 6 61 127 -44 -75 -17 -1 -5 49 52 -34 33 -128 46 -63
6818f3J29m2Rk8JQq4R5l8J00Qm8r5j2J94j21m6J19q0k1J97j82n9J21o9K3k6lj4
$$ -63 66 24 33 5 6 14 -70 25 -13 87 95 47 -48 -60 134 13 -33 86 6 -15 182 0 -59 62 -7 16 -10 -13 -27
6847b7oPQ1lj25O1L2p2l1L9J17j75J14o2Q2qj58R7nJ07j58O0Km9J71j58O4k2r
$$ -27 -33 -26 55 52 -73 -12 20 -52 -83 -44 73 -102 12 -50 32 24 -134 -37 -42 65 -93 -33 -31 -80 91 -67 -3 -25 -34
6876c4K6O1p1L5kj25J38m6M7Pj53K21j17j7J28r7n1n0P3JN1N1J6n4j39N6J24r7
$$ -34 -8 53 -18 17 15 -110 28 -18 29 36 -117 104 -13 -30 98 1 -50 -100 -27 -26 25 76 92 38 -101 -45 79 -18
6904a8N3q9k2Q4M6p3o2J27N3p9J5o1O2j43Q6p2J27J9m1lLj1m3O9l3M0q9O5K8n
$$ -18 35 -54 -76 8 54 -19 -81 46 99 20 35 -26 36 -107 -21 -93 34 53 12 9 12 1 -42 27 -6 34 -55 10 38 33
6934C3l6r4N5J20j02O6m8K8k0%RLj2J0j8R5j36J45q7Q1lj25P6l7L5r0M2L8qk7
$$ 33 -3 -97 -42 78 -24 42 -6 22 2 2 11 14 2 12 -6 89 -47 98 11 92 89 -36 40 3 38 -52 -10 28 20 -7
6964gqp7R3J7n0MP6j08N2q6Q2R1j65k3J56o6l3L3O2m1k1M1L2j10P5q0J52j18n4
$$ -7 -15 -92 1 18 -32 -28 48 -60 -8 -94 -12 79 -86 -109 47 -19 -52 -19 43 2 -19 22 54 -56 19 -61 91 -27 -81
6993h1Q1o8J8Q1qo2R1k14J04M8j2j1P2l3L3m1l6O0j9P7q3kQ4j5j01p4J73n6j53
$$ -81 0 -68 -50 31 23 -39 52 -162 -58 -10 -22 -33 39 6 39 -2 -38 22 3 80 -3 -5 79 64 -37 -111 62 6 -147
7022a47K06o9J17j80P1o0Q7jo5k1J5J9m5P3l3k0k3J39p2l6M0Jl9jQ5j05J8K0P3
$$ -147 59 -10 107 -73 -2 -62 25 24 -41 -62 -47 -28 -73 0 -33 -53 -76 63 -9 -45 -5 -4 -43 -44 41 -64 -46 -26 47
7051D7r1K8J3O7j31M0q3Q8n0LJ11o8j7k0M9J13k20K09q4k0N9m4M3j26L3l5L7j3
$$ 47 -44 -16 -3 64 -67 -27 -110 -22 -72 -69 42 -26 -43 -63 -14 99 -121 88 4 -16 43 -1 42 -84 -51 -86 -49 -62
7079f2J15r1K7l0pN0Q9m1l2o0j1R2j32Q7j04J24l3j0M3j2r2O8L7R8j57R8m4JM0
$$ -62 53 -38 -11 -41 -48 2 91 50 18 -42 -53 39 -93 -6 -110 14 -19 -29 14 2 -90 -22 15 113 -44 54 10 11 51
7108E1Jp2k5K7N3n8L3p4J04L7j23P1k6j2L7O9p9K9n6qKq8J9J45n5j9J7L1J9j5
$$ 51 52 -20 -45 -18 35 -23 10 -64 40 77 -46 25 -1 -13 24 93 14 43 -13 -21 -19 -107 -88 57 2 -17 0 31 50 35
7138C5j10M0JJ9j7P2K0l2m4R9j23M7o0L7N6J0j4o3K4lp7K7Q4l3k9j4J8Q5p2j8
$$ 35 -75 -35 -34 -15 -32 40 60 28 -16 83 -40 7 -53 -16 40 50 36 -27 -3 -6 -83 -56 28 -5 -34 -48 -30 55 -17 -35
7168c5J34k08M3J43J2k02J14J11p9K2j73J45n1r8O1L2l3J20L1k8k2q1J54j95Q
$$ -35 99 -109 -66 77 89 -113 1 112 33 55 -118 27 -24 -122 -61 -29 -62 58 89 61 39 -42 112 -83 -75
7193g5O6%n4M6N8M2q2n5P5p3R6oj26P1l5Q8mn3J8O9p2N5j24N1L4o3M4o0J74j70
$$ -75 -9 -9 -63 -17 41 83 1 -54 21 -52 44 38 -88 -17 -52 36 32 -21 -3 66 -6 49 -75 -24 10 -53 -9 -69 105 -65
7223f5j6J04N5j80J63p5O7j13k2J56K3k03J34k2j9Kn2R1J6n8o6J25Oj07N7l5J54
$$ -65 -81 23 78 -102 61 -14 53 -60 -82 74 97 -106 28 6 -13 -11 -63 28 44 -14 -80 45 51 -56 1 -34 120
7250A20j07P8o9N2n1j1R2j45N1j28J00O8ko8L1l2m3J10j5Mn4N7j02J00J5j61J76
$$ 120 13 91 22 74 23 12 104 -41 10 -118 -18 50 48 -20 11 -21 -64 46 31 35 -19 38 -64 36 51 -110 66
7277F6j16N3J57j13O0k8n8q9R9r6j5P7j9l6J52Qk05P7J8N2n5k0R0q0j2N0M0n0
$$ 66 -50 3 160 47 107 79 21 -68 31 -65 -80 -3 -22 -58 94 102 -103 -26 -8 44 -11 -31 59 -21 -33 17 57 7
7305GrN9J2p6n5p1J94k4j0j01J03L2n7p8J01r1J38j20J8j3L7M9K1j11Q9j2knr6
$$ 7 -2 57 69 -7 -62 -133 61 37 27 -74 29 61 4 -74 27 -64 74 -46 -28 -41 -4 45 66 -45 44 32 30 25 -71
7334g1J19p7M6K0l6n1R9N9l5n5mN1N4r9p3L9j2J7N2k6p3J02k2lJ0l0j1J7L9m7
$$ -71 48 -29 17 37 1 -50 49 108 73 18 14 65 119 20 -53 -14 -26 -9 43 17 -56 46 24 21 31 1 -10 7 46 -1
7364ao7o9J83mk3l9K8r2O4J9K3j24R4P4r1J31j12k2M8l4P8J1n3O1Qj41PJ21m5
$$ -1 -68 -137 46 42 19 -20 8 -84 -20 -1 22 -102 -8 66 -25 106 -6 -28 20 -14 64 75 22 83 91 -50 -43 78 33
7393C3p0M2J3K6j28Q5O6J4j38N7O8l3k5K9j22J18l4m7m0J13p5J10o4k4M9q1Q5
$$ 33 -37 5 18 44 -84 1 67 81 -57 0 68 35 10 39 -83 35 1 -46 -86 27 -48 62 -2 -26 23 -58 27
7420B7m4P1L2j32J0J06l6l2M0j18P0k0j6M3M9j78J01nP0j5q2J3rm0J44O1j51O
$$ 27 -17 54 86 -46 -36 70 34 2 42 -76 -6 -26 -42 1 50 -128 -27 -32 38 23 -59 -46 -55 -95 49 110 -41 -35
7448c5J4q2J65n4Jj15J40lj3r2J25l2P1j72N0L1Q4j14K0J24j08L9j27K7P4m8j8
$$ -35 -21 -103 62 8 9 -106 34 31 18 -74 51 19 90 -82 -32 -1 83 -31 -11 113 5 44 -83 -56 18 -30 -48
7475d8J23r2P8o2np0L9m2O7r5Q6qKj8O6j01J08l7l2rm9J37r6mQ7m0MK8N7j42L6
$$ -48 75 -17 61 -1 -6 -76 -37 -79 -12 -107 -21 -29 -27 -45 21 -80 28 -9 -41 -50 -99 38 -58 -62 25 -15 -11 17 74 -68 -32
7506c2Jk1J46r1K6j15J04rl2%N4n0l6M9L6p7R3o4o0P9RN5p3o2m4O3K4n4N5ol7
$$ -32 -31 -52 94 3 29 -86 18 9 -23 -23 31 -19 -55 -6 30 -47 46 -18 -78 1 10 65 -8 -70 -114 -51 -27 -81 -26 -32 -69
7537f9J81j26O4p3R2k0j9r8J22j3q6oL8M7q8O3m3L5j12J69q9K9M7p5N2j01L6m3
$$ -69 112 -14 50 -23 69 49 30 -68 54 41 -45 -51 -13 34 -54 9 -34 1 -111 58 -31 -2 45 -30 22 -79 -43 -86
7565h6R1K6r4p0J86n2j12J50o1n5M7N3p3N9q3KR2ll1N6k8o6j5R5n6j4J9R6l7q5
$$ -86 5 31 -63 -133 53 1 -111 39 -22 -77 -30 23 -50 9 -74 -72 20 17 -14 42 14 -52 -67 28 -28 -42 -23 73 36 -49
7595d9R3K5m0K9j42J16%P7j68LJ3P9J6j05j2Q5J3j28P1K0Jl6k5Q1Pn3M0M4l5j09
$$ -49 44 69 29 58 -84 32 32 109 -59 -56 -43 36 52 -53 -65 20 33 -95 -24 -4 -3 -39 -64 17 24 -29 11 55 20 -89
7625h9J96n9L0j20J6NN1p1Q3j1ql0k4n3J07n8O5j17Q0r5J15ml4j7M4k3O1r1J06
$$ -89 107 48 78 -42 -26 -21 30 -41 42 31 23 -7 -31 -84 23 -35 30 -87 -7 -102 13 9 -25 -42 2 -21 40 -51 55
7654E5j01lL5L2Mk9qR9j49J71j01m9J34k1k3Jm5Q6M3k07N6J8l3n6M1J39o7j0k3
$$ 55 -46 -49 -14 18 22 -7 -15 84 -65 106 5 -44 90 69 46 47 2 88 131 -76 -20 -2 -35 -91 -50 89 22 12 -11
7683a1j0J5l0M5l8N3JN8r1LL4J19j29L7p0L0l3j61J09J79j73P3J14j00k6J8m2
$$ -11 -21 -6 -36 9 -29 24 25 83 -8 -5 29 148 19 56 -14 16 -17 -178 -69 110 -63 10 124 24 -2 16 -26
7710b6j5JK31j91J2L1l0PRj9l8P1q3Q9l5r5J95j59jK8N7j53J36j5l8J48j62m%
$$ -26 -41 -40 191 0 12 43 13 20 29 10 -28 43 -40 49 14 -81 114 -45 -46 -18 39 -114 22 7 -31 117 -45 -49 -49
7739d9m8R6k8M3j17M3J1J8QJ5mj04M3O4r2L9J12p7J09m5k2NJ16n5n1K5p0n6J37
$$ -49 -97 -1 -29 14 -103 -60 -49 -31 -23 -8 -12 -116 -73 -9 -101 -62 50 -27 82 37 15 20 136 81 30 55 -15 -71 66
7768F6rj50J69j84J02l7q5P0K2q9J53k3K1m5M3qn7L1N2o0L0J0l1K5M1oq5J4N9
$$ 66 57 -93 76 -108 -6 -43 -128 -58 -36 -125 28 5 26 -19 24 16 -41 -10 42 -18 12 22 -9 16 57 51 -34 -20 39
7797C9ln2k6R8l9m2J1l7P1o9R0n0J23n7q9l0J9O7p4k0J30k5r0k7P5j3qj7Q0j1
$$ 39 36 -16 -42 56 17 -25 -14 -51 20 -49 41 -9 114 57 -32 -62 -43 24 -50 -70 60 35 -55 -82 -7 -20 -28 -45 35 24
7827B4K1m1Q1k5%Rn6O3n3j2j7K4N2K3j01n2oJ39r0J66j39mq4M1N6j26J41k5l3
$$ 24 45 4 85 60 60 69 13 76 23 11 -6 18 70 93 -8 -60 -66 73 -17 149 10 6 -78 -37 19 -107 34 9 -24
7856b4P5o2o2Q2Mn6K0m4j7K2J5m9J77q6Pl0J28j15J2Q2m2o1j5nPJ21j33P8L1l9
$$ -24 51 -11 -73 9 13 -43 -23 -67 -84 -62 -47 -96 81 -5 2 -28 100 -15 -3 79 37 -24 -39 -44 -37 84 -49 29 60 21
7886B1q7M5L3r0Q0K5N4mk37J99p2N3J6n5O1L8p3j34J06j1L0j7N0j5o4L6J24j24
$$ 21 -66 -21 12 -78 2 27 81 77 -160 39 -33 20 36 -19 42 80 7 -127 -21 -32 -2 -19 31 16 -48 -12 112 -12
7914a2J00j86Q0k8R0j58K8J69n4k4P9j96N7J53j19j33R5L8J02j22j2P1Oj58O7
$$ -12 88 -98 -18 -46 44 -114 -86 83 29 5 84 -112 -55 98 -21 -154 -59 -21 81 -41 -53 18 24 -134 -67
7939f7J21p3K5n4O5N5k17J37l6rJ8N4m8Q2j47j3J37r9P4OJ4o7O5J2p2N1q3NL6
$$ -67 54 -19 6 -48 17 72 -145 -8 -44 -53 -35 19 -29 53 -94 -107 30 -69 5 11 25 -42 23 35 -37 14 -69 -64 -28
7968b8J41j61N6P4m1j24J05r5L8n1Q4Q8N0p3k0lk5m2R4m1Pok6n1jK6j8o5J75p9
$$ -28 113 -48 8 82 41 -83 22 -73 -35 -86 -2 86 136 63 43 40 15 -27 67 26 33 27 1 -50 -51 -25 -43 -108 67 -12
7998a2K2Q6q1Jo9K4m4mL6J7l2RM6Q6r8m3K4O2n9lR5o5rM2M8l2q9J10r2N5N7j26
$$ -12 10 96 15 16 -53 -29 -73 -77 -41 -24 -56 -47 -1 85 -13 -56 -32 30 -29 -32 63 -2 -11 31 79 47 -42 68 -24 31 88 -38
8030c8j1l4R2lO8l4P5j97J14j00R7o4J1qR0N8r1k5M0p0L0k8J03j16R8Or6R7j30
$$ -38 -49 -83 9 6 74 40 115 -82 32 -68 29 -35 -24 -32 58 116 25 0 40 -30 0 -28 75 -41 57 63 -33 64 -66
8059f6K01j31P7q4l8J18m3j7l4p0J5J7N8K5L4j79J09l3K8M8l0k8J9Q1q0R0j00
$$ -66 135 4 81 -3 -41 77 34 17 -17 -87 -72 -55 3 28 62 -117 -8 -41 -13 35 5 -23 -4 77 -3 87 -13
8086a3j9j8Q8J6l0J3j07K5J20l1o2K6l5j7k1J01l9l2kJ68j64J11L7q4p6L1JR4
$$ -13 -32 -50 38 54 24 37 -70 -45 75 44 -18 8 -27 -44 -65 36 -3 -35 -37 131 -33 78 115 31 -45 -14 -13 81
8114H1n6j47J06M1j2p2J28k2p8O4l2p9O2o3J80o2kn6Njk3Q2J9j25K1J7R2k0M8
$$ 81 25 -122 -16 25 13 -59 69 47 -31 33 1 -78 -16 -79 101 39 37 -19 -14 -15 -38 44 63 -62 -41 -24 68 48 96
8143I6n8K3mo2j2j8JN7J2K2j03%O1J73k57L2Q0j83J09kK1k1K4J03q4O3j15N0l3
$$ 96 38 61 57 -5 -17 -35 -34 23 35 57 -46 -46 15 188 -69 -37 43 -140 -31 -33 -12 -33 -9 94 10 73 -42 8 -25
8172b5L8L7L2j26q1J23l3L7qJ7r1J8P2j6N0r2J39n4o6
$$ -25 13 50 82 -44 -125 -2 -35 2 -6 11 -80 -62 10 -6 44 -48 91 37 -29
8191b9
$$ Imaginary data points
##PAGE= N=2
##DATA TABLE= (X++(I..I)), XYDATA
0@%%%%%%%%%%%%%%qJ6j6J6j6K4l2L2m0M8n6O4p2Q8j00J12j28J48j68J88k12K40
$$ 0 0 0 0 0 0 0 0 0 0 0 0 0 0 0 -8 8 -8 8 -8 16 -16 16 -24 24 -32 32 -40 48 -52 60 -68 80 -88 100 -112 128
36A28k72L04l40L81m23M70n24N80o40P07p82Q63r51J047j152J270j402J546j705
$$ 128 -144 160 -180 201 -222 248 -276 304 -336 371 -411 452 -499 548 -604 666 -736 810 -895
55h95J886k093K327k596K913l288L744m310N037o006P367r441J3010k0791O7051
$$ -895 991 -1102 1225 -1371 1542 -1746 1998 -2312 2725 -3281 4086 -5355 7655 -13136 53915
70E3915m1261o2668J44820n0092n4469P9566k7840n7677N8032o7158n3130R0887
$$ 53915 12654 -50014 94806 44714 -9755 69811 41971 -15706 42326 -24832 -77962 12925
82A2925J997o6528J9676l525j5168J66J949M0317N193k1201N6061j8559n1466
$$ 12925 14922 -51606 -31930 -35455 -50623 -50457 -48508 -8191 -2998 -24199 31862 13303 -38163
95c8163Q1905J0644o2920O9714J290q4303M5527J7213n8160L2634J0103m4953
$$ -38163 43742 54386 -8534 61180 62470 -21833 23694 40907 -17253 15381 25484 -19469
107a9469N320n392j2055J6534n710J1239K437l5324L5405K8828m9761L3441M1692
$$ -19469 -14149 -19541 -31596 -15062 -20772 -9533 -7096 -42420 -7015 21813 -27948 5493 47185
120D7185n9945J2511L7511n0902J7665L7458m9179N921K4558l8599L699J2877
$$ 47185 -12760 -249 37262 -13640 4025 41483 -7696 -1775 22783 -15816 -12117 760
132G60j4364J7294q821j4379K1399k2267k659M1689k2282l497L7980l4456r421
$$ 760 -13604 3690 -5131 -19510 1889 -20378 -23037 18652 -3630 -7127 30853 -3603 -13024
145a3024M1215k5201l779L5570l0811j2396K4880k4551l562J9493k0180N539J0040
$$ -13024 28191 2990 -789 34781 3970 -8426 16454 -8097 -11659 7834 -12346 -6807 3233
158C233k3638J2713O754j9200K3443K058j7765K8463q807k3500L1833p178j7269
$$ 3233 -20405 -7692 -938 -20138 3305 5363 -12402 16061 7254 -16246 15587 8409 -8860
171h860L1346j5310j7948K7664j7443j2831K6404j6111q940J9045j6649j177J6358
$$ -8860 22486 7176 -10772 16892 -551 -13382 13022 -3089 -12029 7016 -9633 -10810 5548
184E548j6463M799J3089j5790J1647Q792k0446J4615N824k1701K0072L858k4986
$$ 5548 -10915 -6116 6973 -8817 2830 11622 -8824 5791 11615 -10086 9986 13844 -11142
197a1142J9311L59k3541K1082j088k0261J8715n878j3457J9453p316o186J6754
$$ -11142 8169 8528 -15013 6069 4981 -15280 3435 -2443 -15900 3553 -3763 -9949 6805
210F805j1869R66J6838j5086M211J3417j9701O438J3140k0872P131J1516k1277
$$ 6805 -5064 -4098 12740 -2346 1865 15282 -4419 2019 15159 -5713 1418 12934 -8343
223h343P019J0291j9015Q115O293j8121J0785M702j3960J2413j293j0782J7158
$$ -8343 -1324 8967 -10048 -1933 4360 -13761 -2976 1726 -12234 179 -1114 -11896 5262
236E262m649p647J8943j0000p211J7937j2251l223J7568j5542k778J4552j4487
$$ 5262 613 -7034 11909 1909 -5302 12635 384 -2839 14729 -813 -3591 10961 -3526
249c526Q05J1531j4543K431Q802j3419N350O289j2865P932M298j1935J1286K315
$$ -3526 -2721 8810 -5733 -3302 5500 -7919 -2569 3720 -9145 -1213 3085 -8850 2436 4751
263D751j2999J2043l51j1345J4664k897j1528J4485n691q155J5451q033n812J3261
$$ 4751 -8248 3795 3444 -7901 6763 3866 -7662 6823 1132 -7023 8428 395 -5417 7844
277G844j0326k134J2455j1451Q48R252j2284L938Q368j1977N468N070j1859P583
$$ 7844 -2482 -4616 7839 -3612 -2764 6488 -5796 -1858 6510 -5467 1 5071 -6788 795
291G95M357j1441Q011K227j1169R508J672j0001J0047j282r072J1592l251p169
$$ 795 5152 -6289 1722 3949 -7220 2288 3960 -6041 4006 2724 -6348 5244 1993 -5176
305e176J1578o246n562J1612p987k113J0539j0957n5J0096j0539K186P649j0906
$$ -5176 6402 156 -5406 6206 -1781 -3894 6645 -4312 -4367 5729 -4810 -2624 5025 -5881
319e881M384N904r656N990M155r654O118K726p808P603L05q487P816n88p019Q778
$$ -5881 -1497 4407 -5249 741 4896 -4758 1360 4086 -3722 3881 4186 -4301 3515 2927 -4092 4686
335D686k992p142R471m454n243J0278o034m007R635p690o39R682q718N63P058
$$ 4686 1694 -5448 4023 -431 -5674 4604 -1430 -5437 4198 -3492 -4131 5551 -3167 -2604 4454
350D454q425L843N622r140M338L436p894N657J497p103O508m98p621P781P2o863
$$ 4454 -3971 -128 5494 -3646 692 4128 -3766 1891 3388 -3715 2793 2295 -5326 2455 2527 -4336
366d336P046j981o007Q926k051o047P794l260l839P790m815j573O744o961M18
$$ -4336 2710 729 -5278 3648 1597 -4450 3344 84 -3755 4035 -780 -2353 4391 -2570 -2152
381b152O070p410L276M132r274M991M224q562N338K702q262N952K184o534M939
$$ -2152 3918 -3492 -216 3916 -5358 -367 3857 -4705 633 3335 -4927 1025 3209 -3325 1614
396A614J277n423M325L1l178M803k663l144N620l940j622O431o500j585Q016o967
$$ 1614 2891 -2532 1793 1824 -1354 3449 786 -2358 3262 -678 -2300 4131 -2369 -3954 4062 -2905
412b905q51Q142p542n05O931o428J664N475o236J750K293m114M578q6l933N199
$$ -2905 -3756 4386 -3156 -3661 3270 -3158 -1494 3981 -2255 -505 1788 -2326 2252 2166 -1767 3432
428C432k229m129O272k239m113O367k662m297O550k866m422O362k120l104N941
$$ 3432 1203 -2926 3346 1107 -3006 3361 699 -3598 2952 86 -4336 2026 -94 -3198 2743
443B743k952k422M190m076R49N281m961J354K789o332L741K414n552M994O13o286
$$ 2743 -209 -2631 1559 -2517 -1568 3713 -1248 106 2895 -3437 304 2718 -2834 2160 2773 -3513
459c513M636j1m257N265j174m065N078j297l224M189j455k372M584k060k298M143
$$ -3513 1123 1112 -3145 2120 946 -3119 1959 662 -2562 1627 172 -2200 2384 324 -1974 2169
475B169k289j343L754k896k12L227m771J449L653m918K938J784p097L988K808
$$ 2169 -120 -1463 2291 -605 -817 2410 -2361 -912 2741 -2177 761 2545 -4552 -564 2244
490B244n572M546J576o053L259L71l289M422Q33k338J514j976n97K462k267J221
$$ 2244 -3328 1218 2794 -3259 0 371 -2918 1504 2337 -1 1513 -463 -1060 1402 -865 356
506C56L367m191k09L184n191Q5N734m391k20N064n648j555M426l360J131L971
$$ 356 3723 -468 -677 2507 -2684 -2599 3135 -1256 -1476 3588 -2060 -3615 811 -2549 -1418 2553
522B553k770M67n81k064L697r86j324M793l135k154M947l505j959N523k791k736
$$ 2553 -217 250 -331 -2395 1302 316 -1008 3785 650 -1504 3443 -62 -2021 3502 711 -2025
538b025M443j831k603K383j650j224K957q19p17J532j899O80J273k657K736J627
$$ -2025 2418 587 -2016 367 -1283 -2507 450 -369 -1086 446 -1453 -773 500 -2157 579 2206
554B206l991L089R61m231L624K19m158M152Q3k900L204k227k911L410j262q33
$$ 2206 -1785 1304 2265 -1966 1658 1877 -2281 1871 1954 -946 2258 31 -2880 530 -732 -1565
570a565L116j479j417J287j715J88K717j130k2J273j714P16R66k588K082J597
$$ -1565 1551 72 -1345 -58 -1773 -1585 1132 2 -20 1253 -461 255 1221 -1367 715 2312
586B312l454K670Q08m931K741J148m597L710J867l835J616R6k316J740K24N6J212
$$ 2312 -1142 1528 2336 -2595 146 1294 -3303 407 2274 -1561 55 151 -2165 -425 -201 -145 1067
603A067j742J498L84l471K258J892l709K205L154m607j32L193l929o02M937j576
$$ 1067 -675 823 1207 -2264 -6 1886 -1823 382 3536 -1071 -1203 1990 -1939 -2541 2396 820
619H20j744K412j768j720J633O65R41q63J88J823l838o17N027l566j339N680l554
$$ 820 -924 1488 -280 -2000 -367 298 1239 376 564 2387 -1451 -2068 2959 -607 -1946 3734 180
636A80l165M427k120k836M166N07k371O43O48j314p60J877J760j641m50K400j660
$$ 180 -2985 1442 -678 -3514 652 1159 -1212 -569 79 -1235 -1995 -118 1642 1 -449 1951 291
653B91k259M136K23m131L487Q65m909L005K099m714J505J848k748L85R07l05l68
$$ 291 -1968 2168 2391 -1740 1747 2612 -2297 708 2807 -1907 -402 1446 -1302 -917 -10 -315 -683
670f83j049J507J84k473K747Q82l336K700J621l731J103K535k371K38K875k124
$$ -683 -1732 -225 -41 -2514 233 1115 -2221 479 2100 -1631 -528 2007 -364 -126 2749 625
686F25j451J560p96n18J697o1m13j096q13J686j242j31K805k325j470L002j886
$$ 625 -826 734 -62 -580 1117 1056 643 -453 -1266 420 -822 -953 1852 -473 -1943 1059 -827
703h27j122L425j689q68K252j207m75Q91o62L63K93k29Q78o43j104J117j30p32
$$ -827 -1949 1476 -213 -1081 1171 -36 -511 380 -282 81 374 145 1023 380 -724 393 263 -469
721d69J331K2j843J031N42j687J572M67j892J245K24j535J629n25q81J463j390
$$ -469 862 884 -959 72 614 -1073 499 966 -926 319 543 -992 637 112 -769 694 -696
738f96R2J676j834K34J161j783J101P24j493R53K70j117Q16M42p88O25j56o11
$$ -696 -604 1072 -762 -528 633 -1150 -49 675 -818 135 405 -712 104 546 -242 383 227 -384
756c84R56L03j078N64P9j138J211O1j285J187m05j231J610m88p38J334j467k3
$$ -384 572 875 -203 361 440 -698 513 574 -711 476 71 -1160 450 -38 -776 558 -909 -932
774i32J630j424M34R58j591R48N56j055Q99K04j114R99No11P53j85o37K30J46
$$ -932 698 -726 -292 666 -925 23 579 -476 423 627 -487 512 517 -94 659 474 -163 67 213
793B13m74M64k7j028Q69J19r66J099m54q77J397o20l63J431j083j41J244j364
$$ 213 -261 203 176 -852 17 136 -830 269 -185 -1062 335 -285 -648 783 -300 -441 803 -561
811e61P66O58j325P17K52j004J081jj055O94l42k40O36j82m50J88K6m72N85J55
$$ -561 205 863 -462 255 507 -497 584 583 -472 222 -120 -360 276 94 -356 -168 -142 -614 -29 126
831A26o15N12j08o57J240k07q10J083p72r1J265j210K09Q54j408O17N64j004R67
$$ 126 -489 23 -85 -742 498 291 -519 564 -208 -299 966 -244 -35 819 -589 28 592 -412 555
850E55l04r72J079j45l92M83l79k60M95j73j52K78j58l84L32K67n22N65k29o32
$$ 555 251 -721 358 213 -179 304 -75 -335 160 -13 -165 113 -45 -429 -97 170 -352 213 -16 -648
870f48P55j23l16R50q18j33P97p18L64N83j216Q40L46j187J038J06p98O03l68
$$ -648 107 -16 -332 618 -200 -333 464 -254 110 693 -523 317 663 -524 514 620 -178 425 57
889E7k53N47k42l92R7k1L23j61l28R8n4j95l3P92k49n15Q18n49l16J445q53m07
$$ 57 -196 351 109 -283 -186 -207 116 -45 -373 -275 -329 -524 -557 235 -14 -529 289 -260 -576 869 16 -391
911c91J114q44p1Q31m78J40r5m75R44o77k86J155j223l41J190p69k35Q24n57o95
$$ -391 723 -121 -192 639 161 301 206 -269 675 -2 -288 867 -356 -697 493 -276 -511 313 -244 -939
931i39P63M17q45K02P20o60o5N70n7k37R9K25L90o36Q22K6j589J012O87j524J095
$$ -939 -176 241 -604 -402 318 -342 -407 163 106 -131 -32 193 583 -53 769 795 -794 218 905 -619 476
952D76O07j802M18M61n22J87PJ94m02m27Q80j97o61Q38J76p58O54M51p37k94J078
$$ 476 1083 -719 -301 160 -362 -175 -168 26 -376 -803 77 -120 -781 57 233 -525 129 580 -157 -451 627
973F27l54n55J133l38j125R06m9n88N07l2o8l12k16R33o95o01J380p99l95J503
$$ 627 273 -282 851 513 -612 294 245 -343 164 132 64 -248 -464 469 -226 -827 553 -246 -641 862
993H62n73p59O83l19l58L46O20j98n64K61J7o47M31O00l14l21K82L17p62J63Q71
$$ 862 289 -470 213 -106 -464 -118 502 304 -260 1 18 -629 -198 402 88 -233 49 366 -396 -233 638
1014F38j007L45J156j139r8N21q50L18M21o2L00r25j14N53q31M94O90r07R1L89
$$ 638 -369 -24 1132 -7 -105 416 -434 -116 305 243 543 -382 -496 57 -774 -280 410 -497 -406 -17
1034a7j76q7L68L22n15J70O60m88j70N34l52l20K17M11r8o53L51%j116R73K13
$$ -17 -193 -280 88 410 -105 65 725 237 67 601 249 -71 146 557 459 -194 157 157 -959 14 227
1055B27j223R39M99j134K62L92l06p6L99O98k19o30Q06q03m97J392O0n83L36P5
$$ 227 -996 -57 442 -692 -430 -38 -344 -420 -21 677 458 -172 634 -169 -666 726 786 203 539 614
1075F14j048k32J008j55n48P73k15j017M78K67m49M26J55J77m57j23P96r44J2
$$ 614 -434 -666 342 187 -361 412 197 -820 -342 -75 -524 -98 57 234 -223 -346 450 -494 -482
1094d82J498p63m15Q98p91m67N88L20j77j28Q4o1o89P02J88o85L52K56k56m0L72
$$ -482 1016 253 -162 736 -55 -522 66 386 209 81 165 104 -585 117 305 -380 -28 228 -28 -68 304
1115C04P4q02J45O26o28L30P64j046j71L65n08L62K07QQ3m92L10L00q27P07L89
$$ 304 378 -424 -279 347 -281 49 813 -233 -404 -39 -547 -185 22 30 113 -379 -69 231 -596 111 500
1136E00m89L96j8m31Q1r8L53O0j2K08n62n04L52P6m4L2OP7p57M16L64o89M88L60
$$ 500 11 407 389 -42 39 -59 294 354 342 550 -12 -516 -164 -88 -132 -100 -94 -17 -774 -358 6 -683 -195 165
1160A65o52N32L05o65K74LJ94J89l56O98m68n90P04on75O85r3n15J84J64j74k47
$$ 165 -487 45 350 -315 -41 -38 156 345 -11 687 219 -371 333 327 -248 437 344 -171 13 177 3 -244
1182b44K41Q3p32O30L44p10O1NJ09N3Q1M93m03m13O97l75k43J021n04l19N87l16
$$ -244 -3 80 -652 -22 322 -388 -327 -322 -213 -160 -79 414 11 -402 295 -80 -323 698 194 -125 462 146
1204A46j07K25L9L4m00K50L16o92P6M08o93K38L72l07l80K35J09l79K14N94o16
$$ 146 39 264 303 337 -63 187 503 -189 -113 295 -398 -160 212 -95 -475 -240 -131 -510 -296 298 -318
1225c18j22O79n28K98L70k52k8o9K25O5l58M15m0n86M23J46m51K56pl97J61J4
$$ -318 -440 239 -289 9 379 127 99 30 255 320 -38 377 337 -249 174 320 -131 125 118 -279 -118 -104
1247a04J27j03q2J92m23L18K46l78q0K39j22J97j85L31j34l93M95J15m32O09l19
$$ -104 23 -80 -162 30 -393 -75 171 -207 -287 -48 -170 27 -158 173 39 -354 141 256 -176 433 114
1268A14l43O10l39J11J71l55L06k55n7L82k47j31K44m29J38K0j77J09j77J52M8
$$ 114 -229 381 42 153 324 -31 275 20 -37 345 98 -33 211 -218 -80 -60 -237 -128 -305 -153 -105
1289a05j72K56j91p4M13j78L2K42k42J64K7m7L69k37j23L39n64L29J43o00K28
$$ -105 -277 -21 -212 -286 127 -51 -19 223 -19 145 172 125 494 257 134 473 -91 238 381 -219 9
1310Imk75K38j60o5J79l86R7K23j23L24l06n8L09r3K22k6K0P7j05M4K56k68K40
$$ 9 5 -270 -32 -192 -257 -78 -464 -367 -144 -267 57 -249 -307 2 -91 131 105 125 202 97 141 397 129 369
1334C69j63m52M23j36r5L18n42J23L06m25K78j3m65N03r4NJ31k72J54O3j23K71
$$ 369 206 -246 177 41 -54 264 -278 -155 151 -274 4 -9 -474 29 -65 -60 71 -201 -47 16 -107 164
1356A64j56K8M8k96K39J75j95J25k30N6K41k89L53j65l48M76j47n5K34k61M0p9
$$ 164 8 36 84 -212 27 202 7 132 -98 -42 199 -90 263 98 -250 226 79 24 258 -3 37 -42
1378d2q7K74j42k07J98l44Q4K98j70J5M8j28J40Q1L8K2j82M05j34j02L92j85k77
$$ -42 -129 145 3 -204 -6 -350 -266 32 -138 -123 -75 -203 -63 18 56 78 -104 301 167 65 457 272 -5
1401eJ66j76K29j01j83K43l98J9L61n35K54J53n11J61J68q1K65j67RJ48j52K61
$$ -5 161 -15 214 113 -70 173 -225 -206 155 -380 -126 27 -484 -323 -155 -236 29 -138 -129 19 -133 128
1423A28O6k66K89k16Q6K71j70Q6j32o1J90l27L2K73m44J74Q0k72J31j60l8K58
$$ 128 194 -72 217 1 87 358 188 274 142 81 271 -56 -24 249 -195 -21 59 -213 -82 -242 -280 -22
1445b2k18K08O6l46J57mp3M70j69k6r3NK46j02j52L77k66p7L98m24J71M5j29O5
$$ -22 -240 -32 34 -312 -155 -159 -232 238 69 43 -50 -45 201 99 -53 324 58 -19 379 -45 126 171 42 107
1469A07l5J45j56m00L16m2k75L77k5j89N9k57L13pj23L89l89m1N53k84k08N10
$$ 107 72 217 61 -339 -23 -65 -340 37 12 -177 -118 -375 -62 -69 -192 197 -192 -233 320 36 -172 338
1491C38k90j91L01J50m7k87J94j2l65L80O3m38L19j6m28J75K36q7k20K37K08p03
$$ 338 48 -143 158 308 261 -26 168 156 -209 171 234 -204 115 99 -329 -154 82 -5 -225 12 220 -483
1513d83K20N04o49Q9O26l58j74K92j69r8Q1N54k17l78N15k26m11N15J65m66L31
$$ -483 -263 241 -408 -319 307 -51 -225 67 -102 -200 -119 435 218 -160 355 129 -282 233 398 -68 263
1534B63K2k90q2K84L1o82M28K27o16K14M03m76n1K40J0j57j5L53k46j77N62o7
$$ 263 285 -5 -87 197 228 -454 -26 201 -415 -201 202 -274 -325 -85 -75 -232 -247 106 -140 -317 245 178
1556A78k42N16k23j97L11j86p0q9R1J75l29J68Q1n06K1K10k35K68M1p4q3j49J97
$$ 178 -64 452 229 32 343 157 87 -2 89 264 -65 103 184 -322 -301 -91 -326 -58 -17 -91 -174 -323 -126
1579a26R6q8M13l21o0L08l55J88m9m0L38j89j12K05l48m9L60j63J32j5k36l0q2
$$ -126 -30 -118 295 -26 -86 222 -133 55 6 -34 304 115 3 208 -140 -189 171 8 140 125 -111 -141 -223
1602b23L71J25m04K29p4l65L99Nr3O5K1j49k5O4K09l99L4M61l65R5L49k29n9n4
$$ -223 148 273 -131 98 24 -341 58 63 -30 35 56 -93 -118 -54 155 -244 -210 251 -114 -19 330 101 42 -12
1626a2J49J7j22K33J0m63N09j46m27K56N9k73K07l8o6j92m1K28k69L41K37m20
$$ -12 137 154 32 265 275 -188 321 175 -252 4 63 -210 -3 -41 -107 -299 -340 -112 -381 -40 197 -223
1648b23kK77j48N7K45J6n7k21L75j53j62M79l24k49K50p6k85J83j37P8j05J02
$$ -223 -225 52 -96 -39 206 222 165 -56 319 166 4 483 159 -90 160 84 -201 -18 -155 -77 -182 -80
1670h0K18m77J12K40l90L48N8j33J18P5Mo9L2J20q1j73K81p6j38L02l38M2P7j57
$$ -80 138 -339 -227 13 -377 -29 29 -104 14 89 93 24 56 176 95 -78 203 127 -11 291 -47 -5 72 -85
1694h5L08k38r8J41k76K46Pj88M05j92k47K18j90J57O3j60R0J1j7J15k54K10J37
$$ -85 223 -15 -113 28 -248 -2 5 -183 222 30 -217 1 -189 -32 31 -129 -39 -28 -45 70 -184 26 163
1717A63k03K17k7j29J64j97P7K48k23R5j35j34K08n8j11K04l18P7K2j70K58r1
$$ 163 -40 177 150 21 185 -12 65 313 90 185 50 -84 124 66 -45 159 -159 -82 -60 -230 28 -63
1739f3j74J31j8O9O5j25Q5m1o5M76k87k2J53j67J38m8l8J24k17J68j65q6K30m9
$$ -63 -237 -106 -124 -55 10 -115 -30 -71 -136 340 53 31 184 17 155 107 69 193 -24 144 -21 -107 123 74
1763G4k75K12n4k3K19l81J87l6p5P6M7q7K39k61R4J41k25K09ko5O0l6J75o6k36
$$ 74 -201 11 -43 -66 153 -228 -41 -77 -152 -76 -29 -116 123 -138 -44 97 -128 81 79 14 74 38 213 147 -89
1788h9K83j88J7L35k44j19R9j24L5L4k19J93k07l3K57k54N3J01k82L85k9j41J57
$$ -89 194 6 23 358 114 -5 94 -30 5 39 -180 13 -194 -227 30 -224 -171 -70 -352 33 4 -137 20
1811B0j78J40Q5j33K83j66N3K47k83R1q1n4j0k6q8J36j51Q7N1l65K87R2j58J54
$$ 20 -158 -18 67 -66 217 51 104 351 68 159 78 24 14 -12 -100 36 -115 -28 23 -342 -55 37 -121 33
1835C3j08j2R4j13J36O5k06J60m9O9J12k18J51J8q1L2N3o3R6k02k5K29k25J25
$$ 33 -75 -87 7 -106 30 95 -111 49 0 69 181 -37 114 132 51 83 136 73 169 -33 -58 171 -54 71
1859G1p2o2J40j29l5J83k14R6o5o1J59j39N2m0N0J23rj52J92p6q1K57k36K06J62
$$ 71 -1 -63 77 -52 -87 96 -118 -22 -87 -148 11 -128 -76 -116 -66 57 48 -104 88 12 -69 188 -48 158 320
1884C20m11K32K7k03K83j28p3k8o4K60k29k20K41j09j9J11j77J29o6J9J37k41
$$ 320 -91 141 168 -35 248 120 47 19 -45 215 -14 -234 7 -102 -121 -10 -187 -58 -124 -105 32 -209
1906b09N2K98k94J64Q2j65K67j10J1R3j89J80k4j72K98k15k59K73o7j91J17p8
$$ -209 -157 141 -153 11 93 -72 195 85 96 189 0 180 156 -16 282 67 -192 81 14 -177 -60 -138
1928a38J30j17L2K0q0J77N0l25K19N5j34O9N3Q2Kj66K09j34o0K73k67O5J04j15
$$ -138 -8 -125 -93 -73 -153 24 74 -251 -32 23 -111 -42 11 93 95 -71 138 4 -56 217 -50 15 119 4
1952Dl5J96o8lp6n5Qj85K44k9k07J30J11l52L32o2k8Q6j33J90j89k6L23k03J9
$$ 4 -31 165 97 94 18 -37 -29 -214 30 1 -206 -76 35 -317 15 -47 -75 11 -122 68 -121 -147 176 -27 -8
1977hK54j44m3O3j03N2k9K1O9l04K21Lj92K40o2k10K69j75j43J85n2P1r0R8J16
$$ -8 246 102 59 122 19 71 42 63 132 -172 49 52 -140 100 38 -172 97 -78 -221 -36 -88 -17 -107 -9 107
2002A07k46J38R8k86J93M8r7J99q0L0L7j61J41n0J9M0j25M1J46k76J22j2j84K20
$$ 107 -139 -1 97 -189 4 52 -45 154 74 104 141 -20 121 71 90 130 5 46 192 -84 38 26 -158 62
2026F2m5j15K30k59q2J14o8K58k35P9J88l30J72K10j34J3J08m9o6L2P3r9q0L53
$$ 62 17 -98 132 -127 -209 -95 -163 95 -140 -61 127 -203 -31 179 45 58 166 117 51 83 156 57 -23 330
2050C30k97k02K84j18k19L29j45j03mJ9Q7j79J36K16m29L01J70l03J70J06k69
$$ 330 33 -169 115 -3 -222 107 -38 -141 -145 -126 -39 -218 -82 134 -295 6 176 -127 43 149 -120
2071a20R1J41L8j06m9L17k97j82N11l86j25L77r3k27N6J72j78j29J57P2l92M83
$$ -120 -29 112 150 44 -5 312 15 -167 344 -42 -167 210 117 -110 -54 118 -60 -189 -32 40 -352 131
2093A31L5m95K60J25j63M9J27J37l38J3L61l30P8L81m63j8K47j23L6N3J01j92
$$ 131 166 -329 -69 56 -107 -58 69 206 -132 -119 242 -88 -10 371 -92 -110 137 14 50 103 204 12
2115A2j26J64j0k67K47pj87K56k9k04J83j18q7L6j0J89p2m1K63k84O5J24j33J12
$$ 12 -114 50 40 -227 20 13 -174 82 53 -151 32 -86 -173 -137 -147 42 -30 -71 192 -92 -27 97 -36 76
2139G6M5JP8j66L3K4j95L10j34j51J11J8j95J36J1N7M1j48j1o2O3J99k21M6J20
$$ 76 121 122 200 34 67 91 -104 206 72 -79 32 50 -145 -9 2 59 100 -48 -59 -121 -58 141 -80 -34 86
2164H6k45K20j12j1J70j32J04O1j21K6n2j3L7J1JM3j92J26M7j75K76j85j16J82
$$ 86 -159 61 -51 -62 108 -24 80 141 20 46 -6 -19 18 29 30 73 -119 7 54 -121 155 -30 -146 36
2188C6p0L4j70R5J50j77N9J58k61J82L4j40j7J63k3N4n8O7kk19K06L1k37K37j18
$$ 36 -34 0 -170 -75 75 -102 -43 115 -146 36 70 -70 -87 76 53 107 49 116 114 -105 101 132 -105 132 14
2213A4n8J75j95J18j30o9K79k99J11O5k63K30M0k24K07O6nj93j1K65r2m1J18j87
$$ 14 -44 131 -64 54 -76 -145 134 -165 -54 11 -252 -22 18 -206 1 67 62 -131 -142 123 31 -10 108 -79
2237g9Q6K10k16J1M6j51J02J44j37R1j55k5J37k45L07j71j64J80j20J14J14p6
$$ -79 7 217 1 12 58 -93 9 153 16 107 -48 -73 64 -181 126 -45 -209 -29 -149 -35 79 3
2259Cm1K3m6J40j00q2K45l02J83L1l8J7J49j21Oo5K14j02j90J55j07j1J94k12
$$ 3 -38 -15 -61 79 -21 -103 142 -160 23 54 16 33 182 61 67 2 216 114 -76 79 -28 -39 155 -57
2283e7M6Oj46J93n3j77J85p7j8J44j42J42M7k61J86K9lP1k17J94J22k42K41j52
$$ -57 -11 -5 -151 42 -11 -188 -3 -80 -98 46 -96 46 93 -168 18 47 44 115 -102 92 214 -28 213 61
2307F1q5K12k25P3Nj65K53k43m8J74m4JK1j09Q7qj03J91j29Q7J38j43Q9m6kJ55
$$ 61 -24 188 -37 36 41 -124 129 -114 -162 12 -32 -31 -10 -119 -32 -40 -143 48 -81 6 144 1 90 44 42 197
2333A97j52l1Q6j04K5j1j53K64j19p1R6r2N9J11j99J08Lj51J10j62K51j4j87J36
$$ 197 45 14 100 -4 21 10 -143 121 2 -69 27 -65 -6 105 -94 14 17 -134 -24 -186 65 51 -136 0
2357@J1m9J06p1O0N5k39K42L1j11O1%M8J9j20RJ10j26k0o3Q3L8j74P6J2j85K61
$$ 0 11 -38 68 -3 57 112 -127 115 146 35 96 96 144 163 43 52 162 36 16 -47 36 74 -100 -24 -12 -197 64
2384F4j00q1O9p8J37k7qP0n3qJ53k08Q3O2j89L22r8l2R5j42R1n3r1P8n2j55J86
$$ 64 -36 -117 -48 -126 11 -16 -24 46 -7 -15 138 -70 13 75 -114 208 110 78 173 31 122 69 -22 56 4 -151 35
2411C5j09MM3q1O9j15J17M6j09K6J92j85J31l5l5J6Q4j89M1N9LP2j08O8rm2J64
$$ 35 -74 -70 -27 -108 -39 -154 -37 9 -100 -74 118 -67 64 29 -6 10 94 -95 -54 5 8 80 -28 40 31 -11 153
2438A53k00L4J16j28P9p7k5J43j44K8nj02J11n1q8J63Kj31J52j15R9K3p4J17J8
$$ 153 -47 -13 103 -25 54 -23 -48 95 -49 -21 -26 -128 -17 -68 -156 7 9 -122 30 -85 14 37 -37 80 98
2463I8l6P8k06J46M8j36Q5k4j31J23o5oJ71k67J11N6j07Q4j59Q3Nj34K00L2k11
$$ 98 62 140 -66 80 128 -8 77 53 -78 45 -20 -26 145 -122 -11 45 -62 22 -137 -54 -49 -183 17 49 -162
2488a62K25o8l6J08O3K6j17l7J50j00o0J52j13J9N2j11O1m8qN2q6J47j95n7L38
$$ -162 63 -5 -41 67 130 156 39 2 152 52 -8 144 31 50 102 -9 52 4 -4 48 -38 109 -86 -143 195
2513A95k77j08R9N3j9o3mK01q3p2J71j54Q1O0o0J52o6j88J55roo1O0l5J6k34L50
$$ 195 -82 -190 -91 -38 -57 -120 -124 77 -6 -78 93 -61 20 80 20 172 106 -82 73 64 58 -3 57 22 38 -196 154
2540A54j40j77K33j88l1J44n8L4k2p8J29j44J22J36j14m2K20k07P9J8o8J5l6J28
$$ 154 14 -163 70 -118 -149 -5 -63 -29 -51 -129 0 -144 -22 114 0 -42 178 -29 50 68 0 15 -21 107
2564A07r3n4K15q8k55K69n6m8Kq6L3k2O3J08j94J52j63pJ54q6k3R4j49Q3J14p0
$$ 107 14 -40 175 87 -168 101 45 -3 -1 -87 -54 -76 -13 95 -99 53 -110 -117 37 -49 -72 22 -127 -44 70 0
2590@J11j17l5J60j29L9J90k96N6J19j23Q2j17j6K0J08m2K2j70N2J31j42J16j03
$$ 0 111 -6 -41 119 -10 29 219 -77 -21 98 -25 57 -60 -76 -56 52 10 32 -138 -86 45 -97 19 -84
2614h4O5P2j25L7J8n0J44r5N5M3r8J08mj34K04j15r0J00m3L0L9n6K4q6n4rJ02
$$ -84 -19 53 -72 -35 -17 -67 77 -18 37 80 -18 90 86 -48 156 41 -49 51 8 38 77 21 45 -41 -95 -104 -2
2641bm5M5j49J64l2j05K19m0QP7j41J2Qj6K24k79p3K00j70J56M9q8O0j01K7oj07
$$ -2 -47 -2 -151 13 -19 -124 95 55 63 140 -1 11 19 3 227 -52 -125 75 -95 61 110 22 82 -19 8 2 -105
2668a05K24k08j33J46NK2J21j15Kj8O6J14j38J3M6r7J60n8n7O2J0l6N5Rm6K4j10
$$ -105 119 -89 -222 -76 -71 -49 72 -43 -41 -59 7 121 -17 -4 42 -55 105 47 -10 52 62 26 81 90 44 68 -42
2695d2J80j54l4P7Oj37J53p2rN3m9k7j6N8k0q2J10l6q1Q3k8m5J35L3K7J5j34J68
$$ -42 138 -16 -50 27 33 -104 49 -23 -32 21 -28 -55 -71 -13 -33 -115 -5 -41 -122 -39 -67 -112 23 56 83 98 -36 132
2723A32q4K6rj3mJ6j02K36k64p9J98j09mR3j49Q4n0L5J26r4K9q1K8m3J29j74J71
$$ 132 48 74 65 52 48 64 -38 198 -66 -145 53 -56 -60 33 -116 -32 -82 -47 79 -15 14 -67 -39 -82 47 -127 44
2750D4L6r4J27k24J76jl6%M1r2J93k07m2P5j01J27j22J14O2j33P7L7r4K3qr6J22
$$ 44 80 -14 113 -111 65 64 28 28 69 -23 170 -37 -79 -4 -105 22 -100 14 76 -57 20 57 -37 -14 -22 -118 4
2777Dn4RoO3L2K9j30J59r8k0J08Oj4R7j98n8J08NP2k08J17j16J4J08n2j1J09j12
$$ 4 -50 -41 -47 16 48 77 -53 106 8 -12 96 102 88 185 -13 -71 37 42 114 -94 23 -93 -79 29 -23 -34 75 -37
2805c7M5p0j09J16JPJ15o5MJ43j93J01j5m2K9J1J3rl2J19M2j74J16j57O8R5j97
$$ -37 8 -62 -171 -55 -54 -47 68 3 7 150 -43 58 43 1 30 41 54 45 13 132 174 0 116 -41 27 122 -75
2832g5Q8j7O5j22qk4M3j18J43Q6j86J34mm2J16Jj19K01j86l1J21j5M9q9j7M8m8
$$ -75 13 -4 61 -61 -69 -93 -50 -168 -25 61 -125 9 5 -37 79 80 -39 162 -24 -55 66 51 100 11 -6 42 -6
2859fQ3mj73J88k4j49K08r4m3M7j51J22m5R4mn0o0L8J1J22q3J1N1j02k8J26q4
$$ -6 77 73 -100 88 64 -85 123 29 -14 33 -118 4 -41 53 49 -1 -61 -23 -12 110 27 38 89 -13 -41 85 1
2886AJ37q1j74K20j23Nk7Q3j04J5n2J58j09p7J65p1j05J18m8O5o3M4R6o2M6p4
$$ 1 138 57 -117 103 -20 -15 -42 41 -63 -48 -100 58 -51 -128 37 -34 -139 -21 -69 -4 -67 -23 73 11 57 -17
2912a7L7J6M9lo0o0K1J58k19N7L6j29J12L1K1j1l8J9P6j85J33p8L7l1r1J01M3
$$ -17 20 36 85 82 22 -38 -17 141 -78 -21 15 -114 -2 29 50 39 1 20 96 -89 44 -34 3 -28 -119 -18 25
2939B5n9J31k37J42L2p9N3J49k75J31J00p0L1l5j0J1j5Q1n5p5J53j91p8J14r8
$$ 25 -34 97 -140 2 34 -45 8 157 -118 13 113 43 74 39 29 40 25 106 51 -24 129 -62 -140 -26 -124
2964a24J13j9j6m6K1m9J80j71K13j26n6J25r1J9J52j26M2O8j57J22m3o5J80k16
$$ -124 -11 -30 -46 -92 -71 -120 60 -111 102 -24 -80 45 -46 -27 125 -1 41 109 -48 74 31 -34 146 -70
2988g0M3J27k20J03q5O9pm2J2J35j21P4O8q9J58k17Q3K7K0j43Q1p4J02K0n1K8
$$ -70 -27 100 -120 -17 -102 -33 -40 -82 -70 65 -56 18 86 -3 155 -62 21 48 68 -75 6 -68 34 54 3 31
3014C1q4K6J60j72N4j7OM8j53R3j6k3J4P0r9J6NK6Q0j39J2R9q5J01l6j5J2N6K2
$$ 31 -53 -27 133 -39 15 -2 4 52 -101 -8 -24 -47 -33 37 -62 -46 -41 -15 65 -74 -62 37 -48 53 17 2 14 70 92
3043I2q3J40r2k2L6r1L1r0J68r5j0M0o3M1p1k0J12j72J11M5p6L4pj09J55m6J3
$$ 92 9 149 57 35 71 -20 11 -79 89 -6 -16 24 -39 2 -69 -89 23 -149 -38 7 -69 -35 -42 -151 4 -42 -29
3070b9R4j07P3M6q4M9M2RM2j75J26K4j87M5J5L4l4K8M2k01J10P3m9l9R6q2L8q8
$$ -29 65 -42 31 77 -7 42 84 93 135 -40 86 110 -77 -32 -17 17 -17 11 53 -148 -38 35 -14 -53 43 -39 -1 -89
3098h9J2L2o4J13L2p1P7n1k0J34Qj55R3lM1j5j13O1q4R9M8k23J52L4j71P4rm5
$$ -89 -77 -45 -109 4 36 -35 42 -9 -29 105 113 -42 51 48 89 74 -39 22 -62 37 85 -138 14 48 -123 -49 -58 -103
3126a03P7J5j6P7o4R5j06PN2o6Q5M6q2m2J1L4Q8n6j00J58j24p3J41j27lO0r1N3
$$ -103 -26 -11 -27 50 -14 81 -25 -18 34 -32 53 99 17 -25 -14 20 108 52 -48 110 -14 -87 54 -73 -76 -16 -107 -54
3154e4j3n9O2N8J2j20J30K2p9L6N9lj2l3j12J62k5l8rkO5J5o8P0Lo6K0q1R3q3
$$ -54 -67 -126 -64 -6 6 -114 16 38 -41 -5 54 51 39 6 -106 56 31 -7 -16 -18 47 62 -6 64 67 1 21 -60 33 -50
3184e0jP4q1n6J69j11O5%j15N6j8m2N8k8O2Q0j01J22q2OJ20j90R0N4j94J76l7
$$ -50 -51 23 -58 -114 55 -56 9 9 -106 -50 -68 -110 -52 -80 -18 62 -39 83 1 7 127 -63 27 81 -113 63 26
3211B6O3p7k9K7J03j15n5J2l1O5Qq0O0J2j5nQ1j28qLM9l6R7l1K7J09j54l4L0J05
$$ 26 89 12 -17 10 113 -2 -57 -45 -76 -11 -3 -83 -23 -11 -26 -31 50 -78 -86 -83 -34 -70 27 -4 23 132 -22 -56 -26 79
3241G9RK0j60J42O8j88M0o6k7J74j36O1n6N4m8L6P9k8j20J09p9l5J49o2r3J15
$$ 79 88 108 -52 90 158 -30 10 -56 -83 91 -45 16 -40 14 -34 2 81 53 -67 42 -37 -72 77 15 -78 37
3267C7o1l5N2L2J59j67o8J37q9K9J28j58J45j93L5M1o8M7Mj67J13M8q4O0Qj15
$$ 37 -24 -59 -7 25 184 17 -51 86 -3 26 154 -4 141 -52 -17 24 -44 3 7 -160 -47 1 -83 -23 -15 -130
3293a30J68p2oJ8k7J14l7qJ18j64k3R5q2J01M4j50QJ28m3K2j37R3nj09J32j20
$$ -130 38 -34 -40 -22 -49 65 28 20 138 -26 -49 46 -36 65 109 -41 -33 95 52 74 -63 30 25 -84 48 -72
3319g2J26j63N7K4j3l3K3l1J11P6j10l0K4O3j8q6P8k3J1Q2m5o6R9o7j03J18L1
$$ -72 54 -109 -52 -28 -41 -74 -51 -82 29 105 -5 -35 -11 52 34 -52 26 3 14 96 51 -15 84 17 -86 32 63
3346F3k9n3N3J9k2j92J74l9J24k42N6P1K4o9J37j85P6R9j66Q9M5k6N1J2j09J26
$$ 63 34 -19 34 53 31 -161 13 -26 98 -144 -88 -17 7 -62 75 -110 -34 65 -101 -12 33 7 58 70 -39 87
3372H7Lj87J38n2%J9p0O7q1NK4K5Ll8P1qn6j0L7nO3M0j27M3L2p0J10p5L3N3k10
$$ 87 90 -97 41 -11 -11 8 -62 5 -76 -71 -47 -22 -19 -57 14 6 -50 -60 -23 -28 35 75 -52 -9 23 -47 63 -12 21 74 -136
3403a36L7J02o7Q3q2J19m7J1R2j20k0O5l6j50J69j15K02n3j15L7o4J09k8MoM2
$$ -136 -99 3 -64 19 -63 56 9 20 112 -8 -28 37 1 -149 20 -95 107 54 -61 -24 -88 21 -7 -3 -9 33
3429C3J06p7q1K4O1o9L6R6j48P3k1j25J42p1M5q3M2J4l9l0J9P3p8J14p9K6r1L6
$$ 33 139 62 -19 5 66 -3 33 129 -19 54 33 -92 50 -21 24 -59 -17 -3 -42 -72 -53 20 -58 56 -23 3 -88 -52
3457e2K6n9J31P7j45k5O7r0Q6O1P4o1r6K1J29o2mp3l5K5Rk4kl0L4n6m3J92l6q1
$$ -52 -26 -85 46 123 -22 -47 20 -70 16 77 151 90 -6 15 144 82 78 5 -30 -5 4 -20 -22 -52 -18 -74 -117 75 39 -42
3487d2J9J0n1J41j61P3J8p0J37jMNq2K7m4R6j1q1M9J0r9J69j64L1KK6Nm8m3J71
$$ -42 -23 -13 -64 77 -84 -11 7 -63 74 73 77 82 0 27 -17 79 68 -13 36 46 -53 116 -48 -17 -15 11 16 -32 -75 96
3517I6%q3p0j0L8L8k8R0Or9J36q4JJ0OQ2j17L7L3q4m5J32r2Q1m4p0N5j2q8K03
$$ 96 96 13 -57 -67 -29 9 -19 71 77 -22 114 30 31 41 47 129 12 49 82 -2 -47 85 -7 74 30 -40 15 3 -85 118
3547A18m9j3J9j77O9N7j03J15p6M0p3KJ20q3J01L6o3p1j5m6J31oK6K7o6l8n0o7
$$ 118 69 56 75 -102 -33 24 -79 36 -40 0 -73 -71 49 -34 67 103 40 -31 -46 -92 39 33 59 86 20 -18 -68 -135
3575a35J39n3JP5o7n4M2m9Q7k2N2K8q6N1lL4J8L0j00J07oj58J19J1j26O7j04J95
$$ -135 4 -49 -48 27 -40 -94 -52 -101 -14 -36 16 44 -42 9 6 40 58 88 -12 95 89 -69 50 61 -65 2 -102 93
3603I3k07K12j9n0k2m0M6o0k5MQ8p7R8J2j38J75o6L8n0N9m7L4j53J18J8n2P8O
$$ 93 -114 98 79 29 7 -33 13 -47 -72 -68 20 -57 41 53 -85 90 24 62 12 71 24 58 -95 23 41 -11 67 73
3631G3r5R5n3O5o3o4J39j63J7R0m6J4K9m3l1n3j2J36N5k28J58j10J24Q3r8L8j0
$$ 73 -22 73 20 85 22 -42 97 -66 -49 41 -5 9 38 -5 -36 -89 -101 35 90 -138 20 -90 34 117 19 57 47
3658D7j42J36j02O9J9q6m0J04J0p3k3M4p9R2J15j34N0j7roJ44j16j9o7l3J19O8
$$ 47 -95 41 -61 8 27 -59 -99 5 15 -58 -81 -37 -116 -24 91 -43 7 -10 -19 -25 119 3 -16 -83 -116 3 71
3685G1j38J32%Op0JlQ7j01O0K6j32K18j98K2m5N4K8Kj7l4l9K0M2o4P1j15J08q
$$ 71 -67 65 65 71 1 2 -1 86 -15 45 71 -61 157 -41 -19 -64 -10 18 20 3 -31 -70 -50 -8 -72 -1 -116 -8 -16
3714a6n1K4M4J0q5J15M5k6j55P0J3J18n5k8rJ5n7Q9p6N6J1k7J5j12J7O5Pj07L4
$$ -16 -67 -43 1 11 -74 41 86 60 -95 -25 -12 106 51 23 14 29 -28 61 -15 41 52 25 40 -72 -55 10 17 -90 -56
3743e6k6R8l6o0Q9Jm1R8n0O9j54P0O0q1jJ01P9j23q1J01j63J27l3O3lo2N1p6M0
$$ -56 -82 16 -20 -80 9 10 -31 67 17 86 -68 2 62 -19 -20 81 160 37 -44 57 -106 21 -12 51 48 -14 37 -39 1
3772Al4r9j9J17j2O0K5q2J08j04p1J12q7M9R2j56J29m0K0Nj8J0J3n4M7q5L5M2
$$ 1 -33 -132 -151 -34 -46 14 39 -43 65 -39 -110 2 -85 -36 56 -100 29 -11 9 14 -4 6 19 -35 12 -73 -38 4
3800DK2j4k4n9J38j50K3J19p6M5j8j95J43K9L9o0m7J39Lj02J12o7L6N4p6J8o9
$$ 4 26 12 -12 -71 67 -83 -60 59 -17 28 10 -185 -42 -13 26 -34 -81 58 61 -41 71 4 40 94 18 36 -33
3827c3P4l0q8P5pp9o3J42n1O4QN2j28J5L1Q7j10q9J65j03J10p2J7J22n2j12O2
$$ -33 41 11 -77 -2 -9 -88 -151 -9 -60 4 12 64 -64 -49 -18 69 -41 -130 35 -68 42 -30 -13 109 57 -55 7
3854GM9j00R6k7N9j50O8N3o9NM5j14P3j7N4j41R4k6O6r9J31p8Q9n5m4RK2p0%J6
$$ 7 56 -44 52 25 84 -66 2 55 -14 -9 36 -78 -5 -22 32 -109 -15 -41 25 -74 57 -21 68 13 -31 -22 0 -70 -70 -54
3884e4NN2rL3l1k2l3N5o6J32p3M9j35K2J00O7j16Rj9M4N8n5p9Q1j54R4p1J28P0
$$ -54 -49 3 -6 27 -4 -26 -59 -4 -70 62 -11 38 -97 -75 25 92 -24 -15 -34 10 68 13 -66 15 -139 -45 -116 12 82
3913H2n1m2L2r4Q9J48j46%l6mp5J81J1m1o1l1NJ6rJ27j20%n7R1j7J2J7n6M1Q9
$$ 82 31 -11 21 -73 16 164 18 18 -18 -22 -97 84 95 54 -7 -38 -33 -17 -26 101 -19 -19 -76 15 -2 10 27 -29 12 101
3943A01j39M7k0m8N1O4l9J4J3K7j0p6j0J34j67R4k2l0k6P5o9QknR7j27j8l2K29
$$ 101 -38 9 -11 -59 -8 56 17 31 44 71 61 -15 -25 109 -58 36 14 -16 -42 33 -36 -28 -30 -35 62 -65 -83 -115 114
3972A14k8j11O9j39M9N1R5q2q6J47oj47M9P5k1j07O7lP9Mj18J11j02L9j4j1m0
$$ 114 86 -25 44 -95 -46 5 100 18 -68 79 73 -74 -25 50 29 -78 -11 -14 65 69 -49 62 -40 -1 -15 -26 -66
3999f6o2Q5L0j40P7M7m1R3L3k1q2N1PJ7m0P8k8o0K4m2J5l1p1J30OrN8k4o7k8n3
$$ -66 -128 -43 -13 -153 -76 -29 -70 23 56 35 -47 4 11 28 -12 66 38 -22 2 -40 -25 -56 -127 3 9 0 58 34 -33 -61 -114
4030a14J44k2n3N3mK5O4j01Q5J7j53L9N5qJ14j06j04J59k1j3j5K9j18J15Oj76
$$ -114 30 8 -45 8 4 29 93 -8 77 94 -59 -20 35 27 141 35 -69 90 69 56 41 70 -48 67 73 -103
4056a03J22RK4j45J6L4k1M3n9R4o6k4QJ10rM2k7j98R4P5k2J59k63R0J14r4m1p4
$$ -103 19 28 52 -93 -77 -43 -64 -21 -80 14 -52 -76 -68 42 33 75 48 -150 -56 19 -3 156 -107 -17 97 3 -38 -112
4084a12J27on4R4p3N6q2K7q5oJ10j1n8J20o2J04q6J3j15Q9l8R4o2N2l3P1k0O9
$$ -112 15 9 -45 49 -24 32 -50 -23 -108 -114 -4 -15 -73 47 -15 89 3 16 -99 -10 -48 46 -16 36 3 74 54 123
4112A23j60J24n9j13O8J10r8j2J0pO8n2l4K8J4N3O9j71J3o4K1j7N0J02j15L2O0
$$ 123 -37 87 28 -85 -17 93 -5 -17 -7 -14 54 2 -32 -4 10 63 132 -39 -26 -90 -69 -86 -36 66 -49 -17 43
4139D3l2m8N2r0O7j0L3Q8j34nL5m4K3O5o4jL2m0M0m3L8j18J37jo4n0P0O4j20J27
$$ 43 11 -37 15 -75 -8 -18 15 103 -31 -36 -1 -45 -22 43 -21 -22 10 -30 10 -33 5 -113 24 23 -41 -91 -21 43 -77 50
4169E0l0rMr2K21j33m1Q0o7Rll0Rq3Q7K4o8Q0p5M3J09j26K4N7j49Q2JJ24j03m9
$$ 50 20 11 15 -77 144 11 -30 50 -17 -8 -11 -41 -32 -115 -28 -4 -72 8 -67 -24 85 -41 -17 40 -109 -27 -26 98 -5 -54
4199e4m9Q9p4J02Nn1O1JL0K5q7J9L1q0j2O1N7Pj25o3K55k26J9M8K1M8j02K3m1
$$ -54 -103 -14 -88 14 19 -32 29 30 60 85 -2 17 48 -32 -44 17 74 81 -44 -107 148 -78 -59 -11 10 58 -44 -21 -62
4228f2P0j9O0r8J28J8o7n3P0o4R0j09J29p0O2q3J0Q2j25j61K85j48q5R2qK5L3
$$ -62 8 -11 49 -49 79 97 30 -23 47 -17 73 -36 93 23 85 2 12 94 -31 -192 93 -55 -140 -48 -56 -31 2
4255Bm4n3l1Q5K6j8qj5J1K5k3M9RM8j35Q2j8O0j02m0J41j06Q9nrK2Nq4j8N2J0
$$ 2 -42 -95 -126 -41 -15 -33 -41 -56 -45 -20 -43 6 15 63 -72 10 -8 52 -50 -90 51 -55 34 29 20 42 47 -37 -55 -3 7
4286GP1p2m8k2n5J39j3q9J56k28J43M4j14LQ6l4L5n9K1J29l3r1R9q5L8K1J4l8
$$ 7 78 6 -42 -64 -119 20 7 -82 74 -154 -11 33 -81 -78 8 -26 9 -50 -29 100 67 -24 75 -10 28 49 63 25
4314B5q6L9l7O5p4Q2p8O3q7J56n2m9KJ5oL1r5J15Oj23J20J4k9O8j06O3J3o7lL3
$$ 25 -61 -22 -59 6 -68 14 -64 -1 -88 68 16 -33 -31 -16 -22 9 -86 29 35 -88 32 46 17 85 -21 42 55 -12 -15 18
4344A8j22J89q9N8M6j56nl1J41j30K4o0J35j28j0J91K2j60j20J79N3p8N3J12j98
$$ 18 -104 85 -4 54 100 -56 -61 -92 49 -81 -57 -117 18 -110 -120 71 93 -67 -187 -8 45 -33 20 132 -66
4369f6J21m4P2o3K3m7lQ1j78J14Mn2POj2O7M9m3j40M1R9q2N1M4M9k45J29O4M1
$$ -66 55 11 83 20 43 -4 -7 74 -104 10 14 -38 -31 -25 -37 30 79 36 -104 -63 36 -46 5 49 98 -147 -18 46 87
4398H7o6Pr2J77r0O2j87J11p7P1o6O9N9J3j44O9J1l5L5k7k6lJ29j14P5n3L3o8
$$ 87 21 28 -64 113 23 85 -102 9 -68 3 -63 6 65 78 -66 3 14 -21 14 -13 -39 -42 87 -27 48 -5 28 -40
4426d0N5j8pn7j1J36q2J05j62LN9p1m7J36k6pJ20j94J18J05j2k17Q2M1J7j4M5
$$ -40 15 -3 -10 -67 -78 58 -24 81 -81 -78 -19 -90 -137 -1 -27 -34 86 -108 10 115 103 -114 -32 9 26 12 57
4453E7j64K6J34p4n7J00j21M9R9n1M0m3q4J53n8N0J1Mj80Q2P6j3m7Pj4k9J03j9
$$ 57 -107 -81 53 -21 -78 22 -99 -50 49 -2 38 -5 -89 64 6 56 67 71 -109 -27 49 36 -11 -4 -18 -47 56 37
4481C7p2j5PM4nJj03J68j04p6J06k5N8%l0oQ5o3Ql0N6l4L3Pk2J6K0pn2k7O0p0
$$ 37 -35 -50 -43 1 -4 -3 -106 62 -42 -118 -12 -37 21 21 -9 -15 70 7 15 -15 41 7 40 47 25 41 61 54 2 -25 35 -35
4513c5J8L1Rj18j0Q6o5J99j02L1k4p1J52j47P3P9o0r0N9ml6O0k9Mq6N7mj7nR1
$$ -35 -17 14 23 -95 -105 -19 -84 115 13 44 20 -51 101 -46 27 106 46 -44 15 11 -25 35 6 10 -76 -19 -23 -40 -45 46
4543D6k0Q3j58J63m9j81J32j1L7m0j8LP4j06J68j53J15j09J26q5L6P9k58J13K9
$$ 46 26 109 -49 114 65 -116 16 5 42 2 -16 -13 61 -45 123 -30 85 -24 102 17 53 132 -126 -13 16
4568A6rq4pN7L6j9P0o7k2j8M3J0n5J7%P7j09L6M0k6o2L1J31m5oo9J4O4m3K7n8
$$ 16 7 -77 -84 -27 9 -10 60 -7 -29 -47 -4 6 -49 -32 -32 45 -64 -28 12 -14 -76 -45 86 41 35 -34 -20 44 1 28 -30
4599c0L6j0J1o4M7M0r8m0N0M5L5l3N8r1K7P1l4j1n2k7L8M9l0p1J34m6p2P0J34
$$ -30 6 -4 7 -57 -10 30 -68 -108 -58 -13 22 -11 47 -44 -17 54 20 9 -43 -70 -32 17 -13 -84 50 4 -68 2 136
4628A36j80QMQ4q0rM8O6j19J3nM5k5Q3N2j26J01j66MJ11k5j48K3K7J40j0n9O3
$$ 136 -44 -36 -32 52 -28 -37 11 77 -42 -29 -34 11 -14 69 121 -5 96 -70 -66 45 20 -128 -105 -78 62 52 -7 56
4656E6l4m9M9r2K5J42m5KK7j45R6n4O8p9J6OP8j02J6m3J4j44J53j0P9k1k9K3q8
$$ 56 22 -27 22 -70 -45 97 52 54 81 -64 32 -22 46 -33 -17 -11 67 -35 -19 -62 -48 -192 -39 -49 30 9 -20 3 -85
4685h5P1J52j70NJ5K4J4m3k4m4J39qm8j4%K9n6j1N4j01L3M1n0M8O4j23mM9M7j4
$$ -85 -14 138 -32 -27 -12 12 26 -17 -41 -85 54 46 -2 -16 -16 13 -43 -54 0 -101 -68 -27 -77 -29 35 -88 -92 -43 4 -10
4715a0%m6J16p0NM0o5K1N5J0Nm0o3k8N7L9p8M5pNJ08j26M3j9M4J2j24K9L8j2j6
$$ -10 -10 -56 60 -10 -5 35 -30 -9 46 56 61 21 -42 -70 -13 26 -52 -7 -14 -9 99 -27 16 -3 41 53 -71 -42 -4 -16 -32
4746c2L5J8K6n4mLL2k5JN3k5q4k1J35p4N2n6j9J06r2j29K53p6j55K14q8oM0O2
$$ -32 3 21 47 -7 -11 -8 24 -1 0 53 28 -56 -77 58 -16 36 -20 -39 67 -25 -154 99 23 -132 82 -6 -12 28 90
4775I0j00P7k03J06j4M1Jj0J7j4M2o5J35r5N2%j50J50o7o6M4K9O9r7L7j8n7q6
$$ 90 -10 67 -136 -30 -44 -3 -2 -12 5 -9 33 -32 103 8 60 60 -90 60 -7 -73 -29 0 69 -28 9 -9 -66 -152
4803a52J89K6j3j20J8K3O8q4Qp3J13n0Q0j4j78J48j8n3l3J97j19J53j1j23j1J4
$$ -152 37 63 50 -70 -52 -29 39 -45 -37 -110 3 -47 33 19 -159 -11 -29 -82 -115 82 -37 116 105 -18 -29 -15
4829a5j9L6j11K9L8M5P4r3j34J30j6mO0M4o6J5Q3j14Q5j61R3m7M2l4P7L0n0p7
$$ -15 -34 2 -109 -80 -42 3 77 -16 -150 -20 -36 -40 20 64 -2 13 96 -18 67 -94 -1 -48 -6 -40 37 67 17 -60
4857f0K01j08l0o1k6J02K4j39J36J3n8m2QL1J6M0k0K7j34j7J65j61nP9l8Q2n0
$$ -60 141 33 3 -58 -84 18 42 -97 39 52 -6 -48 -40 -9 7 47 27 54 -80 -97 68 -93 -98 -19 -57 25 -25
4884b5J65j61Q0q7M0Q7j41M5KqJ4O0Pj14R8p5m4J61j16L0N7p6rr8J48j52J26r9
$$ -25 140 -21 59 -28 12 99 -42 3 5 -3 11 71 78 -36 62 -13 -57 104 -12 18 75 -1 -10 -108 40 -112 14 -85
4912h5N0J03o0r7Q5PL7j80J44Oj1q0K4L4M3j8n5Q3j4J1P1o4j18O4L4l6o3M4M9
$$ -85 -35 68 8 -89 -4 3 40 -140 4 10 -1 -81 -57 -23 20 2 -53 30 16 27 98 34 -84 -20 14 -22 -85 -41 8
4941Hp6J23m5j13J55l1k7l1J56n8k3j27J20K8q3J20n0m9K3K2l7l4k9O0r8J03O5
$$ 8 -68 55 10 -103 52 21 -6 -37 119 61 38 -89 31 59 -24 96 46 -3 20 42 5 -29 -58 2 -96 7 72
4968G2j98O2L8L8l2J1j7O1j61J50K4l3mj5lMR5l6L8j47J9K6J1Jrp6J65q6j3k3
$$ 72 -126 -64 -26 12 -20 -9 -26 35 -126 24 48 15 11 -4 -7 -3 92 56 94 -53 -34 -8 3 4 -5 -81 84 -2 -15 -38
4998c8m6M4K8K3j1l3r4R5K1j7R2m1o2K6J99j78l2P1j4ll2j0M2l4m1M3Np8Q6j8
$$ -38 -84 -40 -12 11 0 -33 -127 -32 -11 -28 64 23 -39 -13 186 8 -24 47 33 30 -2 -12 30 -4 -45 -2 3 -75 11 -7
5028gP3n6P1j5m1j0r5O8J4L6o4M7j8M7m9L7l5Rl5L4L8l6Q2j64Q8j4L8r6J04p2
$$ -7 66 10 81 66 25 15 -80 -12 2 38 -26 21 3 50 1 38 3 12 -23 11 49 13 95 -69 19 5 43 -53 51 -21
5058b1L3O5k02J55n2Q8j31M9Nl7J18r4l2n6J03J4m4Q3m7k3M4p7J52m0j52K41j11
$$ -21 12 77 -125 30 -22 66 -65 -16 -11 -48 70 -24 -56 -112 -9 5 -39 44 -3 -26 18 -59 93 53 -99 142 31
5085C1o4P2o5rLJ9Mrj7N5l0M6O1j69J6K0o9R0%K8q0P5J8J3kp5L5J16j50J11Kj03
$$ 31 -33 39 -26 -35 -32 -13 -9 -18 -35 20 -10 36 97 -72 -56 -36 -105 -15 -15 13 -67 8 26 39 37 -38 -3 113 -37 74 76 -27
5117b7O1Nn7Q4p0M7q0k7Q1j00M0QM3k7J03j6j7j02J35n6q1L5j9J2K6K6Pl3j7L0
$$ -27 34 39 -18 66 -4 43 -37 -64 17 -83 -43 -35 8 -19 84 68 51 -51 84 28 -53 -18 -37 -25 1 27 34 1 -16 14
5147A4l8N0k3l0O7n2rK5M4j11Q2O2m6k5Q1j48l2J34j4q8M3J5Olj0j9L2KN6M5n7
$$ 14 -24 26 3 -27 40 -12 -21 4 48 -63 19 81 35 10 91 -57 -89 45 31 -57 -14 1 7 4 -6 -25 7 9 65 110 53
5178E3q2J63j16k8M9mL6Jj57R0L9k9p4J02q3m5M3k3N8jO2L1j11J17p0q8J4PL7
$$ 53 -29 134 18 -10 39 35 71 72 -85 5 44 15 -59 43 -40 -85 -42 -65 -7 -8 54 85 -26 91 21 -67 -53 -46 -9
5207iRL6j7Jn6J65n0j18k1M3L1j3l1J33j40J5N8J7NKo9mL8j54K17o3k5l7K9M3
$$ -9 0 36 19 20 -36 129 79 -39 -60 -17 14 1 -30 103 -37 -22 36 53 58 60 -9 -13 25 -129 88 25 0 -37 -8 35
5237C5Qr8rm5J16kl8P6n5j1k8M1J10r9KL2Q%n9L2r3l8L0M5O5N1r5nq3J39p0L6
$$ 35 43 -55 -64 -109 7 5 -33 43 -12 -23 -51 -10 100 1 3 35 43 43 -16 16 -77 -115 -85 -40 25 76 -19 -24 -107 32 -38 -2
5269bkk4L4j38J52p7Q1O3n9o2M4m2K1pL3m7mp6J51qj47O9j14K05m1K9L6j26j7
$$ -2 -4 -28 6 -132 20 -57 24 87 28 -34 10 -32 -11 -18 15 -32 -36 -112 39 31 -116 -47 -161 44 3 32 68 -58 -75
5298g5J07J5m5o0K7j1l7K5nL1J8R0k7K0j15r1J19M1p9N4j32J71L2p9j2J4Q6j31
$$ -75 32 47 2 -58 -31 -42 -79 -54 -59 -28 -10 80 53 73 -42 -133 -14 27 -52 2 -130 41 73 -6 -18 -4 82 -49
5326d9J5m2rJ7K3K0qM4n6R2r7J2P0p0M5J03j25k2O8l3k4O2o3j7P8l0n2L6j6L2
$$ -49 -34 -76 -85 -68 -45 -25 -33 11 -45 47 -50 -38 32 -38 7 110 -15 -37 31 -2 -26 36 -27 -44 34 4 -48 -12 -28 4
$$ [...]
8191B
##END NTUPLES=NMR FID
##END=
