##TITLE=1H_ESa0609A-1
 CDCl3
 8 sc, 
 8.9.2023
##JCAMPDX= 6.0         $$ Bruker NMR JCAMP-DX V2.0
##DATA TYPE= NMR FID
##DATA CLASS= NTUPLES
##ORIGIN= UXNMR, Bruker Analytische Messtechnik GmbH
##OWNER= root
$$ XWIN-NMR		Version 3.5
$$ Fri Sep  8 14:21:11 2023 Russian Standard Time (UT+4h)  she@DPX200
##.OBSERVE FREQUENCY= 200.13135
##.OBSERVE NUCLEUS= ^1H
##.DELAY= (6, 6)
##.ACQUISITION MODE= SIMULTANEOUS
##.ACQUISITION SCHEME= undefined
##.AVERAGES= 8
##.DIGITISER RES= 18
##SPECTROMETER/DATA SYSTEM= spect
##.PULSE SEQUENCE= zg30
##.SOLVENT NAME= CDCl3
##.SHIFT REFERENCE= (INTERNAL, CDCl3, 0, 15.7039)
##AUDIT TRAIL= $$ (NUMBER, WHEN, WHO, WHERE, WHAT)
$$ ##TITLE= Audit trail, XWIN-NMR		Version 3.5
$$ ##JCAMPDX= 5.01
$$ ##ORIGIN= Bruker BioSpin GmbH
$$ ##OWNER= she
$$ F:/spectra/data/she/nmr/H-F/1/audita.txt
$$ ##AUDIT TRAIL=  $$ (NUMBER, WHEN, WHO, WHERE, WHAT)
(   1,<2023-09-08 14:19:51.23 +0400>,<she>,<DPX200>,
      <created by zg, POWCHK disabled, PULCHK disabled
       configuration hash MD5:
       00 E9 B6 7A A2 85 ED C7 34 08 36 98 17 FE 4E 26
       data hash MD5: 16K
       38 48 43 03 6C C8 E0 E7 E9 6F 27 A4 72 73 7B DF>)
$$ ##END=
$$ 
$$ hash MD5
$$ C9 74 2B D4 26 8B 0C 7A E0 82 E5 3C 72 BA 95 13
##$RELAX= 
##$RELAX= 
##$RELAX= 
##$RELAX= 
##$RELAX= 
##$RELAX= 
$$ Bruker specific parameters
$$ --------------------------
##$DU= <F:/spectra>
##$EXPNO= 1
##$NAME= <H-F>
##$PROCNO= 1
##$TYPE= <nmr>
##$USER= <she>
##$AMP= (0..31)
100 100 100 100 100 100 100 100 100 100 100 100 100 100 100 100 100 100 
100 100 100 100 100 100 100 100 100 100 100 100 100 100 
##$AQSEQ= 0
##$AQ_mod= 1
##$AUNM= <au_zg>
##$AUTOPOS= <>
##$BF1= 200.13
##$BF2= 200.13
##$BF3= 200.13
##$BF4= 200.13
##$BF5= 200.13
##$BF6= 200.13
##$BF7= 200.13
##$BF8= 200.13
##$BYTORDA= 1
##$CFDGTYP= 0
##$CFRGTYP= 5
##$CHEMSTR= <none>
##$CNST= (0..31)
1 1 145 1 1 1 1 1 1 1 1 1 1 1 1 1 1 1 1 1 1 1 1 1 1 1 1 1 1 1 1 1 
##$CPDPRG= <>
##$CPDPRG1= <>
##$CPDPRG2= <>
##$CPDPRG3= <>
##$CPDPRG4= <mlev>
##$CPDPRG5= <mlev>
##$CPDPRG6= <mlev>
##$CPDPRG7= <mlev>
##$CPDPRG8= <mlev>
##$CPDPRGB= <>
##$CPDPRGT= <>
##$D= (0..31)
0 1.2 0 0 0 0 0 0 0 0.06 0 0.03 0 0 0 0 0.0002 0 0 0 0 0 0 0 0 0 0 0 0 
0 0 0 
##$DATE= 1694168390
##$DBL= (0..7)
120 120 120 120 120 120 120 120 
##$DBP= (0..7)
150 150 150 150 150 150 150 150 
##$DBP07= 0
##$DBPNAM0= <>
##$DBPNAM1= <>
##$DBPNAM2= <>
##$DBPNAM3= <>
##$DBPNAM4= <>
##$DBPNAM5= <>
##$DBPNAM6= <>
##$DBPNAM7= <>
##$DBPOAL= (0..7)
0.5 0.5 0.5 0.5 0.5 0.5 0.5 0.5 
##$DBPOFFS= (0..7)
0 0 0 0 0 0 0 0 
##$DE= 6
##$DECBNUC= <off>
##$DECIM= 32
##$DECNUC= <off>
##$DECSTAT= 4
##$DIGMOD= 1
##$DIGTYP= 9
##$DL= (0..7)
0 120 120 120 120 120 120 120 
##$DP= (0..7)
150 150 150 150 150 150 150 150 
##$DP07= 0
##$DPNAME0= <>
##$DPNAME1= <>
##$DPNAME2= <>
##$DPNAME3= <>
##$DPNAME4= <>
##$DPNAME5= <>
##$DPNAME6= <>
##$DPNAME7= <>
##$DPOAL= (0..7)
0.5 0.5 0.5 0.5 0.5 0.5 0.5 0.5 
##$DPOFFS= (0..7)
0 0 0 0 0 0 0 0 
##$DQDMODE= 0
##$DR= 18
##$DS= 0
##$DSLIST= <SSSSSSSSSSSSSSS>
$$ [...]
##$SUBNAM2= <"">
##$SUBNAM3= <"">
##$SUBNAM4= <"">
##$SUBNAM5= <"">
##$SUBNAM6= <"">
##$SUBNAM7= <"">
##$SUBNAM8= <"">
##$SUBNAM9= <"">
##$SW= 18.05172834244
##$SWIBOX= (0..15)
0 0 2 0 0 0 0 0 0 0 0 0 0 0 0 0 
##$SW_h= 3612.71676300578
##$TD= 16384
##$TD0= 1
##$TE= 0
##$TE2= 300
##$TE3= 300
##$TEG= 300
##$TL= (0..7)
0 120 120 120 120 120 120 120 
##$TP= (0..7)
150 150 150 150 150 150 150 150 
##$TP07= 0
##$TPNAME0= <>
##$TPNAME1= <>
##$TPNAME2= <>
##$TPNAME3= <>
##$TPNAME4= <>
##$TPNAME5= <>
##$TPNAME6= <>
##$TPNAME7= <>
##$TPOAL= (0..7)
0.5 0.5 0.5 0.5 0.5 0.5 0.5 0.5 
##$TPOFFS= (0..7)
0 0 0 0 0 0 0 0 
##$TUNHIN= 0
##$TUNHOUT= 0
##$TUNXOUT= 0
##$USERA1= <user>
##$USERA2= <user>
##$USERA3= <user>
##$USERA4= <user>
##$USERA5= <user>
##$V9= 5
##$VALIST= <valist>
##$VCLIST= <CCCCCCCCCCCCCCC>
##$VD= 0
##$VDLIST= <DDDDDDDDDDDDDDD>
##$VPLIST= <PPPPPPPPPPPPPPP>
##$VTLIST= <TTTTTTTTTTTTTTT>
##$WBST= 1024
##$WBSW= 4
##$XGAIN= (0..3)
0 0 0 0 
##$XL= 0
##$YL= 0
##$YMAX_a= 147962
##$YMIN_a= -159440
##$ZGOPTNS= <>
##$ZL1= 120
##$ZL2= 120
##$ZL3= 120
##$ZL4= 120
##$ABSF1= 10
##$ABSF2= 0
##$ABSG= 5
##$ABSL= 3
##$ALPHA= 0
##$AQORDER= 0
##$ASSFAC= 0
##$ASSFACI= 0
##$ASSFACX= 0
##$ASSWID= 0
##$AUNMP= <proc_1d>
##$AZFE= 0.1
##$AZFW= 0.1
##$BCFW= 1
##$BC_mod= 2
##$BYTORDP= 1
##$COROFFS= 0
##$CY= 11.3945322036743
##$DATMOD= 1
##$DC= 2
##$DFILT= <>
##$DTYPP= 0
##$F1P= 15.7292609196834
##$F2P= 12.9074282941183
##$FCOR= 0.5
##$FTSIZE= 0
##$FT_mod= 4
##$GAMMA= 1
##$GB= 0.15
##$INTBC= 1
##$INTSCL= 1
##$ISEN= 128
##$LB= 0.24
##$LEV0= 0
##$LPBIN= 0
##$MAXI= 10000
##$MC2= 0
##$MEAN= 0
##$ME_mod= 0
##$MI= 1.114404
##$NCOEF= 0
##$NC_proc= 0
##$NLEV= 6
##$NOISF1= 3.799351
##$NOISF2= 2.8
##$NSP= 1
##$NTH_PI= 0
##$NZP= 0
##$OFFSET= 15.70392
##$PC= 1
##$PHC0= -21398.37
##$PHC1= 10.45271
##$PH_mod= 1
##$PKNL= yes
##$PPARMOD= 0
##$PSCAL= 0
##$PSIGN= 0
##$REVERSE= no
##$SF= 200.130013532006
##$SI= 16384
##$SIGF1= 3
##$SIGF2= 2
##$SINO= 400
##$SIOLD= 16384
##$SREGLST= <1H.CDCl3>
##$SSB= 0
##$STSI= 0
##$STSR= 0
##$SW_p= 3612.71676300578
##$SYMM= 0
##$S_DEV= 0
##$TDeff= 0
##$TDoff= 0
##$TI= <>
##$TILT= no
##$TM1= 0
##$TM2= 0
##$TOPLEV= 0
##$USERP1= <user>
##$USERP2= <user>
##$USERP3= <user>
##$USERP4= <user>
##$USERP5= <user>
##$WDW= 1
##$XDIM= 8192
##$YMAX_p= 0
##$YMIN_p= 0
$$ End of Bruker specific parameters
$$ ---------------------------------
##NTUPLES= NMR FID
##VAR_NAME=  TIME,          FID/REAL,        FID/IMAG
##SYMBOL=    X,             R,               I
##VAR_TYPE=  INDEPENDENT,   DEPENDENT,       DEPENDENT
##VAR_FORM=  AFFN,          ASDF,            ASDF
##VAR_DIM=   8192,          8192,            8192
##UNITS=     SECONDS,       ARBITRARY UNITS, ARBITRARY UNITS
##FACTOR=    0.0002768,     1,               1
##FIRST=     0,             0,               0
##LAST=      2.2672688,     0,               0
##MIN=       0,             -159440,         0
##MAX=       2.2672688,     147962,          0
$$ Real data points
##PAGE= N=1
##DATA TABLE= (X++(R..R)), XYDATA
$$ [...]
1581E30K4n79N7K91o96j46J090o48m96J106m06p34O23j1j09j45K03N13r23M13
1601d3O36q31m2N76P0k56L75K31o56n20J018o26n72J221j01j239N48J31m31rM43
1622g7J32p10M04O85j276L17J241m69k47J101m90q26J83J037o96l76R34n21j309
1641i63J163O0j249N51N95r16J0O50J70j168R14Q55j228N92J022r65m02R17j46
1660D62p31M55P53j131j96J165p53r56J411j68r56O98M69p37n11P90M0p39R74
1679C39L87j244K50J052j102M8O86n9r05K14P41q46j60J175p70l50J272n82o46
1698e00O99Q6j23j08O54p9o09K74J56p83M75L83p41J24j88m6L3q0K48n09O7N87
1720B0m88J34N61p8j76K65j95L96j02P6Qj70J52K13n60M5km21J72j76K95l09k87
$$ y = [530, 554, -25, 32, 323, -373, -519, 571, -77, -573, 533, 127, -607, 16, 5, -104, -249, -46, 467, -456, -43, 593, -238, -280, 296, 366, 110, 485, 716, 60, -460, 558, -68, -640, 581, 480, -759, -211, -80, -511, -520, -77, 55, -655, -251, 434, -842, -525, 716, 247, 0, 1101, 611, -215, -32, 1005, 309, -67, 867, 346, -963, 200, 260, -989, -438, 157, -759, -749, -99, 71, -1097, -183, 672, -556, 36, 1058, 93, -309, 608, 462, -269, 186, 939, -192, -388, 777, 24, -932, 479, 311, -645, 53, 522, -215, -726, 64, 104, -635, 339, 726, -518, -268, 784, -318, -270, 416, 357, -548, -334, 407, -439, -599, 576, -194, -544, 728, 146, -500, 199, 285, 162, 54, 708, 629, 20, 294, 450, -333, 142, 525, -216, -92, -280, -326, -293, -373, -125, -634, -567, 20, -468, -334, 227, 149, -27, 238, 43, 439, 337, 413, 421, 251, 403, 616, 56, 101, 99, -322, -150, -326, -31, -340, -627]
1743f27M16N8j70N29o10J44K43J4J20J31k7L05o32L31L97o75J98K29l82J38j3
1764A17O8j57j44K24P7m17K69j58K8J96k91K11L9L1K11k61k48L84n93L21J95m96
1786c94KL58R3j40j8jJ57p0M93n9n46O43l83J02M14l37m6l7r0Kk77q7L89n88O
1811d14K56l71L29K8j97J79K0L00j25o4K08j01k39Q96l78M5N2k55j4QK11l25k69
1834b20k85N06l35J51M9k21J99P9j63J09O9J26j62j94N59j87j37L46m90J63L74
1855C36p25M22k6q5J40l19N00p8k65P3q9n9N37l02j61K1n0L71k76k62M45m05N8
1878a99K03j67P4L8r9J88j78K11J10m65J36M47k70K16R1k26K55l56J93O9j80Q5
1900A76j70l42N99k80k08J51oK5k50K30p9o2j24M95l76L26J75n00M71J12j96j
$$ y = [-627, -211, -153, -323, 206, -404, -260, -17, -3, 117, 248, 221, 526, -106, 225, 622, -53, 145, 374, -8, 130, 117, 185, 28, -116, 108, 185, -232, 37, -121, -93, 103, -188, 23, 62, 93, 304, 43, -205, 179, -414, -93, 102, -394, -392, -34, 59, -81, -99, -100, 57, -13, 480, 421, -125, 518, 135, 237, 651, 314, 268, 231, 141, 143, -134, -221, 168, -420, -414, -158, -529, -200, -172, -369, -190, -170, 130, 5, -59, 149, 48, -191, 705, 327, 372, 424, 169, 155, 163, 374, 49, -220, -505, 1, -334, -183, -134, -355, -156, -77, -240, -131, -62, 64, -98, -292, 267, 80, -57, 289, -201, -38, 336, -389, 33, 7, -78, 62, -257, 243, 165, -100, -27, -116, -175, 362, 60, -101, -80, -130, 241, -35, -297, 148, -257, -199, 4, -163, -89, -51, -150, 38, -140, 71, 181, -284, -148, 299, 29, 245, 336, 110, 365, 9, 202, 271, 91, 176, 6, -336, 263, -17, -225, -74, -80, -55, -305, -75, -154, -216, -340, 155, -221, 105, 280, -220, 251, 363, 167, 166]
1922A66JR9p7l39O57m73k0L93m32o2K48n3j50r5Q6km70O05K36o14J92K51o67L57
1946a63M37l74oo4L27l56K25N80r21P0P72m74q0M89m77l29M03j08J86n30O97l93
1968h9m37N87Nm69K68J89l04J07O3K80m55J51N46q25M45L42o12Q9M70k28j85J35
1990G3M34o47j62Q21n42k12M08j55k98L61Q5l56l7J13J47k79L45l4m15J18M80
2011B48l37J35L0l2j72j11M83Jm27M49r7m44M15M6j97J54l5l2j14n3O63o95n6
2034a78M06l60p4K33l2nj11L23l31l28L95J60o07P05O5l64J80J62k5l49L52L39
2056E56o83p4O09n44q9O14k83l38l9L08j71j63M72j15o51P45J9j027Q38K81l69
2077a04J14K43q3m60N50K34p77L02R44j137j98Q74m82m04N98l9j35j23N11m40
$$ y = [166, 167, 266, 189, -150, 507, 34, 14, 407, -25, -87, 161, 108, -42, -137, -51, -53, -523, 82, 318, -296, -104, 147, -520, -163, 274, -100, -106, -170, 157, -199, 26, 606, -315, -245, 527, 53, -27, 462, -15, -344, 59, -49, 137, -393, 304, -89, -526, 61, 66, -403, -135, 54, -250, -143, -80, 200, -255, -104, 442, -383, 62, 404, -208, -119, 351, 123, -62, 73, 507, -140, -302, 519, -23, -235, 173, 18, -280, 81, 166, -190, -227, -114, 33, -246, 99, 65, -350, -232, 248, -89, 46, 76, 44, -128, -239, 244, 245, -182, 267, 170, -274, 141, 187, -10, 144, 109, 77, -37, -90, 573, -122, -178, 228, -132, -206, 27, -5, -10, -121, 202, -129, -457, -62, 98, -509, 196, 261, -103, 77, 239, 214, -135, 217, 556, -127, -201, 408, -136, -225, 389, 106, -232, -271, 37, -134, -297, 175, 60, -591, 154, 173, -854, -16, 265, -104, 10, 253, 170, -290, 260, 494, -283, 19, 963, -174, -372, 502, 20, -384, 214, 175, 40, -83, 428, -12]
2097a2l41Q38l63p43O32K17q39L35O18k96k82L90J30o35L62M36p93R7P15n01m8
2118h3L14k4l51J88M58n23o85R74k39j64M69k19n85M13P8j7j07K42O7q01N60J66
2140A31n63M41J13m47M25r4On0m9L15k10l7N39m33k6R3j14J8N2k03ok09K59K20
2164A71l84J56K4l21J52K27j74J68o6J10j46J69P6q9j44J96p7J32K2j01P7rk57
2187h8L31m93J08K75l38J52J1k28K24j11J20L1k29L27Q3l89J88j27KK23n9J01
2209A14k30J03J19l25L95L28p81J30J63J02l6J96m05K67k17L83k90o0K99m16k07
2230c68M39j28k71L07j81J22j08Q0R5l47L87J40l43L58K35m63J42J23j57J34j28
2251F8J80k47j60M14J1l62L64l32j68L1pK26j24n3K38k21j04L12k50K56k9j70
$$ y = [-12, -353, 485, 122, -621, 11, 228, -611, -276, 342, 46, -236, 154, 284, -351, 11, 447, -346, -249, 466, -35, -83, 231, 207, -144, 44, 502, -21, -706, 268, 29, -135, 334, 115, -470, -57, 21, 4, -103, 139, 206, -595, -35, 131, -432, 9, 122, -325, 100, 6, 12, -38, -87, 228, 18, -19, 520, 87, 61, 154, 40, 58, 110, -93, -99, -308, -49, 171, -213, -57, -33, -354, -202, 25, -149, 19, -47, 63, -83, 86, 162, 73, -71, 125, 48, 180, 202, 101, 178, 169, -88, 243, -250, -142, 133, -205, -53, -42, -270, -46, -157, -37, -6, -235, 92, 175, -214, -26, -153, -151, 72, 13, 114, -116, -13, 106, -219, 176, 504, -277, -147, 16, 118, 82, 278, -127, 140, -77, 306, 16, -44, 255, -161, -368, 71, -57, -328, -21, -202, -80, -188, -108, -13, -360, 27, 167, -176, 182, 417, -46, 96, 219, 62, 196, 68, 248, 1, -159, 255, 266, -96, 268, -64, -232, -201, -208, 18, -106, -159, 79, -142, -246, 66, -184, 72, 43, -127]
2273a27L03k4nN6j15J00j94RK80k79j46L73l75J4R3k39L03k08J77n9k18K49j41
2296a73l5L56k54o9K32j15L5J17k03K55q9k75K51J27K9J24m17K41j07QLJ0j9L23
2320C55l47QN6j69J63j46K7J26j40p9L68n75K66j96J45R1k41K83j6m1J73j37J3
2343a3K32j73J16L75m34J42j30q9L18n99J40O6j44K64k60P1M11l69k07Q4j5K33
2365A9j28j55L46j26J47J47l80K71P8l83J14K78k80or1QK51j35J78k66n3L08j93
2388e1j42K68l06J78m5P3J51k39r6J84j98L82O6m91L47j07o8J41l1L2J09k21J23
2411E9j38J75J06k78l8M45k10j36J72j98Q8j44J07q9j95J84P7k01K28rK4rj27
2434a07L48k47j29L85l66Q3K88l81K90J79j17n2l3k8rj48NQ3k69K39j5l0J76l19
$$ y = [-127, 176, 152, 147, 203, 88, 188, -6, 3, 283, 4, -142, 231, -144, -130, -37, -276, 27, -181, -4, -63, -281, -32, -173, -208, 148, -106, -175, 57, -58, -23, 94, -109, 146, 57, -218, 33, 160, 189, 313, -104, 137, 30, 38, 41, 51, 32, 355, 8, 16, 72, -97, 66, -80, -53, 73, -67, -146, 222, -353, -87, -283, -138, -47, -288, -5, -21, -62, 111, -26, -13, 219, 46, 162, 537, 103, 245, 115, 26, 344, -255, -115, -49, -193, 71, -189, -118, 293, -76, -283, -199, -214, 19, -109, -264, 82, -44, 103, 250, -130, 141, 219, -164, -50, 228, -52, -58, -149, -141, 110, -25, 153, -113, -166, 142, -51, -193, 75, -231, -53, -98, -25, 126, -113, -209, -25, -223, 159, 225, -266, 81, -26, -94, 47, 16, 48, 157, -64, 59, -79, 96, 202, -76, -114, 331, 121, -15, 157, -41, 47, -97, 10, -79, -274, -90, -13, -214, 14, 5, 29, 20, -107, 241, -6, -135, 250, -116, -33, 255, -126, 164, 343, 226, 174, 141, 113, 104, -44, -39, 44, -225, 14, -1, -31, 145, -174]
2458a74qL14k12J83l75MK79j12l2J86p9K04K7k50K78k44l6J76j42K67q3j32J05
2481A44L2j95L6l10L92l6k24J27n5j15L00O1k22K72l43K92j97M0l5O9J75p2k37
2504a01L28k97j6N1M7J57j03k7q1n4j05L93o61N26J1k87q8L52j92j4J26L6j41
2527a40k90K29K77l80L68O8k17J24J62j83M6J65L3k35oN24o62j60N51l25j17M0
2549a28J91j9p2J00j55oN3j27k99O86k58m8J74j70J67j19J80j31%k2J21k07J30
2572D1L61j33k17P4k84K53j98K47k27k24L11q4m3Q2p9j37J93j42K29j53J97Nj57
2595h5J06K33l58L8K45k63J54lj70L4P0R1J9j78J35K18n01K36n2q5L10k27L5j77
2619a75l0J29p1K7K00o6j41K60j97L16l67L55L8l97K25L6j94K10k10J1L0J39q
$$ y = [-174, -182, 132, -80, 103, -272, -268, 11, -101, -133, 53, -26, 178, 205, -45, 233, -11, -47, 129, -13, 254, 171, 39, 144, 176, -19, 17, -293, 99, 63, -161, -34, -89, -204, 96, 157, -65, 207, -136, 156, -41, -1, -36, 33, 208, 136, -101, 227, -70, -86, -35, 12, 169, 66, 39, -42, -96, -201, 192, -469, 57, 68, -219, -307, 45, -147, -161, -35, 1, -140, -430, -201, 76, -304, 64, 132, -85, 39, 201, 18, 64, 229, 262, 27, 21, 545, -117, -277, 274, -51, -168, -128, 63, 44, -28, 72, -83, -89, -36, -163, -462, 224, -34, -82, 92, -78, 89, -30, 150, 19, 19, -3, 118, -89, 41, 402, 269, 52, 126, -158, 95, -103, 144, -83, -307, 4, -80, -123, -41, -120, -257, -64, -206, 23, -130, 67, 72, -85, 21, 254, -104, -66, 179, -84, 70, 67, -103, -69, 1, 92, 111, -67, 68, 286, -215, 21, -31, -116, 194, -33, 2, -175, -205, -76, -147, -120, 80, 14, -127, 133, -64, 252, -115, 240, 278, -119, 106, 142, -52, 158, -52, -41, -11, 128, 120]
2642A20j09n5J00p3k8L27j59k94J86n0j33J18L5M2l49L15j03k58L93j30j21M16
2664A90k62JK37l5M5j54Q0J37l17K1K68k76J8O5j67O5J59k02Ok76L80j81J49L30
2688B81l01j61M07j82m7QK81l35P9j3K27j97N6J64m08K51L7k20kR7nP9M4q3j37
2713h0o6J46j08k4J9J41K0k15L7K87j54j65K50l21M76j89j33P3j02N7J42j9jl3
2737C8j14K83k06j7Q9j44J13M0j24J5j3rJ36M6j15j0j50N4K6O7j73K99k6q3j5
2762Gk1L27j01j5k78J26j48j8K25j52J48K39m16j34L34l29R7K9j34K27M6j2p0
2785b3j46K14J34j33K24j84q1L6J26j31L1J25j24j57J13K10q5p3o6j41J86N4j80
2808g1J8J48j11M2p8l6K72j92Q2j41J0J49k18J85j8Q8j35o2Q3k1k82K30J71r4
$$ y = [120, 11, -44, 56, -17, -45, 282, 123, -171, 15, -35, -168, -50, -15, 27, -322, -7, -110, -368, 25, -105, -226, 190, -72, -71, 166, 131, 176, 22, 102, 239, -78, -57, 211, -65, -47, 18, -149, -84, 75, -127, -121, -397, -17, -198, -49, 281, -20, -181, 226, 44, -3, 5, 286, -49, 30, 17, 244, 47, 103, 267, -141, 110, 147, -73, -75, 22, 17, 96, 140, 57, -80, -146, 0, -108, -132, -113, 28, 48, -167, -130, 157, 3, -162, 88, -233, 243, 54, -79, -6, -108, -51, 91, 72, 71, 38, -76, 207, 1, -16, 73, -71, 42, 82, -42, -27, -40, -49, 87, 133, 18, 8, -142, -88, -62, 5, -168, 131, 105, 22, 7, -14, 313, 212, 197, -81, 45, -103, -121, 104, -48, 100, 339, -77, -211, 123, -206, -109, -80, -214, 13, 59, 47, -23, -169, 45, 179, 46, 270, 86, 5, 41, 167, 36, 67, 192, 68, -89, 24, 234, 149, 76, 10, -131, 55, 109, -71, -53, 95, -16, 26, -52, -88, 184, -8, 74, -67, -57, 92, -126, 59, 41, 129, -6, -68, 15, -6, -288, -58, 113, 19]
2832A9n8l6N3K06k00J61Rj92rK59l37L47k81k73J97J04j7R5j0j43j5J34J12k89
2856a64M0K04k16M31j39j16m6J78oj19q1L5R9j26J3k1p7J98k30l0L12m97L68p6
2880f6m2R0M7l3P9j63O9J01j10J39r5l1Q4l48M82k11Q8k11O3k9J73l76L59k48
2904a89J64R2k74L22j50j00L8P0n8K32l24L6M3J2K16l7k10K51j37j0J39j42J89
2927A73k41Q5K13j91K21k75r2K00J62l84K3M0k28L87k59Q6N4j38J30J24k41K32
2949H1k09Q3K40k03n8Q1P1j22J43rJ12k58J53j14n7J57J97m11K1P7JK5k01J33
2973f7J6m1N1RJ11lj12J89j43k6R3j62J08K02k17J37k9l05J60J58j13J15k43J41
2997B9oj28M08j94l08J53N3k0n2j39J4J88l1O0M1n1J85j21j58J91j21O9r6J02
$$ y = [19, -39, -75, -22, 184, -16, 145, 154, -38, -47, 212, -125, 222, -59, -332, -135, -31, -48, 47, 37, -106, -121, 13, 125, -164, -124, 80, -136, 295, 156, 40, -6, 172, 166, 47, -34, 1, 100, -26, -13, -34, -111, 87, -143, -173, 139, -358, 10, -66, -108, -18, 29, -4, 75, -88, -19, 82, -28, 111, 16, -15, 69, -279, 203, -8, 80, -131, -68, -97, 76, -300, 59, -189, -25, 67, -207, 115, -35, -135, -97, -27, -85, 147, -177, -141, -98, -86, 130, 93, -117, 134, -3, -13, 126, -16, 173, -68, 17, 230, 39, 260, -15, -107, 93, 255, -129, -106, -66, -294, 93, -166, -80, -26, -164, -34, 90, -151, 81, -128, -45, 195, -8, -66, 15, 86, -36, 107, 98, 210, -48, 105, -9, -66, 91, 288, -123, -102, -25, -24, 1, -200, -67, -51, -92, -41, -32, 79, 76, -36, 153, 10, -16, 77, -85, 23, 225, 8, 145, 116, -189, -29, 129, 16, 131, -112, 29, 23, -105, 303, 109, -199, -46, 7, -13, -65, -204, -190, -2, -33, 27, 68, 17, 202, 81, -77, 114, -7, 62, -34, 68]
3021F8N7N8j99o3jL40k30j7K17k52J23j55q5K04J0q9j7L1m6o8l7K13k91J78K08
3046A57k55j13M8J6K07j12K41l9P9j90N2l1J52k96j22K96j7p3k0J43k11J13k58
3069b33K27j20J68lj29J04k7K4p2K1l9L2Q4P8M3j09R9j33J50j92r8K84j48J1Q0
3094A02j14K0J70l38J82p0R8%j58nK77k09j51J57o5K06j34n0J37j10k1J42j8J81
3118B29k29k3R5M3j98K15%k08Q8p8R6p0j52K12j71J12J26k96K5K31k68J04J85
3141F8K1j31j55J40M2M5O4p3J36j31r0j61J22J43q7R2N1J6j56j17K21o4J24k99
3165a79QK18j24K9J35n0J71k76J75L2m0l14J96O8ko1k6K42j43M9p9q0K02j02N
3190E4M0L4n7m9J65k67J35k22J40j81J71K29k79K01j44R8j44J64k00J46P9j92
$$ y = [68, 125, 183, -16, -79, -80, 260, 30, 13, 230, -22, 101, -54, -139, 65, 75, -14, -31, 0, -46, -114, -151, 62, -229, -51, 157, -98, -211, -163, -147, 60, -52, 189, 150, 229, 39, 91, 60, 212, -84, -206, 90, 73, 0, -20, 123, -88, 25, -233, -6, -126, 42, 39, -90, 14, -13, 11, -61, -40, -79, -47, 37, 115, 158, 49, 148, 15, 165, -27, -125, 159, 11, 22, 102, -12, 8, 178, -160, 22, -48, 50, 50, -108, -113, 164, -45, -196, -39, -104, 102, -32, -82, 55, -55, -76, 66, 48, 229, 0, -23, 72, 115, -83, 132, 132, -76, 12, -66, 30, -40, -192, 20, -151, -39, 87, -209, -184, 47, -221, -117, 68, 89, -42, -197, -57, -15, 30, 94, 21, 157, 26, -64, -225, -103, 40, -47, 45, 96, 112, -44, -161, 60, -4, 120, -179, -171, 47, -77, -48, 87, 37, 208, -68, 107, 139, 99, -215, -19, 49, 47, -14, -40, 202, 59, 108, 29, -51, 151, 49, 54, 94, 128, 71, 22, 187, -80, 55, -167, -27, -208, -37, 192, -87, 114, -30, 68, -76, 88, -112, 34, 113, -79]
3212g9K91l80J13m5K35j10o5R7j09j1J03K1l07J0K10R5nk62K03l2m7J08j47P8
3236c5R9j64K00q7p1J80n3L0j81L12k66ol5J38J35k09O0K5r3o9Q8Lr6L7J92k66
3262a32J25J20j86R3n7J9o7L0Kj11R9J01j20J06mJ85j49J31k36K0P1N8J73k27
3286D4l1j37J5J06r7K43k93J37j37J25J7O9j37J1K85k03O6j17O9P5K1r5lk5j46
3311a38J83J75l42L60k63L8L8j82K61j37j64J57j18K9j08N6j2K55j76RKRJ34q7
3335b1m1p5J29K89k25r3J61k65K24j41L5J54q5j48K63k17J64k23M4J77j26j3K
3358c1N9j51k0J44J30m17J29L24j44q0J56j39O0k5r7J70N2j30J40k37K77j06j80
3381a16J83J62k28Q2O8j85K01k70Q7L7j22J57qo9J01l35J02K27k57L47k57J89
$$ y = [-79, 212, -168, -55, -100, 135, 25, -40, 57, -52, -63, 40, 61, -246, -236, -26, 69, 64, -198, 5, -27, -74, 34, -113, -35, 64, -100, 100, 13, -58, 122, 69, 99, -82, 230, -36, -42, -77, 61, 196, -13, 47, 72, -21, -90, -2, 1, -95, -58, 134, -132, -7, 113, -73, 20, -37, -18, -85, -55, -53, -164, -65, 36, -84, 22, 18, 203, 54, 185, -51, -31, 40, 98, 271, 44, 13, -124, -109, -3, -100, 143, -150, -13, -150, -25, -8, 61, -76, -65, 220, 17, 83, -34, 35, 110, 131, 36, 33, 8, -138, 45, 220, -122, 238, -25, 13, 51, -131, 130, -7, -171, -14, -132, -103, -211, -155, -167, 88, -88, -79, -77, -68, 66, -21, -62, -137, -8, 281, 56, -37, 124, -141, 83, -58, -23, 131, 46, -102, 161, -56, 108, -115, -71, 106, -20, -33, -31, 28, -123, -143, 1, 131, -286, -157, 167, 23, -57, 99, -40, 20, -5, -102, 68, 120, -10, 130, -107, 170, 64, -116, 67, 229, 1, 83, 151, -34, 167, -103, -16, 21, -101, 56, 48, -21, 80, -255, -153, 74, -183, 164, -93, 96]
3403I6R3j74k2M5K2J2j5k7n0J05K5n7n6J24j44r9L45m01J36k0j32J03Q4Oq9n5
3429a45K61j31k12J61k9m3J25M2j20n8J91p5q9O1J9m5J85O7k61J12O0J51j27L6
3453A36k45K05j8l4j8o1k4P3N0O6k43J60o2Ol8J17j72J87k25L03n3j13J82k54
3477g5k6J86k50J21P9l2K7L8j70K05j70J94j66m1J76k02J47j59L6K2J26k7o6J33
3501A06n0JM7j4j75j59K39j43L81Kk83j8l5N9M4J02k48J95j15M8O2j30L1j03J67
3526A1j28J86J03l32q2P7J34Q0J22k87J5J16n6p8J98J8j11N5J6m8l1Q4r3o8k4
3551a23p8J76q3q6RK51Kj63j0n2J10J25m11M42j98M9Q5j87N3K22j7m8o1o3K23
3576A67k04L04l41O7l9j23R3J11jj05J49l44L86j42k1L2j4J34j53q5J39q5N6k4
$$ y = [96, 189, 15, -7, 38, 60, 72, 57, 30, -20, 85, 110, 53, -3, 121, -23, -122, 223, -178, -42, -62, -194, -91, -7, -1, -90, -145, 116, -15, -227, -66, -95, -138, -13, 29, -91, -149, 42, -33, -122, -61, -42, -87, 98, 165, -96, 16, 76, 227, 100, 136, -109, 96, 78, 44, 26, -35, -59, 14, 64, 130, -113, 47, -15, -9, -47, 70, -102, 85, -140, 163, 110, -3, 179, -75, -101, 85, -165, -44, 35, 3, 30, 68, -102, 103, -67, 127, -39, -80, 96, -106, 41, -118, -82, -60, 66, 39, -27, 106, 56, 57, 104, 90, -85, -244, -5, -148, 233, 235, -48, -66, -101, -42, 2, 104, -144, 51, -64, -16, 46, -84, -53, -156, 11, -117, 69, 172, -160, -242, -165, -31, 49, 171, -116, -101, 15, -41, -119, 79, 97, -14, 41, 57, 9, -22, 62, -31, -99, -123, -201, -25, -108, -194, -185, 66, 68, -95, -105, -157, -47, 78, -333, 109, -89, -40, 45, -142, -89, 133, 116, 68, 7, -56, 167, -37, 267, -74, -7, -46, -169, -76, 35, 34, -71, 78, -266, 120, -22, -43, -11, -25, 109, -44, -129, 10, -75, -19, -43]
3600d3J8L3K18k05o6nj29k6K62q1n5J80n9j16N0nr2RJ55j03r7K33p6N9j55P6p
3627b7n0Q2K71k65j7Q9k68K70k49M52j54k00J91j58M2L3J1n7K31k38L8j12j9P8
3651b6j56J47Q7m4n5J58l10J27J2J33k1J52l80J29Jl6K15j08P2r8j64L17j43N
3675A4K19k32P1n3J1L8k59J60J62r0q7J15j53Q1l3J14m3k28R5J75j62Oq2J01p1
3700a31J2J79N0r9J41k84J7J34rJ5n5J5P0P1j26J07k49J87p4l2K61k79P3k0j18
3725a44K33l9nn5k79K91L6q6o4K03m9l9N0j29K24j83J53J1k0R6k65P5K8n1J92
3750A84l87K12M2j65j47K80Kj90J84JK2L6j09J71r9rJ07j21N0j06r4J53J10k99
3774a72L88j81r7K47j76J23qj26k91L32Mj8k5O3j14P3n4j07L12o4jo5P9j3j0o7
$$ y = [-43, -25, 8, 226, 21, -45, -50, -179, -205, 57, -24, -79, 101, 42, -74, -24, -29, -121, -112, 43, -60, -157, 76, 0, 59, -96, -20, -27, -77, 5, 276, 11, -6, 83, -185, 85, -164, 288, 134, -66, 125, -33, 9, 42, 53, -4, 227, -11, 27, -85, -104, -26, -182, -35, 52, 8, -47, 111, -199, -72, -60, 73, 52, 204, -176, -47, -46, -82, 133, 25, 97, -1, -165, 152, 9, 14, 233, 1, 72, 19, 30, 68, -191, -31, 131, 41, -46, 69, -84, -3, -36, 78, 35, -193, -98, 77, -85, -79, -161, -60, -131, -119, 60, 110, 11, 152, -132, -115, 19, 10, 25, -30, -15, 55, 126, 0, 107, -142, 45, -29, -61, 200, -79, -6, -26, -144, 89, 50, 45, -10, -289, 2, 38, -48, -112, 91, 42, 3, 53, -76, 148, -35, 118, 129, 109, 205, -60, 15, 43, -8, 184, -203, 9, 51, -114, -261, 19, 21, -169, 15, 16, 38, 74, -35, 136, 37, 28, 135, 14, 64, -42, -136, 17, 127, -172, 216, 35, -62, 185, 9, 132, 124, -2, -293, 39, 43, 25, 0, 63, -51, 22, -32, -139, 173, 109, 108, 43, 122, 109, 99, 32]
3800C2j12M6K18k41R2n4j6q9O1J21k0j0J37l88O4K29j65J3Q9m8q9l1K74q0j22
3825h9J20j41J15o7N5m6p0K42r2n4O8o2oP3j97J13J14J47j89k20K20j11l8R4m5
3850f6j02J90J37k37J88j18k10K65k0k28J32k8J4J33p7j09M2J80J2j93J3J77K4
3873A19j06J8k07J60K1R3j06J2n5K6k13J62j23K21j5j24J80J5j53l9M3P7K39j71
3897G4j78NP3J93p6j24J31k9j46J54j27J16j08j8j35J35q0J45KJ14j85l9O6j1
3921d8J72J29k23J16k41O9M4J29j82N4q8J99m1r5P5j38Q2j88J58N5k02R8m1J64
3945E7N4j75n8K38r2o9K61j65p5M3J4O0p9P1Rj13j66J90o1R4J00j72J64m3j02
3970a5k5J00r7n2J65J41k11k07L77l92l3L33r2k2J51j90Q1Q2k54K48k4Q2j9m2
$$ y = [32, -80, -34, 184, -57, 35, -19, -35, -124, -63, 58, 38, 28, 165, -223, -159, 70, -95, -82, 7, -41, -130, -161, 113, 33, -89, 31, -110, 5, -62, -7, -53, -123, 119, 27, -27, 41, -21, -27, 46, -151, -38, 76, 223, 34, -186, 34, -77, -115, -21, -66, -168, 22, 159, -78, 110, -8, -218, 47, 27, -201, -69, -97, -83, 50, -27, -136, -94, 86, 98, -95, -82, 95, 119, 13, 31, -176, -16, 5, 98, -8, 4, -51, -25, -238, -76, -199, 22, 7, -117, 63, 78, -75, -114, -71, 6, 245, 74, -104, -99, -26, 167, 91, -33, 98, 69, -77, 77, -50, 66, -42, -60, -195, -60, -140, 5, 7, 121, -64, -103, -37, -48, 124, 253, 30, 146, -95, -26, 18, 147, -35, 19, -69, 130, 89, -6, 69, -69, 13, -175, -17, 38, -164, -66, -107, 57, 111, -64, -122, 116, 24, -45, 216, 51, -24, 19, 33, 93, 14, 85, 94, -19, -185, 5, -56, 38, 138, -34, 130, 87, -15, -40, 60, -37, -89, 76, 217, 6, -201, 176, -216, -249, 84, -8, -30, 121, -69, 12, 94, -160, 88, 64, 146, 127, 85]
3994H5L1j85nP1r8J47lJ87r7j39J1K8q6j30L4L40q7j53J29j34J57N5J05j51k5
4019H7j33qK33l24J02J13mk4M1o9Q9r2n6P1j61k1L13j30P0N7m40K66r2J40K47
4044B75k85N9j92K22K7p8N4K1j35P9j19K73on3k21K11l28M17l44L8K18k00J74
4067A07k73J18m7J85n7j0j76L42j96R3N5k00J27r8J77k38m2lo1J26j94K74N2n1
4091A0J20n1q2M0q8j49K28j12J82j26j19K02j93L00m5l34K91j59m5J99j87K66
4113A48q9p7M3r2J18j4M4j65M55m13J37J4j65J91j20Q9j87J32J6m3j23N1Q8j15
4137g7K79j35o4P8L8j86M4J71j66P3o0L9k32K66q6Q5j0m9j8K96l37k2l0j17L66
4162A46j33L5N3j97M4J01o9M3j08K0J19k66K39j80L06l22K58M0j58K19l11J78
$$ y = [85, 116, -69, -74, -3, -101, 46, 43, 230, 133, -6, 5, 33, -53, -183, -149, 191, 104, -49, 80, -54, 103, 158, 263, 112, 87, -46, -54, 179, -145, -43, 70, 66, 42, 83, 14, 103, 11, -45, 26, -135, -156, 157, 27, 97, 154, -286, -20, -112, 28, 275, -10, 49, -143, 79, 106, 28, 82, 103, -32, 47, -72, 201, 195, 142, -79, 132, -196, 221, -123, -85, 133, -67, 107, -166, -48, -95, 90, 33, 23, -153, 189, -7, 86, 141, -59, 68, -30, 147, -91, -133, -136, -197, -71, -265, 9, 61, 10, 130, 79, -3, 37, -51, -200, 28, -84, 98, -28, -147, 55, -138, 162, 117, -217, 74, -85, -130, 69, -118, 148, 59, -18, 25, -67, 51, 37, 81, -84, 371, -42, 95, 109, -56, 135, 15, 104, -83, 49, 65, 22, -101, -50, 38, -77, 202, 67, 3, 81, 119, -67, -23, 148, -18, 55, -5, 34, -198, 68, -18, 67, 57, 8, -10, 286, -51, -73, -103, -220, 146, 13, 48, 101, -96, -52, 49, -20, 23, -85, -65, 54, -212, 27, -153, 153, -169, 89, 129, -29, 190, -121, 57]
4184E7l11L18J9M0j8j49J18p2L6N1j1j29J9q2J67n3r4M6N8PJ64q6n7o7K22j59
4210C4k9j57K56j17j09L60k37J2k44K97n0j36N5J9K6j95K03j55J56J02l25K52
4232A8l0O9O5k10N5j21L3J44Q0j4K3o6nJK6j53L06j60K9j06j5P1o2L4J97k63P0
4259A6r3P1m6J12j64J66j36J88q6l41J80l5J73L7l3j02mJ40M6k33J97K12l72J44
4283C7k0J66r8n2J6p8M1k82J45K25K2k46L20k25j96K07J80j25j87J53J00k34K49
4306A18r6P5N2k07k9J20j92N1J86p0n1J4Nn9n7J52m3L5o6K12k87M6J18M2J50k52
4332c3k59K59o5L13j97j6J14r3j17k6L53k66Mq9J83p6kj01J45r5P2L9j56N7M2
4357a0j32J96J78m66J55J43k40Q3R0k91K39M2j43K39j32P6j05pK0L0L5J41l9j28
$$ y = [57, -254, 64, 83, 123, 105, -44, 74, 2, 38, 89, 78, -51, -32, -114, 53, 0, -94, -48, 10, 17, 181, 95, 38, -29, 193, 34, 5, -152, 104, -13, -122, 238, 1, 13, -231, 66, 16, -120, -65, -46, -20, -215, -12, -167, -11, 91, -234, 18, -12, 57, 122, -88, -33, -154, -121, 23, 103, 89, 112, 46, 41, 42, 68, -85, 221, 61, 90, -16, -31, 40, -22, 12, 209, -54, 16, -77, -6, -52, 60, -104, 62, -74, 114, 28, -313, -133, -168, 5, 42, 9, -93, -97, 43, 89, -144, 53, 265, -107, 37, 17, 183, 85, 33, 49, -29, 12, -270, -125, 100, 122, -124, 196, -29, -225, -18, 162, 37, -150, 3, 103, -131, 118, 22, 97, 149, -58, -87, 33, -159, -108, 78, 8, -43, -29, -24, -83, -140, 12, -31, 4, -62, 150, -137, -91, 27, 69, 219, -33, -292, -33, -98, 215, 18, 2, 116, 23, -94, -120, 233, -33, -29, -118, 65, -11, -13, -114, 31, -64, 8, 47, -109, -52, -10, -142, 54, 232, -234, -79, 64, -176, -93, -3, -294, -55, -13, -156, 83, -49, 27, -78, -85, -65, -35, 0, 141, 102, -26]
4381b6J70r1N4j34P4l3j79M01n68K81j00J19n9J85r9J55l69L67j68J34k5j35K26
4404A80k64K00q7J59k03J32j26p4J55l04K56k1J2J06j42k9J94k47J21K34k05J68
4426B15m12R5K63j74Q8k52J70PoJQ8o8J78j24j38L14k62R0j34L6M5mK2N1j62K13
4452A40k40P7o3K9m5R6j34j70L33J33j66j24J38k0k7J20k52K30j71K42j23K7j60
4475a30j8J94n4n2P2j94J43J03j62K70k11lQ4k6jj93J48M8j45J34p5MJ17N9Pl0
4501H9J4JR0p9r9n0r0m9K75j42p0L3K34k58Q4R3j62M3j75J62l1j35K51j3J01j0
4527A07j52n7k6j69K26J06j15lJ07q8kn6N2M2K23l70K04P2j09M4L7r0J35K1j01
4552C8J04j32J0o6j23J84j25K17j83R4J52k18M2k5n8K60j51p4Q3RP8r0j41K76
$$ y = [-26, 144, 53, 107, -27, 47, 14, -165, 236, -332, -51, -151, -32, -91, 94, -5, 150, -219, 148, -20, 114, 89, -46, 180, -84, 116, 29, 188, -15, 117, -9, -83, 72, -232, 24, 3, 15, 121, -21, -50, 144, -103, 18, 252, 47, 215, -197, -102, 161, -13, 75, -177, -7, 0, -6, -5, 83, 15, 193, 69, -69, 245, -17, 73, -61, -25, 20, 16, 38, 89, -73, 140, -100, -23, -86, -57, -102, -6, -140, -310, 23, 156, -10, -134, 4, -16, -43, 77, -175, 55, -116, 126, 3, 30, -130, -148, 46, -8, -60, 12, -182, -39, 64, -98, 172, -39, -42, 42, 16, 15, -178, -30, 18, -127, 7, -68, -64, 53, 112, 119, 89, 103, 104, 194, 115, 16, -34, -124, -173, 102, -40, -110, -77, 157, -101, -17, 76, -86, -43, -218, -56, -87, -222, 29, 16, 117, 107, -45, -102, -128, -297, -71, 35, -80, -83, 24, -64, -66, -122, -70, -28, 195, -175, 29, 101, -8, 36, 73, -17, 118, 139, 38, 142, 10, 20, -46, -169, 15, -110, 107, -76, 18, 170, -48, -6, -31, -89, 171, 20, -54, 29, 38, 116, 26, -115, 161]
4576A61k15j0J03k35K51k26J09p9L09l9j39J38j71L6j00J61Nk43J57Q8rp2Q3N0
4600A13o2J60k7q8q1Jj30o7K49r2p9K7kj11K78J07r5j18M8l0o3J0j01J03J55k18
4626a13K01L4j70J50j40J9MN7K8M5k39K1R8j02K16j69J79r5j27J66q5j90L57k
4650A43k6o2P3q9rr3l4o7L44j65J1j11J61M3L2k15L01k21m1L8l0K01j56Q5j27
4675a4r9R3l5j89J92J14m0P2j42K8O5l8J30j23j47P7m0o7K52l08M1K34o0l2P1
4700C5j3m4J31k00R8M6j77j14K76J29k33Q7J95j74r2R2j20p7J51m3n8M6m2N8J
4725d2r7J61K20n9o0k62J65J54j87L0O7j19n4J97k1k63J74N0o7k6J31jj70O9J86
4750A76l19K35l22K66K08k70J93j13Q3j23l1MM8P0q0m7J57j87j55L74j37j68K03
$$ y = [161, -54, -64, 39, -196, 55, -171, -62, -141, 168, 129, -10, 128, -43, -7, -107, 54, 59, -184, -27, 61, 52, -20, 63, 113, 51, 211, 184, 96, 15, 16, -114, -181, 68, -24, -103, -76, -78, -189, 89, 196, 101, -17, 31, 1, -62, -52, -153, -50, 105, -113, 88, 122, -48, 102, -38, -19, -15, 42, 70, 115, -124, -103, -5, -107, 109, -60, 119, 24, -103, 63, -22, -212, 145, 143, 117, 55, 128, 39, 30, -63, -97, -164, 180, 15, 26, -85, 76, 119, 151, -64, 237, 16, -25, 13, -17, 184, 28, 113, -14, -113, -20, -55, -244, -52, 62, 22, 94, -48, -20, 45, 7, 137, 14, -133, -56, -96, -163, 89, -219, -178, 56, -4, -36, 35, 22, -22, 109, -91, 7, 53, -124, -238, 38, 167, -66, 21, 216, 42, -50, 42, -78, -155, -4, -47, -105, -59, -101, -43, -42, -139, 22, 242, 183, 123, -139, 26, 180, -7, 23, 90, -29, -83, 114, 93, -170, 4, 54, -13, -39, 92, 91, -79, -10, 176, -143, 92, -230, 36, 244, -26, 167, 54, 137, 14, -17, -13, 35, 105, 25, -22, 135, -52, -207, 167, 30, -138, 65]
4773F5j58L56m30J75L5k06K73j39mMJ67j37k0K35j35r0Q4M8J42k47L2K9m2o4Q5
4798E8o4m6P7m3P8p0Jro8J05n8q8rR6M9K5k0rN2l1r9J34J58k32J50j24Q8l9j77
4827a15k5K08j76KJ77Po4N9j05p2J90j03R0j98J36M2J25p0j34J06o5J34j11L6
4851G4j52J67m0j35J54m0m4J48k05M4o1J0J46j74J84j09O0N3j39j63K28o6N3q
4875a5k2J37r5J8r5n2J85j1J61j83k08R5J56j22J43M8j22l1J17j30N3p3O2j11
4899i5rJ42j94R1m2J28j09J16m2j61K05q7l2J44J6k29K44n6J10j80P7k04J6L1
4923a20K21j81J57m4o2R8j60Q1J21j28lk0J3M7lpPL3j44m6L4L3K10j67J03j55
4949h2O9j30N1J3K62j17o8j22K76j35jj20J93Rj45M6j29J73K2j24K8J63k68M2
$$ y = [65, -93, 263, -167, 8, 43, -163, 110, -29, -33, -29, 138, 1, -19, 216, 81, -9, 75, 123, 265, 18, 50, 79, 37, -27, 58, -6, -52, 25, -18, 60, -10, -9, -18, -86, 19, -39, -127, -136, -40, 9, 34, 14, 5, 57, 26, -73, 61, 219, -13, 137, 13, 101, 62, -115, -140, 68, -108, -106, 71, 78, 14, 73, -32, -104, 86, -17, 73, -125, 11, 53, 178, 108, -26, 80, 15, 149, 38, 74, -78, 89, 49, -86, 68, 28, -16, 132, -73, -29, -90, -80, 66, -108, 76, -33, 27, 80, -59, -222, 6, -60, -7, -15, -37, 100, 5, 23, -72, -124, 61, 50, 211, 28, -180, -85, 71, -51, 92, 140, 18, -13, 104, -26, 27, -46, 16, -95, -104, 38, -156, -65, -107, 21, -88, 28, -14, -175, 30, -57, -89, 55, 71, -158, 86, 30, 140, -40, 37, -167, -151, -120, 101, -80, 77, 33, -29, 69, -91, -10, 111, -17, -20, -40, -27, 20, 17, 10, 17, 50, -94, -140, -106, -73, 137, -30, 73, -82, -13, -143, -92, -79, 183, 66, -2, -124, 152, 17, 16, -104, 89, 98, -47, -1, -130, 43, 65, -59, -31, 132, -136, -94]
4973i4q5K50k16P2j24K91m2r5J35r5l3Q1r0O6M2j30J76L9k08O1J00j19O6M0j48
4998f0K16k01P8Jj7p9l6J94K3j42n8P7Q6K2j71N5J46l09J41l7k1J84r0o2o2K1
5024a01J35Oq3J8Q4J12j87J13n7J8J2J2r8q0J22M9NJ16k75M2J30k21k9K62j14
5049iJ45Lk16J70k3n6oj11L53k06j13j66J87JJ18j54l07K81J17j60ORR7j4OJ72
5075A24j16m6J04O2k23K9R5k66K07M6j99J84j19J86m7J08k74O0J21q2P1j4k2J44
5099A33k38j66J75K43oj66LJ57l58M4J74o9J27j12K38k06J21Pj05K03j41l5L2
5122E5j16K99k24J29l06K38j13P8j12rJJ5J92q0j40O3MJ60k19K09k84J43L18k01
5146A00j5q3K2J93k98j4K7K16j22l7m5j8J83l76Q4K05M2o4K4o6J6j22J22Q4N3
$$ y = [-94, -179, 71, -145, -73, -197, 94, 52, -43, 92, -3, -36, 45, -45, 21, 63, -67, 109, 148, -60, 1, 101, -18, 48, 88, -60, 156, -45, 33, 34, 17, -62, -98, 96, 119, -23, -81, -4, 82, 104, -67, -12, 134, -175, -34, -71, -92, 92, 2, -60, -122, -101, 34, 40, -43, -25, 59, 171, -16, 97, 40, 58, 70, 82, -16, -96, 26, 75, 80, 196, -79, -37, 93, -128, -157, 105, -9, 136, 139, -77, 93, 70, 14, 8, -103, 250, 44, -69, -235, -48, -47, 71, -83, -390, -109, 8, -152, -146, -137, -40, -54, -48, 124, 8, -38, 66, 128, -95, -66, 29, -237, -30, 16, -183, 1, -118, 68, 21, 129, -145, -85, 36, -46, 25, 11, -11, 133, -105, -271, -96, 147, 141, -25, -22, 135, -223, -179, -5, -74, 53, -59, 179, -27, 94, 101, -4, 199, 58, 23, 55, -61, 238, 14, 143, -163, 75, -38, 40, -72, -81, -80, -65, 127, 47, -93, -30, -26, 134, -85, 124, -160, -17, 301, 100, 85, 2, 24, 217, -81, -95, -68, 148, 26, -11, -56, -74, 109, -267, -183, 22, 64, 0, 24, -42, -26, -148, -26, 58, 111]
5171A11j55K04o4k63K18J44m40K54O0K2Q8k74J38j65k2J63J62j92r0J02k6K12
5193A87j70n3l4r4L03j23j03J36Q5J0j16O4p4j5J13k3n5j52J38Kkk4j31L79k61
5218a3J29O8k19K15k3n4Q2l06L7J61L3k29n7oP8Q5N6Q4k32K68k55Q5q9K01m6J23
5244A76j46K4J55k71lP0K2j6O0m7M1K4j55P6j53OJ44Q8j22j61K47k22K62m0M7
5269A06o5k66L66p9l2l6K1p2J36J07l11K06o9k32N19j90M7l59J73JJ14k61O1J9
5293i6J87K1q8k38L42j77J5NJ00j28j2o2K54J04j72q8K34j43o9J69j02L8q5O6
5317G5j58K1k1J44J69j92m7J26r5j02R9Q6j31j94K27j26l5L93m72J82j26O9J68
5340F0j9r9J97j68J46Q3k23R7k12K61o4k42K11l4N9j13J99j08j10J09r6J31j15
$$ y = [111, -44, 160, 96, -167, 51, 195, -245, 9, 69, 91, 179, -95, 43, -122, -144, 19, 181, -11, -101, 1, -25, 187, 17, -36, -70, -164, 139, 16, -87, 49, 134, 144, 28, 92, 18, 3, 116, 93, 38, -114, 24, 26, 24, 0, -131, 248, -13, 116, 184, -35, 180, 157, 103, 185, -121, -84, 77, 110, -119, -176, -182, -104, -19, 37, 121, -111, 157, -98, -13, -102, 99, 53, 176, 30, 54, 209, -62, -65, 5, 27, 11, 71, 24, 65, 89, -66, 10, -143, -137, 7, 95, -27, -188, 59, -163, 99, 59, 106, 41, -225, 141, 62, 30, -6, 15, -57, 79, 186, -125, 81, 12, -220, 299, 109, 156, -203, -30, -29, 85, -176, -115, -96, 91, 112, 24, -214, 128, -49, -34, -29, 71, -57, -69, -131, 123, 227, 55, -33, 201, 58, -11, 158, 56, 94, 9, 75, -83, -62, -83, 61, 230, 38, -9, 117, 22, -80, 19, 105, -26, -220, 7, -119, -154, 239, -233, -51, -177, -108, 60, 41, -58, 139, -29, 117, 200, -23, 74, -138, 123, 59, -183, 28, -6, 53, -60, 139, 31, -79, 30, -66, 65, -50]
5363e0K8Q3k03J84P5r6o1M5N6j23K12j67K07k75k6J90o6O4q9q9J37j78K05k7j48
5388a12M4n2L49j86m9P3j43j6mj95N35k10n4j84M05k74J67jN6l37K24J18r2j15
5412e3J4J91j71P8o9N6j55J33L6l4R6J3k26O2R9m1j07L9K21k63J26k39L7K08j19
5437f8K49j32j3Q0k91R2k9l0r7J44j0J21J63j70n7k18N08m84L81j81j8R5j61K14
5461H8j8j25K1J69j88O9j5J21j7j59R6o4P1K2q5N1m2q5K73l42PJ39r2m8J15J68
5487A30o4l5K2J8k07N9J47p5Mo0J14l7q6l2J57o1K9K1k11N7Q2J03j48N4qL2r5
5514i0J14j06j44L07j84K87k57J03J31j23m5J58m7j93N3J16k47J45Q5Q1j83j8
5536e7J08N5R4j04j24K69nj60j9j14K25j35J2j64J22m2O5j21K51j82J3J66m3r5
$$ y = [-50, -22, 61, -142, 42, 117, 21, -40, 5, 61, -62, 150, -17, 190, -85, -111, 79, 13, 77, -12, -101, 36, -142, 63, 36, -112, -68, -120, 229, 43, -6, 67, -76, -92, -96, -291, 244, 34, -20, -204, 201, -73, 94, 93, 149, -188, 36, 154, 62, -53, -39, 152, -19, 59, -10, 46, -109, 24, 60, 26, 122, 135, -91, -29, 70, 29, -78, -39, 182, -81, 45, -194, -157, 51, -68, 181, 49, 36, 116, -175, -83, -112, -142, -239, -95, -105, 16, 179, 9, -48, -266, 242, -242, 139, -42, -60, 35, -126, 88, 70, -55, -34, 135, -53, 16, 1, 122, 105, -54, 42, -22, 49, 71, -14, 37, -5, -90, 183, -159, -152, -13, -105, -153, -38, 130, 66, 31, 53, 71, -136, -77, 70, -5, -1, -61, 53, 16, -70, -102, 55, -6, 23, 44, -167, -110, -28, 75, -73, -19, -27, 5, -90, 24, -82, -226, 81, -103, 184, -73, 30, 161, 38, -7, 151, 104, -89, -36, 80, -167, -22, 63, 144, -39, -57, 51, 106, 200, 96, -28, 241, 236, 76, 57, -57, 168, 33, 45, -119, 3, -39, 26, -95, 156, -26, -13, 153, 110, 15]
5560A5J14j43J69Nr5j86J77j37J82m6R1o4r8P2j74J12K0K8k21L15j66q3L0N3J5
5585a5j50R6O9r2J38j7j76K09j01P7j57K08M3r4m6O7O8J3n1j16K4nj87K66l7O8
5611A02j80k46J82k8l6J49K48m10J82o8j1J16l3j44L08j36J63j08j64L26k91J73
5633I4K2j49P7k05J55JJ0O5n0n4L8L0m9N8L8k47J02m0k9kJ37m7K6j8N7j63J02
5660d1N6q2m3P6K28j62J0jj0P6k19o0R1J5o9Q2J9M6j5j91O8J33q9J15oP0M3j41
5688arjj83K29J4m4J29N7j07j47O6NJJ14q8q8J02j7J69j91l0l4j79L35k2o2M4
5715F2p9j3R8rmj09J1n2k9K67j55O5k7j0n0N7J1j46PN7J87j39L5P5j45r9J01j0
5743d3J52k12J07j18N0J17j98M9j1J7j7K57j26J29J0q5P6m4j12j58J38J10l7R
$$ y = [15, 129, -14, 155, 160, 65, -121, 56, -81, 101, 55, 146, 82, -16, 56, -118, -6, 14, 42, -179, 136, -30, -113, -83, -30, -15, -165, -69, 0, -92, 46, 29, -147, 62, -39, 38, -119, 89, 132, 38, -8, 59, 127, 140, 89, -27, -3, -8, -195, 71, 34, 102, -78, -324, -142, -170, -206, -57, 191, -219, -37, -105, -116, 0, -33, -177, 131, -5, 158, 50, -114, 212, -79, 94, 116, -33, 44, -161, -6, -5, 5, 70, 20, -34, 4, 34, -15, 43, 81, -166, -64, -104, -133, -135, 2, -45, -19, -37, 20, -143, -41, 15, -67, -110, -34, 194, 32, 42, 41, 31, 107, -112, -172, -81, -66, -135, -53, -34, 12, -3, -194, -126, 7, -82, 33, 27, 97, 140, -1, -10, -11, -194, 35, 49, 5, 134, 191, 84, -63, 3, 8, 9, 123, 35, -53, 49, 32, 201, 10, -20, -54, -233, 102, 80, 18, 62, -17, -30, 68, 59, 55, -54, -43, -95, -124, 143, -12, 53, 26, 16, -34, 23, 34, -112, -105, -48, 139, 0, 35, 110, -35, -134, -33, -43, 109, -103, 4, -114, -64, 53, -145, -96, -107, -90, -107, 150, 24, 153, 163, 78, 154, 110, -2, -160, -22, 88, 51, 60]
5767F0p5j84J30J17qL1K8l19J82O5k2m5K14o8p5M8K0k6K7m2j25M8J38J49n7o7
5793A44m0j96n0J15P6lk18J82J09m36L09J3K2Oo3J37j45P3o5j16J26j34N6J33
5817C5j87K66m1j9n0Rm4p0O9K90j92j50j03K14J53j50j51j3L8M6q6J42J10j90
5841g4j42K76r9RJ04O9j14j28N9j57K02p2J71Rj65lJl1K00j88P2Q9j41J67k42
5866a28J0Q0n1RO4n5p0J27m2q6P2J53k03J56J46k24O3L9k2p2N0O1p6Pr8J10K7
5893D7J09k09l54L61k9J20J84j47m3Q1k70J95nj33J4l3Q6J3j43J0k4J47kmj24
5918a53K53j97R7J82rk62J31p0J74rN0k21q1J04m7P5Q1j20Jl5p0J43p0j35J36
5943e2N5l8J02k8J92j32j67jJ58o6M2L5j05MJ68k53K20kj60o0J83n8o6j86J61
$$ y = [60, -15, -199, -69, 48, 40, 71, 99, -220, -38, 27, 5, -40, 174, 106, 31, 79, 99, 73, 100, 58, -67, -19, 119, 268, 211, 144, 104, -92, -142, -27, 49, 46, -172, 10, 119, -317, -8, 5, 27, 33, -30, 107, -38, 35, -30, -146, -20, -154, -98, 35, -152, 114, 73, 54, 4, 13, -31, -101, -32, 258, 66, -84, -187, 27, 180, 30, -121, -134, -96, -50, -136, 6, 116, -74, -216, 60, -39, -30, 74, 143, 29, -99, -40, -197, 5, -67, 104, 113, -52, -55, -54, -85, 115, -73, -1, 88, -53, 114, -128, -118, -38, -89, -80, -16, -71, -141, -14, -56, -142, -70, 83, -120, 36, 182, -42, 21, 60, 38, -34, 16, 77, 1, 8, -90, 20, 47, 156, -53, -407, -46, -75, 45, 229, 82, 39, 120, -150, 45, 40, -93, -79, -112, -26, -13, -156, -146, -170, -23, -25, -29, -153, 100, -97, 0, 182, 173, -89, 42, -28, 146, 137, 187, -34, -115, -11, -58, 17, 98, -22, -21, -56, -126, 17, -53, -188, -52, 3, -35, 67, 39, 231, 99, -68, -69, 89, 23, 65, 100, -5, -1, 167, -86, 134, 132, -28, -88, 95, 37, -29, -215, -54]
5968e4P0j73K74Q9p1q6K1J90m32K16n2j17K43k01R1m4J52k13K60j21p5o5O7k2
5992e3J37j19k3J03j92J62j65J86j22k1J30q2J71k27M2R7R1l0k58M01k20J7N2
6015G7p2J10j22K15k38J70k02m0J21K11j17j60J78j6j09k8N9j55K3Q9j70J56j36
6038a56J66j2oP9J7j30n7J25mL5n7j29K08r0J04j31%Q3k59K41Q3k49J4J17J10
6063A02Q9k91K20j26N8p5Q4q1r1q6K83l5k9Q1j31J39j07J0J2L2o2J1Q5m5j6j1
6089B0k6R7L9n7Q2k46R9Nm9j30Q1lM4l1r7N1m7J88m1J58p0pm4M1q9R1r1k9j8M2
6119c7o6R9O3k6l5q5m2K6M8q3R4n4J16q5J72l37K30k0%O4j01j21J22Q8j69M36
6145B97m55J50J94j97L91n72K94o7Q8k36L9J18J44k82J37r0o2O3LJ71n9J01oj51
$$ y = [-54, 16, -157, 117, 206, 135, 49, 70, 260, -172, 44, -8, -125, 118, -83, 8, -36, 116, -97, 163, 42, -33, -98, -31, -53, 84, -35, -58, 45, -147, 15, -150, 36, -86, -107, 23, -59, 112, -115, -73, 24, 115, 85, -173, 228, 8, 25, 77, 5, 115, -7, 208, -30, 140, -62, -102, 19, 230, 113, -47, 131, 115, 6, -22, 37, -118, -95, -6, -176, -20, -156, 10, -2, -8, 71, 88, -42, -99, 26, 22, 57, 0, -129, 79, -11, 93, -38, -38, 45, -214, 27, 110, -139, -125, -8, 102, 191, -100, 120, -6, 52, -23, 61, -20, -111, -197, 86, 51, 22, 103, -28, 111, 4, 14, 26, 58, -4, 7, 92, 47, 31, 20, -6, 91, 130, 73, 155, -91, 8, 13, -36, -166, -85, -88, -44, -75, -172, -121, -168, 20, -21, 137, 67, 60, 16, 57, -32, 59, -32, -61, -79, -37, -103, -4, 59, 33, -2, -87, -129, -103, -55, -138, -44, -98, 18, -67, 105, -232, -2, -22, -22, 42, -59, -180, -58, 30, -139, 297, -158, -8, 186, -11, 380, -192, 102, 35, 123, -113, -74, 44, 188, -94, 43, -47, -109, -46, -43, 128, 69, 170, 164, 13]
6169A3J29j35j09M5n9J47J29j17o3L1j05M1J59l8o1M2Rk36J20J86l19J93k8j22
6193a48K00j77L07kj84J44k94K29j95P5o3K2J34N0P7k13Q4q0J50p0Jr6J96l4j33
6218b0L29k54j23j8J69J0j12pQO4j01r8K83k15J38l24K48j2jl5%J04l2k18J62
6243e5J04k08M62k68p9J27kj70J88q3J55k13j19n1J07ML7L8J31O9j00l12J20p0
6267a88K02oP0j6L4K4M5j12q3J54j59O1K4j21J56O2J14l26j31K21J01n9j79Q6
6291b6j95J86m6K41k44k7J72j94J26q7l0KJ12P0r3Jk85M97k22Q5j4Q3p8K7O0j5
6317A06p9k09L06k82j8K02r8j9N2m6K42j26L3r9J75k85J44N8o2Rn3n2Q1nK1J3
6343IR7j74J89k11L54k05o7J23j5k9k00K14%J41k78RNM5l2P5k3n5%k29K75k20
$$ y = [13, 142, 7, -102, -57, -116, 31, 160, 43, -20, 11, -94, -53, 106, 68, 7, 49, 58, -178, -58, 128, -191, 2, -26, -148, 52, -125, 182, 180, -4, 140, -154, 75, -120, -45, -108, -86, 48, 98, 175, -38, 46, -34, 116, 46, 47, -49, 147, 113, -20, 309, 55, -68, -86, 83, 93, -19, -26, -18, 46, -55, -153, 130, -85, 53, -271, -23, -35, -36, -71, -71, 33, 1, -217, -55, 49, -159, 303, 35, -44, 83, 81, -89, 99, 16, 171, -42, -161, -212, -105, -101, -64, -26, 105, 174, 74, -238, -118, -188, 14, 8, 78, 62, 96, 120, 165, 53, -30, 124, -35, 26, 50, -71, 85, 147, 261, -65, -196, 25, 126, 67, -112, -26, -221, -35, -81, 160, -84, -111, 61, -133, -7, -94, -124, -122, -10, 60, -33, -32, -317, 180, -42, 43, 29, 112, 34, 61, 121, 106, 27, -182, 124, -158, -176, 26, -72, -91, -39, -85, 157, 31, 64, -35, 140, -145, -1, 57, -5, 4, -49, -101, -20, -25, -4, 9, 106, -68, 121, -90, 264, 59, -8, 115, 100, 71, -129, 85, 85, 226, -52, -43, -38, 7, -25, 50, 27, -28, -28, -257, 18, -202]
6369b02J82k2Q7j13J07k25J44K0J46j80L7P2m4o4J26j82N0j48J66kp3m3J62j95
6393a94O7k7J09L3Q3j81O0K90k98J67M9j69o5l6J19q8O3J03j15J75q5j50J80l86
6417b96L20J7r0j81K57j32m7J37%j05J32M5j26l4K61k90K05l1k53L40j79J24p4
6440@m0n8J65j53J50k88J75m7K15q0l3J73l96K55k40J59J7j5J29l8r1L0n6r9K62
6465I6j59J00J11j22N4j67R8K11N6k83l5m5J89j25j2j24J01O6R9m7o5j65R2j88
6489b64K91j7j00k9K84j57M3k0j21KP2k3J19m1j54K57k22R5n2o6K20j60q3J92
6513F6R2Jj53p8j35J37j80J46J15R1j83K22k31q5Q2J48j0j95K88k38J58R4k82
6536a30K14j11K18l22L29k37MQ4l49K43M9k15K6R6J9j8l7J20J22j06l3r7J18K03
$$ y = [-202, -20, -42, 45, -68, 39, -186, -42, -22, 124, -56, -19, 53, 9, -55, 71, -111, -61, -209, -43, -45, -118, -161, 1, -194, -127, -154, -45, -12, 71, -110, -50, 240, -58, 109, 158, -11, -76, -112, 7, -81, -18, 85, -30, 145, 60, -90, 90, -296, 24, 41, -49, -230, 27, -105, -152, -15, -15, -120, 12, 57, -69, -103, 158, -132, 73, 42, -211, 129, -50, 74, 0, -40, -98, 67, -86, 64, -224, -49, -96, 119, 39, 6, 179, -217, 38, -202, -43, -26, -41, 88, 50, -41, -11, -67, -166, 96, -63, 37, 148, 26, 80, -87, 11, 222, 278, -5, -40, -85, 104, -21, -33, -157, -56, 10, 109, 62, -3, -168, -76, -264, 27, 10, -90, -119, 165, 8, 51, 31, -90, -88, -16, -39, 80, 39, -115, 142, -80, 15, -37, -103, 117, -43, -126, 66, 158, 159, 6, -72, -207, -70, -250, -104, 11, 102, -81, 141, -90, -175, -93, 55, 45, -150, 138, -100, 58, 152, -130, 84, -27, 191, -131, 198, -39, -35, 49, -300, -57, -8, -223, -197, -101, -82, -100, -137, -17, 105, -1, -34, -131, -13, 190]
6560A90j89pj13P0R5j1P9q9o1j3L9L3J09%j65O2j26K46k66l6j00J72J23j65R6
6585b7j69L03j40K6j94K25Q3k1J73k49K79l09k16J81K86j81k07L72l50K61j21
6606En1j72L01q0n0KJ78k18kJ3O3Np6K82r2j01N8p7k2K07q2L0K16l46n0J36l7
6633D0Q4r4m0J5L0L11l29J65k37k6N2M1r3k9J11L8m7N2j12J1N2r0O0j76j8M14
6659A85j03q4q6K90k22j82K91p5j3K6k8j12J68j32Q1R4j48J19J05k05P2j28K16
6682A29k68J83j8k40L76n7j67m5J65m8r8Q5l0J23Q4J81n01K39p8j3o2Q6j91J87
6706B2K5J19j40q0j8j4J61j63R3Jo4K30k02J8j01m1K83j11j41L68l21Q4j24o1
6730a77M13l01L39k48J05k1j1r1r4J18j29J15m8J74j72P3j29j8R8J26K3k14j8
$$ y = [190, 1, -6, -119, -49, 46, 35, 114, 25, -36, -49, -10, 23, 132, 132, -33, 29, -97, 149, -117, -153, -253, -81, 42, -123, -27, -196, 107, -33, -7, -201, 24, 107, 86, 259, 10, 289, -20, -236, -55, 231, 50, -157, 215, -135, 126, 5, -46, -218, 83, 3, -47, -45, 133, -85, -87, -74, -11, -6, -82, 200, 108, 7, 65, -12, -34, 173, 91, 121, 337, -9, -59, 77, 40, 124, 30, -10, 5, 35, 346, 17, 182, -55, -81, -29, 12, -81, -110, 1, 39, -8, 44, -68, -57, -5, -95, -35, -211, -229, 185, 82, -2, -88, 202, -20, -202, 89, 14, 1, 27, -1, -113, 55, -77, 4, 98, -50, 69, 174, -31, 41, -87, 129, -139, 44, 26, -214, 162, 105, -62, -107, 58, 10, -88, -3, -33, 90, 174, 355, -146, 93, 15, 2, -60, 26, -165, 22, 47, 166, 26, -54, -72, -86, 75, -88, 5, 6, -58, 172, -30, -12, -113, -154, 129, 18, -123, 245, -76, 8, -116, -177, 236, -65, 274, 26, 131, 110, 99, 8, -86, 32, -97, 18, -30, 144, -28, 45, -84, -102, -4, 122, 145, -69, -87]
6753h7J55r4o9J68K0r2J7K05l13J19m0N6r8kJ72k04OK08q8pJ12j24J6L4j85K06
6779I1k09n7J30j23K08j68P8J45p8J28l14K10rk9K89l18L2j18J81j78m5J00J53
6802I9l0j30L6PJ58j13j68K01j4k7k5j58N3J46j3M3r2j57MK44oj07M7j5m8P1q8
6829h2P6k2j79K35L4Oj40J50R3n5n8o5R3j76k1O2J08k86K29O8q2O8j52n7L17j40
6855B4j2j44K29lkK2j8j00m2P5L4O5j28j38J3K0j75K42Q6o9k19K76P8mp9q5J79
6882A25k55k2L12k59J03J27k6m1k3j88J81%P4L4j45m9PJ54j40j2J82p3m5P3k33
6907a39P4%m4J21j26J31L2k9P0o9r3r1K02p2j1O1j49K46j31J5l6j00K57k94N8
6932a17J30j96J5K01P2p6j45L27j44k24Q5J53j09N0k07L13N4k23J51o1o4j07J23
$$ y = [-87, 68, -26, -95, 73, 93, 1, 18, 223, -90, 29, -11, 45, -53, -55, 117, -87, -81, 127, 39, 32, 144, 20, 36, 70, -115, 91, -118, -175, -45, -168, 40, -128, -50, 95, 17, 145, -169, 41, 32, 3, 292, -26, 6, -112, 69, -109, -154, -54, 99, 69, -61, -25, -18, 140, 27, -141, 60, 46, 19, -6, -164, -111, 35, 22, 65, -27, -184, -180, 64, 58, -49, -2, -17, -65, 6, -82, -6, -28, -207, 28, 62, 68, -72, 78, 171, 116, 58, -7, 86, -90, -111, -49, 59, -227, 2, 70, -12, 56, -96, -153, 164, 24, 12, -132, 97, 94, 92, 114, 96, -4, -46, 29, 63, 128, 0, -138, -125, -105, -280, -38, 48, -21, -240, 36, 114, 110, 31, -54, 125, -130, -152, 160, -99, 4, 131, 105, 64, 41, -147, 34, 34, 108, 142, -3, -52, -45, 109, -31, -43, 139, 66, 21, 94, -139, -65, -65, -109, 12, -114, 17, 49, 20, 90, 21, -72, -163, 39, -33, -44, 17, -132, 114, -17, -2, -38, -138, 119, -175, -117, 13, -183, -168, 33, 105, 29, -116, 211, 67, -157, -72, 81, -28, 22, -185, 128, 182, -41, 110, 49, -15, -122, 1]
6955Aj41K00k30J60j61Q0J28j91l2J61J22j12J95l10k5M9R1l7np3J58j86K28j12
6979d2QL4Ml7q7M5J54j94K51k87J22P5R4k81Q6N5Q5rnj38o0O8K2J76j26M9J5P3
7007A50j00q8l7R1j8J22l1j21M5kJj16L6K76k35R9Rl15J11M1K0K45K4k89J29k7
7033B0jK6nj98K60r4mo4N5ON6l2m9P9r9O6j67K35j71PJ46n9M0L5k26N8N7Rm8P5
7063A3j50J89j59RL06q1m21K30Q8K2R6n5q3O0n9j00M5J9J1q4J81j49J12p2j2j71
7089b15K04J7J57m6l10K11L6p8K4j8J15m6q9N9Mq4O7oJ76j33n7J46j48j27R8j98
7115b41L39k08J21j11r4K62j04n3J79Oj70J56j34R0o3J11k38K36k7j36J39k95
7137b35R5K34j07L8L9j09J32j59K52k32j24J78L0J5r8o8J12J39Q5k39r7M7O7K7
$$ y = [1, -140, 60, -170, -10, -171, -91, 37, -154, -186, -25, 97, -15, 180, -130, -155, -106, -15, -52, -57, -130, 28, -158, 70, -42, -34, 0, 4, -33, -120, -75, 79, -115, 136, -151, -29, 46, 140, -141, -55, 0, 85, 76, 71, -67, -127, -59, -37, 139, 13, 62, 77, 150, 50, -38, -75, 16, -2, 120, 89, -32, 13, 11, 12, -104, -68, 208, -27, 72, 81, -234, -123, -82, -62, 183, 207, -82, 47, 20, 19, 45, 40, -158, 102, 8, 4, -60, -5, 1, 57, 25, -24, 55, -44, 22, -145, 90, -81, -74, 72, 13, 53, 88, -138, -80, -23, -14, -62, 13, -137, 52, -107, -98, 208, 127, -294, -64, 24, 46, 142, 87, 4, 64, 5, -95, -50, -31, -20, -104, 77, -72, 40, -32, -44, -215, -11, 6, 163, 117, -193, 18, 54, -24, 0, -18, 97, 51, -38, 21, 25, -59, 8, 2, 178, 45, -12, 134, -14, -141, -43, -241, 98, -110, 11, -100, -194, 68, -36, -89, 90, 96, -74, 82, -52, 38, -25, 86, -152, 84, 57, -79, 60, -235, -140, 94, -13, 25, 64, -45, 87, -72, 180, -52, -176, 2, 32, 47, -51, -119, -7, 132, 217, -22, -119, -72, -5, 22]
7161B2k3N4K08l22k05K22R8q6J0Q3R8n2k42J30r5J18k32K12J0K13j97K7n3l6K96
7186B58O3j22m1j98K9k1o3K75k60K97k58j05K29j84J58n4j04J4L8R5M1nj17Kj58
7211a91P9J08k34J69Q8L3j02j38M80m38K83j14j4J5m4k7PJ0r8J60j63K07j28K17
7235A65L0k21m3Q6l7Oj45J71J60k73R8l3j09K40J3k66K5K36j66j27O9J36L2m9
7259bj83J18k91K05q1L37k02j23J93P5P5j00j00k6J64k35J32J95j06N6k45P1K79
7282B06k00J35k17l9K48Mj14n5R5k24J35N3L2j04J14%N0j08j44J46r6n2KJ49r0
7307g4j42L51q4J87j49j37J25mJ0j08M1m2K40k01o7M9m2J76k1j64O4j15P3l8K13
7332A41j19N8Pk37K45PK4k57J22P8r7j67K92K4j79Q3j07k4lK51k38K03p0r2L7
$$ y = [22, -1, 53, 261, -61, -266, -44, 54, -32, -22, 61, 159, 107, -135, -5, -100, 18, -214, -2, 8, 221, 24, 51, -2, -38, 258, 321, 199, 158, -40, -11, -32, -95, 180, -80, 217, -41, -146, 83, -101, 57, 3, -101, -87, -49, 46, 87, 82, -35, -33, -191, -112, -4, -238, -69, 19, 52, -50, -188, 292, -146, 137, 23, 9, 24, -20, -47, -40, -30, -128, 32, -131, 76, -52, 165, 195, -26, -69, 17, -20, -14, -159, 12, 172, -101, -3, -36, -145, 95, 108, -158, -133, 103, -63, -190, -121, 15, 47, -2, -185, -67, -358, -153, -234, 103, -99, -222, -29, 46, 121, 21, -79, -105, 59, -176, -44, 151, 45, 101, -144, -73, 206, 6, 141, -76, -115, 133, 137, 23, -32, 63, -161, -26, 27, 59, -45, 69, 69, 119, 11, -133, 13, -83, -135, -133, 16, -74, -216, 135, 51, 238, 89, -48, 77, 73, 83, -25, 16, -26, 214, 13, -54, -5, -47, 129, 108, -56, 8, -107, -34, -72, 141, 22, 80, 87, -150, 95, 102, 126, -131, -9, 69, -28, -195, 97, 121, -58, 25, -82, -106, -109, 142, -96, 107, 37, -55, -18]
7357a8mj5J21p4j68J03N3n6Q7k1RJ1k09J70J77k49K7K60k5j04K6J29l13J17j01
7382f7J14J02o4j42J4j19J99R5k33J45J73k00m9R0k2L9Rm2k31J50k9J34O9J26
7406B61j52j43J25j72J44r5K59k58K47j53l0q9L4J74j43j00J65j0l51K16J24k31
7428a78J80j51L34j77K4k62L71j08l6J58j95J0l2O9J24k68J04M8k6P1O0j8n2l4
7452A6j37N5J53j34q8J02R2k52P7L46k52J36k21L41l59K65k14jK9J15n0j12J01
7475Ho9N7O3o4R7j40o7K91j65p7RL87l57q2J35L1r0o8j36J85K9K1L8j72J69j82
7501a49L24j80j06R7j18O0L1p7J95k3R3n1j61R2J6pp9j0K61r1J5k78j8P6Q6j03
7527a05J17J52j35O3k2l01K88O4j19K1j55O3J53J3p4N8k17L56j94n9J29k05K9
$$ y = [-18, -22, -37, 84, 10, -158, -55, -2, -58, 29, 8, 17, 28, -181, -11, 166, -83, -56, 204, 179, 75, 101, 230, -83, 34, -67, 47, 149, 85, -57, -43, -162, 37, 132, -101, 44, 217, 17, -32, 58, 36, 75, 84, 42, -189, -39, -68, 66, 135, 261, 109, -34, 91, -81, 63, -32, 227, -31, 216, 63, 33, -56, -22, 152, 9, -91, 74, 64, -287, -71, 53, -178, 2, -149, 185, 8, 32, -230, 141, 33, -3, 155, -40, -30, -62, 7, 131, -137, -33, 15, -11, 60, 120, 102, 50, 16, -121, -66, 87, -47, -135, -33, 59, -193, -116, 230, -22, 114, -107, 234, -125, 140, -74, -75, -46, 69, 19, -93, 8, -61, -4, 59, -5, 92, -48, -115, 176, 11, -66, -57, 330, -27, -109, 26, 57, -33, -101, -237, -52, -23, -2, 36, -136, 33, -149, 175, -5, -111, -14, -132, -72, -41, -118, 77, 54, 147, 96, -65, 27, 43, 36, -43, -53, 208, 117, 132, -146, -164, -88, -2, -105, 12, 164, 29, 92, 70, -231, 57, 121, 2, 23, -132, -69, 84, 97, 23, 81, -136, 220, 26, -33, 96, -109, -80]
7550h0K05l67K97k1M5q8p5Q4J58k2K4r4q0R8j54J57j05O8J11o3j60J69k1n3Mr
7576B8J51j43r1J01k3q7K0J68k46J14l7n5RK4M2m9l6l4L7J83j95R3j79L17j49
7601c7P5P7o6n2j08J31J06k71J34p6O5N3k08L02j04q5L6J95j17j50K15j46J11
7624H0q4j05K36j40Q4r2R7R8q0j78qJ78rM1k40K19j92L1J9M3Oq3m8J81l0J6q9
7651d9j20K59j57R7J21q5%q6j4K91l30k11L20n3N7J21j06J19j50j29L35j05p1
7674E4N8j66J04o0M0o8%j53J41k5K08j12j43K16j06%n2PO4J57j29j20Q4R6r8j01
7700a04K92j79J9JR5p7K20m03K28j92K33k61J23N2l30J81J0L09k73l2J81M3p0
7723F6Q8j10lo2M5L6j0j06J06m3O9r7K8K39l80n4J14J55j40K06o1j47k1J85k38
$$ y = [-80, 125, -242, 55, 34, 79, -9, -84, 0, 158, 136, 160, 66, -14, 84, -70, 87, -18, 50, 161, 98, -62, 107, 86, 33, 37, 28, 179, 36, -55, 46, 23, -64, -44, 124, -122, -8, -45, -100, -91, -67, -25, -74, -110, -144, -107, 76, -119, -26, -205, 112, -37, 38, 115, 49, -3, -111, 20, 126, -145, -11, -87, -22, 31, -177, 125, 21, -64, -28, 167, 50, -100, 115, -31, 80, -4, -109, 127, -13, 71, -21, 76, 174, 94, -84, -92, 86, 77, 118, -122, 97, -95, -64, -45, -2, 4, -79, -127, 54, 24, 40, -49, -169, 90, -67, 30, 151, 66, 66, -20, -34, 257, -73, -284, 36, -17, 40, 161, 55, 174, 24, -105, 230, 125, 54, 112, -54, 50, -10, 30, -38, -38, -191, -50, -75, 133, 21, -122, 94, -12, -12, -64, -57, 7, 164, 35, -85, -1, 95, -3, -104, 188, 9, 28, 29, 124, 47, 267, -136, 92, -100, 133, -128, -5, 47, -283, -102, -92, 217, -56, -88, 93, 136, 66, 154, 44, 41, -21, 24, 60, 50, -56, 50, 7, 76, -21, 7, 246, -134, -188, -74, 81, -59, 147, 86, -61, -82, 103, -135]
7748a35J7J49j81L75j25j68J25j7m6p4K13j43J62j14j62J89k64J42J88j00p0k1
7770f0Q7r2M1J67k30RJ97PJ06m73K62K6J6j2p9m2n0l4K95k81J96m6J9p9l4J22
7796C8j39K56m4M4k82J68%L4q2L2j13K20q3k54J06J2PmM1k3p2L64k75J84k12J60
7822H3k01K98k24P1Q2m1j9j29J65O2k42j9O4J18j5L4m3j83L3J35n2K5j77j80M54
7847I9j64J77Q4k18p4qJ20l7j7Ml4l4m5J67j3j58Q9K4L5k23J89J02l1K69j00l6
7873A67q5j85K38p1j68K93l5n3k31J83k0l3j46n9M19l20J69O8m92M31q9J03j48
7896f4J30p2o0J34p4j35m3O4K80j18k75J74j04N8L32k29J70l56O6J82j28J51j80
7919i7J6J34j84K74q1k0j21P0J27p0k8p8K76m26K48M5j63K85k57Q0j64K34k12
$$ y = [-135, -118, 31, -150, 225, 100, -68, 57, 40, -6, -80, 133, -10, 152, 38, -124, 65, -199, -57, 131, 31, -39, -60, 27, -65, -24, 143, -87, -78, 119, 126, 232, -241, 21, 47, 63, 51, -28, -70, -120, -154, 141, -140, 56, 10, 29, -50, -84, 38, -101, 155, 111, 155, -127, 41, 41, 75, -7, 25, -88, 132, 49, -205, -99, -87, -80, -84, -43, -66, -138, 226, -49, 135, -77, 83, -118, 180, -44, 27, 109, 68, 49, -80, 85, 147, -95, -114, -50, 68, 53, 87, 44, -139, -106, 29, -23, 2, -175, -355, 99, -65, 112, 196, -22, -96, -104, 16, -21, -38, -34, -68, -102, -147, 20, 7, -151, -62, -38, -3, -226, -37, 65, 34, 303, 203, 167, 82, -103, 135, 64, -104, 189, 154, 101, -130, 53, 33, 0, -146, -205, 214, -106, 63, 131, -361, 70, -19, 84, -64, 66, -6, -66, 68, -6, -141, -184, -120, 160, 42, -233, -59, -163, -105, 227, -2, 168, -188, -122, 60, -68, 83, -97, -81, 53, -131, 143, 62, 42, -79, -9, 118, 48, 20, -58, 218, -208, 40, 85, -78, 207, -50, 30, -134, 100, -112]
7942a12OL24k18O3o9K6R7j61K0K22k61J57l2l5j06O4L5K7o0J77j00j04M0J1J05
7967A16j49J05j01j04J96j17r1J18J00j43K37R9p4k86Q3jK01P8l66J89k17J72
7989D5mj14J90j07M1R1j24J01q3q7l5pmQ9K4o3Q9j65o8J89k9j3j43J86O4j47N6
8016b8J27j27k9J02nj17m3M4J48j31J4K70l22R5R3M8q6J9j67jR8pj76ON1KK82
8043A60k47J52N1r4P8r7l0K5p7O3N3k06M0J75n7m9jp1J58m7M4J0l4J76j92q3J02
8070BQ7l7p8P3k4o7lJ28p3P2n4j88k7P7L06k02n7n7J03P9O0J4l8r0k6m7K32j47
8098A8n4oJ36k27K01l6n2l0M7J53j86P5r1J53k61J94j19J40j86N9K57j82J26k23
8122i4M8K27l7j63P9j07m0q6J39q2L8J74n3J0k06K08j32J39L9j10m3j9j73J45
$$ y = [-112, -106, 218, 0, 63, -6, 20, 117, -44, -24, 198, -63, 94, 62, 27, -79, -15, 20, 47, -13, 164, 64, -40, 0, 11, 116, -33, 72, -29, -133, 63, -54, -145, -27, 73, -70, 167, 266, 192, -94, -11, -12, 189, 267, -99, 90, -127, 45, 41, -73, 117, 10, 51, 142, 18, 119, 36, -51, -86, -93, -97, -8, 16, -47, 42, -123, -191, -2, -31, -44, -187, -1, 63, -84, -28, 99, -28, -57, 45, 40, -77, -120, -76, 72, -59, -45, 225, -97, -2, 91, 139, 53, 72, -95, -96, 2, -5, -181, -175, -124, -122, 160, -87, 65, 116, 22, 100, 3, -27, -2, -79, -16, 37, -169, -129, 46, -11, -60, -61, -132, 26, -21, 23, 33, -1, 175, -17, -100, 2, 89, 52, -26, 47, 23, -44, -47, 81, 8, 80, 26, -162, -189, -112, 194, -8, -65, -122, -19, 60, 120, 134, 96, 6, -20, -67, 165, 18, -36, -42, 94, -133, 68, 32, -20, -50, -3, 150, -36, 39, -52, 101, -160, 34, -85, 55, -131, -72, 185, 3, 129, -94, -46, 181, 144, -19, 60, -47, -87, -173, -34, -116, -78, 96, 43, 53, -153, 55, -77, 62, 101, -9, -52, -71, -244, -99]
8146i9k21L42m7k1J05p6j6J54q6P8j08m0O1PJ08k81K65k03K6J43m8l24L53K6M
8171A02Qk26N0K22k04P7j31j0M2J54n5P3j76M8p4J09M5L8Q2k65
$$ y = [-99, -320, 22, -25, -46, 59, -17, -33, 121, 35, 113, 5, -35, 26, 33, 141, -140, 125, -78, -52, 91, 43, -281, 72, 98, 102, 110, -116, -66, 156, -48, 29, -102, -112, -70, 84, 29, 102, -74, -26, -100, 9, 54, 92, 174, -91]
8191i1
$$ Imaginary data points
##PAGE= N=2
##DATA TABLE= (X++(I..I)), XYDATA
0@%%%%%%%%%%%%%qJ6j6J6j6K4l2L2m0M8n6O9p8Q9j04J20j40J63j87K11k36K66
35A41l03L43l84M30m80N34n94O60p33Q12q95R88j093J204j323J457j606J773j956
54a025K158k385K643k940L281l680M154m730N446o361P580r292J1888j6333K5916
69A6320q2070P9004P4702k41507N6746J20591j43290L243J47535r8836N5218J60306
81A47962j66296p1734K01300m6281p3009J24842k4686p0531O1220n0057o6596
92c3866L4620N255M230j7807o4463M5442J1036r2974O6627O9968j04456M6616
104b9772Q9995j17300K2326J30139j00310k2745J16336p5791l3321J03651o1403
115B1805n7053O2665l6537k9664M4758k0689J701J9559m6174J8205K8223m5853
$$ y = [0, 0, 0, 0, 0, 0, 0, 0, 0, 0, 0, 0, 0, 0, -8, 8, -8, 8, -8, 16, -16, 16, -24, 24, -32, 37, -41, 48, -56, 64, -76, 87, -100, 111, -125, 141, -162, 181, -203, 227, -253, 281, -313, 347, -386, 426, -469, 519, -574, 630, -693, 764, -842, 931, -1025, 1133, -1252, 1391, -1549, 1732, -1948, 2206, -2524, 2922, -3439, 4141, -5151, 6737, -9596, 16320, -65750, 13254, 87956, -153551, -96805, 23786, -119504, -116261, 31274, -67562, -12344, 147962, -18334, -90068, 111232, 64951, -8058, 116784, 92098, 21567, 82787, 32730, -33866, 754, 6009, 10239, -7568, -72031, -26589, -15553, -108527, -41900, 28068, -76388, -29772, 60223, -57077, -34751, 95388, -4922, -27667, 88669, 12878, -20443, 83208, 21805, -35248, 27417, -9120, -38784, 5974, -14715, -13014, 6545, -39629, -21424, 6799, -39054]
127c9054M6388M6655p3483K8837N6881q8064R425P7028o7731N410O9226q2873
139a1355k4832N8168n9719o586O1681m3759n878L3502n4513P954N3177l3263J8511
152f912M6126m5064J2116M3170n3543J1675N6786m9925k375M3745n4792j0101
164i094L2171n0245P466M0841m7549L917K5531m8904J8579L4931m4691K7036L9722
177B9711n4734J6255M5728n1277Q612N0331m7712m3M7769m7258j1480L8757l8978
190a4319l476L7666l1197L74K1637l4849J3813K4261l3261K3250K2745m2981K1271
203D934K7319m6619J7485L3837n0603O785L8879m7734l680L5787m2913k208M0340
216A1609l2180k100L0779k6912N551K5445k2899J6235K0129l0710J6301J9136
$$ y = [-39054, 7334, 53989, -19494, 9343, 66224, -21840, -12415, 64613, -3118, 2292, 71518, -11355, -36187, 21981, -37738, -44324, 17357, -26402, -32280, 1222, -53291, -45337, 7840, -25423, -6912, 39214, -5850, 6266, 49436, -4107, 7568, 64354, 14429, 12054, 55799, 1007, -9094, 23077, -27168, -19702, 21139, -26410, -22493, 3038, -45866, -27287, 7644, -37047, -10011, 29711, -25023, -8768, 36960, -14317, -5705, 44626, -3086, -3129, 44640, -2618, -14098, 24659, -14319, -17795, 19871, -11326, -10952, 10685, -24164, -10351, 13910, -19351, 3899, 26644, -16337, 4934, 32253, -14366, 3119, 36956, -13647, -6862, 32017, -15717, -19397, 16390, -26523, -28731, 11609, -20571, -22671, 8108, -18804, -13253, 12192, -10707, 5528, 25657, -5053, 11248, 30384]
228C0384l2242J7287J7109m1011J4667K4734m3608N480K6709m2811K232L1482
240A0412l5577L834L0531l3719K883K9253k3881R960K2504k6551J1604J9981k5846
253d612J2563J5977k8415J2442J6521l2217J0164J9073l5352O155K2532l0695
265a5864P530K2053l3653P496K5178k8048R029K1066k7908R264J8768k5743J1515
278F83J6479k6736R018J5368k4410J0305J4895k7596P727J8246k5486P342J8118
291A3953k6725P692J8412k6431J0852J8328k8643Q912J7762k4394J0160J3922
303A3800k4689R962J3336k3300J0147J3936k3104O726J3597k0583Q818J4348k3969
316a0975P203J5639k1979Q773J4391k4475R831J4280k4144J0787J3976k3046Q647
$$ y = [30384, -1858, 15429, 32538, -8473, 6194, 30928, -12680, -7200, 19509, -23302, -21070, 10412, -25165, -21331, 9200, -24519, -21636, 7617, -16264, -6304, 16200, -10351, 1253, 21234, -4612, 7951, 23928, -4487, 7955, 24476, -7741, 2423, 21496, -13856, -7701, 14831, -15864, -8334, 13719, -19934, -12438, 12740, -15308, -6279, 14787, -13121, -3857, 14911, -10832, 683, 17162, -9574, -556, 14812, -9598, 707, 15602, -11994, -4267, 13979, -11507, -4165, 13953, -12772, -5080, 13332, -13099, -2247, 16081, -12562, -3650, 14112, -10282, -122, 13800, -10889, -927, 12409, -10891, -744, 13192, -9912, -3186, 10411, -10172, -1354, 12994, -10975, -3772, 11867, -10112, -1339, 13052, -11423, -1592, 12688, -11456, -669, 13307, -9739, -1092]
329a092J1018k0334J1022J1522k2397P339J2074j8548Q003J0829j9973P797J2832
342A0092k0714P912J4466k0237O732J1588j9273J1303J1845k2052Q614J0415j8060
355g369J0160P988j9414R436P786j8716Q639R605j7823O450Q912j8472R345J3272
369I799k0583N749J3018j6890Q535J1343j7925P643R498j6100Q803P532j4561
382d139Q744L210j5549J0452O180j6220P431N909j5808R770Q049j9675P956J1906
396H216j9020P160J2870j7429N008R915j5167P239R215j2544N653M026j0969Q723
410B896K935j0893R376J862j3301J1485M138j6748R040P348j7408R391J0168j8450
424h161N734J0030j7241N885J0776j2749M800N179j1528O687L829q980P474J769
$$ y = [-1092, 9926, -10408, 614, 12136, -10261, -2922, 9152, -9396, -1393, 9436, -10537, -2740, 10092, -10622, -2710, 11756, -8481, -1749, 9839, -9434, 1869, 13714, -8338, 276, 10691, -7369, 2791, 10779, -8635, 801, 8587, -10129, -1490, 8115, -9708, -3258, 5654, -12818, -3473, 9799, -10784, -5035, 7983, -8907, -372, 10971, -6954, 689, 10187, -5913, 2890, 10422, -4139, 4605, 7815, -7734, 2718, 8898, -7322, 109, 6018, -9790, -20, 8029, -11646, -3690, 8216, -10804, -3644, 9226, -8203, -3195, 6720, -8447, -1208, 8007, -4537, 1116, 5142, -5827, 2896, 5831, -5062, 4314, 6176, -7125, 4360, 8498, -8250, 790, 8138, -9270, 121, 10289, -8161, -2427, 7603, -9638, -3753, 7023, -5726, -926, 4253, -7275, -588, 3241, -5739, 1735, 3504]
438C504q404R923O15j3623J0068M525j4959J0530R327j7058M664P723j6198O068
452c295J1923j1793L573N161j1102M258L049o519Q256N65p647P639k293r891J0747
467B631R7j2043J2987M896j7882P168Q494j6042O451J2173j2782K945Q146j0838
481c599J557N830m541L983m06m841P360l473o576Q641m241q382J2793M45j3088
496h538J0969L066j7819Q010J1149j3837O685J1260j4591l97Q590o809R12M795
510C445j056L774m055n026M347n032j965J1633l016p573J0787n006j6154J2839
524b058P983j2289R757P273j7739J966R249r968L361J0050m937p26j305m152L271
539b64j862o68Q538l407m468P340n765r226J1666L251j0471R470M104j5072M171
$$ y = [3504, -4900, 5023, 5638, -7985, 2083, 6608, -8351, 2179, 11506, -5552, -888, 6835, -9363, -3295, 8628, -3165, 408, 5569, -5533, -1275, 1774, -4745, 3511, 4076, -3571, 4068, 1775, -8116, 2631, 2728, -9315, 3672, 8568, -9314, -2146, 6348, -9694, -3243, 8930, -3852, -907, 7239, -3599, -2042, 3788, -753, 3230, 2824, -2017, 5343, 1870, -4706, 3935, -306, -8688, 4105, 4550, -8538, 2431, 5497, -12322, -4312, 6837, -7000, -315, 10945, -3646, -4043, 4547, -2262, -1350, 3445, 2389, 6163, 2108, -2918, 1429, -3603, -5568, 6065, 3049, -4524, 6263, 1257, -14897, -2058, 5925, -6364, 3393, 10666, -7073, -5107, 4142, -5826, -2465, 7585, 2648, 1922, 617, -3535, -264, -2126, -2794, 5744, 2337, -2131, 5209, -556, -9782, 1884, 5135, -5336, 4134, 8238, -6834, -2663]
554b663P097j1406M953Q982p866m41K779l539J369k115j104O852k239j761P358
569F256o070p263R605q85p944J2194L921j4123L350N498j1625M240R747p123L56
584A34M116n502k158r1J083M750k470R15N089r031l825R232m327l889J3997j134
600F889j4141O999L577j2474P479J0130j0363J419O903q558j873N862r11k02O6
615H02K326J242o916J24N559p444j55J1621n792p557R633k926j1566J0798N553
630E302j1457O486P875j2668K10Q028n618m32O359P8j789k219P6R2m502M548O751
647G120o870j828O101p328n862J1440K73q355Q147J974j2744N058O407q436L068
662a835O696n437k73K530k507k43M2K267K088l296P05K940n973j182P234k389
$$ y = [-2663, 4434, -6972, -2019, 6963, -903, -1344, 1435, -2104, -735, -2850, -3954, 2898, 659, -1102, 6256, 186, -7077, 2528, 1643, -6301, 5893, 9814, -4309, -959, 4539, -7086, -2846, 6901, -222, 134, 4250, -1252, -3410, -3501, -2418, 2332, -138, 777, 5866, -3165, -6990, 2242, -2085, -5974, 8023, 6889, -7252, -253, 3324, -9150, -1671, 8459, -1904, -485, 6418, -2140, -4013, 1849, 938, 736, 802, 3128, 4370, -2546, -2422, 3137, -4307, -4462, 7159, 1367, -6190, 3443, 517, -11049, -251, 5302, -6155, 331, 8206, -4462, -4252, 3776, -1842, -2274, 4085, 4163, 2374, 155, 231, 323, -4179, 369, 7120, 250, -1578, 4523, -2805, -8667, 2773, 3046, -5309, 2838, 4812, -7932, -2874, 3533, -4903, -1835, 4861, -576, -849, 1681, -826, -1069, -1027, 1240, 3328, 32, 737, 3677, -2296, -3478, 3756, 1367]
678A367m427O884j421p761O378K155q771M644M505p097L014L127m808P51N30q36
694a766K963l35j3J850m262o12M464k213j250N353k495n088M947J37o059N099
710G20K446o039L367K258n385J869R21k094L035J88j372J415l008o29L803j957
726d62q14L682k279l418M113L3l787M554P54n470L878K334m820K677J210l475
742a290K448P45j763J842k361q14K194k065m74L054k965j664L158r81j978L500
758E86k60l653M047J435m048L229J575m301K918J189k719K240o47k305J675j062
774a01n31J973k262j251K440j679j260K838r07k122K652N44k647L233M01l879
790b558L834N92l123L418k95k933K413n61j099K343j571j285J821j127l51J535
$$ y = [1367, -3060, 3824, 2403, -5358, 1020, 3175, -5596, -952, 3553, -3544, -530, 2597, -2211, -1460, -930, -1766, 1197, 862, 849, 2699, -1563, -2175, 2289, 76, -1174, 4179, 1684, -3404, 1543, 1680, -4379, 720, 3166, -2873, 494, 2752, -2633, -764, 157, -1937, 1098, 1286, -86, 1329, -1679, -2308, 1495, -462, -1276, 2406, 127, -3291, 822, 855, -2932, 1622, 2376, -3094, 784, 3118, -1702, 975, 2185, -1290, 1158, 1903, 140, 1982, -379, -1193, 1001, -1064, -1538, 1516, -1449, -3113, 45, -936, -2914, 586, 326, -3327, 720, 2155, -1893, 1336, 2911, -1390, 1528, 2717, -2, 2238, 1591, -714, 961, -101, -632, 1341, -921, -2172, 268, -1411, -2671, 167, -740, -2862, -210, 334, -2313, 920, 1321, -2558, 1276, 1868, -1255, 2163, 1868, -1065, 1348, 787, -312, 2031, 460, -825, 996, -131, -482, 1053]
806A053j239j236J778k65j693K297j89k818K409K17k585L498n51l228L227o06
822F9j570K968j215j721K375p48p33K021p99n65P77k66q97J847l56k165J450K24
840F96j732K296q60k443K789p06k179K896q34j840K329j284l29K257j422o70J321
857B85o85l23J724l74j254J063J47j319K154n2k209J934k42j701K557o37j925
874h57J989j514n27K348j972o67J180j461N03J305q01r17J545q15j336K692K87
891I82k349J962K58k133K498M25k241J519k67l68J038q91L3L99k314J112J627
908A290j876M35J018k042l88K283o96j878K934l95l270K835J177l608K039J434
924A292k470J171J058q60m08n09J710J44j553K188n05l001J872J660k415J30K627
$$ y = [1053, -186, -1422, 356, 91, -1602, 695, 506, -2312, 97, 314, -2271, 1227, 676, -2552, 675, 69, -1501, 1467, 252, -1469, 906, 158, -575, 1446, 647, 82, 859, 593, -304, 1543, 1187, -978, 472, 696, -1036, 1260, 400, -2043, 746, 40, -2139, 757, -77, -1917, 412, -872, -1201, 1056, -366, -1036, 285, -400, -723, 1001, 627, -627, 436, 583, -736, 1418, 1366, -843, 1091, 849, -852, 1705, 1068, -857, 1132, -382, -909, 1439, -533, -1200, -20, -1481, -978, 327, -474, -1391, 154, -661, -1997, 695, 982, -1367, 595, 853, -1280, 1218, 1643, -598, 921, 654, 286, 1324, 433, 466, 865, -1449, -337, 1290, -586, -151, 867, -1175, -1563, 720, 24, -1854, 1080, 685, -2585, 250, 1427, -2181, -142, 1292, -1178, -7, 1051, 191, -217, -726, 984, 1128, -425, 1763, 1258, -1743, 129, 1789, -626, -496, 2131]
941B131k301k601M118m35l862L214Q04l540K558J433l058O45J108p84j19J215
957E26J431j937j735K702k06k409K710J110k728j42K699k395j908L903o47l406
973b432M140N81m431J902R56k076J180J737k57j859r67J731j445m31K925j74k795
990a715J411Q35k266K42L222j376j955M294p41l724K492R48k935K272J480j725
1006G59p29j1r6j419J97K588j590k013K240r8k246J097K086j712p99L797o08k970
1024a527K859Q0l389K789K662k323l09L64j022j956R56K666j595j982K730j286
1040b83l139K507J593k438Q52L644k709k399L812p74m040M581K665m403R16J762
1056B147l445q51K861J030k650O69K261l735j098M286r79l032L638J326l926Q04
$$ y = [2131, -170, -2771, 1347, 912, -2950, 264, 1068, -2472, 86, 1519, -1539, -894, 214, -570, -689, 526, 1957, 20, -1715, 987, 781, -1628, 1082, 2192, -536, -678, 2021, -374, -2282, 1621, 974, -2432, 1708, 2289, -2142, -240, 716, -1360, -180, 1557, 1300, -559, -1526, 205, -1240, -1671, 1254, 1080, -1715, -304, 531, -1735, -1493, 1729, 353, -1602, 2692, 1951, -1773, 719, 1667, -1268, 1004, 2484, 759, 30, 19, -77, -1496, -1299, 1289, -301, -2314, -74, -172, -2418, -1321, 765, -947, -1746, 2051, 1443, -1527, 1332, 1412, -1977, 812, 3474, 1151, 842, 1206, 184, -1772, -816, 1850, 255, -1727, 1003, -283, -3422, -915, 678, -1760, -908, 2736, 27, -2372, 1440, 666, -3374, 1207, 3872, -531, 385, 2147, -1298, -2149, 712, 1742, -908, -239, 2022, -1713, -2811, 1475, 496, -2536, 1102, 2428, -1498, -694]
1072f94L563l231k407N265o09m051M058M51n475J585K941k419p93K766n5l486
1088b591J215L037l085p86M482j097k331K993M73m093P79M232k481j456M473k341
1104A423m780L394J058l604K418J984k857j668J997p0k087J983K619k473l56L263
1120B244j945k109K820J251k173J031K242l070j952L323j234k208L238k78k929
1135a749R79L41j046K19R38K82j193R44J635j722m71J562p2r21J185J079j226
1152G64j549J625r85j369K555k72k119J223Q5j279K75P12N41o41J71J403j110
1169C0n51J599r62l68J739N61j863q36J295j137j302K747m33k200J300o8j338
1186a787J093O72k66j83M59Q11j018N2J879j369o58K090k26j791O60L78j436k90
$$ y = [-694, 2869, -362, -2769, 2496, 1887, -2164, 1894, 2345, -3130, -1545, 1396, -1023, -1816, 950, 895, -2591, -1376, 1661, -1424, -2210, 2272, 1175, -1156, 1837, 2310, -1783, -1004, 3228, 747, -709, 3764, 1423, -3357, 37, 1095, -2509, -91, 1893, -964, -2632, -635, -705, -2792, -809, 1810, -663, -1019, 2244, 299, -1810, 1010, 2261, 88, 1119, 3361, 291, -1661, 1662, 428, -1780, 1458, 1180, -1749, -770, -429, -1475, -1256, -318, -36, -1229, -285, 1350, -372, -843, 719, 647, -274, 911, 1990, 764, -785, 840, -145, -1514, 1041, 769, -1350, -127, -42, -1321, -1046, -334, 207, -434, -263, 1140, 30, -521, 1078, 116, -252, 1487, 2048, 185, -651, 644, -493, -1795, 952, 519, -1681, -381, -449, -1787, -694, -22, -288, -471, -12, 799, -219, -167, 1712, 343, -315, 1775, 1549, -242, 418, 796, -640, -930]
1204i30J922r27k134K045k91j934K047M83j543O78O85K26m94N97R66j646L01J623
1222A674j079o39J301j070j082O87N87j035k66J567j711r01K278k75j504J736
1238B68j33o51P85J29J12l24J85M61p32K44P48j332l02Q85k11m67K29J64r16k85
1258a143J658o04l63J123o28o82J521n26j74J66n11L16K9k34O13p48k09L87k09
1277b18J8J53l20j06%N28J62m46R34n36m04J120o30q3N52q35L66K17n92L95l39
1298f4l10K66m39J57M85n44k05J34J62L47l69O00j84l86R25l27q7N34n73O1M40
1319F23m74L74k82n68N16l30j42N89m57k27R5j82N61k33M3j91j97P95K7m82P29
1340E87p45k83R28m83L03P6o11M39k58K2M99l33k36J30l99N37L14k61k92j46M15
$$ y = [-930, 992, 65, -2069, -24, -315, -2249, -202, 281, -1262, -584, 101, 327, -167, 430, 1396, -250, 51, 1674, 595, -44, 1257, 187, -895, -208, 379, -656, -922, 645, -1066, -1967, 311, 36, -1468, 268, 135, -516, 269, 398, 510, 186, 371, 832, 100, 344, 1092, -240, -542, 343, 132, -335, -106, 58, -858, -1143, 515, -89, -452, 671, 43, -639, 882, 356, 182, 348, -163, 153, 182, -52, 561, -187, -396, -9, -218, -200, -47, -367, -473, -473, 55, 217, -229, 705, 169, -235, 885, 255, 172, 724, -111, 255, 472, -120, 275, -64, -374, -108, -547, -390, 95, -449, -654, -520, -358, -11, -380, 220, 36, -350, 575, 248, 161, 695, 122, 183, 623, 149, 523, 241, -327, 189, -141, -283, 306, -151, -378, -283, -465, 96, -137, -94, -285, -482, 313, 340, -142, 587, -158, -441, 487, 4, 307, 383, -228, 211, -47, -25, 474, 141, -95, 35, -364, 173, 487, 226, -66, -212, 203]
1361B03R8p67Q05l40n89P81j87l61P57q68j65M26m0M09l75j75N00n63M79M55m68
1382A5R3M5N4J77l0L66n96l97R05p12k53J069r82n69R75m82R4Jj47K39m65L90
1404b10N72r16N30L32q60Q20K78k8m1m04N28p27LJ028q01m62R40p92j17N09k43
1425f1l41J09J84Nj90K47K50p23L81M64l81K09k61l3k79K06O81m74k81R53r12
1446b47p7O71k94q6K89J47n2m53K92L1m70L72M55q89M02l9k71l34L88K89p78m9
1468g03J062n32n89J083k37n85M85P2J50j09K31J58q90Q65N51j243J45R08r91
1487a69m66P56K62p00J64Q83r38j035J712n72j156J761j68q68N28N49q41o41J274
1506C35M09j366J044M79j681M47J266r41k15R62l69j067N69J269j518k69J812
$$ y = [203, 301, -466, 339, -1, -590, 191, 4, -357, 400, -468, -633, -207, -247, 162, -213, -388, 112, -451, 28, 483, 15, 108, 153, 207, 384, 354, 720, 124, -273, 632, -80, -333, 736, -246, -815, 160, -322, -228, -227, -374, -135, -600, -210, 362, -554, -24, 308, -552, 268, 546, 518, 477, 73, 601, -126, -123, 905, 104, -358, 582, -210, -327, 182, -61, -402, -293, -109, -104, -294, -47, 203, -520, -139, 325, -56, 153, -108, -141, -420, -214, 467, -7, -288, 665, -247, -324, 347, 53, -33, 256, 403, 351, -102, 190, 221, -249, 123, 578, -311, 91, 52, -219, -553, -165, 124, -654, -703, 359, -173, -762, 321, 84, -501, -16, 56, 206, 97, 328, 486, -404, 461, 1012, -231, -86, 822, -169, -635, 121, 383, -317, -153, 730, -208, -1243, 469, -103, -1259, 502, 334, -534, -6, 543, -298, -939, 335, 744, -622, 422, 901, -780, -333, 933, -8, -223, 739, 370, -697, -128, 1141, -377, -646, 1166]
1523A166j284r13J638n09j004N16R30r83r5J067l46j283J265O10j646Q48J083
1540A060j372j01J213l2j366O71J090j623N1J875j577p79J396p85p46J301M82
1557G58j014m71R05n89q17J561N42j524P68M10r91Q2Q89M4p95M70Q10j604R4J328
1577H56j270m9J007m37k68J37M6j64j99Q55j56r48Q02K20j113M79M74m85k68M81
1597@L28p34j52P16o84j39J115l79j86L32jl23m62R91J82p86R17J96j393L16O53
1618E07n01k33M10M28j268J87O13j006M6J463o78p35J012l00o26N13R57j93q17
1637b21R49J0j424J081M40j146K43Q31q68k01N65K23j266J06J353j345j46J432
1655F16r19m79J038J09o23L36P82q49m10J177k68j113Q78L02r50L2Q77o44m94
$$ y = [1166, -118, -1031, 607, 98, -906, -390, 540, -443, -538, 529, 183, -1100, 165, 775, -871, -23, 1060, -312, -413, 800, 768, -598, 73, 1163, -460, -409, 1466, -111, -890, 506, -279, -1025, 276, 758, -256, -727, 178, -411, -1228, 333, 875, -649, 119, 529, -462, -380, 509, 553, -242, 228, 1038, -566, -472, 856, -414, -463, 544, 107, -161, -24, 22, -142, -341, 514, 358, -590, 212, 432, -681, -202, 272, -213, -481, 0, 328, -406, -558, 158, -526, -665, 450, 71, -115, 217, 216, -107, -569, 422, 604, -182, 735, 931, -462, -146, 507, 6, -227, 183, 611, -657, -470, 143, -863, -817, 646, -32, -767, 245, -55, -681, -168, 789, 596, -221, 728, 738, -686, 395, 835, -311, -68, 763, -105, -306, 259, 482, -784, -678, 675, -670, -816, 616, -303, -782, 256, 365, -258, 78, 860, 11, -399, 778, 510, -603, 275, 577, -373, -341, 536, -108, -602]
1674f02O34J24m24K94R95j618M2J216q59j3R61l93m68j3N69l20p04Q74j05q65
1694f75Q79k99n73M63R3r9j54N17Q3o29K32O84p19L18P32p90J15L17l66J37l5
1715B31Q7l42n16M41k4n81M79k60j32J84J48O6Q0r4M38k56l3N54l67J68K53k32
1737B92K05J03m71R8l37L06j23o38N29q7n18M09M1N6o0j72J01Q0N6M46l10M1L14
1760C61l31M4O5r8K17k90P9O9m32M07K3n63M31k8k59L10j36L77k23J99L93n66
1782D9M6L66m58q7K74k53J24j1l92K42l11J99K45k34L2K76k71L36l8r4K99j70
1804A69L72o4k96J33j92k4M04m90rR4k72j20K05j96J68m73K56j44n5N82k60j04
1826c16M20j00K1K44k99M15k23O0L77m43J36J33n91J99K79l73O8o8j48L37k83
$$ y = [-602, 32, 156, -268, 26, 1021, -597, -555, 661, -198, -211, 750, 357, -111, -124, 445, 125, -579, 295, 190, -675, 204, -95, -668, -205, -112, -211, -365, 152, 235, -394, -162, 522, -197, 121, 853, 63, 178, 495, 129, 266, 231, 318, -24, -540, -99, -123, -704, -225, -485, -617, -433, -285, -219, -139, -233, 205, -51, -84, 470, 103, 271, 524, 292, 497, 600, 129, 227, -110, 196, 73, -565, -36, -123, -641, -232, -191, -135, -195, -367, -266, -186, -130, 316, 6, 47, 361, 30, 74, 139, 41, 258, -32, 47, 116, -316, 91, 114, -449, -18, -46, -305, 5, -131, 246, 23, 222, 615, 49, 95, 461, 3, -84, 190, -63, 61, 50, -342, -100, -411, -212, 33, -201, -169, 107, -164, 172, 134, 40, 339, 169, 541, 477, 181, 314, 122, 98, 502, 12, 3, 97, -175, -295, -90, -286, -118, -591, -335, -479, -534, 48, -212, -316, 104, 4, 25, 269, -30, 385, 162, 222, 599, 156, 292, 425, -166, 33, 312, -61, 7, -61, -209, 128, -155]
1847a55M38l41k99K71l2r7K04o0P1q4N6K74k31m3J96k65N4K09k76K51J42n64M67
1870A86l19L50J39n65N36p4l84M47l55k9L42m72J08N0j52K69m84J20K71j99K20
1891Enk49P4J30k9L52K3l4n2k94L76J3m67M59j22J2L8k57K93m17p7L10m53K64
1915a07K92m61K2M12m40K5P1K51m0l09N13M2p46P00q7k59K63L9j21N6qK4l84L54
1939A02K03m28J9L77q57K97M02l66j49L69R4n10J41N71n06j59P48n18n8L10jk75
1961a94J37N22k10l60L75n9o46O99K21r28L20L84l37k06O16k69m67j14P66l87
1981a37l53P36m61k28M59%m0m4L07q3n14Q48l7q14P22j19o74N73M4j81K91l31
2003c6rJ26k45L77n82K2O42k88o8K21k27k8k82J78N03m73K25P3n93O79j89r1Q2
$$ y = [-155, 283, -58, -357, -86, -118, -215, -11, -71, 0, -84, -28, 246, 15, -28, 168, -97, -43, 166, -110, 141, 283, -281, 186, -133, 217, 356, -209, 327, 253, -131, 316, -39, -68, 274, -198, -90, -40, -192, 77, -407, -287, -16, -215, 5, 0, -249, -175, -45, -74, 278, 301, 267, 215, -79, 297, 310, -157, 302, 180, 192, 230, -27, 266, -151, -228, 82, -371, -107, 185, -276, -254, 158, -282, -257, -186, 65, 25, -284, 229, 271, -475, 225, 138, -121, 142, 181, 60, 116, 108, 132, -252, 102, 305, -123, -104, 273, -584, -287, 115, -251, -400, -31, 63, -447, -306, 265, -241, -400, 348, -170, -228, 82, 81, -194, -57, 465, 255, -105, 270, 211, -435, 264, 485, -443, -123, 261, -76, -282, 334, 65, -402, -516, 250, -137, -490, 246, -215, -443, 16, 16, -24, -68, 239, 156, -358, 490, 453, -361, 361, 242, -432, 141, 185, 4, 295, -36, -45, 81, -164, 213, -369, -347, 295, 7, -61, 160, -67, -95, -377, -199, 304, -169, 56, 129, -464, 215, 26, -65, 17]
2026A7O3q5M0p8N00l30k80N12k81k61L58m2n1k79J97K15o11M13K88o60J53M22
2048B20n26%K03M5q0K60L80m88j75L50k42r1Q14m31l98K57J41j88k50M68Mq29
2070e56N39L40p53J95M37m57n0N51k55l94K40N51o56o0Q87p47k44O73Lm91M43
2091A96J38k93k73N62j21m98P17j09j053P25M21q80K40N32k51m97M43J93n23K37
2111i4M95n76k29P56n16k31N95J28l86q5M17j18m10O47l3p56O19p9l89L90N4k6
2133A73j50J69k1m71K11M41o59j16O47k42k75K4J49N8j24K72j29j32M84k68j29
2154h8K42j24j01L10j11o0J6J47J58l28l04K97l02J68J35OL6m29J66J59p4M4J02
2177F5n76L56K50j83q9L62m9l3k55L46j37M7J62r2k31J21j47l2K04p5J79k36L47
$$ y = [17, 80, -5, 35, -43, 457, 127, -153, 359, 78, -183, 175, 133, 82, -197, 0, 215, -396, 17, 305, -355, -202, 220, -306, -306, -103, -58, -138, 122, 502, 14, -161, 189, -53, -144, 670, 239, -159, 98, 239, 51, -199, 269, 273, -556, -17, 323, -430, -235, 202, -255, -305, 246, -9, -403, -163, 388, -268, -328, 559, -188, -432, 241, 244, -247, 196, 334, 41, -232, 330, 209, -289, 428, 319, -734, -9, 412, -468, -228, 304, 53, -444, -1, 192, -331, -94, 401, -175, -404, 352, -164, -395, 200, 328, -58, -143, 274, 156, -254, 393, 360, -396, 223, 144, -245, 145, 199, 173, 23, 192, 171, -300, -89, 352, -307, -423, 224, -18, -293, -269, -120, -62, -186, 86, -43, -175, 309, 41, -88, 154, 30, -71, 239, 128, 68, 84, 231, 389, 61, -243, 54, -248, -80, 55, 61, 97, -332, -166, -7, -81, -37, 65, -511, -155, 95, -88, -177, 185, 136, 103, -152, 194, 57, 104, 266, 174, -57, 64, -83, -115, 89, 14, 193, -43, 304]
2200C04p9n04J09L29k33P4j0k42K24n3j4o8L4M43o24l2O62j49k39L65l31m0J93
2223A19j63L6l02M37l8l59N38J48p60N55l44j0L09q9m1l9p9J87l81J01K73m23
2245c25J36L52l19O6K1O8J12o4L70k31k96K23K5k74J62K78m07l3J28j9l0n2K15
2268A06n90L20J16k10J53J73m01J36QJ47O7j65L67j40K8Q1j44j55L06k80L91n8
2290B56j34p0l5l09L25k64J61K6m64N43%j43J48k22J76J91m40K37J50k84K52j46
2312d6j26L45j54P0o3r7K83j50p0K47k32l6J17Op5q5L7j56O4J59J9l27L99l01
2336a72J8L34l72Q0N6k26L31n5j24L59k97K8k1o6L54q5p7K75l31K03L92n97J06
2359A13l1j72m8P9P5r2k89M4K97j46K49j67j2m5Q5K72j6j53j18P5J71j98J1K79
$$ y = [304, 225, -279, -170, 159, -74, 0, -10, -252, -28, -81, -95, -163, -129, 314, -310, -342, 320, 171, -68, 297, -34, -74, 119, -44, -8, -310, 127, 89, -270, 268, 416, -344, 211, -133, -143, 166, 77, 36, -3, -82, 105, -276, -175, 98, -325, -189, 163, -156, -90, -69, -1, 111, 47, 417, 186, -110, 113, 138, -136, 26, 304, -103, -136, -8, -27, -57, -109, 106, -484, -164, -48, -258, -105, 68, -333, -197, -189, -42, 25, -140, 227, 87, 115, 196, 52, -103, 203, -77, 314, 256, 122, 52, 17, -292, 33, -231, -70, -44, -508, 35, 35, -108, 40, -182, -6, 185, -255, -18, 132, -152, 100, -46, -172, 173, 19, 89, 26, -71, 212, 62, -8, 239, 7, -29, 88, 94, 19, -66, -29, -185, -121, 38, 57, -270, 129, -172, -154, 180, -192, -112, -56, -282, 49, -6, -130, 229, -68, -40, -61, -127, 227, 142, 65, 340, 9, 212, 604, 7, 113, 82, -90, -138, -59, 16, -76, -365, -321, -24, -170, 79, -88, -100, -145, -60, 212, 196, 43, -75, 0, 171, -27, -16, 263]
2383B63k52j46M81k96Q0k9k03J39O0j99K23j44k79M23j06j72J13q6L2J44l10K84
2405B0J44l59P8N0L59l83L1L20r6k32J47L0M2Ol57J90K9n4L53m11nK58k96K0K71
2430A55k74j2L2J8K63n23J98n1j58L36N9j54J24k24K61J6k2K15k15J62J21l99
2452g2K12jj13j37J01j12K60k52j4N8j72J34o1J29K42j01j88J86k07J68L1lK85
2475C73n27N9N19m45M2J64l47K80k45L26j21p6J90j45l65L90Pj30K6k7qP3K0L1
2499F4j52j2K36l99L7M07k46R9K15j72k32J67K61n49J58N17l84r7K61j58k39M00
2521A82j04j96R5K14k37j18K89k12k03K76P2l52J76N8j17k8J83K59j95p4K13j99
2543a8p2M14o3k22J07J7r9j51L25r4l13J82J69n81M39K38m61M8K2j9M3J05j18
$$ y = [263, 11, -135, 346, 50, 130, 101, -102, 37, 97, -102, 121, -23, -302, 121, 15, -157, -44, -130, -98, 46, -264, 20, 164, -195, -117, -67, 292, -91, -60, 260, 164, -68, 79, 109, 151, 157, -200, -10, 19, -35, 318, -93, -98, 160, -136, -116, 155, -119, -131, -99, -81, 182, -341, -143, -194, -352, -16, 43, -111, 13, -211, 50, 66, 44, 259, 44, 206, 327, -72, 140, 139, 26, -111, -10, -122, 138, -114, -128, -70, -242, -108, -169, -40, 202, 101, -87, 99, -108, 60, 91, 88, 373, -154, -95, 424, -21, 21, 185, -162, 118, -127, 199, 78, 2, 192, 47, -318, 72, 79, -51, -25, -52, -60, 13, 33, 64, -88, -100, 136, -263, -226, 181, -65, 34, 249, 77, -155, 12, 273, -276, -118, 399, 15, -82, 179, 21, -218, 182, 78, -118, -23, 191, -46, -164, 125, -87, -290, -14, 58, -294, -118, -60, -177, -205, -22, 237, 42, -32, 181, -18, -90, 324, 261, 39, 146, 163, 64, -87, 238, 144, -169, 13, 182, -399, 40, 278, -183, -135, -113, -132, -89, 16, -102]
2566a02O7J26Q5l09k26L07N8j89K79P0j98O4J94jk32J4J99k30k2O5J5P0j7j72
2590h5N4r1K08pm01L32q5j25J94M8n2q8P5m4J75p3J4j02J57J52l25J46J00j08
2614F9q2J18r3j59k11M20r4j32K66k52j9L37k61Q6J7m9J69j81J3J20l42K44J65
2637A49j28R5J22k05j11K97N4k24k27M37l58J18k44M31l07M6J64p3o5Q2L4l59
2659b72J30K54l99L40j11j22J16J27J7j74L3J08p7P9R4j65j06K91j23L4K22j94
2681A02Mj36J91m5l24L76k46k40K99o3J0R9k1j02r7J11K26k42j43N98l90J07M6
2704A20n9J2j19J96K2k43K10j27k66K91k99J79J72k5rm6j53J51K9k78K46j29K27
2727A02K0j65n7Q7o7K09o3k89J83k05K77L5k03L5J26j48J91k17J68K5k18M37n0
$$ y = [-102, -35, 91, 176, -133, -359, -52, 6, -183, 96, 166, -32, 32, 226, 225, -7, 7, 206, -24, -46, 19, 34, 104, 87, -85, -31, -122, 86, 79, -322, 10, -75, -200, -6, 42, -10, -98, -23, -67, 108, 35, 49, -53, 104, 256, -69, 77, 177, 69, -13, 105, 12, -147, -358, 62, -32, -164, 102, -150, -169, 168, -93, -7, 10, -39, 130, -51, -38, 82, -260, -16, 149, 21, 116, 238, 33, -78, 219, 273, 49, -178, 259, -99, 19, -225, 206, -101, -55, 109, 36, -29, 53, 87, -272, -142, 112, -287, 53, -58, -180, -64, 63, 80, -94, -61, 47, -30, 49, 143, -22, -128, 163, 40, 74, 296, 102, 106, -30, 161, 116, -208, 168, -78, -318, -19, -82, -72, 27, 6, -96, -193, -82, 144, -98, -241, 357, -33, 74, 120, 61, 73, -46, 150, 172, -71, 139, 12, -254, 37, -262, -83, 89, 64, 55, 9, -144, 7, 36, -242, 4, -125, 102, 122, -43, -100, -13, -80, 129, 66, -223, -40, -245, 32, 67, -136, -101, 25, -123, 68, -149, 19, 44, -174, 263, 213]
2750B13k56J83j64J06R1m78K67J63k07J71k42j4L30k51L2K26r5o4J90k2r6k5Q2
2773A40J18p1N3l1j01J19l02r9J67m4jLj07J47k32J26n6J55Q3M3k08J46k6o9J48
2798A01k99K71q4P4L4nq9J21k38K42j79q4J31J50q3J80l94L07j64l4J80l01L6
2821a27L81m04l9K47l36M45k62L9J9j54K10j96J82k9mM4J89l20J22J04rR5k23
2844b6M6Q9M2nQ3j56o3O6j99M3J0o8L6O6k85L08j02K09r8j80M85k8j69O8q2J63
2870B53k22R8j9J13m01J11O1k67L42j29P3k72L58j29j25J24j01J01k3o2J48l3
2892ak7P3R9j29N4p8J21j00J55l0Mk12J47R7k26R3l48J50L80j71k60M10o2p7j39
2917g7jn1K4K19J2k11O7J20j75q1K65j15k06M15j53j33K13o3j78m1L22j98Q2L7
$$ y = [213, -43, 140, -24, 82, 173, -305, -38, 125, -82, 89, -153, -167, 163, -88, -56, 170, 75, 11, 201, 179, 83, 58, 140, 258, 187, 240, 209, 108, 227, -75, -174, -7, -51, -52, -49, -156, -9, -241, -115, -171, -16, 67, 110, -98, 48, 22, -47, 101, -198, 73, -11, 63, 97, 92, 3, 124, -114, 128, -51, -135, -4, 146, 63, 243, -151, 156, -8, -42, 138, -163, -127, 254, -150, -189, 58, -278, 167, -95, -56, -37, -191, 19, -177, 5, -24, -28, 16, 205, -115, 7, 111, 102, 197, -26, 20, 109, 151, 146, 229, 73, 10, 76, -123, -80, -70, -138, -102, -36, -321, -13, -115, 94, -4, -184, 301, 273, 104, 172, 90, 253, 31, 129, 110, 223, -178, -67, -6, -273, 69, -60, 13, -259, 99, -30, -155, -31, -132, -31, -54, -116, 32, -1, -28, 45, 144, 15, 69, -9, 112, 12, 167, 137, 141, -71, 76, 173, -53, 40, -308, -158, 222, 51, -209, 201, 139, 62, -77, -78, -129, -105, 114, 126, -85, -18, 102, -73, -154, 111, -4, -210, 205, 52, -81, 132, 69, -109, -150, 172, -26, 56, 93]
2941I3o5r8k39J91K55m13K61J7j33K60k04k3J89J3k93J54J22J9j0k48L43m7p9
2964F5J44k58J42p9K21o4k03K08k69j73K95j77l1K08j03%P5N6k53K52k27J29P2
2987C0n3J33j03lK80n46K68j14m1K75k83J74j50J69J33q7j48J28q7K37j42n4K8
3010D4J6Ml6l23J61M2j98K33j0J14lj31J08l0j73L94j99RJ10k19j83L19j60J47
3034C6J54j40J01j58m1L0k17L81j19j59J85ll40K35n3J42J05l20K29l1J09j27
3056ak4q2K88j06Q4l28J99J52r0k2R8l17K43J21m8p4j56j34Q0nJ46n1N6J01j56
3081b6r4K17j07P6J19k30M0p9K00k6j41KK03j71J0J39j52J76m6j18J12k30L63
3104B37m44K90J14k00r1Qm1R8j45J16J01j23j5Q7j35J27J19k55J81J54j86J80
$$ y = [93, 28, -70, -309, -118, 137, -276, -15, 2, -131, 129, -75, -98, 91, 104, -189, -35, 87, 106, 96, -152, 191, 144, 65, 209, -49, 93, 14, 235, 171, -32, 176, -93, -266, 29, -148, -179, 29, -74, -74, 1, 57, -196, 56, -171, -42, 30, -23, 110, 7, 4, 284, -262, 6, -108, -149, 126, -157, 17, -133, 36, 169, 82, -66, 62, -25, 212, 70, 16, 44, 60, 64, 28, -295, -134, -92, -290, -57, -67, 47, 44, -87, 21, -9, -182, 212, 13, 22, 132, -87, -270, 49, -111, 36, 190, 50, 151, -7, -48, -18, -235, 146, 27, -132, 53, 50, -290, -55, -108, 34, 139, -181, 48, 17, 126, -1, -25, -107, 181, 75, 159, -169, 30, 182, 92, 70, 168, -149, 94, 215, 167, 93, -63, -197, -117, -122, 24, -27, 29, 130, -26, -120, 97, -10, 66, 185, -45, -5, -84, 116, 90, -51, -49, 154, -17, -7, 132, -20, 156, 110, -8, 104, -126, 237, -207, 83, 197, -3, -94, -86, -127, -29, -174, -58, 43, -80, -95, -8, -143, -16, 103, -152, 29, 183, -3, 177]
3126A77j49N0j22PJ88j17l0J37j71q6K20j73P4m2L5Jl7o9J44k31R2K77k70Q3Q2
3151G0p1P7m6j96J08p2P9L8n4J19j28J6J48n5P9No2J9j63J05j24P4O3k16J20M8
3177a9j45J22J9n2J95j91j46K34n2j2R3j1m9K4o8l8R0nQ9J23j40J7j74q2P6J7
3203h5j07J98k34K22n6N6p1J02M2l9r7R4m04L60J87k95L57q2Q4k16n8N9J99k49
3227c3N9l8L7O3j91L8L7k57M02r2j51J32r7L3P6j69K48k40J03N7J08j04J8O8j35
3252b8P1N4m1J01m59M20R0j51j48R1N2L1j38N3j36K20j37O3KJ13k46K88k27PL2
3277b3J5Q9k92K27N7N8k24N6L8k7P8p7K15j85J05N1j86L7o5L0k5J10k68J39j4
3302h1M2j4JJ01p0K1p2J13j7r0j3J12N2j33P9K4p2K9l4J10r8J46k29M2J48r5j76
$$ y = [177, 28, 78, -44, -37, 151, 34, 4, 141, -30, -116, 104, -69, 5, -37, -2, -1, -38, -107, 37, -194, -102, 175, -95, -12, 70, -1, 76, 30, -166, -58, -130, -51, -13, -67, 52, -76, -60, 88, 33, 112, 117, 55, 74, -89, 16, -108, -34, 29, -187, -67, -19, -164, -42, -23, -75, 120, -71, -217, 17, -35, -47, 46, 35, -14, 10, -58, -96, -6, -11, 78, 201, 61, 78, -96, -178, -102, -85, -192, 6, -228, -6, -62, -6, -77, 25, 67, 28, -69, 25, -379, -19, 168, -127, 230, 148, 232, 16, -42, 17, 216, -33, 26, -12, 25, 88, -103, -65, -28, -285, 117, 25, -126, 6, -91, -58, 18, -151, 97, -143, -40, 17, 125, 21, 39, 107, -28, 43, 97, 56, 157, -302, 118, 208, 57, -91, 0, 52, 83, -55, -2, -138, 82, -55, 8, 10, 123, -123, 165, -62, -55, -23, -8, 81, -211, 16, 73, 131, -93, -37, 1, -26, 52, -25, 190, 5, 110, 161, -25, 12, -53, -23, -48, 62, -206, -67, -81, -39, -53, -52, 49, -21, 0, -72, 41, 24, -66, -79, 33, 85, -48, 31, 55, -17, 12, -22, 88, -10, 136, -93, -51, 97, 2, -174]
3329a74J78j98P2K70k27N1k7N4m0Ql3K10j19L0P8k74O8R7J19j47k5J80l2j54R0
3354E5j4p0K78j92n8K03l76J88J11q8l4l1j58J50K0n7m1j19J10P5pK3l3j50K34
3379A9j85L02j25j36R7O7L3J20o1N9q1k37L57q2j96N9k57K45N4k03R0J28j6Qr0
3404c1L6j6j56R8P1J31J3qL9j78J06n1l7J10O5k70Q1J33j19J66j30j41J17K9j1
3429D7M9j98J69r6p8N3j12K04L7k30O5m0pJ13MN9m6k6oJ72j2j39j40O1K08J46
3455B57m22P2J07N3L6l5J60m1k08R8j45l2K29k51k9K97k03M8Q0n7K8p5k3J76Q
3480A28j20m7R0j99J05P1J6j66K33k30J13j24n3J11n0K75j05Jk91K99o7p2R9L7
3504E4J36j76K19j14j81L19j3j35j8r5p6K14q3p5J52j28J4j97J73K44j94j48L5
$$ y = [-174, 4, -194, -122, 148, -79, -28, -55, -1, -41, -33, -66, 144, 25, 55, 133, -141, -73, 24, 143, -4, -29, 151, 119, -35, 55, 41, -29, 249, 57, -1, 202, -174, 14, 125, 37, 3, -28, -186, -36, -16, -73, -114, -233, -123, -48, -55, -32, -65, -215, 19, -166, 136, 11, -125, -28, 39, 72, 192, 131, 190, 109, -128, 229, 147, -49, 10, -247, -2, 52, -151, -61, 67, 51, 59, -31, 5, -11, -167, -69, 2, 133, 146, 138, 177, -1, 105, 54, 17, 127, 192, -78, 3, 136, 17, 183, 53, -88, 29, 58, 47, 96, -102, 67, -29, -107, -54, -166, 38, 75, -155, -90, -130, -137, -24, -20, 39, -7, -33, -39, 133, 121, -18, -158, -97, 111, 257, -165, -93, 14, 67, 103, 68, 228, 187, -21, 77, -68, -100, 129, -122, -151, 146, -57, -9, 71, 14, 42, -33, -56, 120, 128, 8, -39, 51, -148, -43, 28, 44, -122, 111, -119, -6, -130, -183, -72, -122, 153, 48, 49, -242, 57, -10, -82, 17, 54, 190, 14, 233, 119, -62, 257, 244, 109, 91, -4, -80, 134, 51, -24, 128, 0, 14, -183, -10, 234, 40, -108, -73]
3527g3K5R1j06j21L38k10J94k20r9L05K3j99k8K82l18O0j30K26NJJ79q7K3j09
3551E2m3j43J57j48kK92k37q0J1K15j8m8J19j46M0k7k15J17J7J20n4K9J37Pp5
3576G7l4K2n6K2L4j62J83J52l11J25N8j69k9J32O4o9j72K48j6l34J30O2Q6q7J18
3601G4K2p3J9q7J49l99L44j70K80k6j40K0p0J41pP0j94L2J7j1mj4p7R4J10L0k41
3628a11OkP5J13j02m7J15n3N7L4j11N8j74L76j28k19L77m43O3J33PJ15r0j11J87
3653A25m9r2j56n7J81l9%J05p8m1o1J23K32L1k98J5K67k90K02p7J24k38J3M8N
3678eR1K4m11K57J52k25L03j07k80L41j36J11o1l1K9m6O8p9J90l41K13o1j8K0
3702bnN6J08k57J65o3J53k8l9Qj6J9p9O9M6j9r6p8J18q5J75j30j85J65j36L1J32
$$ y = [-73, -48, 43, -63, -184, 154, -56, 138, -82, -181, 124, 147, -52, -80, 202, -116, -56, -186, 40, 45, 46, 225, 138, 161, 52, 9, -134, 23, -125, -127, 165, -72, -152, -141, 74, 56, 8, 127, -19, 21, -6, -221, -104, -87, 33, -21, 8, 145, 152, 77, 43, 65, 9, 31, 65, -97, 86, 238, -73, 52, 110, -59, -88, 44, 108, 39, -133, 115, 99, -235, -105, -43, 43, -44, 74, 96, 23, 42, -45, 104, -295, 49, -121, 159, 133, -7, 13, -57, 84, 77, 147, -47, -15, 2, -9, -13, -27, -104, -10, 100, 130, -111, -105, -107, -32, 81, -21, -68, 47, -6, 51, 85, -26, 32, -142, 234, 106, -113, 264, -179, -116, 17, 24, 139, 49, -62, 125, 76, -16, -172, -229, -48, -87, -87, 18, -60, -101, -162, -39, 193, 224, -74, -59, 208, -82, 120, 43, 167, -71, -58, -10, -5, 86, 110, -301, -44, 108, -117, 186, 79, -201, 140, 4, 115, 54, 23, 52, 6, 74, -5, 185, -156, 57, -4, -22, -2, -7, 49, 157, -100, 65, 2, 155, 127, 88, 96, 80, 99, 20, 89, 135, 116, 20, -58, 60, -25, 150, 20, -165, 0, -136, -105, 27]
3729B7j55J68n7M3K1k73K23n9j89K82J8n8N6n2j5K01k88P8P5j21K42j61J47l10
3753a57J1J04r7J99j12K3k6Qo1K64j88L19j5j95o6K06k38O5K0q0J37k04J49j25
3777e9j0J08k60J43K45j80m2j51M09j79%k65L23j94P0J33l19J80Q7j81J46j8J9
3800EJ43k33o0L23j78L7R3k05J14q9j5J8kk11J17o0K81k25O8O1o1j21K46n8L3
3825B1j91n6J16J61l4J2j51K6J99j79J63n4r2Q2o8QM0N2M3j67J07m2j3L9l1qJ23
3852A06k23J54o5n3l1J17j76K29k4q8K07l06K20l5J76j55j33P5Rk0J68j31j79
3875a58L4M5J5Q5K8l9J69l58L5J57L3o9j10J31k28K55n2J75j42K26k10o0J87j04
3899D5P3o4n2J28j07J50q0j38P4l4MJ68j31k20L5J22M3j90J10O1p7m5J97m18K83
$$ y = [27, -128, 40, -17, 26, 47, -226, -3, -62, -251, 31, 49, -9, 47, -5, -20, 181, -107, -29, 46, -75, 167, 6, 153, -157, -146, -42, -139, 60, -52, -29, -55, -47, -108, 156, -32, 287, 272, 77, 11, 217, -21, 44, 64, -16, 121, -83, 66, -59, -69, 39, -221, -78, 167, -13, -55, -206, 203, 24, 24, -241, 82, -112, -42, 91, -228, -48, 39, -142, 4, -14, 5, 148, -85, -145, 178, 0, 37, 130, -75, 39, -50, -65, -47, -49, -260, -143, -203, 78, -147, -79, -18, -79, -200, 46, -12, 21, -170, -226, -110, 51, 17, 29, -122, -96, 103, -76, 87, 33, -59, 23, -45, -37, 3, 55, 98, -69, 38, -4, -17, 22, -9, -17, 106, -117, 37, -28, -81, -112, 5, -171, 58, 34, -54, 153, -153, 67, 32, 208, 53, -80, -5, 4, -16, 152, 21, -158, -124, -79, -64, 21, 49, 10, 179, -179, -144, 13, 46, -23, -133, -2, -230, 25, -27, 148, 6, 232, 22, -38, 149, 45, 118, 54, 2, 130, 23, 173, 93, -45, 29, -5, -1, 167, 36, -184, -149, -27, 16, -174, -64, -3, -80, -125, 72, -346, -63]
3924f3j09L21k18J68j92J20q3J36j06mJ04q9J33j02r1J43m9j6p4J43J8M3lk36
3948a06K67j61J0K7k27K36j32j32L10k83O8K26l46L69r6j16P8J69nk03q1L0J19
3971B1o5j05N2J73j56R1l2N0j36qK69j21kk36K53N7k32J66n3l7J20j36R4M1k1
3996D7m4j9j25L16o3k46K23j25p7J22l6N0M4l10K22j16l4J27o6K85k54J03J95
4019B19j78o5Q5j28R7m5m2J48k60J41Qj9K2J35j87m0J71l9j15J31j28K8K5j13
4043a49J73JK8m7Q7n3k81J52R7p8J86j51J10O0m2J83m23M8J95o7J11j58j07J66
4067D1p3P4Q8j32L5M0j88J6L4%J18Q3k25K6K2P0p7O7j17k0J37J05l7Q2k44J99
4093A24p6J6J6j11K85l13O5j06L8pQ7ML8j09q5o9L89j22j4p7R3n6n8Kl5j03J46
$$ y = [-63, -172, 149, -69, 99, -93, 27, -56, 80, -26, -30, 74, -15, 118, 16, -75, 68, 19, 3, -71, 72, 90, 133, 130, -106, 161, 0, 10, 37, -190, 46, -86, -218, 92, -191, -123, 103, -243, 126, 30, -86, -8, 161, 156, -47, -128, -98, 21, -44, -149, -97, 76, -80, 11, -21, 29, -107, -115, 154, 33, 31, -205, 48, 105, -127, 39, -14, -51, 69, -67, 27, 68, 47, 3, -16, -141, 175, 112, -134, 89, -36, -113, 9, -27, 23, 67, -243, -21, -137, -171, -44, -110, 175, -79, 24, 219, 41, -24, 61, -67, 30, -15, -57, 91, -169, -28, -20, -39, -17, 118, -69, -109, 62, 23, -92, 39, -89, -61, -36, -149, 24, 25, 53, 6, 93, 40, -241, -89, 8, -70, 116, -35, 75, 135, 93, 276, -147, -99, 96, 29, 140, -18, -125, 41, -32, 42, 130, -2, 33, 73, -115, -99, -65, -65, 53, 136, -89, -63, -41, 29, -48, 19, -98, -118, 19, 124, 87, 169, -75, 124, 48, 64, 80, -31, 254, -59, 6, -100, -62, -69, 18, 22, 60, -49, -134, -203, 186, 64, 50, -27, 66, 10, -48, -46, -81, -184, -38]
4120c8M5l4J95j42k7J01j32M9P1lQ6k98R8n0OJ6J7L9m7O5j40L42j89n6J57j90
4146e9J83k26j0K1J98k30O1QJ23n1J2k44M17j53m1P4L0k34J65k3N8k45K44m8j30
4171a00J50j95J38J36k29J6J18p2P5j28o3P5L7O7K7j14K52j96KN8P3j13K11l26
4195a01L57k70j07J41nQ1n7l7K6j05j51M4K04p1J97k97j1K16j02J18j14P2j7l7
4219b6R0LJ52o9j82J01k9LK2M2k40N0J03N6n9j46K48J5p4n2J56m06K91j7qj16
4245i2O9J81l58M16k30r7R2j53J41P7j70J83K03k32j57K65k89J68K6l2n6R4k15
4268a66K05r9k11L14k50M85k63l11M23j10J8l6M5p5R9o3M7j99J97R6k62N7K17
4291A58j88k4J14k0k1l61L18J99j64J87k64J71j37J37Q9l10M32k62J8O7k20r0
$$ y = [-38, 7, -27, 168, 26, -1, 100, -32, 17, 88, 85, 171, -127, -29, -79, -73, -57, -40, -1, -48, 17, -123, 219, 30, -26, 131, -59, 124, -102, -112, -91, 107, -123, -62, -54, 69, 18, 30, -214, 203, 50, 9, 83, 113, -121, 44, 21, 79, -166, 78, 30, -100, 50, -145, -7, 129, -100, -84, 34, -38, 37, -91, -154, -79, -42, 25, 52, -62, 190, -6, -4, 54, 127, 14, 225, -101, 256, -14, -121, 20, 15, 96, 39, 2, 28, -77, -228, -184, 20, -51, 146, -151, -162, 54, -48, 70, -44, 28, 11, -26, 64, 67, 219, 150, -32, 69, 40, 43, 65, 107, -133, -83, 20, 76, 17, -129, 119, 134, 60, 8, 164, -242, 49, 32, 24, -92, -23, 158, -200, 216, -14, -111, -19, -172, -31, 46, -124, 59, 262, 30, -127, 138, -151, 17, 43, 11, -45, 49, -166, 39, -60, -271, 43, -207, 278, 15, -296, 127, 17, 35, -1, 44, -31, 68, 5, 52, -147, 50, 146, -116, -59, 158, -30, -54, 60, 40, 19, -342, -24, 175, 11, 198, -66, 105, -32, 105, 194, -116, 316, 54, 72, 139, -81, -171]
4313a71J00J26j4m1L8J15l49K15k9K68k82NO0Q7p6K4j78J12k17J50R6j92L15n4
4337A08j94K11l2j68K18k77Q1j03K32Nrj05PrpL74l21J14o3j71J15k3j1M5p0J36
4363H3n0k32L26j17r8k8J14M1j94M8j9O6O8J7NK2q4k0Mr2jK43L7p9J46j59J74
4390B21j15k74J80k2J7qN7j05r5O3K58k03N8J57k6k39J99j31R6j14K9k0k02L09
4414I0L0l21K02j19P7J71k7j16J04j15l9LJ13m2J6N2o0j62P6J13J01j97j16K16
4438E0J9p4Q9Pj27K6PO7J69l68K92n1j38J8J54j99J58j88K5PJ96p6j86M6O1K7
4464A1j3m7o2P9L0l4l9J60o8k6R7om6o1j53J17k1J55k07J20J6P1n2Q8Nr8l8J94
4492A72l2n6Q3j68Q9l30J73J18O6j61k04J74K60k40PN3kj07L1J17J19l6O0n3l12
$$ y = [-171, -71, 55, 41, 0, 38, 153, -196, 19, -10, 258, -24, -19, 41, 128, 52, 76, -102, 10, -207, -57, 39, -153, 162, 108, -86, 125, 93, -75, 143, -134, -53, -156, 76, 81, 72, -33, -26, -35, -42, 332, 11, 125, 62, -109, 6, -17, -28, 17, -53, 83, 33, -199, 127, 10, -88, -116, -2, 39, -155, -107, -126, -60, 8, 25, 30, 52, -32, -52, -48, -140, -141, 102, 139, 60, 206, 47, 221, 106, -168, 12, -10, 7, -1, 56, -49, -144, -81, 177, -26, 32, 189, 163, -76, 123, -8, 88, -26, 3, -17, -219, 90, 120, -201, 1, -118, -41, 130, 103, -13, 91, -24, -63, -60, 53, 11, 27, 79, 19, -143, -67, 46, 147, -50, -166, 50, 69, -5, 84, 91, -36, -10, -3, 64, 233, -135, 157, 106, -32, -14, 140, -59, 99, -89, -64, -57, 139, 63, -123, -77, -16, 11, -2, -49, -111, -32, -2, -36, -75, 85, 17, -9, 88, 82, 36, -25, -178, -61, -82, 73, -134, -14, 2, 73, 21, 109, 114, 16, -22, 172, 140, 84, 167, -1, 88, -242, -69, 49, 115, -46, -250, -76, 184, -56, -49, 4, 2, -105, -74, 43, 162, 126, 186, 133, -179]
4517a79J40n5M34l90K13j44P9n0P1j4j53J41j43P8k1j65K68j67k3K65k08J26k43
4540a40K34P4k81j30J91J63j43M7M5PM0l05K17r8j18J76R1Nj72J82J3l4j78J13
4564aJ7n8J16j55J89k66K32n8O8j78L76j01k04N9j08j13J06mrK45j07N0j22O7
4588D1o6K29m6k26l3J12j40R4m1j19J45P4r5J75j4r4K99k04k7k64K85K0p1J1J1
4613E6J65j38l0j39J96J17k82j42J42j07m8M05k26O6k8j70J28k11J93n5lJ68k
4636E5j0Mj99J25J5lJ4n0n1QL7L26l8l43K7r4J49q3Q6n7Q3J15J9o9j36K51j89
4663hl1j16j3j4K92p9m1k57M19j07pj20J47k04J64K2o4J25j43rj2J21K5j49m5
4688a04J11N8j01j1K0p5pR4P1Nr2M0r2j43L47q5J69n5K0k20N0l2J72k26M2Q4j23
$$ y = [-179, -39, -94, 340, -50, 163, 19, 98, 48, 119, 105, -48, 93, -50, 28, 7, -158, 110, -57, -80, 185, -23, 103, -140, 94, 168, -113, -243, -52, 111, -32, 15, 60, 67, 107, -198, 19, -79, -197, -21, 70, 75, -97, 85, 98, 64, -114, -1, 16, -42, 74, -81, 108, -158, 74, 16, 84, -94, 282, 181, -23, 36, -72, -185, -79, -83, -92, 153, 46, 96, -26, 41, -25, 204, 158, -68, -101, 11, -129, -35, -76, -195, -50, 24, -71, 104, 90, -4, 295, 91, 64, -200, 85, 105, 34, 45, 56, 221, 83, 53, -86, 110, 227, -55, -197, -55, -162, -210, 195, -31, 35, 7, -163, -35, -246, -53, -108, -111, 57, 55, 45, 49, -150, -25, -10, -13, 1, -49, -100, -92, -55, 271, 233, -110, -83, -177, -28, -111, -25, -82, 1, 116, 135, 66, -70, 181, -8, -39, -155, -168, -182, 110, 31, -10, -267, 152, 45, 38, -82, 65, -139, 25, 47, -17, 108, -35, -44, -56, 65, 90, -59, -104, 7, 65, -36, -47, -27, -102, -109, -15, 56, 61, -31, 9, -83, -226, 121, 36, 205, 150, 170, -50, 0, -32, 140, -86, -44, 40, -83]
4715h3J90j33k99L56J56l82J77O4N7p2q5J3J70r1K1j41J79j37kJ9J55j13Q3L1
4739A33j25l5Q7k84K34N7M1j04Q5l02J82j18O8J4q0R7m7q1L60j35k4k9q0J61j26
4764e1J81n5j24Q0o9O8j7O5N7o1j10q8J82j65J51m7r6J92k04k6M2O7nM5j0l3m9
4791h0OQ9j70K32K0l7K8q3L0K4jk57J02K1O9o7Lq2J29j97J67j9N0J5j38M9Q9j0
4819a8j84J36L7o4J28J31j62MQ2L1n8n0N8q3J5P4j91P6R3j2J51k64J07J05O0k15
4845a3j17J42p5R9R3j62j56K65k47O4J30%P9n0L6q5Q1P6j4n14L19RJ49o0n1L0
4871B8l3K5j06p4M6K28j87K62j51m2j85J14R2pj29J87n1k7J8j9j92L44k41K17
4895A17M5k58L17j84J02q6Q6j61R0j26P1j06N7L8m3O8n2o1N3p0J22o7r4L5J73
$$ y = [-83, 107, -26, -325, 31, 187, -195, -18, 46, 103, 31, -54, -41, 129, 38, 59, -82, 97, -40, -42, -23, 132, 19, 102, 133, 8, -27, 60, -224, 10, 67, 108, 4, 89, -213, -31, -149, -81, -67, -147, -50, -97, -178, 182, 47, 23, -6, -86, 75, -51, 130, 75, -49, 31, -38, 30, 13, 78, 135, 74, -36, -124, 58, -107, 44, -3, -99, 93, -111, -137, -95, -28, -33, 12, 2, -31, -80, -74, 15, -155, 77, 97, 60, 88, 5, 35, 59, 58, -199, -97, -76, -7, -74, -71, -153, -24, -221, -54, -73, -23, -8, -146, -97, -8, -18, -202, -66, -29, -93, 35, 166, 4, 8, 90, 121, 63, 13, 71, -12, 3, 77, -114, -38, 55, 43, 194, -70, 37, 142, 202, -13, -130, 12, -63, 36, 129, -33, -189, 76, -171, -107, 23, 23, 102, 52, 88, 3, 84, 160, 146, -368, -49, -40, 109, 49, -2, 28, -5, 20, -86, -160, -114, 114, -73, 189, 38, -4, -189, -75, 17, 10, -119, 68, 17, -10, 8, -11, -203, 141, -100, 117, 162, -96, 221, 37, 139, 53, 139, -22, 68, -58, 13, -93, -36, 2, -41, 27, -25, -86, -33, -103, 19, -48, -142, -107, 66]
4920F6l43K42K08r0k89J19M8R8p1j0R0j62P2Q9j31J5j26R1J87j62o7J24m4N6j36
4945a26QK17Q7k26L4q8J65j19J47J22r3j30J4L0j46K72k27r9K25J8j51o2K49k28
4969a07k1J36J7j07J03O2k02R5q5j09J97l1M0K01j47M7j03L1j22J60k03K49j67
4992f6J74o0J8Q7q1j51J77j06j45P9K21j1k04P4J2k11K15J8r2O0j7j02l7J04r7
5017a41J43n9R3O3m4j04M3J56n8m1M3q0J87P7j63j10p1L6J2Rn8rK14k19j0OJ99
5044A14k95J50J65j40M4J71k26l2J09o7N0No9J18n4J39j86j9J19j30l0J50j45
5067e9O7j94J47J49k29K41l8n1j44J48p1K09q0j44J04j40J10n0J15j4j98K45j71
5090d8q4J58k44K40%K4l5l6J78J0k48j85J80n8L3K7Q9J04n7l31J98PJ72K2m6r7
$$ y = [66, -277, -35, 173, 83, -206, -87, -39, 59, -12, -22, 68, -94, -22, 67, -64, -49, -175, -84, 103, -59, -126, -2, -46, 10, -126, -118, 99, 186, -40, -6, -94, 71, -48, 99, 221, 128, -2, 12, 42, -104, 168, -59, -158, 67, 85, -66, -128, 121, -107, -128, 8, 25, -82, 21, 83, -119, -24, -109, -218, -21, -52, -12, 189, 42, 89, -14, 17, -105, 55, -148, 101, -66, 108, 48, 66, 153, 72, -79, 98, -8, -153, -74, 147, 136, -68, 6, 18, -193, 22, 40, -52, 8, -9, -111, -148, -44, -141, 2, -57, 36, 99, 55, -49, -6, 150, 92, 51, 94, 14, 201, 278, 115, 5, -66, -30, -18, -9, -67, -76, 138, -81, -91, -85, 114, -181, -31, 134, -6, 38, 209, -17, -49, 60, -7, 43, 48, -21, 97, 43, 182, -4, -23, 96, -34, -64, 86, -59, 8, -186, -39, 110, -119, 122, 84, 33, -111, 37, -34, 175, 95, -49, 55, -85, 25, -25, 90, 76, -122, 123, -48, -132, 26, -218, 22, 22, 46, 11, -25, 153, 163, -85, -270, -90, -148, -115, -88, 1, 105, 48, -283, -85, -78, 94, 116, 70, -27]
5116b7Q2r8L6L8J15k34N1N1k6L8o3M6q8Q7m6k3R0J8j87j2K20j42K08r6j39J09
5142HJ09Mm4k36J09J9Q5O0j72kL0R7J59l51M9R1J36k14K33r2j37k9K6L6l6J32
5168G0J40k85K18l34J82J9j07J32K1Qj72L8J54q3K8r2Q6j17J53n7J44m9j47J27
5192G7o3J47Nj26j19L2j29J10J63R0j60k74K72J8k00K94o4M7K5j72P6l7k23K89
5216G8j34p9K4P0Q9j66J55JOn0J80j94K96l23Q6L9l02L11j61R2j23K8k22K78p3
5241i4j3K48j94N2l5j33M61j75l30L21o3J25o0j54K6J33j70K75j70n5qP0O7j25
5265am1L07l15L3j9m3QO8j38J15M2j11J59o7R4pL3k65J75m7J08K7j66J50mk78
5291a83K36P8j17N8Lm4J02j50j55N3R9j54J36J38j34J00j64J98L6J7j84k2k9Q2
$$ y = [-27, 55, -43, -7, 31, 146, -88, -37, 14, -12, 26, -37, 9, -79, 8, -38, -61, 29, 47, -140, -152, 68, -74, 134, 38, -101, 8, 117, 121, 77, -159, -50, -31, 54, 114, -58, -60, -30, 67, 226, -125, -76, 15, 151, -63, 170, 78, -59, -88, -62, -26, -62, 70, 210, -75, 143, -191, -9, 10, -97, 35, 56, 64, -108, -70, 84, 1, 29, -63, 23, -94, 59, 2, 146, 97, -50, 77, 14, 161, 166, 40, -79, -47, -176, -66, 97, 187, 27, -247, 25, 43, -157, 137, 73, 120, 145, -27, 49, 12, -211, 78, -56, -135, -111, -41, 48, -118, 37, 38, 44, -6, 174, -20, 276, -47, 39, 78, -224, 87, -74, 18, -105, -77, -299, -21, -94, -107, 141, -53, -1, -36, -169, 292, 117, -213, 108, 45, 170, 110, -44, -18, 115, -55, 220, 50, -5, -13, 57, 124, -1, -42, 265, -50, -17, -36, -79, -71, -3, -141, -26, 16, -95, 64, -3, 91, 84, 117, -148, 27, -20, 88, 115, -51, 99, 95, -183, 53, 131, 14, 72, 75, 31, 133, -17, -172, -119, -20, -174, -38, 100, -34, 66, -98, 100, 136, 153, -31, -53, -82, 0]
5315@K5K7m8R6O2o0r4N2j12O6M4Jm6n1O9o2N5R5r8m9O0r4J25J37j41j7j11j7R0
5344Dk8m8l8J9J86m0k5r8Rj08J16R4jK0j59K72j00m4j00J98j54j26n0J66J25j3
5370G7j30l9J01j43J12J1nq2Q7kL2JO4J08k07J64k42j14K64j2l3k46L10J03l21
5395a42K45j19k49K37q9J18L7m9J8J19l39K73J29m45J90K50l23L65m48K63L1O9
5417A41k06M9P2M0r2O4M7k50R8P0J3m2k32K48j76K91j53J94j09r0j67J45J29k2
5441F2o0l7O5L4j42M8j23K53k72K36N4j79J34j60J55l3m1J88M0l02o9J57K00k53
5465d5j00J89P0k1O1k17K10r1k32M25k44J22q8j41K05M7q1r8k7j03R1J83j77j5
5489g7J40l02J11L27J17l66J09r9m6J3O7J2j30o4O6J12n4qk4K26j73N7J0Q9k01
$$ y = [0, 25, 52, 4, 100, 162, 102, 8, 60, -52, 14, 58, 59, 13, -38, 31, -31, 24, 119, 21, -28, 32, -62, 63, 200, 59, 42, -69, -86, 4, -24, -72, -110, -91, 95, 55, 30, -68, -59, -167, -51, 43, 42, 62, -97, 175, 75, 31, -69, 129, -25, -151, -201, -35, 90, 77, -53, -92, 9, -134, -22, -11, -16, -98, -11, -13, 19, 20, 84, 192, -15, 149, -93, -207, 57, 45, 12, -234, 76, 179, -142, 103, -16, -265, -28, -117, 1, 38, -11, 7, 126, -213, 60, 189, -256, -66, 184, -139, 226, -222, 41, 72, 141, -65, -16, 56, 96, 4, 68, 115, -135, -37, 33, 46, 4, -228, 20, -156, 135, -18, 176, 67, -23, -190, -45, 84, 62, 2, -35, 30, 64, -78, -30, -153, 100, -172, 64, 118, -61, 73, -87, 68, 35, -6, 182, 222, -80, -149, 8, 208, -45, -145, 44, 114, 93, 154, -63, 147, 56, -176, 249, 5, 127, 39, -102, 103, 150, 69, -29, -56, -159, -68, 115, -62, -77, 63, -239, -128, 199, 316, -50, 59, -40, -86, -73, -6, 6, -124, -188, -122, -10, -64, -72, -96, 130, -43, 14, 24, 113, -88]
5514h8m5k2K4J96j49J30r7qJ12j43L3O6P4J63l90J84n7J26j38Q9k31J80J14k60
5538a37K07p8L4L6j88K42M9k4j19j80J92o3l3K37j30k08K86j20j48J26M3ll6M2
5562B7N4p6r6R3q7O6P8L8m6Q9k17J62J2m2J3j50R0j3K04k47k8j53K12l9N7j36
5588a35J27Q5j15M0N5mk07K29j61J95r0j96K55j30O1N7j13J45p3k07K70k80L70
5611A78k92L2N1M7K73l84mK1Nk7K01k67j5J40J16J86k60P2k76K44r3M1m1J54j88
5636h6P4M8M1k60K34J7j49K72j02J8m8o0j10J12L8K75l00j12J49j34J01j8k28
5659b28J50R7j37J54JJ8J1j40J67k16J49j02n6J59j3o2J48m5n0q6m3K51j68n6
5683i7J28j07P6K4k49K78m1o7J24j9m2N5k27K75k01K46j73q1J37N5j90J91r6P7
$$ y = [-88, -133, -155, -131, 65, -84, 46, -51, -59, 53, -90, -57, 9, 83, 246, -144, 40, -17, 109, -29, 60, -171, 9, 123, -137, 70, -8, 26, 62, -126, 116, 165, 141, 22, -158, 34, -29, -62, 175, 45, -163, 123, 3, -145, -19, 24, 21, -15, 27, 81, 5, -91, 2, -85, -19, 59, 97, 51, 140, -77, 85, 97, 55, 68, -82, 8, -5, 199, -48, -76, -229, -17, -56, 1, -135, -8, 77, -38, 2, 57, 53, -154, 75, -86, 109, 19, -177, 78, -52, 9, 66, -47, 98, 25, -182, 88, -192, 178, -114, -82, -31, 16, 289, -95, -99, -78, -73, -100, 101, -166, -181, -41, 75, 261, 1, 73, -203, 41, -52, -11, -52, 102, -86, -12, 36, 77, -183, 51, 68, -81, 191, 89, 107, 59, -1, -111, 1, 39, 314, 14, -98, 51, -83, 18, 0, -228, -78, 19, -118, 36, 37, 55, 66, -74, 93, -123, 26, -76, -132, 27, 14, -48, 100, 55, 5, -81, -124, 127, -41, -97, 31, -76, 0, 24, -225, 53, 12, -55, 69, 50, 8, 63, -164, 111, -90, 156, -17, -98, 39, 94, -96, 95, -1, 76]
5707G6k34K73r7O0j38K7N0r7l7J34K4j4J8j21K55k08J30k13J09J54l61N1J50r9
5731a08N0Q5K2kJ18q0k1j11J48j33j76J66K5o8j21K32O5q6P4P2p7j88K48l1k18
5756a15J25j85J73j04M4L0M6k07J50Pm1J33j94Q7J4j69L07j62K8L7J31n0j30k1
5780f6M4R2j31K37k86pQ7J55k69O0O8oj74K93j40R7J01p4q9%n8J19j64M9O7Mn
5807DJ11k29L1K26p4m8P5j12j8p2L02k33jJ28k45ro5lK21m4l6J62J66j70m5Nj7
5834A0K1j10k1K39O2j61p3kP4K1o7j82J85m9m9K65j88m5l6L4O4O2j64J94k14K04
5860G4J77l39Q8l2J31p1J3q3Q0j16J11p4K2o9O4L2p9p6J03N9j08N1k6J83r2o8
5886d5l5N5j41L05j04l5J2r0j6R5m3l0J10j51LJ54o8L7j64P5P8mJ95k36K09o1
$$ y = [76, -158, 115, 18, 78, -60, -33, 17, -80, -117, 17, 41, 27, 45, -76, 179, -29, 101, -112, -3, 151, -210, -159, -9, -108, -58, 27, 49, 47, 165, 85, 64, -47, 101, -32, -208, -42, -17, -85, -206, 26, 91, 5, 79, 151, 74, -114, 134, 103, -115, 10, -175, -2, -106, -62, -32, 14, -193, -43, -36, -77, 56, -138, -51, -37, -206, 101, -61, -33, 4, 135, 85, -45, -66, -22, 70, -61, 176, -110, -117, -30, 125, -144, -84, -16, -22, -196, 97, -43, 54, 155, 81, -8, -8, -66, 53, -111, -62, 5, 9, 4, 115, -114, -83, 143, 69, 21, 96, -16, -34, -106, 196, -37, -38, 90, -155, -164, -229, -232, -11, -55, -91, 71, 237, 67, 22, 27, 10, 31, -79, -100, 139, 201, 40, -33, -35, 39, 60, -7, -189, -4, -53, -102, 163, -25, -70, -106, -72, -8, 54, -110, 84, -130, 74, 251, -88, 0, -32, 99, 28, 41, -42, 38, -78, 33, -41, -19, -88, -24, 8, -71, -147, -44, 15, -93, -42, -68, 115, 23, -45, -80, -25, -166, 139, 35, 0, 12, -78, -94, 1, -42, -72, 38, -113, -110, 44, -24, 13, -151, -76, 2, -2, 193, -43, 166, 105]
5912A05L5n3k79K89L9%L7j14N9j15O4P6j26K8l39L44R7l9j26j94J40K41k48n4
5936a33K68r1j45j3M00o7l73Q6Q9j12J66m1q4K97l10M6O4j53J70k65K74k97J29
5959i5j42M24p9K8k6j11J1j21P4q2L7J38M4l03L10k41Q5J43k52L9J96l59L32j70
5983a20J4J02r9J28J40j71k26K72M2n1K3Nj4L1k9J3J63m8j28m4M3o3k0K6q6J09
6009A2j14J23ro5J77J61n21L62j14j4k4M8j07Q4K30k13jL7k27R7P7n6L4p5K09
6034A11k47J2J57k03kK04j49n3L31j73k8oR6j86N0M2N1J6j00M9R5Q7r2j43P1L87
6060C77n41J42J95m2p6M6k17LL0J46r2r3M5jQ1m0K66l03p6J17L3L0p2J41j01P6
$$ y = [105, 140, 87, -192, 97, 136, 136, 173, 59, 118, 3, 67, 143, 17, 45, -294, 50, 147, 108, -18, -212, -72, 169, -79, -133, 135, 44, -101, -114, 286, 219, -154, -68, 21, -91, 75, 34, -50, 247, -63, -17, 47, -106, 64, -201, 73, -224, -95, -237, 187, 108, 136, 110, -1, 10, -111, -37, -119, -82, 56, 100, -203, 107, -134, -49, 94, -158, -119, 77, -282, 50, -120, -106, -4, -103, 25, 165, -6, -232, 40, 82, 31, 54, 59, 45, 76, 47, 60, 223, 175, 47, 3, 46, -17, -37, -11, -97, 12, -102, 21, 12, -53, 124, 285, -236, 126, 12, -2, -26, 22, -85, -1, 229, 16, 15, 52, -175, -78, -1, -57, -23, -98, 111, -136, -124, 33, -170, -172, 32, -117, -170, 161, -12, -40, -46, 50, -136, -86, -44, 7, 23, -77, -28, 67, 154, 62, -81, -10, 377, -164, -22, 173, 131, 55, 101, -116, -113, -83, 63, -29, -122, -77, -78, 3, -37, 229, -74, -150, -33, 0, 30, -42, 99, -2, 74]
$$ [...]
8191c
##END NTUPLES=NMR FID
##END=
