##TITLE=1H_E5a0609
 CDCl3
 8 sc, 
 7.9.2023
##JCAMPDX= 6.0         $$ Bruker NMR JCAMP-DX V2.0
##DATA TYPE= NMR FID
##DATA CLASS= NTUPLES
##ORIGIN= UXNMR, Bruker Analytische Messtechnik GmbH
##OWNER= root
$$ XWIN-NMR		Version 3.5
$$ Thu Sep  7 13:43:56 2023 Russian Standard Time (UT+4h)  she@DPX200
##.OBSERVE FREQUENCY= 200.13135
##.OBSERVE NUCLEUS= ^1H
##.DELAY= (6, 6)
##.ACQUISITION MODE= SIMULTANEOUS
##.ACQUISITION SCHEME= undefined
##.AVERAGES= 8
##.DIGITISER RES= 18
##SPECTROMETER/DATA SYSTEM= spect
##.PULSE SEQUENCE= zg30
##.SOLVENT NAME= CDCl3
##.SHIFT REFERENCE= (INTERNAL, CDCl3, 0, 15.7039)
##AUDIT TRAIL= $$ (NUMBER, WHEN, WHO, WHERE, WHAT)
$$ ##TITLE= Audit trail, XWIN-NMR		Version 3.5
$$ ##JCAMPDX= 5.01
$$ ##ORIGIN= Bruker BioSpin GmbH
$$ ##OWNER= she
$$ F:/spectra/data/she/nmr/H-F/1/audita.txt
$$ ##AUDIT TRAIL=  $$ (NUMBER, WHEN, WHO, WHERE, WHAT)
(   1,<2023-09-07 13:42:48.54 +0400>,<she>,<DPX200>,
      <created by zg, POWCHK disabled, PULCHK disabled
       configuration hash MD5:
       00 E9 B6 7A A2 85 ED C7 34 08 36 98 17 FE 4E 26
       data hash MD5: 16K
       42 CC AF E5 27 C6 41 CA 75 AA EF CD 1F 10 02 6F>)
$$ ##END=
$$ 
$$ hash MD5
$$ 3F 14 C5 D4 58 CA 16 70 2B 53 3C AE 15 03 B1 4F
##$RELAX= 
##$RELAX= 
##$RELAX= 
##$RELAX= 
##$RELAX= 
##$RELAX= 
$$ Bruker specific parameters
$$ --------------------------
##$DU= <F:/spectra>
##$EXPNO= 1
##$NAME= <H-F>
##$PROCNO= 1
##$TYPE= <nmr>
##$USER= <she>
##$AMP= (0..31)
100 100 100 100 100 100 100 100 100 100 100 100 100 100 100 100 100 100 
100 100 100 100 100 100 100 100 100 100 100 100 100 100 
##$AQSEQ= 0
##$AQ_mod= 1
##$AUNM= <au_zg>
##$AUTOPOS= <>
##$BF1= 200.13
##$BF2= 200.13
##$BF3= 200.13
##$BF4= 200.13
##$BF5= 200.13
##$BF6= 200.13
##$BF7= 200.13
##$BF8= 200.13
##$BYTORDA= 1
##$CFDGTYP= 0
##$CFRGTYP= 5
##$CHEMSTR= <none>
##$CNST= (0..31)
1 1 145 1 1 1 1 1 1 1 1 1 1 1 1 1 1 1 1 1 1 1 1 1 1 1 1 1 1 1 1 1 
##$CPDPRG= <>
##$CPDPRG1= <>
##$CPDPRG2= <>
##$CPDPRG3= <>
##$CPDPRG4= <mlev>
##$CPDPRG5= <mlev>
##$CPDPRG6= <mlev>
##$CPDPRG7= <mlev>
##$CPDPRG8= <mlev>
##$CPDPRGB= <>
##$CPDPRGT= <>
##$D= (0..31)
0 1.2 0 0 0 0 0 0 0 0.06 0 0.03 0 0 0 0 0.0002 0 0 0 0 0 0 0 0 0 0 0 0 
0 0 0 
##$DATE= 1694079768
##$DBL= (0..7)
120 120 120 120 120 120 120 120 
##$DBP= (0..7)
150 150 150 150 150 150 150 150 
##$DBP07= 0
##$DBPNAM0= <>
##$DBPNAM1= <>
##$DBPNAM2= <>
##$DBPNAM3= <>
##$DBPNAM4= <>
##$DBPNAM5= <>
##$DBPNAM6= <>
##$DBPNAM7= <>
##$DBPOAL= (0..7)
0.5 0.5 0.5 0.5 0.5 0.5 0.5 0.5 
##$DBPOFFS= (0..7)
0 0 0 0 0 0 0 0 
##$DE= 6
##$DECBNUC= <off>
##$DECIM= 32
##$DECNUC= <off>
##$DECSTAT= 4
##$DIGMOD= 1
##$DIGTYP= 9
##$DL= (0..7)
0 120 120 120 120 120 120 120 
##$DP= (0..7)
150 150 150 150 150 150 150 150 
##$DP07= 0
##$DPNAME0= <>
##$DPNAME1= <>
##$DPNAME2= <>
##$DPNAME3= <>
##$DPNAME4= <>
##$DPNAME5= <>
##$DPNAME6= <>
##$DPNAME7= <>
##$DPOAL= (0..7)
0.5 0.5 0.5 0.5 0.5 0.5 0.5 0.5 
##$DPOFFS= (0..7)
0 0 0 0 0 0 0 0 
##$DQDMODE= 0
##$DR= 18
##$DS= 0
##$DSLIST= <SSSSSSSSSSSSSSS>
$$ [...]
##$SUBNAM2= <"">
##$SUBNAM3= <"">
##$SUBNAM4= <"">
##$SUBNAM5= <"">
##$SUBNAM6= <"">
##$SUBNAM7= <"">
##$SUBNAM8= <"">
##$SUBNAM9= <"">
##$SW= 18.05172834244
##$SWIBOX= (0..15)
0 0 2 0 0 0 0 0 0 0 0 0 0 0 0 0 
##$SW_h= 3612.71676300578
##$TD= 16384
##$TD0= 1
##$TE= 0
##$TE2= 300
##$TE3= 300
##$TEG= 300
##$TL= (0..7)
0 120 120 120 120 120 120 120 
##$TP= (0..7)
150 150 150 150 150 150 150 150 
##$TP07= 0
##$TPNAME0= <>
##$TPNAME1= <>
##$TPNAME2= <>
##$TPNAME3= <>
##$TPNAME4= <>
##$TPNAME5= <>
##$TPNAME6= <>
##$TPNAME7= <>
##$TPOAL= (0..7)
0.5 0.5 0.5 0.5 0.5 0.5 0.5 0.5 
##$TPOFFS= (0..7)
0 0 0 0 0 0 0 0 
##$TUNHIN= 0
##$TUNHOUT= 0
##$TUNXOUT= 0
##$USERA1= <user>
##$USERA2= <user>
##$USERA3= <user>
##$USERA4= <user>
##$USERA5= <user>
##$V9= 5
##$VALIST= <valist>
##$VCLIST= <CCCCCCCCCCCCCCC>
##$VD= 0
##$VDLIST= <DDDDDDDDDDDDDDD>
##$VPLIST= <PPPPPPPPPPPPPPP>
##$VTLIST= <TTTTTTTTTTTTTTT>
##$WBST= 1024
##$WBSW= 4
##$XGAIN= (0..3)
0 0 0 0 
##$XL= 0
##$YL= 0
##$YMAX_a= 328975
##$YMIN_a= -311166
##$ZGOPTNS= <>
##$ZL1= 120
##$ZL2= 120
##$ZL3= 120
##$ZL4= 120
##$ABSF1= 10
##$ABSF2= 0
##$ABSG= 5
##$ABSL= 3
##$ALPHA= 0
##$AQORDER= 0
##$ASSFAC= 0
##$ASSFACI= 0
##$ASSFACX= 0
##$ASSWID= 0
##$AUNMP= <proc_1d>
##$AZFE= 0.1
##$AZFW= 0.1
##$BCFW= 1
##$BC_mod= 2
##$BYTORDP= 1
##$COROFFS= 0
##$CY= 11.3945322036743
##$DATMOD= 1
##$DC= 2
##$DFILT= <>
##$DTYPP= 0
##$F1P= 15.7292609196834
##$F2P= 12.9074282941183
##$FCOR= 0.5
##$FTSIZE= 0
##$FT_mod= 4
##$GAMMA= 1
##$GB= 0.15
##$INTBC= 1
##$INTSCL= 1
##$ISEN= 128
##$LB= 0.24
##$LEV0= 0
##$LPBIN= 0
##$MAXI= 10000
##$MC2= 0
##$MEAN= 0
##$ME_mod= 0
##$MI= 1.114404
##$NCOEF= 0
##$NC_proc= 0
##$NLEV= 6
##$NOISF1= 3.799351
##$NOISF2= 2.8
##$NSP= 1
##$NTH_PI= 0
##$NZP= 0
##$OFFSET= 15.70392
##$PC= 1
##$PHC0= -21045.11
##$PHC1= 13.45271
##$PH_mod= 1
##$PKNL= yes
##$PPARMOD= 0
##$PSCAL= 0
##$PSIGN= 0
##$REVERSE= no
##$SF= 200.130013532006
##$SI= 16384
##$SIGF1= 3
##$SIGF2= 2
##$SINO= 400
##$SIOLD= 16384
##$SREGLST= <1H.CDCl3>
##$SSB= 0
##$STSI= 0
##$STSR= 0
##$SW_p= 3612.71676300578
##$SYMM= 0
##$S_DEV= 0
##$TDeff= 0
##$TDoff= 0
##$TI= <>
##$TILT= no
##$TM1= 0
##$TM2= 0
##$TOPLEV= 0
##$USERP1= <user>
##$USERP2= <user>
##$USERP3= <user>
##$USERP4= <user>
##$USERP5= <user>
##$WDW= 1
##$XDIM= 8192
##$YMAX_p= 0
##$YMIN_p= 0
$$ End of Bruker specific parameters
$$ ---------------------------------
##NTUPLES= NMR FID
##VAR_NAME=  TIME,          FID/REAL,        FID/IMAG
##SYMBOL=    X,             R,               I
##VAR_TYPE=  INDEPENDENT,   DEPENDENT,       DEPENDENT
##VAR_FORM=  AFFN,          ASDF,            ASDF
##VAR_DIM=   8192,          8192,            8192
##UNITS=     SECONDS,       ARBITRARY UNITS, ARBITRARY UNITS
##FACTOR=    0.0002768,     1,               1
##FIRST=     0,             0,               0
##LAST=      2.2672688,     0,               0
##MIN=       0,             -311166,         0
##MAX=       2.2672688,     328975,          0
$$ Real data points
##PAGE= N=1
##DATA TABLE= (X++(R..R)), XYDATA
0 0 0 0 0 0 0 0 0 0 0 0 8 -8 8 -16 16 -16 24 -32 40 -46 56 -64 75 -88 104 -120 144 -166 192 -216 248 -283
32 -283 323 -364 412 -466 522 -586 653 -730 810 -900 999 -1108 1223 -1351 1492 -1644 1812
49 1812 -1998 2200 -2423 2674 -2949 3259 -3606 4007 -4463 4996 -5622 6377 -7302 8470
63 8470 -9996 12088 -15132 20008 -29069 51600 -229013 -214540 282275 11127 -270922 -115061
75 -115061 213958 186736 -15214 -154168 35476 324004 255168 -126545 -137288 165565 224623
86 224623 21396 -69526 -30626 83862 110288 -114210 -311166 -81413 188223 4634 -274259
97 -274259 -161202 65705 74182 -51284 -121739 -12448 182260 118203 -132647 -101462 171599
108 171599 207497 25380 -31669 26458 70791 90765 -6669 -123761 -10026 130102 -18487
119 -18487 -199226 -114404 33724 28776 -48191 -103209 -74145 47124 54259 -93415 -79025 106070
131 106070 121520 -10104 -36725 21975 69017 98821 50822 -38411 4550 99015 21387 -92643
143 -92643 -38084 43151 20987 -33371 -81370 -77596 11053 40699 -56431 -84922 20592 48899
155 48899 -33183 -47759 4517 39896 64624 32049 -38738 -5854 80371 48094 -34108 -14081
167 -14081 39262 22694 -15438 -38722 -38197 20726 45818 -36580 -75144 -4 33328 -16556
179 -16556 -35595 -6019 17795 28200 8723 -32668 -6268 63400 40974 -27428 -15775 25225
191 25225 20635 -1096 -19002 -19227 12357 24167 -26598 -55396 -2994 28442 -10568 -31592 -14027
204 -14027 3327 15941 5715 -19007 -1872 39929 29646 -14771 -9993 25826 26018 7110 -5324
217 -5324 -10734 8268 20085 -12975 -33078 -4296 15061 -7720 -28580 -18928 -2965 4839 -103
230 -103 -18923 -12138 20720 18270 -9541 -6293 16579 23468 11859 -1658 -2214 11540 20269 1575
244 1575 -18041 -2125 13644 -2068 -18159 -16710 -4997 3981 -4812 -19402 -13997 5933 10159
257 10159 -8113 -11139 8161 16001 8127 -1949 -1560 13467 19500 4244 -7096 866 12404
270 12404 5835 -10130 -10172 -162 3089 -4340 -16616 -12645 2524 2705 -8927 -12196 -1892 9044
284 9044 4113 -4937 -1127 9449 13522 4822 -3383 4606 12842 8251 -1531 -5660 1939 6930 -2382
299 -2382 -10009 -7479 -693 176 -8729 -11661 -3688 1977 578 -6678 -6322 5109 7924 1936 -506
314 -506 2988 9225 8613 1238 104 4825 7914 3202 -5430 -3327 2802 298 -4472 -7777 -5837 -444
330 -444 -2432 -7745 -7045 -1208 2863 -1897 -5077 975 5075 5180 2744 -428 4079 8269 4684 519
346 519 879 5058 4675 -1468 -2992 -939 -75 -35 -4804 -7561 -2197 -316 -3436 -5572 -3564 964 225
363 225 -2055 -1032 226 3990 4581 -739 437 5368 4946 2027 234 1615 3048 1288 46 -2294
379 -2294 -1360 2605 -1158 -5651 -1905 -116 -1304 -2451 -3018 -1683 -170 1016 -512 -2501 2083 4023
395 4023 -1169 -445 2499 2057 2561 1371 -693 100 2583 2239 -2292 -1610 2519 -1121 -2948 -218 -1506
412 -1506 -626 1417 -1484 -3185 -136 2147 -690 -2270 1536 1037 -1327 1447 407 -1211 3277 2347
428 2347 -2320 -811 2023 978 -1672 168 894 -2023 507 1021 -3288 -203 3197 -1516 -2121 1085
444 1085 831 -450 846 1497 -1329 428 3485 -1603 -2069 3253 408 -2340 782 105 -1316 228
460 228 1010 -2240 -1989 2474 -105 -3538 1334 1165 -2455 933 1581 -1684 981 2709 -368 -1755
476 -1755 2566 3056 -1627 372 2246 -2082 -123 2489 -1909 -1293 2010 -843 -3781 -1128 1216 -1635
492 -1635 -1566 1221 -2312 -2222 2369 -581 -1987 2614 1700 -1699 -131 2051 777 541 3060 708 -1785
509 -1785 2683 1758 -2533 1231 2154 -1790 -1530 -83 -1511 -1825 537 -318 -3499 -725 1027 -2886
525 -2886 -1122 2475 -704 -518 1558 140 -435 1993 2399 -467 349 3343 -6 -1168 2726 277
541 277 -1329 1503 89 -2122 -392 260 -1764 -1947 651 -440 -2458 364 -27 -2761 691 1626
557 1626 -1144 276 1613 -230 -546 1387 1633 -341 972 1628 -1752 -352 2211 -523 -638 1634
573 1634 -463 -1457 -188 416 -905 -611 1455 -1360 -2101 1183 -193 -1658 1364 376 -1493 -144
589 -144 557 -321 -407 1889 753 -1654 576 963 -1280 1118 1732 -1042 -68 784 -213 -570 891 1424
607 1424 -873 -574 980 -1307 -458 1694 -681 -1057 611 -473 -1284 -196 786 -545 -1177 566 -661
624 -661 -1843 1238 507 -1406 1077 888 -760 360 1048 593 -64 993 973 -906 802 1317 -1316
641 -1316 141 1217 -996 -552 314 -845 -1159 -330 217 -1119 -927 537 -1292 -1150 1013 -582 -429
658 -429 1116 37 -353 293 1111 759 140 1628 623 -584 818 543 -656 1046 447 -734 -389
675 -389 -241 -347 -885 -83 190 -1686 -618 85 -1394 -181 951 -613 -604 314 -9 -6 456 1096 246 -183
695 -183 1170 128 -92 1650 283 -301 501 -114 -9 57 182 209 -782 -9 143 -1232 185 189 -1078
714 -1078 -319 -356 -676 94 43 233 -275 -278 746 -277 -5 1162 -157 38 912 -105 346 576 422 318
734 318 -272 373 335 -487 681 -161 -698 188 -596 -721 160 -259 -234 -711 -768 240 -540 -105 470 -721
754 -721 73 511 -195 770 598 226 733 59 844 634 -16 984 31 -307 442 -259 -87 157 -191 -184 -656
775 -656 -678 -150 -521 -361 -31 -1123 -318 -181 -666 330 65 -132 333 -79 335 495 299 856 369 -29
795 -29 878 -18 310 506 -39 200 -164 -196 200 -500 -81 -100 -991 -55 -138 -610 137 -231 -553 -237 -263 125
817 125 -90 -35 537 -326 160 1124 -193 480 975 -5 263 24 61 582 -58 359 -21 -607 163 -226 -497
838 -497 256 -273 -648 -243 -454 -185 -342 -264 103 -770 -188 161 -402 292 561 -290 420 440 171 499 384
859 384 673 110 -163 862 -12 -77 597 -364 -221 235 -461 1 -296 -490 -212 -828 -234 8 -695 211
879 211 75 -933 61 50 -155 416 -26 208 -25 -57 724 22 470 756 -46 39 581 -147 293 473 -102
900 -102 -30 -389 148 -364 -677 258 -489 -963 100 -449 -329 356 -316 -427 -299 -85 115 -230 250 476
920 476 -411 646 621 -120 798 515 -31 -27 17 196 136 -43 538 -519 -430 152 -557 -381 150 -694 -522 -496
942 -496 -146 -212 -403 243 12 -779 361 165 -280 941 79 -192 594 460 298 377 470 389 -478 519 684
963 684 -398 224 270 -713 -204 -129 -568 -350 -335 -173 -537 -724 301 -333 -421 759 -231 -255 754 -1 139
984 139 472 470 83 -34 671 507 -241 811 285 -625 460 187 -525 298 7 -520 -520 -184 97 -550 -82
1005 -82 318 -1079 -273 382 -515 137 348 -72 -339 71 107 288 194 705 -160 -283 719 -150 -104 812 302
1026 302 -247 185 54 94 32 339 -81 -836 136 21 -997 354 -4 -725 -232 -141 -377 -228 191 318
1046 318 -368 32 560 -327 240 776 -320 120 593 171 20 184 315 -1 -237 386 -225 -508 430 -394
1066 -394 -673 187 -705 -669 -130 -318 -542 -569 151 -92 -421 429 281 -699 225 462 -126 562 554 104 192 158
1088 158 418 -10 118 608 -438 -209 493 -627 -71 390 -449 -472 -252 -293 -212 -499 81 -306 -750 263
1108 263 -91 -298 717 105 -70 312 57 211 265 537 372 -207 207 434 -195 431 216 -549 -63 103
1128 103 -568 -36 -222 -137 -354 -505 23 -569 -195 301 -462 -145 294 -195 78 184 302 164 -145 387
1148 387 415 27 657 372 -286 475 190 -58 148 -12 177 -178 -276 28 -307 122 69 -738 -228 -239 -487
1169 -487 97 -74 -174 117 -428 163 -21 -179 354 30 -245 358 -145 455 490 54 316 58 189 288 12
1190 12 202 221 -425 -81 -152 -552 138 10 -397 -207 -323 -318 -2 -321 113 -534 -176 349 -12 327 457 -10
1212 -10 296 97 48 373 271 436 388 -269 84 -24 -330 212 -267 -277 -218 -444 -108 -218 -322 -94 -585 -240
1234 -240 53 -574 64 187 -367 25 -26 -116 258 220 367 186 95 569 205 265 656 57 -298 286 -293 37
1256 37 59 -184 130 -380 -147 36 -432 84 99 -532 132 -232 -80 455 -2 148 162 -46 471 9 193
1277 193 519 -183 -105 346 -133 182 405 40 134 -194 69 -126 -261 83 -160 -478 -108 -275 -101 7 -312
1298 -312 -257 -94 -360 247 -341 147 300 -220 40 325 -61 352 307 129 262 -33 376 384 160 132 -163 -307
1320 -307 296 -178 53 -69 -329 -325 -342 -294 -85 -277 -44 -10 -516 53 -35 -294 408 -181 18 136 186 361
1342 361 143 214 116 163 112 336 49 282 400 -208 11 -301 -380 89 -315 -9 -125 -311 118 -159 -406 219
1364 219 -320 -167 246 -38 -49 172 195 183 134 139 235 -21 543 343 67 312 61 -14 272 -86 12 -346 -380
1387 -380 133 -164 -306 36 -466 -404 -100 -492 156 196 -210 -58 -154 -160 185 -105 465 -2 -302 379 41 61
1409 61 474 252 271 166 38 170 -1 134 11 -380 -99 -42 -319 37 0 -405 -331 -139 -187 -302 -241 329
1431 329 -264 -393 224 78 134 531 152 112 107 87 182 97 193 120 -164 117 133 -184 261 -129 -418 47 -67
1454 -67 -193 66 -248 20 -229 -216 145 -317 107 160 -258 -73 94 49 328 356 211 135 11 200 308 -124
1476 -124 528 -88 -176 348 -53 -237 144 -112 81 -123 -154 170 -445 -56 -49 -289 -8 71 -199 151 16 41
1498 41 62 -15 271 7 56 337 -173 70 264 -167 216 503 146 157 -208 -21 149 -60 350 -207 -463 -261
1520 -261 -231 -438 45 -169 -291 -193 -280 128 -109 -78 204 6 76 405 -41 245 401 30 230 384 128 194
1542 194 -71 134 -44 -101 121 12 -128 233 -222 -68 -48 -326 -52 -17 -135 21 -297 -62 90 -84 208
1563 208 -5 -180 142 127 -104 271 158 233 13 -57 432 49 199 292 -336 113 -6 -269 89 -200 -68
1584 -68 0 -207 -235 28 -346 19 -163 -298 115 -89 -79 241 45 99 9 9 463 13 251 24 -77 322 89
1607 89 2 196 -264 -91 13 -188 -75 15 -347 -129 -284 -450 -103 -166 -89 151 -207 197 10 41 33 3 143
1630 143 192 -85 361 231 54 421 13 53 115 -94 188 129 4 -13 -84 -379 -103 -354 17 -56 -467 68
1652 68 -27 -165 -94 8 90 -72 -247 -87 31 55 301 -118 146 222 -211 346 31 148 114 49 -7 96 -142
1675 -142 129 -79 -73 117 127 -241 -58 -315 -174 -51 -563 -99 -359 -81 63 -322 38 58 81 263 -21 -41
1697 -41 166 -28 236 319 -32 335 -53 -253 203 -117 13 402 -104 -210 -335 -166 -121 -234 -56 -169 -183
1718 -183 -274 -396 -404 107 106 -126 -52 -130 298 -62 215 57 -88 -25 301 -38 235 329 -36 181 -166 6 -19
1741 -19 34 -45 -56 -364 -5 -96 -400 14 -276 -212 -125 -191 -157 -136 -121 374 46 -117 126 -145 283 248 44 69
1765 69 240 12 376 -42 258 123 97 78 -36 -194 71 -371 -293 -25 -143 -144 -15 72 -247 -331 -79 49 73
1788 73 104 -60 -113 125 182 166 233 378 215 249 81 237 278 11 360 5 -47 67 4 -63 -25 -329 -196 -43
1812 -43 -196 -167 -186 79 -50 -185 -6 -70 36 101 -9 253 167 192 127 17 244 379 27 118 150 -113 118
1835 118 -32 -91 131 -180 -120 -116 -312 129 -121 -179 6 -278 -82 35 -134 -113 83 50 60 -13 6 43 -48 109
1859 109 246 -62 400 79 -102 61 -92 145 118 -36 183 -91 -214 -37 -173 -175 -27 -235 -58 -141 -504
1880 -504 -39 -109 -301 166 -243 143 47 38 336 -71 230 121 44 158 289 -3 82 -51 -113 115 -81 316
1902 316 1 -207 8 -203 -236 -18 -262 -135 -40 -220 61 -49 -210 85 -346 -68 106 58 168 274 35
1923 35 180 -131 81 254 -77 205 153 15 155 -251 -8 137 -199 -173 -82 -146 -97 36 -62 113 -118 -33 185
1946 185 -179 215 140 -91 109 -23 -57 31 -20 328 94 -67 113 38 -135 164 -181 21 144 -144 32 44
1968 44 -99 -119 -211 238 -37 -149 -122 -24 -168 -18 -240 -124 4 -204 77 -82 -58 192 59 144 376 -106
1990 -106 135 185 -10 220 55 176 195 -58 190 -165 -96 196 -123 -229 29 -252 -139 -40 -197 -115 -101 -108 -104
2013 -104 -8 117 30 -17 112 -35 -70 145 319 -16 187 28 170 116 89 102 -156 37 186 -106 -37 59 -189
2036 -189 5 -93 -103 -5 -218 260 -161 -425 1 -8 33 251 -191 62 187 -100 200 161 184 156 92 14 258 -39
2060 -39 256 127 18 63 -38 -48 110 -155 14 -8 -333 -148 -264 -220 238 -208 -199 38 -123 -2 35 21 143
2083 143 -153 152 -54 -17 81 -33 72 82 -65 -149 41 1 210 -100 -260 20 -63 -109 55 -259 -159 -116 -193
2106 -193 7 -62 -296 13 -154 88 255 -22 183 21 -109 478 -37 191 425 102 76 -1 -163 98 15
2127 15 14 -64 -319 15 14 -166 -51 83 -173 -34 -73 -149 82 115 38 -40 -128 214 -164 79 95 54 130 70 163 138
2153 138 -57 246 142 -67 285 126 -12 -26 -112 -98 -81 -169 -68 -62 -236 -14 -95 -190 22 -1 -29 -109 -124 249
2177 249 81 -113 29 -19 216 177 -105 56 97 231 240 -151 0 56 -130 -27 36 -167 150 101 -40 -119 -158
2200 -158 -122 -92 -122 56 42 -304 35 -141 251 194 -70 319 218 -74 221 -175 166 249 -105 44 115 -100
2222 -100 225 -1 -205 88 -124 136 -138 51 103 -79 -87 -109 -219 -237 -151 -95 -15 -187 9 56 -134 78 63
2245 63 48 218 63 21 204 -62 77 126 -186 81 -96 -188 -107 -67 115 31 -245 172 -236 -267 -76 -3 -184
2268 -184 18 -110 43 4 205 31 -15 -130 224 -189 174 54 91 113 -32 69 6 189 48 124 11 104
2290 104 -69 -148 30 -249 -183 52 -308 -13 -254 -181 -142 -66 -30 -161 -42 -36 89 -180 53 -95 -152 104 -99
2313 -99 137 195 8 140 16 -199 191 -170 38 -35 -197 69 -67 -129 60 -140 17 62 -207 -62 -190 -198
2335 -198 -23 -129 26 -153 11 275 -48 41 174 -44 -15 279 155 70 135 -55 99 -93 -51 -42 -40 -188 -9
2358 -9 -57 -145 -103 -283 -126 -88 -16 154 106 -136 -157 -158 58 101 -42 47 -32 136 162 -38 123 8 -64 126 106 219
2384 219 55 91 241 -111 -415 244 -126 -152 77 -135 -34 18 80 -9 -55 -39 -101 -124 227 29 -119 79 39
2407 39 -186 92 58 106 61 213 74 -157 31 13 46 -155 -137 -103 80 -49 -87 199 -122 -53 4 -22 -7 56 -110
2432 -110 1 -47 55 32 -110 228 72 58 318 54 -16 149 79 -54 241 -87 -98 87 -46 191 31 37 -37
2455 -37 -122 13 -137 -217 11 -243 -113 -98 64 -163 -309 -162 83 -8 0 -1 100 286 151 -273 102 -50 -7
2478 -7 296 47 70 -110 -57 167 98 -8 34 -161 -149 -49 -9 184 -27 -185 42 -395 73 20 -91 10 -114
2501 -114 -46 50 54 -113 271 -132 0 -36 93 142 25 75 127 33 -37 -40 -190 -12 112 -151 19 -114 35 -36
2525 -36 -56 53 -41 0 -2 -118 -48 61 22 77 162 -130 342 64 256 96 -9 127 47 -56 123 -83 79 9
2549 9 -107 -38 117 -41 42 -44 -38 -58 -232 -28 -53 -87 45 3 -87 22 -88 37 114 142 36 94 -72 125 -142
2574 -142 65 229 91 306 66 164 -38 -185 -49 -5 -230 3 -88 -394 82 -53 -163 131 11 -288 21
2595 21 -81 30 46 103 40 -55 214 69 -114 105 205 -84 277 54 -32 -172 -133 -29 -96 -68 -96 21 -3 57
2619 57 -172 -215 -2 87 152 -136 -118 -36 21 -223 238 100 52 55 -82 235 77 -35 49 88 208 -102 -100 248 -99
2644 -99 -70 30 11 -84 -63 -142 -100 12 54 136 -120 94 -64 -248 151 159 -56 44 -56 60 -64 213 107 -19
2668 -19 84 85 41 181 4 -45 77 -76 -24 56 -192 57 109 106 127 -23 -73 89 -132 -236 172 -139 29 -87
2692 -87 -7 247 -89 57 101 185 -62 -20 -118 121 158 147 123 150 91 46 -128 15 26 -88 114 -51 -45 84 -23
2717 -23 -82 26 -99 -23 -44 24 -228 -229 83 131 2 205 0 59 216 117 -96 -100 93 -78 96 -52 96 28
2741 28 -103 -104 -95 109 -19 -28 69 -300 -57 -110 -57 18 31 -103 1 74 -66 -110 81 87 77 -55 168 135 268 74
2767 74 -86 84 190 122 69 177 100 56 37 35 139 -84 -13 -85 91 -145 59 -47 69 31 -43 46 -104 15
2791 15 11 5 -4 -150 96 -239 -114 201 49 308 219 -109 -222 -40 2 215 -82 -20 118 93 18 22 -48 22 -118
2816 -118 -43 72 -119 128 -3 3 -118 110 18 -93 -46 -1 289 -162 142 100 85 85 -49 186 187 -109 -83 238
2840 238 -13 175 -35 -139 202 -330 -73 -128 106 212 0 11 77 -123 -44 -27 -131 -56 25 -71 53 42 20
2863 20 4 -101 61 -35 -121 140 -5 -56 -4 -74 150 -20 -177 63 -94 -204 9 -144 -11 176 120 -52 86
2886 86 -8 224 6 -60 64 101 286 241 50 209 212 -11 107 -49 -153 66 -176 95 -280 98 54 -3 23
2909 23 38 -130 -60 19 -35 38 -3 141 99 -73 -147 -114 -128 35 -12 124 -31 -116 89 169 71 134 -151 102 -39
2934 -39 79 -147 -31 16 -129 54 -23 -107 -117 -266 -137 -85 -40 102 11 -49 3 -54 -32 -22 58 63 48 107 -165 -158 83
2961 83 -3 22 -188 2 28 132 -67 36 -187 23 3 -191 102 7 26 -84 -206 46 5 -369 -46 23 -78
2984 -78 44 -13 69 2 5 37 85 65 163 42 -132 201 -88 54 -213 146 -139 88 -164 -38 -73 26 25 -25 -11
3009 -11 -151 60 35 -92 -134 32 -30 102 47 -190 9 152 147 -144 -92 164 128 176 126 -78 -70 130 59 -134 -44
3034 -44 -25 -35 -88 -141 -41 -113 -24 38 131 132 -192 64 -103 -109 66 138 37 -19 103 35 217 50 62 162 180 -104
3060 -104 16 -19 247 107 -12 66 -6 36 -35 63 34 180 -326 -35 -64 -102 49 33 -88 -76 -153 -154 -195 258 -219
3085 -219 2 38 74 85 103 45 69 217 -38 -3 29 -50 -124 27 -27 211 60 77 113 30 -144 -161 -48 62 -128
3110 -128 71 -86 -110 210 69 36 75 -131 139 44 130 289 44 -54 4 261 -12 123 16 72 -192 68 93
3133 93 -154 -49 45 -186 156 6 13 60 -142 -63 -195 -112 0 95 -7 4 -28 -28 114 84 176 -23 -1 97 -27
3158 -27 57 112 -141 -135 -114 17 -125 -76 -143 -58 -21 -69 138 -43 -16 73 22 19 -32 -141 -105 -127 20 -78 -114 247 81
3185 81 232 230 -64 -17 20 38 107 -81 47 -18 -63 -21 159 -56 7 -161 -119 -16 43 148 -122 -193 9 -117 -101
3210 -101 -19 143 55 43 -42 217 -107 147 42 -15 108 25 17 -104 0 -199 76 -39 -52 125 -162 -201 18
3233 18 53 46 111 -7 -10 20 20 177 -7 41 -57 -64 -95 -67 -76 133 36 58 143 154 121 37 -21 118 -113 -5 -128 -36 -41
3262 -41 -152 -14 78 -71 -282 -57 -165 -92 -58 -2 -30 -29 14 32 216 -131 -33 146 30 -235 12 67 95 155 -30
3287 -30 94 116 125 -120 -93 -225 -67 -70 -124 -70 -243 -84 -39 -86 -36 89 -195 49 -29 -21 -39 -162 104 79 -94 -38
3313 -38 -47 137 -19 54 95 117 -29 216 -74 7 -85 -58 14 317 -59 -86 156 -284 5 -35 -2 -75 15 -54 -71 22
3339 22 30 82 -95 -36 -64 -38 35 19 164 94 16 -86 158 155 -10 -111 -7 259 30 -96 -43 -113 -37 52 -108 51
3365 51 -29 64 78 195 5 -139 -51 228 -18 209 16 -55 179 10 -15 -22 25 100 -57 87 -5 17 12 34 0 -103
3391 -103 97 -113 115 38 -110 12 -83 98 33 -38 98 -134 70 154 58 -22 -47 33 58 10 82 117 83 -50 104
3416 104 133 -28 -10 -37 121 -117 -185 -98 130 148 -127 -219 -37 -8 292 185 49 -44 -86 -128 -71 6 -183 -76
3440 -76 -42 65 94 -130 216 -34 88 96 64 11 173 4 -2 12 67 7 9 59 -95 132 -82 -39 -137 63 -131 107
3466 107 226 84 81 -16 28 72 -54 -134 -155 219 27 123 151 156 -31 153 102 99 -62 95 -159 179 -114 -62 -110
3491 -110 9 17 -227 39 -80 53 57 3 -89 36 41 86 101 -225 -136 55 -171 -29 121 -72 69 -13 119 106
3515 106 90 12 -42 87 -132 115 -4 -121 -35 -280 -56 86 25 -38 -44 -165 172 132 -96 -126 -9 33 182 -13
3539 -13 75 35 120 83 150 5 -81 33 266 -5 69 142 -89 142 -1 -154 -229 26 74 -94 -133 -82 67 62 61 177
3565 177 65 52 -180 248 -123 -115 27 -98 -180 -42 -54 41 95 112 -44 -50 62 5 107 -17 -39 -92 92 -91
3589 -91 -135 155 -71 60 -17 3 61 -9 17 144 -2 46 -39 56 101 181 52 -169 45 30 -163 -23 70 81 102
3614 102 95 -63 -20 -143 -18 -4 -52 -11 206 69 -57 161 -168 169 -46 -35 140 -92 52 13 -144 30 153
3637 153 1 -8 141 -120 97 9 46 123 -27 -24 -99 10 111 -42 109 3 17 -6 90 -150 89 291 -49 -176
3661 -176 -113 78 -44 -52 0 55 106 83 59 -73 -105 92 47 -105 -13 50 150 19 24 -43 -92 60 -188 -157 184 -82
3687 -82 48 145 -87 11 -175 52 -6 -62 -99 90 63 -107 -59 64 -30 -77 -140 83 193 -107 -7 125 28 -37
3711 -37 103 90 -108 126 -239 77 175 -134 -54 71 -29 -165 -106 -100 -10 73 -21 63 54 17 -214 -327 169 51 55
3736 55 117 182 -6 25 -11 115 16 100 82 -57 -89 -227 -128 -3 50 -18 13 -121 63 -19 -109 -179 1 -76 -62 -98
3762 -98 90 -165 38 90 32 -120 -5 -189 90 -95 87 87 194 61 -125 -74 28 72 -31 -81 14 -176 -29
3785 -29 -61 176 6 1 -82 232 26 147 -230 -32 -135 30 52 137 -172 -99 -46 -158 90 -46 -13 -57 61 -155
3809 -155 -114 269 -85 -286 -31 -156 -151 -21 -123 -120 -33 -111 67 116 81 -46 -8 -38 20 -4 181 77 10 -58 126
3834 126 232 -106 -37 185 -143 33 -112 -229 41 144 24 -20 -67 -41 -230 24 89 87 -74 -25 80 24 -31
3857 -31 101 124 151 -42 -187 110 -73 25 163 -76 106 79 -1 -5 -7 -236 136 -75 -149 4 46 -7 -130 -75 40
3882 40 -76 -22 -90 55 125 -73 -37 -114 63 -49 133 -284 79 -36 22 -5 103 -127 225 26 121 2 -29
3905 -29 82 163 94 -182 3 -66 66 38 -222 -28 0 -249 -41 -103 119 54 40 24 149 -14 -167 67 114 15
3929 15 142 13 -79 -114 -35 105 39 -197 184 224 89 23 -158 -65 97 -72 -104 -56 -121 -75 28 42 115 -115 202
3954 202 -44 19 -96 -68 -52 61 -77 -20 -63 102 102 4 97 72 91 -3 133 -157 33 -23 113 -15 6 -55 -66
3979 -66 -201 127 92 -7 -10 -23 -73 189 126 72 -104 -49 175 -91 3 24 76 -20 152 -84 -105 -147 -88 -24 -167 105
4005 105 17 10 84 -69 -148 -81 -98 86 260 18 -101 75 -47 300 48 92 -126 60 5 -67 -26 260 67 -66
4029 -66 53 25 -103 -12 171 97 142 134 -51 -17 84 14 -304 0 43 44 14 -271 -236 -100 38 51 21 -39 -326 -62
4055 -62 97 51 103 75 167 60 -188 -42 42 65 48 -7 74 5 35 -272 -101 117 -75 -78 -6 -235 -87 -125 -50 30
4081 30 -5 -83 51 -194 56 33 113 -109 -256 -63 34 86 -18 -21 -2 116 -93 -15 5 -35 -109 -48 28 -65 47 4
4107 4 -80 -2 -79 -162 30 -217 150 46 166 -123 -20 29 -157 126 -4 40 -150 26 23 -66 -274 107 84 45
4131 45 89 -38 -115 -7 16 65 -81 41 58 74 37 121 -105 202 -61 22 77 156 100 -79 58 -107 -45 205 -119
4156 -119 241 105 50 -56 48 31 110 20 -224 59 62 73 -34 -4 9 36 170 -2 -26 -24 -169 -134 179 -27 -187
4181 -187 73 0 -46 -160 -19 83 114 -74 56 129 -17 -17 -2 30 26 -10 -181 150 -26 32 -52 -77 -61 -121 -39 -98
4207 -98 -140 -74 -94 -134 -163 -34 53 -91 52 198 -100 49 115 112 34 -123 -37 -102 201 -38 -170 -92 5 -49 55
4232 55 31 -110 -87 -8 -126 -138 -1 36 42 -104 47 -63 -98 156 -145 115 -24 107 -172 -104 72 80 -41 -19
4256 -19 136 19 -5 -33 48 -152 82 -4 104 -244 41 82 -100 23 -152 8 73 147 -54 -84 -15 -125 -158 -40
4280 -40 -135 73 42 -154 119 56 108 -17 76 287 31 -83 -29 -77 -154 -205 -1 30 -87 -178 51 105 28 20 -107
4305 -107 105 113 -14 75 -103 -169 250 -60 137 -56 220 106 52 -74 -77 38 7 48 109 -56 -51 -176 -224 -63
4329 -63 -42 53 -102 -170 -35 12 -1 62 34 16 -60 40 22 -15 40 137 -24 48 -54 -87 -85 71 69 213 -11 88 4
4356 4 108 -16 13 173 -47 -44 -49 -145 -38 141 40 -24 16 -60 -90 -149 -73 41 -37 -5 -52 9 -96 97 12 -189
4382 -189 58 -96 -153 -31 58 -90 141 111 77 -91 -136 -174 -116 32 20 111 70 -25 76 -92 79 -85 -100 -132
4406 -132 -49 -154 -57 13 -186 115 16 177 77 -65 7 116 -7 -68 10 39 -53 68 16 207 11 116 137 41
4430 41 143 -109 124 103 -79 196 54 18 -23 58 50 39 40 221 -25 288 -4 155 60 -32 -77 42 48 0 1 116
4456 116 -4 177 -88 -207 8 -118 55 -112 60 163 -97 -94 -231 4 31 57 -172 -218 1 46 -63 86
4478 86 -9 26 -108 -68 -55 143 188 120 276 -16 2 -188 -15 -33 63 88 140 6 37 27 -11 81 -52 -219 114
4503 114 1 -68 133 115 48 29 67 41 -68 -15 -156 -68 29 50 -12 53 176 89 130 151 -56 -123 65 -24 -105 9
4529 9 74 39 -181 202 76 -80 -76 185 180 -124 55 20 183 115 0 -52 32 26 6 -45 -117 -44 190 -91 208 134
4555 134 72 -12 4 -44 -93 83 25 -30 -56 -90 -12 150 90 -63 11 -103 -97 -47 96 118 123 112 -62 105 43 -195 62
4582 62 -46 -97 -6 16 -109 -147 113 -151 -161 82 24 74 55 -63 -51 -177 -187 87 89 43 -38 -179 -51 -23 3 123
4608 123 -58 21 195 -139 -19 -59 19 -181 165 -17 -9 57 32 105 138 72 -65 14 9 -145 21 -36 8 -41 -55 -54
4634 -54 69 -113 -35 61 -6 -114 -42 -95 168 -34 -12 74 -26 -8 186 -19 38 -127 28 4 -41 -26 35 24 -126
4659 -126 41 33 -26 21 -3 79 -4 -49 189 -71 53 9 9 -14 -144 -91 41 33 3 23 99 91 -67 -158 123 -73 -242
4686 -242 -129 -1 -23 118 -129 56 94 25 59 -46 -140 -133 -76 -7 -128 21 179 37 8 201 -50 162 83 51
4710 51 174 -65 42 -3 -154 -4 -10 -152 81 -79 -75 -39 -142 -19 238 -6 -67 -131 32 80 -162 21 -101
4733 -101 -14 12 -107 85 -91 32 86 8 66 -174 61 14 241 -59 -71 -18 -98 78 21 -20 2 79 36 11 62
4758 62 -168 -190 102 -97 -107 -52 -6 163 -14 18 -45 234 -165 -72 -56 -83 -214 44 -96 37 -231 -226 73 -113
4782 -113 17 0 81 97 46 93 -96 15 65 -16 67 -143 24 -64 -194 -14 28 32 178 -27 -47 89 -34 -7 -51
4807 -51 -148 110 -183 39 16 -188 -207 112 26 178 10 40 -60 -76 4 -70 169 -184 68 20 66 2 111 -205
4831 -205 97 -155 -26 -82 12 -116 11 106 166 59 -134 50 14 46 -202 111 85 54 -22 63 130 36 -108 -131
4855 -131 50 193 -24 -171 -67 -16 -79 128 -149 -127 57 128 -13 -19 189 260 128 329 155 -45 158 18
4877 18 35 64 15 -113 103 181 -105 166 -79 1 -107 -66 31 72 -140 79 85 -17 -90 -118 -153 97 84 -39 106
4902 106 74 -19 -25 -114 -174 -33 -41 22 66 103 -46 36 -88 -11 -190 12 66 36 79 -183 86 151 12 -106 -59 72
4928 72 23 -30 230 -142 -39 -63 24 -16 -118 62 79 174 -64 -29 157 -68 98 146 -5 31 -192 -140 39 -109
4952 -109 71 -89 109 -44 -70 76 122 -123 103 -150 149 84 -56 117 -7 90 -141 93 14 -78 -12 32 196
4975 196 -173 -57 -87 173 61 53 -28 10 49 187 149 -132 -98 95 30 59 64 -60 -145 -125 136 -58 -128 21 -77
5000 -77 101 -32 77 82 -107 -133 -97 -126 71 -78 84 44 -111 127 -52 -111 -103 -126 71 -71 5 38 -36 -150 -198
5025 -198 37 -172 62 63 -106 -226 -347 40 136 29 4 -87 -43 100 83 50 139 114 73 48 163 -86 -141 78
5049 78 51 54 111 64 234 120 -110 -22 137 10 -31 12 -16 -56 97 106 39 16 -69 101 -181 -116 -28 307 59 -11
5075 -11 261 -68 104 65 71 13 -79 -70 30 72 -62 90 177 11 30 9 111 -146 -63 -82 -19 -53 -234 6 82 119
5101 119 65 73 -46 7 7 96 -88 -196 8 -183 77 214 45 -14 92 8 170 -19 105 -25 32 -231 -128
5124 -128 48 47 68 4 54 116 47 -41 8 27 -68 174 -148 -115 12 -73 -44 39 -185 -122 -19 323 -174 -34 132
5149 132 -128 -133 205 -129 74 18 -288 -31 133 7 49 -42 42 -126 -172 72 -12 87 -219 -81 32 77 3 16
5173 16 -158 -86 108 -26 -110 9 -52 -3 -61 159 127 -166 -80 -16 45 27 43 -120 11 209 -11 -23 -46 17 72
5198 72 -244 138 -46 57 -5 47 -16 54 3 87 -64 57 227 94 30 4 -20 78 -5 -130 -68 -43 -120 79 -117
5223 -117 32 51 -12 -17 -66 126 -16 -30 -255 72 -112 64 -134 36 -224 -92 -12 -15 -56 -73 68 -126 66 -246
5247 -246 -35 -69 95 81 74 9 -117 12 87 -1 -145 32 2 -80 -291 30 207 54 -86 -64 15 -137 -217 34
5271 34 104 36 82 39 26 -43 20 -228 -51 -48 197 72 126 2 191 -123 8 96 176 -24 -45 -18 -1 78 152 -105
5297 -105 -51 -107 -77 31 117 -10 62 132 -2 -35 49 -21 -210 70 37 -144 -36 225 -141 141 -15 109 -43
5320 -43 -140 -175 -36 -8 149 -238 -72 132 -119 -185 22 0 -19 17 -38 49 -159 40 37 -68 162 -30 -26 6 -85
5345 -85 88 266 -38 -77 17 16 -18 94 270 -24 24 -14 -23 0 -131 25 26 199 39 69 51 -80 49 -76 -114
5370 -114 124 -47 96 -53 224 91 18 126 -42 88 36 50 -123 5 154 34 285 -6 -173 114 -58
5391 -58 -95 92 -11 -51 -82 -11 24 174 -82 96 50 38 28 2 43 -24 195 64 74 50 198 64 -169 -217 8
5416 8 7 40 -37 -104 -135 182 -45 -90 45 3 62 -82 -155 80 -40 -17 172 -31 136 -2 -115 -240 64 -126
5440 -126 -77 40 127 31 -48 -44 254 -219 -37 -95 50 120 -175 -106 -225 52 25 -108 15 136 -105 156 59 60
5464 60 157 191 83 112 64 56 -15 -13 -72 -48 -34 -128 -96 -312 -90 56 -95 -2 252 -114 -76 188 -96 -144 188 2
5490 2 -244 -52 -101 230 -94 65 -59 -89 151 -110 -42 60 -37 -44 -42 69 139 11 -37 -153 15 -241 37 2
5514 2 -40 -74 -19 -18 224 -153 15 99 -205 54 101 -97 92 -62 -17 13 -86 -123 -34 -10 -147 12 -108 200 48
5539 48 -103 -173 154 29 -116 -282 321 107 321 129 19 -7 53 -201 110 98 -159 48 71 24 15 184 152
5562 152 -81 88 2 47 205 -167 -141 41 48 -179 132 56 14 -99 13 114 54 -216 160 -165 214 54 81
5585 81 -30 -97 151 198 -166 -81 183 -73 104 -211 -97 56 72 -67 -70 -75 -7 -155 -104 -53 8 -39 -111 -47 18 -74
5611 -74 -71 -43 57 144 24 -167 119 -14 -10 52 -117 -50 27 -51 59 129 9 -22 -7 22 8 30 -131 -10 21 109
5637 109 -128 77 156 -76 -47 -131 -141 -204 -248 13 -95 103 128 -67 -26 90 -108 -34 124 49 -71 -28 34 -30
5661 -30 39 -209 23 12 175 -52 6 137 -7 88 -13 79 -67 103 -143 68 32 -173 -59 -29 18 -17 52 139
5685 139 -64 -127 68 67 23 -114 98 74 -140 -76 17 157 -158 -117 -133 -102 -81 -74 -147 6 154 -223 62 34 -184
5710 -184 -94 61 187 112 -47 148 171 69 71 -7 97 26 16 34 -147 -188 -88 56 64 -225 166 242 199 93 -55
5735 -55 73 23 2 -42 -74 -36 8 97 73 40 148 -328 -19 74 16 82 -168 156 -125 56 -223 -183 -57 -188 33
5760 33 -39 -107 150 31 248 172 64 160 -55 102 -134 -229 31 30 -52 38 -92 -52 -209 -89 -38 19 114 81 -66
5785 -66 4 32 -178 35 -145 46 44 -96 203 12 -3 55 139 103 -105 -4 148 52 309 135 73 -69 -183 -104
5809 -104 126 132 -121 201 -136 -2 179 -113 -28 -20 172 135 -96 -36 99 164 -27 -133 -15 -23 -110 -74 -77 -20 -32
5834 -32 -188 -48 -185 -114 132 -3 -105 28 -78 20 85 68 -114 -61 51 -48 98 -68 25 -88 -155 127 120 4
5858 4 -128 -30 75 -153 11 -99 187 -20 -80 -55 208 80 152 -93 77 -212 15 57 -280 -54 11 200 -142
5881 -142 -178 -137 106 28 64 -130 17 119 77 -72 95 -51 -60 -26 104 53 100 199 -90 52 -163 0 -130 -59
5905 -59 -45 -79 119 10 -233 77 -118 -23 -50 -14 -20 27 102 -58 45 -191 -109 56 117 -70 74 5 -107 20
5929 20 71 158 -31 68 -46 112 -89 30 125 94 -41 -202 -30 48 32 -76 -64 61 24 36 91 24 -8 9 22
5954 22 94 -86 -36 189 -3 -220 -105 -104 -134 59 -159 -1 89 -17 -20 161 -72 203 130 -8 -100 159 5 82
5978 82 103 -35 -14 58 121 79 172 -7 99 -101 57 76 -107 3 -25 -64 30 -57 -20 52 98 30 76 -45 -52 -91 -89
6005 -89 37 13 -35 53 131 36 -39 175 -11 -162 129 61 344 72 -31 -55 144 81 -43 -66 -13 71 -47 -23 68
6030 68 -49 108 127 -33 180 -13 25 -161 -10 44 -47 61 -138 -110 54 21 29 236 -148 -10 49 18 -5 -58
6054 -58 83 176 129 -75 128 -67 -79 42 63 -69 37 47 93 21 -192 -64 81 169 -38 -153 -179 195 11
6077 11 -114 -23 -25 -88 -58 -24 112 -108 31 5 57 83 -19 61 32 92 4 80 259 -125 150 -19 84 67 13 136
6103 136 52 -159 -26 41 158 29 94 70 202 -13 -78 -46 -67 -21 147 48 -36 77 118 -216 -29 122 114 -238
6127 -238 62 204 -192 -45 26 -11 37 -7 -73 43 184 -76 -86 42 82 355 148 61 21 110 156 94 -65 75
6151 75 93 -181 40 154 -41 219 88 -82 -44 -52 -59 -41 -51 -72 -287 97 -56 10 69 -19 -45 21 -98 -14 -9 -36
6177 -36 -72 -26 131 188 23 28 54 275 96 -15 -148 -104 116 226 -247 147 -128 -118 74 42 43 16 -1 55 50 -40
6203 -40 -132 -3 -143 -56 5 27 12 -255 19 121 -74 -53 67 61 35 -87 248 -9 18 -27 -35 65 136 89 -80
6228 -80 22 245 -80 31 -70 -94 -100 -81 28 111 -45 79 -125 74 22 -167 150 -24 156 -124 3 49 -25
6251 -25 33 -78 169 44 -160 -123 148 -68 53 75 38 -5 -77 40 5 -30 58 -167 -17 90 78 -16 -4 84 3
6276 3 40 -73 86 -186 88 -52 -135 -94 -159 208 77 -24 45 -36 201 301 -138 -221 135 117 -53 -35 -141 102
6300 102 83 -41 -108 -49 -24 -128 61 42 -67 90 70 -10 -16 -6 -84 -36 52 18 77 88 -67 -28 -159 82 75 -146
6326 -146 153 -50 90 -143 -13 -103 -81 62 -78 -74 -26 -47 -110 -104 -64 57 39 -178 -29 118 48 -232 -58 204
6350 204 37 -65 72 -27 73 93 11 -77 -151 61 123 -62 -183 71 12 37 44 46 32 -116 48 -121 -153 -10 -275
6375 -275 144 -128 -122 -87 39 -137 28 23 -78 208 -22 190 103 -22 39 -106 -149 29 96 12 -65 97 -31 -164
6399 -164 98 -34 50 -315 -156 190 -67 213 -105 101 -23 12 170 -46 11 -119 166 158 50 16 -53 -29 -52
6422 -52 -163 -144 157 -162 -74 110 -12 -79 -141 25 95 -76 -185 -57 -26 89 26 17 59 -8 -44 75 -36 112
6446 112 68 -78 47 -145 -23 -77 -25 -55 -14 -25 70 -63 -104 -143 -77 -164 -5 59 259 108 -32 37 -25 75 30
6471 30 -145 -98 -45 124 22 -33 31 16 70 19 194 -171 107 -160 144 -169 -97 79 129 15 -52 101 -43 -52
6495 -52 -19 128 -4 10 -97 -65 -22 -31 41 1 305 -77 -7 -56 -107 100 -87 -16 -135 48 173 89 12 95 16 164
6521 164 149 39 109 81 17 -147 65 121 -198 44 52 -2 111 -142 99 201 26 171 52 23 -80 -100 93
6544 93 -166 173 14 10 -20 50 -19 -50 -99 -21 -37 70 -110 -13 137 -10 39 -46 173 199 -57 -155 -13 -167 -26
6569 -26 -142 -117 68 105 111 132 -71 10 -20 -86 -97 79 31 123 -13 9 16 282 79 20 101 -4 37 -203 45 80
6595 80 -153 14 -40 -95 15 52 -187 -143 54 49 87 -136 149 23 -88 116 150 35 -171 -49 119 -18 -11 67
6619 67 273 -91 127 148 105 -71 -24 11 18 183 -63 -203 -61 75 2 44 -118 70 -56 46 136 -78 -47 -126
6643 -126 -131 -48 -67 -164 -140 46 93 125 45 27 -2 -95 172 123 57 -84 98 207 141 51 -19 7 -25 -129 -122 -85 -15 -45
6671 -45 -83 -127 93 103 -62 126 -15 -58 -16 50 -52 40 293 -45 11 -14 22 -220 5 -92 121 95 14 -200 180
6696 180 -57 61 -43 -94 -61 17 137 43 63 24 -165 25 -79 -23 -16 -9 -20 -111 56 -75 -178 145 174 112 -75
6721 -75 112 207 -80 4 -10 -118 -60 -172 -33 -99 -9 -73 -82 -130 140 -71 42 148 218 46 8 -5 8 59 38 -117
6747 -117 27 186 -85 9 97 132 -35 -69 8 56 74 -123 -62 80 -79 27 195 112 54 -74 -36 -172 -12 62
6771 62 -38 -102 -10 -182 107 304 -204 44 34 64 -86 109 -42 128 -134 -51 28 223 -15 107 93 -35 -52
6794 -52 -208 -124 36 -113 127 -85 15 -13 -47 -23 -104 -24 -126 176 103 -31 -49 -70 -177 -54 -229 7 16 97
6818 97 53 108 -88 36 114 178 -136 -39 -122 0 -133 88 -251 -10 29 60 94 45 -140 -42 -103 -48 184 130 148
6843 148 33 -58 -194 3 65 153 -117 -29 64 244 -122 -11 -123 -69 127 -71 0 -73 24 -37 99 -24 -166
6866 -166 44 100 24 -23 -88 -31 0 62 143 -26 -105 -1 83 14 59 91 136 -127 9 49 -98 -93 -234 -29 48 -75
6892 -75 87 16 149 74 69 136 -36 121 -37 -31 -96 74 -176 36 21 -45 28 60 2 162 219 -41 105 -69 121
6917 121 -207 -187 15 100 102 -124 90 123 24 -94 48 -30 -38 -98 19 48 -203 -43 167 -115 84 -1 -82 6 73
6942 73 -5 -36 6 88 81 -138 56 43 196 93 36 -46 14 205 126 9 21 -221 178 -7 -149 221 -40 -195
6966 -195 138 -13 118 194 -121 -110 145 6 -3 12 221 116 46 48 -217 130 44 95 -45 -37 -63 -9 3 -202 233
6991 233 -6 156 81 102 -15 -52 -34 -40 171 153 -165 84 4 140 144 -16 45 132 -161 112 32 102 -116 -39 -5
7016 -5 -191 -165 -100 -109 28 90 -181 -96 -40 96 -79 117 -73 148 -53 -150 -61 -14 -15 146 42 63 -24 -70 22 -5
7042 -5 -17 -78 -132 -122 -143 -98 44 178 -28 -151 89 267 103 26 -74 -24 -56 -70 28 68 -297 220 89 60 39
7067 39 -141 -5 -52 136 -151 -214 164 1 140 -106 -46 -118 174 69 -59 -162 -7 58 35 -42 21 49 -44 -232
7091 -232 19 21 12 -25 112 -40 -8 -92 -68 191 153 199 112 -65 -15 -105 -102 -7 -22 68 -180 -125 17 -47 100 112 -74
7118 -74 179 21 18 145 125 -134 33 6 -49 -65 -83 -52 44 -96 94 -21 -13 55 75 236 -7 134 105 -88 -86 198
7144 198 48 -145 -34 -88 72 35 155 -214 -143 -73 -93 -63 -37 178 -123 -58 65 159 0 -187 -136 41 46 -83
7168 -83 54 70 12 -45 39 -152 253 -154 -61 -14 -38 50 -45 56 66 -45 18 -262 127 -138 -64 45 92 -56 20
7193 20 -35 140 -5 1 -69 39 -34 75 22 -43 -41 77 175 50 4 -132 156 34 173 1 137 26 40 76 -74
7218 -74 -63 -118 28 -138 -43 93 17 -112 -50 20 19 -55 -2 132 54 85 -79 224 -190 -169 83 18 8 109 -9
7243 -9 -299 -20 -51 -111 -23 201 -107 97 -4 -23 51 -161 -169 -113 -130 51 -74 84 -40 -73 67 62 -212 69 191
7268 191 -91 144 -202 168 -137 -105 90 -79 136 -66 138 -39 -172 -169 -51 -72 20 32 74 -43 -188 -39
7290 -39 -140 -7 201 -42 -141 -29 -13 27 -222 -50 -29 -177 47 -145 -97 2 -186 11 251 -283 42 -34 129
7313 129 59 10 82 16 41 -12 77 -46 97 -156 118 -28 57 60 99 -227 12 2 -83 -87 155 -77 -176 13 124
7338 124 186 168 205 -247 -41 108 -105 -85 -54 -247 -124 48 113 10 107 165 45 -93 -91 -21 203 44 83 -127
7362 -127 -112 -170 22 -190 -4 33 -10 212 -99 -76 7 -100 -204 -75 118 41 -155 179 308 72 -33 -3 -100
7385 -100 -128 -70 -126 -16 -182 -189 8 120 -83 104 20 -86 55 147 16 15 212 -71 112 56 50 -152 -3 92
7409 92 -38 99 117 -68 -200 -104 -63 -46 -115 -40 109 -106 143 -130 -81 132 -112 119 86 35 -215 -163 -4 38
7433 38 33 20 82 -5 -188 -83 177 -73 71 15 287 -9 86 -262 -103 17 -87 -35 22 33 -130 3 -78 85
7457 85 -67 94 13 107 25 -153 -55 -189 -121 -22 119 62 -131 8 -107 10 165 -74 47 34 18 -182 -170 47
7481 47 71 -40 78 19 -3 -67 57 121 119 47 152 11 177 34 -71 -70 83 -18 119 -219 -78 -123 52 77
7505 77 -146 116 -110 -75 26 48 93 141 87 18 63 104 107 170 -51 -7 -45 -150 -21 10 -199 -17 83 81 -28 220
7531 220 101 83 -139 -97 -86 -97 -9 107 99 0 -71 125 -136 -206 91 126 -116 14 90 22 111 -167 -5 -84 137
7556 137 120 -183 92 81 15 -35 -32 -10 -19 -21 0 246 53 -102 -38 157 6 155 210 -33 -167 -110 36 -123 10
7581 10 125 -105 -31 142 -145 -172 -170 21 45 47 112 65 -50 18 37 104 -115 199 114 -14 -100 -172 -84 -209 126 125
7607 125 15 56 78 -91 7 104 146 48 -136 -134 187 103 3 96 62 -20 -173 129 259 -150 61 213 -83 -120
7631 -120 69 145 16 -64 -96 81 -136 -40 -25 -25 132 -11 0 69 7 167 50 -38 234 131 8 8 -150 47
7655 47 21 -48 -126 -38 -83 69 35 0 28 -124 194 93 77 31 162 66 21 -25 56 17 -3 210 60 -147 -53 -55 -218
7682 -218 26 218 33 -37 -33 1 110 -38 -45 95 154 76 11 78 61 60 37 122 62 -65 -5 -136 -80 -53 18 14 -120
7709 -120 -223 -52 -102 54 79 -63 -53 -219 61 -39 -35 14 195 -85 48 37 -27 3 -39 60 1 14 97 -100 -9
7734 -9 83 48 91 -152 163 81 -34 216 -55 -81 -168 -58 1 -103 -25 133 42 -76 10 -77 -199 101 -28 -12 -17
7759 -17 -102 -74 54 -83 -29 -45 28 -62 -46 -40 -154 37 -81 101 127 102 -142 126 89 200 237 -5 118 30 185
7784 185 1 -33 -19 114 47 14 253 60 -59 -75 339 -22 -89 132 172 19 1 -46 -90 51 -3 -11 8 -30 -11
7809 -11 -193 115 -89 18 136 -44 0 9 216 15 -114 39 49 85 -36 -58 -258 -130 73 42 -201 -130 -199
7832 -199 103 -42 -27 -202 -339 -27 -217 99 62 6 30 75 17 -80 -56 30 -178 -19 -123 -40 -131 -44 14 22 23 -56
7858 -56 126 103 180 35 -44 -16 24 -20 -116 87 202 -174 171 230 -83 214 -123 -80 -155 15 -68 -61 -65 -28 -167 -77
7884 -77 -1 -73 128 23 155 62 123 164 116 -86 -28 80 -97 -252 -236 79 48 86 3 161 129 -108 -45 142 -59
7909 -59 19 71 0 -262 -24 47 -76 131 77 20 47 -47 -83 96 41 29 114 43 152 327 -91 100 23 97 56 -22
7935 -22 26 238 5 -107 95 102 -158 -57 32 180 -38 85 -18 33 13 -27 8 9 154 317 62 142 -87 -82 105
7960 105 99 79 -11 -61 -1 97 -37 193 -156 -10 70 40 -21 -130 -3 -143 92 71 -130 105 8 -65 -88 -6 246
7985 246 160 -13 -1 53 -56 54 119 83 -92 88 -184 -159 29 124 1 136 -196 -72 123 47 -29 7 -74 76
8009 76 7 114 -1 236 -47 -81 -16 -153 -153 203 149 14 20 -30 -31 -56 107 -17 -47 -96 -66 181 5 29 24 -309
8035 -309 27 179 -179 34 -48 -164 153 -176 30 35 123 6 -62 -167 11 -6 -43 111 3 -16 143 -12 105
8058 105 -109 15 -18 81 -96 -26 125 77 142 3 -256 -86 157 -105 32 -8 -90 40 -40 28 -129 -57 -5 -7
8082 -7 -28 61 30 90 109 -48 -119 -147 -135 -185 82 -92 -192 -61 74 15 43 -9 -117 52 -21 -21 -117 -81 -153 21 196
8109 196 -10 50 54 39 157 99 -44 17 8 149 87 -62 106 -109 2 -17 -102 88 -105 -57 -35 2 -168 -10 -61
8134 -61 -39 -87 28 84 73 -123 -52 -79 67 -145 -75 -192 140 102 -59 92 -21 87 14 -148 190 74 3 91
8158 91 73 45 -2 -84 215 53 132 -22 -77 158 85 -90 -90 38 -21 -180 -93 -27 -80 67 -101 135 -239 -83 -293
8183 -293 58 -26 -32 -11 178 72 88 101
8191A01
$$ Imaginary data points
##PAGE= N=2
##DATA TABLE= (X++(I..I)), XYDATA
0 0 0 0 0 0 0 0 0 0 0 0 0 0 8 -8 8 -8 8 -16 16 -18 24 -28 32 -40 47 -53 61 -72 83 -94 108 -124 140 -157
34 -157 179 -202 226 -253 285 -316 352 -392 435 -479 532 -586 647 -712 787 -867 953 -1052
52 -1052 1160 -1280 1412 -1567 1737 -1935 2166 -2437 2764 -3163 3668 -4329 5229 -6550 8661
67 8661 -12605 22573 -102642 -167309 5014 58210 30182 -218881 -295163 -22719 145894
78 145894 -75226 -200199 -36660 114641 92013 -9263 -74514 106150 328975 162168
88 162168 -144329 -40419 208426 142917 -33677 -28131 29299 52080 30089 -110297 -187543
99 -187543 -9202 95968 -85826 -219588 -127632 -16632 15251 -24653 -100140 -36964 141323
110 141323 93049 -121610 -58996 179946 169242 11575 -21299 25511 85523 107648 2306
121 2306 -77563 38651 114491 -39986 -154067 -62358 25369 17176 -35563 -116251 -90109 52671
133 52671 44356 -102479 -70710 95414 91133 -34052 -53955 11694 75393 96064 12448 -59085
145 -59085 31320 102773 -398 -75943 -5402 50958 15746 -41006 -82309 -57908 36905 38912
157 38912 -72404 -68852 42008 40933 -37715 -39014 11681 49964 53420 -2098 -47037 19205
169 19205 87266 24223 -39229 5703 38757 8093 -20644 -40535 -26888 28886 23463 -55415
181 -55415 -62417 14635 28266 -24226 -30201 -2161 15022 24137 -4421 -33434 14538 64202 22889
194 22889 -26594 -2783 32188 20516 -1298 -15267 -14223 17361 17997 -36747 -43790 9944 21561
207 21561 -15627 -31070 -13414 6981 14109 -2499 -23296 2655 40797 16281 -21137 -1384
219 -1384 28287 24120 5025 -10482 -5804 16604 15677 -18610 -29318 5190 15272 -14986 -27461
232 -27461 -13763 755 7266 -7861 -22658 -3108 21378 10056 -13409 -3179 22043 21067 5493
245 5493 -2550 1270 18139 17768 -6918 -13109 5767 11627 -6125 -19710 -11408 817 254 -10004
259 -10004 -19650 -9492 8577 2063 -11820 -6211 8440 13265 3522 -3788 3800 15122 15036 1544
273 1544 -5625 6513 13236 1627 -7897 -6445 1560 2634 -8574 -14544 -7052 1578 -545 -10913
287 -10913 -10905 1125 5704 933 -4420 -884 10340 10620 1187 -34 6220 11930 7391 -3186 -2483
302 -2483 4782 5034 -2113 -9469 -5490 1300 -3027 -8745 -9369 -3986 2261 -2360 -8645 -3536 4285 5993
318 5993 584 -2270 4755 9036 6319 2387 416 6266 8838 600 -3872 -436 2935 1384 -5435
333 -5435 -7261 -2969 -1088 -2443 -7695 -7305 470 457 -4568 -4156 126 4698 4059 133 693 4477 7314
350 7314 4786 -973 2039 6228 2641 -406 -1605 -96 2346 -889 -5157 -5259 -2016 486 -4181
365 -4181 -6646 -1549 -122 -1170 -1472 -2402 928 3890 1633 -912 581 5462 5003 79 898 3051
381 3051 2164 2785 -206 -2316 856 1854 -1685 -4355 -1781 1474 -1865 -3619 -1789 -2810 -66 1128
397 1128 -2994 -1844 2916 1808 -843 -363 2458 2380 751 1283 -776 -303 4489 1131 -2897 1122
413 1122 1912 -981 -1450 -394 -488 -579 450 -1207 -3975 1457 2853 -2604 -981 1604 -582 -54 873
430 873 -344 -362 2273 1963 -2669 -759 3873 -540 -1919 1445 -1174 -1502 1329 -705 -2551 742
446 742 2446 -1401 -2375 2521 841 -1722 2162 271 -1786 2573 1937 -2228 -74 2779 206 -2267
462 -2267 533 917 -2313 400 456 -3772 200 2392 -2787 -2297 1468 80 -1791 641 1837 -1505
478 -1505 128 2832 -1547 -886 4366 1036 -1173 2121 890 -1363 1063 2147 -1017 -1196 2001 -1192
494 -1192 -3810 1301 548 -2715 203 -69 -3420 -1095 1466 -665 -1498 1816 1119 -2379 820 2903
510 2903 -891 1573 3383 -1030 -166 2729 689 -885 1046 1616 -1605 -1110 1279 -2158 -2003 2049
526 2049 -1469 -3511 352 -424 -2480 -383 616 -1000 -915 1606 70 -1555 2824 1899 -1383 1795
542 1795 2381 -420 708 1620 163 -55 1425 488 -2401 124 1319 -2712 -1120 1271 -1653 -1322
558 -1322 345 -1283 -1531 572 957 -1221 -720 1717 -861 -1040 2531 466 -752 1879 251 -1094
574 -1094 828 1806 53 -637 1345 323 -2044 898 869 -1660 880 601 -2205 -866 1013 -192
590 -192 -850 716 276 -1723 -177 1214 -1327 209 1806 -1324 -1225 1317 117 -238 874 871 -631
607 -631 -723 1459 -143 -721 2074 368 -1193 805 202 -457 598 828 -467 -988 469 -101 -1834
624 -1834 659 663 -1756 -266 505 -1411 -410 545 -390 -797 297 910 -887 -222 1739 -600 13 1921
642 1921 -91 -132 1352 470 -523 695 805 10 -772 644 -790 -1434 710 -397 -1529 124 -724
659 -724 -1620 -565 165 14 -693 210 517 -962 632 1341 -293 946 1438 -281 151 824 793 220 439
678 439 799 -723 -564 1052 -638 -629 690 -1084 -1090 -152 -558 -611 -233 141 -484 -1077 237 227 -728 1043
698 1043 497 -618 738 533 133 610 803 274 -236 243 797 -330 429 925 -754 -300 174 -529 -358
717 -358 -104 131 -386 -698 35 -457 -788 282 -530 -800 448 -218 -221 483 -46 100 0 217 799 53
737 53 778 733 -386 715 705 -173 721 320 -253 115 -158 340 -341 -417 17 -744 -850 25 -545 -315 127
758 127 -642 -327 -318 -216 366 -175 509 393 -540 667 715 169 888 444 249 410 148 650 233 -129 225
779 225 -814 -452 345 -590 -244 -323 -785 -270 -480 -381 -44 -275 -267 -59 -515 357 333 159 825 7 164 614
801 614 324 941 334 161 559 -365 290 706 -337 228 23 -730 -91 -394 -93 -264 -509 -128 -362 -709
821 -709 145 -301 -520 569 -341 -140 287 48 367 381 242 385 -203 506 751 -112 457 333 -460 377
841 377 -25 -154 349 -373 3 -512 -433 268 -538 -399 127 -777 -308 260 -261 452 54 -20 107 -476 508
862 508 500 -186 837 280 -318 876 393 15 383 59 186 -57 -116 498 -412 -59 78 -745 -174 -60 -491
883 -491 -258 -278 -364 -391 -423 305 -139 -304 421 -76 -285 659 45 184 725 73 281 261 305 514 -42 583
905 583 280 -648 455 266 -647 358 -361 -519 -66 -147 -7 -598 -486 -34 -930 -272 386 -633 20 435
925 435 -348 114 402 374 394 321 757 210 -208 761 341 -159 771 -211 -465 164 -65 -107 -188 -267 -222 -841 -231
948 -231 -167 -1005 -191 -1 -884 45 112 -177 220 171 308 -75 93 916 185 229 1042 -119 164 791 107
969 107 53 338 87 -275 -448 141 -225 -926 147 -359 -1081 243 -65 -432 99 -167 -487 -213 273 492
989 492 -153 157 596 -503 460 765 -87 378 705 -190 56 161 252 -83 -302 486 -647 -704 652 -646
1009 -646 -334 297 -556 -792 59 -120 12 -349 309 -215 -608 728 27 -414 689 164 -375 423 538
1028 538 316 241 552 319 -412 146 541 -513 231 684 -678 -227 153 -433 -236 -171 -272 -729 -781 460
1048 460 -328 -427 514 -467 -385 515 -177 -160 391 8 286 -70 437 594 -354 908 327 -453 572 337
1068 337 -366 404 391 -349 -127 -200 89 -573 -118 -32 -1089 -125 167 -561 61 110 -496 -72 302 271 171
1089 171 65 581 75 -222 849 224 287 683 -27 -138 263 67 219 -206 89 -78 -882 70 -304 -894
1109 -894 40 -91 -1024 -151 -37 -281 92 -74 248 -374 127 787 -230 259 806 -139 119 334 -91 467
1129 467 12 299 9 -297 249 -46 -414 174 -341 -644 138 -411 -374 149 -222 -315 -440 77 231 -385 276
1150 276 217 -458 253 283 -74 579 407 163 98 -31 371 153 99 459 -152 -301 433 -552 -34 280 -220
1171 -220 -119 -248 -167 -3 -382 22 -199 -500 151 -33 -124 422 -119 -56 243 -118 390 297 329 321 -38 73
1193 73 364 133 502 222 -119 203 42 -112 192 17 -123 -259 -262 -69 -341 -356 59 -226 -310 48 -384 40
1215 40 10 -77 133 -416 421 383 9 459 250 -39 286 -2 -169 265 -221 236 33 -371 333 -368 -158
1236 -158 -25 -661 -453 -99 -324 -181 72 -290 65 -160 198 308 -207 298 142 -126 410 268 204 398
1256 398 117 349 -9 206 313 -177 48 180 -523 -11 30 -192 -99 -308 -231 -121 -385 88 -191 -379 107
1277 107 -288 -282 256 -69 173 277 -19 245 293 332 489 -30 355 306 -309 215 87 76 129 78 -190 -57 -129
1300 -129 77 -199 -221 31 -585 -303 -82 -461 -123 -60 -164 218 -108 -114 427 -8 246 169 -32 327 250 -43
1322 -43 562 46 -117 264 -135 100 -239 -80 139 -388 -181 89 -105 -177 35 -471 -215 -228 -230 102 -151 -149
1344 -149 -51 8 402 133 122 492 -22 -28 229 94 254 217 -5 289 -241 56 232 46 31 -81 -394 115
1366 115 -328 -172 56 -274 -163 -328 -109 178 -338 -180 324 -363 117 235 -24 443 220 49 115 -59
1386 -59 298 212 -115 483 -87 -401 168 -154 -42 228 -460 53 -276 -305 112 -283 -16 -156 -468 344 294
1407 294 -330 166 -22 -112 264 -64 243 177 -12 310 22 151 514 157 178 278 47 131 3 -69 39 -278
1429 -278 37 -230 -538 38 -144 -256 237 -132 -265 -69 58 17 90 102 -14 19 242 460 -65 93 421
1450 421 -275 232 271 -19 169 -10 198 -232 -384 195 -223 -197 -14 -329 -375 -101 -266 5 -81 -264 130
1471 130 -178 111 313 -171 307 83 -14 348 185 95 238 221 215 87 -132 268 -148 128 240 -397 -128 30
1493 30 -406 -105 -220 -324 -187 -305 -74 -152 -254 112 -181 -346 193 8 -30 331 95 36 39 83 436 28
1515 28 114 389 -134 280 104 -263 319 -50 -279 17 -204 -115 -114 -189 -191 -399 -164 22 -211 -117 193 -173 26
1538 26 26 4 251 -87 173 290 -297 448 286 75 422 129 -103 225 -132 -59 -11 -130 -108 -233 -89 -79 -422
1561 -422 -176 -88 -502 -189 -147 -97 53 -159 -105 -41 -65 201 56 151 393 -18 -15 393 -135 282 303 30 140
1584 140 -166 -5 65 3 -19 -63 -256 -144 -156 -183 -2 -254 -58 -173 -179 114 20 111 223 -158 -164 175 -1 248
1608 248 103 -94 287 225 341 196 -81 183 91 -232 183 -123 -109 113 -181 -134 113 -179 -201 -34 -51 152
1630 152 -285 40 130 -183 57 159 -250 257 -131 59 365 215 223 -17 226 380 -7 159 119 -136 -124 142
1652 142 -192 -97 40 -56 -198 -332 74 -18 -57 68 -162 -496 69 -48 -56 282 -43 98 -39 83 143 -100
1674 -100 164 120 -44 97 283 -216 151 -169 -213 24 -71 128 -107 -472 12 -151 -443 379 -238 -209 -37
1695 -37 -43 -67 -2 -1 150 12 93 19 -22 107 120 143 255 192 87 127 -73 182 27 -100 89 -317 -214 170 -277
1720 -277 -98 68 -265 -193 -212 -154 66 -71 1 167 -186 53 11 235 178 -16 95 158 73 104 291 -49 143
1743 143 -68 225 64 -316 -76 -95 -277 -48 -76 -119 -34 -133 -20 -180 -226 163 -236 -254 -80 -124 -107 23 -44
1766 -44 220 180 96 57 42 235 227 4 136 132 -62 187 111 -59 -83 11 116 -281 -231 -52 -122 -75 9 -369 -231
1791 -231 -93 29 187 -90 -226 115 -105 -96 107 -26 383 26 61 322 136 234 330 54 231 -20 117 127
1813 127 -55 -4 90 -182 203 -98 -278 -55 -419 -186 -14 77 -28 -29 -51 -22 2 -70 128 -87 216 496 20
1836 20 294 8 -55 369 42 -82 -21 5 -56 -25 30 2 110 -38 157 -341 -57 -97 -236 -66 -207 -183 67
1859 67 44 200 89 -110 305 35 63 192 -68 15 6 -56 73 165 213 266 -47 0 18 -301 5 -99 -72 -28 -263
1884 -263 -209 246 -346 -100 -25 -182 -170 -134 56 162 73 285 57 193 231 173 181 7 -54 50 -29 114 246 197
1908 197 -49 203 95 -3 2 129 1 66 -174 89 -87 -125 30 -226 -155 97 -10 12 47 16 330 -120 74
1931 74 129 187 491 185 -148 205 -79 94 75 -120 -1 -102 -67 -72 -63 -75 -75 -344 53 69 -296 7 -284 -182
1955 -182 -11 -188 17 -196 -26 162 -54 52 365 -111 -71 68 142 126 0 0 293 -245 36 36 -9 58 -115
1978 -115 -120 -120 -40 -70 -89 -119 -223 -69 -211 -45 -142 -128 76 -37 109 119 -91 -21 -71 -43 401 40 93 -60 -191
2003 -191 208 -16 115 -37 -13 78 26 -42 -33 5 -185 -157 -436 -215 62 -91 -35 6 103 157 -120 38 79 23 285
2028 285 15 -53 329 96 -78 265 -40 16 48 -191 -16 91 -179 30 -116 99 -78 -175 5 -223 -293 -72
2050 -72 -114 -162 213 7 -24 -24 -249 112 -43 69 308 -24 197 362 172 123 253 27 30 -267 45 55 94 95
2074 95 34 -147 -3 -14 -150 -66 -229 21 -94 -211 40 -110 144 87 -50 120 -29 -76 105 293 221 91
2096 91 -181 -27 137 -78 272 -166 -50 238 -26 37 -225 76 39 95 -102 -80 -127 -1 -133 -178 -68 -18 -221
2119 -221 59 -270 -296 240 16 297 82 -56 105 -36 -82 187 -7 231 64 39 19 17 -206 68 -251 -115
2141 -115 5 -176 -68 -215 -132 -33 -159 -117 133 -128 -42 -50 71 212 -116 -61 134 19 275 144 -151 292
2163 292 166 -14 177 -82 -48 -101 -141 -58 -170 -123 105 -165 -92 33 -184 -110 56 -209 36 -53 93 -3 64
2186 64 147 -52 36 282 -113 107 140 155 244 -102 137 102 -133 192 -188 -114 -76 -38 -252 -119 -151 -361 -46 -214
2210 -214 78 48 -275 52 -304 -140 267 -120 146 -28 43 7 25 3 282 -103 22 -68 -80 128 139 15 -77
2233 -77 114 -42 37 4 -216 -80 11 -231 -133 -73 -29 -146 -42 -67 -328 -42 30 -50 20 17 155 20 28 60 74 121
2259 121 55 54 -196 309 -17 63 38 17 131 -104 -28 -55 -45 108 5 -271 -27 -171 -81 -32 -167 27 38 -10
2283 -10 146 -118 -48 203 54 146 -39 90 22 -51 -3 -4 218 129 145 -83 -80 158 -187 83 -43 -92 -7 -181 -23
2308 -23 -177 -233 -76 -207 -70 25 -81 130 243 -141 5 83 129 184 51 242 135 139 137 -62 -138 48 9 -88
2332 -88 19 -190 139 -212 -4 -3 -60 53 -61 -61 -7 -41 22 -109 40 18 215 -2 -41 184 75 217 -45 228
2356 228 108 71 158 254 -74 -38 -184 -67 7 21 17 112 -130 -2 -171 81 -127 -92 -189 12 -109 132 -54 -190
2380 -190 210 49 -101 89 -38 132 208 -61 283 62 -178 70 -145 -88 28 -229 63 -52 -225 18 52
2401 52 -217 58 -180 -61 61 -24 34 20 -87 58 -117 -33 -7 -3 92 -11 138 379 204 -5 53 120 306 33
2425 33 13 107 -68 10 -52 -82 85 8 -32 -97 -102 -86 80 -133 -58 -236 32 23 -105 -132 418 -100 285 164 17
2450 17 129 83 164 54 66 127 156 -43 156 103 -211 -108 -164 -131 73 49 -69 -272 -91 92 -45 -27 18 -59
2474 -59 100 173 -193 143 1 108 276 -44 76 194 47 125 -75 -131 126 -37 59 224 -61 95 92 -284
2496 -284 -52 -175 42 -81 -328 -153 -125 43 140 -60 169 96 64 212 144 33 156 -80 37 149 -27 68
2518 68 50 -31 214 26 100 194 -13 -33 -154 -181 60 -89 -160 128 87 -70 69 -110 -69 -6 -164 -38 13 -20
2542 -20 36 140 -33 67 -39 173 35 92 -42 -42 210 239 -322 263 30 73 -28 19 -85 -150 -138 -143 4 -140
2566 -140 -75 -217 -70 55 146 -104 201 -177 110 -119 140 215 -12 253 -12 33 240 107 84 138 23 20 54
2589 54 100 169 15 33 126 -154 93 -84 -241 -123 -272 -179 197 -66 57 165 -58 -87 -117 105 164 233 53
2612 53 155 -94 -7 71 -2 187 -105 -76 112 -64 121 -86 -207 206 -71 61 4 -172 -124 -32 27 21 -44 59
2636 59 -48 30 -65 81 -11 86 -77 -78 194 19 -1 -153 22 144 -27 63 240 187 -73 36 -120 87 -132
2659 -132 -286 -182 -200 9 51 -73 -328 -16 -143 -7 168 118 -74 -33 -91 120 -162 410 14 28 -28 28 144
2682 144 32 195 -42 -62 -142 80 -68 107 57 -78 80 -232 -132 -143 -57 -24 168 -146 -48 64 110 126 120 71
2706 71 84 -61 -66 164 260 172 53 -80 40 26 -138 -29 13 42 63 40 69 -112 -130 95 -116 -164 33 -78 12
2731 12 13 -137 63 -147 -13 -113 74 125 -100 25 43 70 61 46 48 -100 -26 73 -84 1 -51 -10 -346 64 119 -43
2757 -43 27 -197 -33 88 -73 41 -82 -95 -130 -54 41 120 120 76 78 -55 -58 6 95 149 98 91 -3 -79 153 -161 -34
2784 -34 129 10 -43 -9 -83 86 19 -191 27 -67 -1 -30 11 141 45 -26 -63 -51 -53 106 -22 24 164 -38 61 47
2810 47 -62 149 -75 -28 118 -49 -37 -40 -92 -55 -19 -73 47 -148 -4 78 -218 -76 -7 44 46 -31 -110 11 46 117
2836 117 -137 126 127 98 75 -30 -143 -15 28 -60 -76 -164 21 -35 2 -89 -42 37 48 -87 -171 -22 -77 -193 -166 208
2862 208 42 -29 -60 181 -39 172 126 106 109 45 -119 -43 -128 -95 136 43 -85 246 16 -90 -186 -115 107 -163
2886 -163 90 -71 -78 41 -81 -269 61 130 72 -10 -90 90 30 77 81 76 -4 254 57 76 152 -89 169 -132 -1
2911 -1 -160 -119 212 121 147 -84 -36 -192 1 -226 -15 -18 134 -28 -61 25 -69 -192 268 -66 -79 193 6 77
2935 77 158 -29 134 -29 -67 97 -135 132 62 42 61 280 -15 -119 -30 -195 92 -273 -85 -243 28 87 -40
2958 -40 41 -173 68 226 -65 -208 269 -86 -188 83 -11 111 66 -89 140 35 -54 178 -11 -142 -91 -146
2980 -146 161 -122 -57 -14 -195 -169 15 -190 -38 105 -133 -50 -6 11 25 -4 -62 -119 0 -6 181 25 133 -22
3004 -22 -44 102 -111 111 128 -122 33 -79 -32 -60 -93 -74 -160 30 31 -58 -122 66 -251 -238 228 -136 -46 -1 99
3029 99 -42 65 -85 132 -13 9 117 -128 118 233 -75 208 -113 58 -40 -298 -113 -50 -179 -110 30 -243
3051 -243 -127 -111 323 -141 -66 41 107 -64 43 -78 100 172 -59 49 -28 36 27 161 202 -45 -15 140 42 54
3075 54 134 -133 -220 -28 -89 -90 -61 39 -48 -83 -186 18 -139 -109 -66 -58 116 -266 246 80 53 176 131 112 264
3100 264 -80 -1 31 -18 31 -2 -41 -112 63 66 -25 -123 -44 31 -98 -113 -205 -259 228 -30 -144 -172 21 125 -46 143
3126 143 177 58 169 96 -173 71 -42 -145 34 107 162 -12 -230 -88 164 60 55 -257 24 29 -171 83 57
3149 57 -182 -27 89 -115 -49 -192 8 215 -11 179 -37 74 -34 -96 41 -25 39 -100 86 -62 233 -129
3171 -129 4 205 -7 -73 -63 -68 -196 36 -75 -133 48 -104 -215 114 -63 -120 -158 -17 188 34 -8 152 173
3194 173 -81 -73 -80 -99 75 69 -122 83 -108 13 -100 -277 -14 23 -78 -91 44 -46 85 -190 168 -16 197
3217 197 -70 103 -161 6 94 67 -79 -303 23 31 15 40 -147 94 111 -60 157 94 98 -134 84 -166 71
3240 71 1 -12 228 -124 49 29 22 44 -172 -132 -62 -72 70 -37 -43 128 -12 -32 131 103 70 -53 -62 65 47 -277
3266 -277 33 -46 99 -101 -36 -88 49 -17 -167 -40 -85 -20 65 125 -23 138 81 60 24 -31 98 217 -66 97
3290 97 137 208 59 18 48 19 10 117 -67 -5 -37 -77 20 9 38 -44 -205 -15 33 -91 47 -29 -144 -21 -41 -14
3316 -14 -47 80 28 69 194 99 93 94 54 -38 22 42 -125 76 79 62 54 21 149 -61 -72 -35 6 84 99 70 49 -40 75
3345 75 -29 -63 58 1 -25 29 15 108 -121 -39 26 50 40 73 0 -187 134 -59 203 2 9 4 -78 -55 -108 -242 -52
3372 -52 -75 127 36 6 -85 -28 -220 -85 49 -143 69 22 82 239 86 -63 22 -24 -8 64 111 -89 -106 -49 -21
3397 -21 -185 134 74 -90 118 -91 -93 -8 -67 -60 46 15 221 33 -80 -10 -143 109 -81 57 -86 66 83 51
3421 51 53 54 -6 -106 -123 81 -70 -115 -142 84 -87 -142 191 -97 -7 -174 17 -82 -36 -156 4 -21 -11 58 -9 179
3447 179 -73 -124 -96 82 -66 63 191 33 30 -32 -14 88 64 42 -45 -67 -192 34 -15 -52 74 -79 -232 22
3471 22 28 -231 -39 -78 153 41 -40 -3 4 227 138 55 -65 206 231 -113 -118 -6 4 29 -49 23 -107 72 -34 110
3497 110 24 -78 -40 -47 -71 -122 126 -44 61 98 112 107 -76 -20 -21 -197 -48 -83 -48 -45 -14 112 138 -151 43 79 -79
3524 -79 136 49 -137 132 -40 -92 -34 -161 220 19 -166 -149 5 -134 75 87 -27 23 -8 -153 47 -69 270
3547 270 -62 -53 180 58 108 146 29 125 142 63 54 -140 73 56 -126 16 -101 -253 133 -114 15 125 57 27
3571 27 -92 -9 7 -54 -171 -217 72 34 -34 -6 123 32 154 -10 66 -46 79 56 91 -91 98 13 -14 22 -139
3596 -139 30 31 98 48 -101 -225 -152 -57 57 -36 105 -115 -116 -161 223 78 69 -11 -120 97 114 -53 19 81 39 74
3622 74 148 -53 64 -17 -133 205 -145 -65 121 -67 39 -65 74 -69 110 -7 -27 54 -156 43 139 182 -14
3645 -14 124 -57 56 99 18 185 116 -41 -46 -115 8 17 308 -50 -68 124 -46 -94 -28 -91 -99 76 25 -152 10
3670 10 27 -108 -23 57 -62 125 134 9 161 -49 34 158 -13 49 -108 147 -21 -57 -117 -71 -92 64 18 139
3694 139 116 -60 -121 59 191 3 76 109 -24 -116 -87 -185 52 50 19 46 7 94 -147 12 232 -107 -141 -61 142
3719 142 -45 -38 79 97 17 -85 -76 -39 47 -37 65 81 -164 35 -152 31 193 -92 -13 -58 -11 128 191 124 30
3744 30 126 50 111 215 137 13 89 100 45 -30 -109 60 -1 5 -94 54 -132 -46 7 -139 -145 -15 14 209 -117 16
3770 16 118 -4 -3 -74 -52 13 235 274 -136 54 23 331 -189 -15 36 104 36 -138 -33 -141 -92 -104 -47 -215 54
3795 54 17 57 -183 -111 79 -42 -21 107 -79 1 -104 -49 51 101 30 66 -102 -52 -181 -119 -6 -83 -20 202 61
3820 61 -73 69 -76 62 16 -45 11 -110 123 -15 42 -40 46 17 90 69 74 124 125 130 -105 -12 -14 10 -49 61 104 -16
3848 -16 110 -136 40 -30 -37 27 -1 113 -136 -156 56 2 -170 -67 164 -102 102 -111 7 136 123 24 244
3871 244 99 188 84 63 -56 126 208 81 10 57 39 31 -82 71 127 0 150 -88 -63 151 147 -153 -85 -7 6
3896 6 -59 222 74 117 -150 -67 67 7 120 80 46 188 -123 -39 7 -54 7 -77 25 -23 -23 30 -42 -60 157 -15
3922 -15 -85 -83 57 55 150 103 3 58 -36 -49 35 46 123 -223 -108 -23 85 7 46 -139 -55 15 33 105 35 -46 72 95
3950 95 -117 75 -88 -133 -34 14 -137 -2 -33 -172 107 117 -112 184 -70 138 205 53 -14 -46 68 -53 63
3973 63 137 31 16 -53 -64 -186 -42 71 -3 -51 -72 -78 -74 17 -89 -57 -21 -138 -89 106 123 30 -162 -139 -120 -89 9
4000 9 151 64 133 108 31 -36 11 -43 38 31 -81 223 349 -39 -92 -113 -82 -102 -46 -148 -35 -40 -122 221 43 64 -20
4027 -20 -44 153 -108 55 -129 -125 56 132 27 60 17 -114 -96 -98 249 -2 17 24 -103 -46 264 68 28 16 70 -68
4053 -68 -211 -37 0 2 33 -89 -31 -58 -50 49 42 40 -46 73 -137 -193 108 280 16 -97 -35 38 -211 -21 167 -43
4079 -43 170 -90 -249 -12 17 41 163 -3 48 16 29 -64 -51 -101 160 246 -31 -54 8 -16 2 42 -168 -43 153
4104 153 -169 -22 7 -156 -206 -73 -137 74 99 -45 -110 -114 -13 4 -127 -68 -11 -94 14 -151 50 -95 -24 159
4128 159 16 -22 133 267 26 -310 -82 89 -18 30 34 152 46 45 118 28 -141 17 -64 81 -117 -190 -46
4151 -46 -143 -7 -32 -121 -122 -6 -81 82 -10 138 147 -31 -28 77 101 62 -32 189 82 -153 102 65 7 -55 -8 130
4177 130 -30 82 4 -57 -78 -162 92 112 69 -105 80 -191 -41 -5 -161 140 11 -201 133 119 -108 161 -22
4200 -22 178 -94 259 116 -133 65 -81 54 -48 -105 69 -170 -184 -292 34 -85 2 -22 -31 -23 -76 26 101 -112
4224 -112 2 -114 -27 -67 -134 -36 112 38 6 -89 -209 -47 45 6 -12 -27 58 105 -240 -51 -165 57 20 113 192
4249 192 -59 -82 29 92 -72 -66 -136 -101 218 -26 202 85 -65 -89 79 -306 -43 80 -95 90 -210 -68
4271 -68 -93 80 -31 -33 -48 -75 126 -170 34 -25 65 192 -60 80 -100 -109 -80 14 232 -64 55 52 -25 88 -53
4296 -53 17 220 58 81 -142 148 -55 -42 -228 -215 39 147 27 80 -188 23 1 60 -52 -91 151 65 73 38
4320 38 -133 -121 127 -112 -24 91 30 26 -10 -70 55 85 -108 40 -89 140 -96 35 90 -135 -153 131 15 35
4344 35 -65 12 -118 78 -62 132 -1 -110 -86 111 221 -22 -73 58 138 27 45 46 3 142 21 -87 0
4367 0 -10 123 -17 145 -323 51 -50 -147 -214 127 -46 70 -117 -7 -1 42 101 299 -5 34 5 95 -64 -31
4391 -31 103 -129 -23 91 -38 2 10 -10 -178 34 58 12 29 -7 279 1 -18 57 -23 2 35 82 52 18 -4 -85
4417 -85 -59 -6 39 -108 248 -93 -180 11 215 -68 77 5 -20 -247 -61 0 75 -98 -107 25 -22 159 -166 60
4441 60 -103 -152 13 -38 -22 155 -68 143 29 -97 -19 9 -145 206 -32 -50 -90 -26 -25 87 60 -148 76 -208
4465 -208 26 -2 104 -132 -21 -27 160 3 -79 8 -170 -1 -54 12 -281 11 11 25 122 111 156 73 144 -239 48
4490 48 35 66 -53 145 -84 -133 125 -76 -60 -210 -219 -79 73 19 -7 97 6 -178 90 159 13 -267 -57 98
4514 98 232 -4 -157 -127 226 -4 -50 64 16 245 -27 81 166 -172 -150 55 -183 -134 56 54 28 -79 -48 -156
4538 -156 64 -68 -42 -76 -56 -173 -217 103 -31 99 82 -24 257 -113 47 120 248 180 88 2 21 168 95 47
4562 47 -91 65 -72 28 70 123 26 126 89 105 -15 -59 56 -48 -104 14 42 -189 29 -144 75 7 87 -34
4586 -34 -212 -160 153 19 146 8 -165 76 132 -81 27 -41 -198 2 148 99 -13 49 -65 34 13 28 116
4609 116 -30 -25 -103 86 -28 -150 143 -10 98 33 14 6 -92 3 78 129 -56 83 -86 175 130 -132 79 145
4633 145 -41 3 -47 199 -6 19 -12 147 206 -214 -164 72 138 152 -12 23 162 -19 -52 46 17 99 -67 -78 75
4658 75 73 1 -94 -30 70 -17 -13 27 -12 3 -31 20 -24 -2 -76 -93 -23 79 66 -113 -115 -3 -249 -25 6 -56 -19 53 -27
4687 -27 121 196 4 -85 -64 -101 -16 -54 52 185 -160 -55 132 25 -122 -77 54 63 -32 -125 98 -35 -17 26 50
4712 50 -156 -72 -56 -168 115 -37 295 45 -14 -122 3 -51 73 207 -106 81 3 87 69 -36 155 -80 191
4735 191 -87 -8 53 -85 17 149 -120 -3 4 58 -183 26 -168 -149 45 37 171 121 177 76 -7 -108 111 -91
4759 -91 -41 13 82 -17 19 -116 -79 7 18 -84 -106 110 80 -61 38 -52 36 -165 177 39 -155 -52 30 25 -122 -120
4785 -120 -236 211 57 121 -56 64 16 -29 -1 -72 43 70 -11 -53 -32 63 75 30 -28 -15 -48 77 -35 71 -117
4810 -117 -134 198 -144 -173 -29 22 72 -155 -128 -203 17 -17 -197 -51 84 5 67 -93 -202 47 -230 -62 93
4833 93 83 -61 -86 -31 -119 34 57 152 -64 -69 -5 -132 3 60 20 -6 -61 62 184 18 -34 -21 -82 -68 -143 0
4859 0 190 72 11 -93 -200 159 89 -236 48 7 81 70 20 -39 -94 49 206 123 128 63 -19 -6 256 -66 26 -76
4885 -76 92 45 -132 88 -182 -83 171 18 57 -53 -147 -77 249 28 -133 -47 -40 -143 121 -44 -137 155 -10
4908 -10 -72 10 -86 -17 42 97 -41 -105 13 -44 -125 -59 -77 -67 -13 32 42 -43 105 -65 -83 -155 -31 -145 -127 48 -170
4935 -170 19 -124 79 91 18 183 -46 50 -174 352 -163 107 -174 35 139 -34 -21 41 -56 64 36 -115
4957 -115 -94 -132 -51 -98 -90 96 -105 -10 68 -127 88 114 28 4 -121 108 38 66 -22 -136 91 -92 -81 85 -101
4982 -101 -87 -48 20 -11 74 45 -236 43 -76 124 -37 -54 11 75 38 -13 -116 -4 -29 151 77 -100 19 25 183
5007 183 -104 244 165 -99 -7 168 73 63 -12 20 10 4 62 249 14 -5 86 293 115 185 29 66 -122 19 12
5032 12 18 -136 -52 -1 -67 14 92 144 112 -94 11 6 -227 -38 3 -162 -18 113 54 26 -172 30 7 -52 -113 -65
5058 -65 68 -179 -84 -20 169 -123 98 31 30 33 -50 -43 -18 -146 143 -59 -61 6 61 141 -25 48 -159 -12 -53 -35 12
5085 12 -125 -1 91 143 -187 -158 139 163 177 -14 238 -175 -74 -49 -60 -124 -10 151 -31 -11 44 28 117 -86
5109 -86 -112 32 83 12 -52 62 -16 -63 -140 64 4 -116 -82 -66 -139 15 96 207 -87 120 -9 56 -138 -67 96
5134 96 181 -33 -34 74 13 117 20 -101 2 22 -59 -27 50 241 -54 -34 92 54 58 -143 24 6 -143 -98 -27 -98
5160 -98 5 133 99 -91 12 58 -11 121 -126 62 -36 156 26 -165 -15 6 71 260 -34 -56 24 -92 61
5183 61 22 -179 -136 -46 175 -75 -122 31 150 132 75 16 -69 -21 130 63 193 56 139 15 -47 -97 43 -70 -197
5208 -197 31 -175 54 -139 -81 -266 76 163 46 -31 106 -174 1 29 -3 -1 24 61 82 -176 -135 -67 -124 144
5232 144 53 -5 -48 38 -46 -131 -83 159 -185 129 47 -57 -61 61 -177 5 160 -90 88 202 -91 147 115 101
5256 101 -84 -98 -65 -57 -204 -155 -138 117 55 -212 -211 -10 -64 44 -28 -213 123 42 -96 190 14 50 28 -24 -57
5281 -57 -32 91 -148 -81 -47 121 128 -158 176 122 148 -119 50 -11 -37 149 153 78 -56 10 -206 174 88 33 180
5306 180 -4 166 -109 -27 -270 -60 118 -100 97 238 34 -5 197 -191 -33 -75 1 -172 -9 -40 -78 -53
5328 -53 -37 -80 1 64 147 -13 12 -153 -52 55 38 -82 -10 -263 164 -32 70 52 -4 -174 214 -198 137 -126
5352 -126 -29 -1 61 13 57 11 35 -38 -47 192 -53 7 -56 108 -201 -118 55 -50 -23 8 -157 -169 140 -100 -195 202
5378 202 57 -45 -37 -123 172 -115 83 -24 8 -45 -64 -95 80 -53 163 41 45 -11 -67 -8 -155 65 -66 -44
5402 -44 4 50 176 -48 -165 -171 -155 -103 -91 78 -49 -208 -45 72 -77 -103 123 -191 -59 58 -213 -116 -43 106
5426 106 66 45 -19 100 -64 -157 121 178 -62 66 -19 -77 -7 31 155 61 26 -95 -113 -207 -92 99 -71 118
5450 118 -142 -72 76 36 -78 210 205 45 -152 103 16 -80 268 -166 -97 77 147 242 -3 -76 -166 -146 -33 33
5474 33 -72 178 -115 -4 -16 -45 -149 0 -127 37 -103 78 137 120 89 103 -91 13 -54 -31 12 77 -139 -53
5498 -53 -193 -5 123 -18 -49 -76 -88 83 -156 -198 4 26 38 -64 13 -147 -38 -31 71 37 60 -118 72 0
5522 0 70 41 2 -67 -20 -87 105 -46 44 -21 167 -61 -172 202 -111 52 -27 59 45 -308 101 -144 43 -29 -82
5547 -82 150 -18 -21 7 -46 30 49 39 -84 146 84 -58 -11 -163 32 -167 -85 210 -10 -227 -24 87 226 -175
5571 -175 -145 143 30 -55 -86 -85 -156 50 166 81 140 -43 -71 -131 71 77 -28 39 -4 43 9 2 -62 -66 -78 -19 -103 25
5599 25 189 50 65 90 161 -40 92 50 52 -40 -205 212 -44 118 -179 -63 -17 -24 -63 -188 -1 33 -3 158 66
5624 66 119 -60 -158 -157 -92 61 42 -135 54 7 16 17 -142 90 53 -121 7 33 16 -211 34 -144 75 90 193
5649 193 51 -17 -15 122 -208 -48 -157 21 78 -47 78 85 -57 -77 3 74 -9 -31 115 104 66 6 40 -169 -49
5674 -49 100 99 -71 74 -83 141 -255 14 246 -62 -59 10 48 -4 -30 -66 175 -151 82 96 68 79 -93 -154 214
5699 214 -12 -169 78 134 -36 -99 45 -103 -54 -29 -62 -80 159 140 241 -129 -163 109 -74 3 -95 107 -43
5722 -43 112 37 102 -93 -26 201 -35 -54 -167 -11 65 73 -117 57 -100 81 11 -45 -45 -2 151 -52 16 102 230
5747 230 -27 83 85 -116 -178 126 100 146 83 154 48 104 -72 -83 -2 -143 6 -51 -86 -244 -24 -109 -147 -30 -47
5772 -47 -19 31 -106 145 9 -86 3 -66 -24 -43 45 10 -105 17 234 -206 87 46 97 -79 -238 -167 -1 14 16
5797 16 -119 69 -44 57 -95 -10 -96 213 -287 -82 242 -278 39 -26 -35 -68 -118 -104 -45 -118 -42 23 134 -29
5821 -29 72 -56 -5 73 -100 43 -17 36 6 -30 62 84 -126 -61 6 -143 -178 -29 101 31 56 112 79 -45 -195
5846 -195 81 -88 -15 -30 119 56 104 37 7 -61 186 101 -222 -8 20 -15 173 216 -173 73 59 57 -5 257 -26
5871 -26 -55 14 252 -76 7 -34 55 92 -12 -5 -57 -195 73 -143 -37 -111 -146 21 92 -162 130 -80 243 -29
5895 -29 -200 -15 -86 -52 103 87 38 -52 152 -122 -124 79 85 146 -93 -153 158 150 -47 21 -246 -89 142 -215 111
5920 111 9 0 191 110 -22 -26 17 -98 106 25 -102 0 -159 9 -89 -104 -74 -153 -20 36 248 -99 -168 -44
5944 -44 79 -73 65 -172 -8 -111 -11 -70 -74 147 46 -154 -235 112 -85 15 -47 -36 -193 136 74 -52 -58
5967 -58 -106 84 -119 66 57 -21 14 41 -256 78 55 -71 -52 -16 2 -8 -108 28 92 58 182 -60 -50 -35 -62 78
5993 78 81 -43 4 -24 10 75 3 120 50 32 45 76 -27 186 31 -47 -88 -115 54 -179 7 -150 -32 -158 82
6018 82 -115 -81 59 72 154 -73 108 -1 -117 137 -37 -101 -159 -58 82 -40 -30 -4 7 156 17 -1 -53 148
6042 148 -14 -206 93 -7 69 -113 91 -132 -86 -89 -38 40 107 275 -124 71 -99 39 -55 -130 -63 -1 -6 20 -191
6067 -191 38 -32 87 -47 33 58 46 -38 35 -62 64 21 -118 -184 -107 173 -8 -97 59 -41 35 -99 -31 71
6091 71 -158 21 46 -68 158 13 84 -109 -27 -130 20 -128 -131 284 -22 86 4 -34 -61 90 -49 -30 -116 -20
6115 -20 37 95 -175 45 41 189 30 325 105 -153 205 114 52 -49 66 53 126 -47 19 -87 48 101 27 -48
6139 -48 36 44 1 18 37 -9 -242 25 82 -180 92 61 93 -134 76 189 52 4 -101 145 -23 27 147 -29
6163 -29 -138 96 44 117 26 -81 40 -38 9 -66 -190 -87 104 63 -18 -35 115 3 72 -101 256 -149 10 35
6187 35 -237 181 -57 -129 -223 -26 3 -31 17 -36 -109 -115 0 273 86 121 15 -35 39 -2 90 -58 -69 30 128 44
6213 44 -72 -19 51 25 62 31 182 -7 -110 -26 -56 188 158 -15 20 -106 -177 -18 -62 -106 -74 27 134 -191 -85
6238 -85 117 -1 -235 -68 131 25 174 -40 82 -103 160 -94 -19 -49 -19 170 -51 -15 -165 -172 73 -17 23
6261 23 -22 -67 153 29 33 -108 -10 117 -147 -80 70 -138 32 -68 4 -183 -31 -263 -26 47 -36 122 -114
6284 -114 -253 183 100 -167 35 48 -112 -32 113 -19 89 184 14 -34 -16 9 -78 -25 -114 -7 101 102 7 73 155
6309 155 -19 -107 153 65 -20 48 -123 69 -27 10 -85 153 275 84 71 151 -52 -131 146 -18 -42 -110 15 45
6333 45 101 53 53 -67 -33 81 17 62 16 43 85 71 143 -137 -302 9 55 59 -78 2 137 -271 -22 9 165 -34
6359 -34 50 57 -112 -115 128 -141 101 153 -133 -9 25 17 -31 -81 7 -14 -43 123 56 188 -76 170 189 29 -16 174
6385 174 -40 -38 194 50 -82 -88 -4 -63 -81 -107 154 -119 -57 80 117 299 -154 -56 -43 -1 282 51 -15 217 -104
6410 -104 -95 -89 -57 102 75 44 -131 -110 30 -2 -73 35 30 -81 -195 129 -88 14 -19 -238 57 60 -61 45 -37
6435 -37 82 -117 42 -149 162 107 41 62 -15 111 -200 -107 -36 -219 26 101 8 102 17 118 4 43 -90 -124
6459 -124 56 205 -84 -102 -56 -84 -77 -96 60 71 -60 89 -2 -21 -35 -181 -45 49 76 -33 62 -216 61 93 -40
6484 -40 170 -5 52 -11 105 38 126 129 108 -76 -78 160 -23 -41 -72 103 29 -114 28 -76 41 -81 -29 -81 -39
6509 -39 -4 -211 61 -45 -61 15 -5 59 -165 -228 -26 17 88 128 186 -63 -8 38 91 81 135 78 39 -14 -181 76
6535 76 -74 -98 -175 77 158 52 62 -100 45 34 -167 -50 94 -82 53 -107 -165 -95 110 10 141 0 43
6558 43 -57 52 -53 -182 89 -48 37 4 55 -214 3 -45 -27 138 119 154 -81 -1 -215 -136 -47 -63 142 -35
6582 -35 -18 60 -72 75 84 -60 -151 22 10 150 37 -85 238 143 55 -146 -85 70 -50 183 47 -190 190
6605 190 -87 28 39 -54 29 198 107 -85 194 74 -128 131 11 -24 -74 -17 -8 88 54 67 28 8 -95 -190 -9
6630 -9 22 -211 -106 100 224 -15 -64 -18 77 212 69 32 46 -68 36 -107 87 57 -60 75 41 -146 -73 21
6654 21 -18 -336 -27 180 13 -241 -191 115 107 -136 43 -237 -135 -126 -38 127 79 26 67 126 -118 -24 126 -100
6678 -100 -136 41 -253 -224 -74 -30 -158 11 -92 0 -72 47 -7 -22 -70 33 212 -167 -15 -56 -98 -4 74 90
6702 90 -10 298 89 -189 -55 -2 8 136 -61 122 9 -31 23 167 81 175 88 -50 10 -198 -71 -1 89 150
6726 150 -73 123 -108 -184 146 -151 -159 11 -139 126 213 119 -11 98 -40 82 -131 -12 -89 -64 -142 123 -9
6749 -9 171 -64 -103 -11 77 -59 -59 156 155 85 -110 232 112 -77 -55 20 -83 97 156 51 113 -154 98 31 -105
6774 -105 114 -33 204 -70 18 -70 18 -40 25 74 45 98 -51 -90 -259 -55 -2 -41 146 67 -82 84 238 62
6798 62 -84 129 -157 -108 -15 136 7 -39 -13 126 -30 36 -1 -130 -168 -18 -35 98 35 -60 10 25 203 -52
6822 -52 -59 -41 44 -50 151 -105 -100 41 -45 -96 60 40 -214 -101 177 57 -107 59 3 141 9 54 30 -3 -66
6847 -66 -46 -55 -30 -37 -154 -167 36 -15 -12 69 -79 192 148 152 -83 -10 -27 96 -51 68 21 -231 14 169 -314 43
6873 43 -43 150 26 -48 124 85 -72 -117 66 -45 105 114 -33 -25 6 97 -75 68 110 -89 187 76 139 -14
6897 -14 21 -102 48 30 -27 11 -56 76 45 -73 149 -27 76 244 3 -117 -175 163 22 -72 56 18 106 -85
6921 -85 -48 11 -9 94 79 15 89 -126 132 -78 -31 -56 91 172 91 9 -64 86 55 92 -20 71 -55 -152 119 9
6947 9 221 80 -139 -122 -135 -174 -97 179 201 105 -118 100 -115 -102 -6 2 0 92 42 -15 128 -46 66 5 66 273
6973 273 2 112 97 -13 36 65 -95 154 40 55 48 123 -98 -11 155 178 -55 -73 -12 56 -21 13 7 -226 46
6998 46 189 50 9 275 91 24 -128 -29 -50 149 45 47 97 99 -140 -160 -98 27 -58 130 141 78 72 107 -4 102
7024 102 53 -335 207 -214 -248 159 -4 -12 -133 132 47 70 -126 264 -161 212 109 12 190 48 143 91 -4
7047 -4 -67 149 13 35 -101 128 -1 16 -18 55 161 -121 3 -130 -65 -135 -153 23 -142 88 17 77 200 -31
7071 -31 57 -144 -2 61 89 82 84 -77 60 -163 -6 -14 -52 -41 -51 -172 -57 -14 -89 -101 212 -21 59 58 87 -139 -15
7098 -15 -48 -17 7 -269 34 70 -192 18 127 142 -25 54 89 -10 7 97 11 80 119 -182 43 -88 90 163 5
7123 5 20 -100 -1 -22 -22 -149 -45 142 -46 -92 -17 -23 67 193 -120 33 48 -124 -12 48 -14 -187 -103 -79 -68 -28
7149 -28 15 80 -100 -14 11 -12 -37 -24 -48 22 99 72 35 -184 13 -124 -20 43 -11 -143 -11 -104 32 271 -77
7174 -77 -137 -75 -11 -163 186 37 -87 130 -26 -60 150 -184 -145 115 77 123 -4 139 -157 115 14 16 -164
7197 -164 -161 57 40 14 86 71 -122 -19 -164 157 56 -85 1 6 25 -14 84 122 96 -94 101 68 5 26 -112 107
7223 107 -159 -28 94 27 136 194 26 164 34 10 -16 -149 83 -47 14 -31 -169 -8 -94 -36 98 -19 4
7246 4 -184 48 39 85 -153 -188 242 -136 -163 49 90 28 197 -94 -196 -221 -104 -29 -11 -8 38 -41 -3 81 -61 -76
7272 -76 -284 -58 -53 11 92 141 45 31 -117 -3 66 137 -24 124 -10 -207 135 -13 -128 -39 51 -82 130 148
7296 148 57 -118 -46 19 -125 17 4 88 74 -57 132 -93 3 27 116 64 -27 68 -82 23 -60 153 271 36
7320 36 -78 16 -210 6 46 13 78 -16 118 -174 -186 14 -160 -79 86 -27 -143 36 20 -209 42 -229 -44
7343 -44 -72 -54 0 -5 184 -136 -86 126 42 -7 87 -99 -3 61 66 -19 -18 70 -50 -52 108 114 -98 124 -227 -19 9 -13
7371 -13 -11 -52 -180 127 21 -128 249 145 19 -21 -93 -65 -123 -9 -79 23 -41 124 -88 -14 114 -107 215 98
7395 98 130 -58 -18 79 127 79 88 -71 -85 -80 -74 -46 107 -212 171 106 191 132 52 25 -130 218 19 -32 232 65 168
7422 168 -12 -41 -159 -126 -96 -80 23 -167 -41 48 -18 -164 81 -269 -35 -20 76 -37 -11 -137 -66 46 70 116
7446 116 41 -94 102 -51 -64 -12 -101 170 23 73 62 123 -58 -73 110 -20 -96 -3 -62 -193 63 127 -98 -28
7470 -28 -111 -168 -50 -50 -223 135 72 -148 73 -99 -131 -145 112 -24 -63 -41 8 20 -141 -3 -7 -61 -110 65 89 107
7496 107 77 31 56 30 103 47 80 -38 -45 -224 50 -38 -36 130 73 -44 -80 10 -62 8 -17 78 45 164 229 -84 -84 9
7524 9 10 -41 -17 -117 241 50 5 144 49 123 -173 40 22 -65 -158 81 64 -112 -17 -84 43 127 -166 14 64 163
7550 163 52 -189 77 145 -10 -31 144 21 133 -191 193 -16 40 147 -29 -124 65 -135 3 164 202 -23
7572 -23 133 -72 31 134 -140 -25 56 -66 -73 124 -99 68 -89 172 -67 -98 -18 -197 46 71 26 16 -141
7595 -141 -32 -269 -70 -68 -86 -103 -168 -46 -45 -20 -81 -11 40 -174 179 130 8 -28 95 6 -56 -63 14 -95 -29 -106 -159
7622 -159 -75 -99 20 -128 99 11 -124 24 63 -38 -86 -102 -50 -10 14 -172 -73 -9 -33 -39 216 -21 -19 103 -27
7647 -27 -100 -56 -67 13 116 259 -64 -108 92 2 31 149 -165 -157 37 66 27 38 -9 -72 9 246 -38 -78 -140 185
7673 185 -32 -78 -85 -178 -77 -33 -139 89 -12 -59 63 -109 90 54 -106 -47 98 -140 175 23 79 -26 33
7696 33 -19 -13 -153 -90 21 -22 -93 -97 42 90 -230 91 239 119 129 84 41 -116 -133 0 95 -52 6 52 -22 190
7722 190 19 -141 3 176 21 3 49 71 1 32 55 -153 228 -121 -172 143 101 -126 139 -88 -98 108 172
7745 172 -39 -30 -49 -78 138 70 25 172 72 67 161 -119 -58 214 -192 117 -31 47 71 -190 -68 97 -43 89
7769 89 80 -2 72 62 -101 36 223 2 -10 75 -53 25 101 -106 93 -247 -13 -39 -218 -32 39 -141 99 -41
7793 -41 94 -77 -6 -112 -25 84 -1 -126 -136 159 12 15 -40 -191 -257 -100 52 -18 130 108 -63 163 -89 -64
7817 -64 -95 11 86 113 -36 7 54 -43 105 67 149 -131 100 73 77 -130 -36 101 47 94 51 -50 -45 -158 57 -5
7843 -5 -80 68 -49 10 -99 -173 -3 76 -58 -135 -69 -38 -28 -167 -31 -52 85 20 -80 -52 -195 -35 25 15 61
7868 61 -37 -1 181 -101 98 53 -35 9 -279 -170 -108 11 9 112 173 -14 -130 -2 -29 -91 76 17 49 10 51
7893 51 57 -77 -8 -121 27 237 -109 -110 -84 26 -57 114 -42 22 244 79 -114 139 96 143 100 -27 -125 25
7917 25 81 59 -39 -68 -146 0 -52 32 -62 158 89 14 67 -77 57 150 -83 -89 136 193 86 40 -28 -138 115 -15
7943 -15 5 -240 -30 31 -166 151 125 -200 140 226 -1 21 -126 -157 54 -178 -4 46 -86 -116 -103 236 64
7966 64 0 -43 -120 -32 46 -243 194 96 -59 -19 98 27 -115 38 -91 105 47 -81 61 38 -38 25 45 23 -38
7991 -38 157 -20 1 -153 30 -32 30 93 -130 -19 90 6 208 126 -100 -65 304 -226 76 187 -157 -44 -10
8014 -10 2 -68 -192 19 16 118 -48 34 142 -64 -47 95 -34 -66 84 41 -100 -76 -86 62 -56 -249 66 -94
8038 -94 117 46 0 -42 5 -85 -150 41 -22 109 -93 -50 -32 -160 179 -105 8 -43 44 -217 29 110 133 110 -119
8063 -119 -26 -108 -31 69 -1 -83 134 176 -92 -22 186 -199 -57 -48 87 -78 -98 -80 94 -39 -25 31 54 -183 173
8088 173 0 -164 142 -99 92 63 -23 -37 45 -212 -173 118 -43 -189 20 30 -155 -60 -33 -31 -151 -97 -39 -9
8112 -9 -217 -5 15 -143 -128 -99 -131 -210 -13 -2 95 78 20 -50 -36 -33 -77 215 25 -134 -104 27 83 65 55 257 89
8139 89 -128 -28 78 -33 165 -167 -106 -78 176 89 57 -159 -41 -48 87 209 -81 -26 -182 41 -114 23 43
8162 43 -26 -97 -107 -44 3 -25 -257 144 5 19 112 -51 189 64 57 -286 12 -68 172 -55 180 -80 -105 -16 -85
8187 -85 168 26 206 121
8191A21
##END NTUPLES=NMR FID
##END=
