##TITLE=1H_E3eN3-2
 CDCl3
 8 sc, 
 25.12.2023
##JCAMPDX= 6.0         $$ Bruker NMR JCAMP-DX V2.0
##DATA TYPE= NMR FID
##DATA CLASS= NTUPLES
##ORIGIN= UXNMR, Bruker Analytische Messtechnik GmbH
##OWNER= root
$$ XWIN-NMR		Version 3.5
$$ Mon Dec 25 14:29:49 2023 Russian Standard Time (UT+4h)  she@DPX200
##.OBSERVE FREQUENCY= 200.1313
##.OBSERVE NUCLEUS= ^1H
##.DELAY= (6, 6)
##.ACQUISITION MODE= SIMULTANEOUS
##.ACQUISITION SCHEME= undefined
##.AVERAGES= 8
##.DIGITISER RES= 18
##SPECTROMETER/DATA SYSTEM= spect
##.PULSE SEQUENCE= zg30
##.SOLVENT NAME= CDCl3
##.SHIFT REFERENCE= (INTERNAL, CDCl3, 0, 15.7039)
##AUDIT TRAIL= $$ (NUMBER, WHEN, WHO, WHERE, WHAT)
$$ ##TITLE= Audit trail, XWIN-NMR		Version 3.5
$$ ##JCAMPDX= 5.01
$$ ##ORIGIN= Bruker BioSpin GmbH
$$ ##OWNER= she
$$ F:/spectra/data/she/nmr/H-F/1/audita.txt
$$ ##AUDIT TRAIL=  $$ (NUMBER, WHEN, WHO, WHERE, WHAT)
(   1,<2023-12-25 14:28:48.06 +0400>,<she>,<DPX200>,
      <created by zg, POWCHK disabled, PULCHK disabled
       configuration hash MD5:
       00 E9 B6 7A A2 85 ED C7 34 08 36 98 17 FE 4E 26
       data hash MD5: 16K
       83 82 94 31 56 AE A3 F6 02 3B 3F 76 EF CB 4E AF>)
$$ ##END=
$$ 
$$ hash MD5
$$ 70 C5 97 F0 AC 5B 6C CA 2E 3F 5E 58 4F 2C 5B C7
##$RELAX= 
##$RELAX= 
##$RELAX= 
##$RELAX= 
##$RELAX= 
##$RELAX= 
$$ Bruker specific parameters
$$ --------------------------
##$DU= <F:/spectra>
##$EXPNO= 1
##$NAME= <H-F>
##$PROCNO= 1
##$TYPE= <nmr>
##$USER= <she>
##$AMP= (0..31)
100 100 100 100 100 100 100 100 100 100 100 100 100 100 100 100 100 100 
100 100 100 100 100 100 100 100 100 100 100 100 100 100 
##$AQSEQ= 0
##$AQ_mod= 1
##$AUNM= <au_zg>
##$AUTOPOS= <>
##$BF1= 200.13
##$BF2= 200.13
##$BF3= 200.13
##$BF4= 200.13
##$BF5= 200.13
##$BF6= 200.13
##$BF7= 200.13
##$BF8= 200.13
##$BYTORDA= 1
##$CFDGTYP= 0
##$CFRGTYP= 5
##$CHEMSTR= <none>
##$CNST= (0..31)
1 1 145 1 1 1 1 1 1 1 1 1 1 1 1 1 1 1 1 1 1 1 1 1 1 1 1 1 1 1 1 1 
##$CPDPRG= <>
##$CPDPRG1= <>
##$CPDPRG2= <>
##$CPDPRG3= <>
##$CPDPRG4= <mlev>
##$CPDPRG5= <mlev>
##$CPDPRG6= <mlev>
##$CPDPRG7= <mlev>
##$CPDPRG8= <mlev>
##$CPDPRGB= <>
##$CPDPRGT= <>
##$D= (0..31)
0 1.2 0 0 0 0 0 0 0 0.06 0 0.03 0 0 0 0 0.0002 0 0 0 0 0 0 0 0 0 0 0 0 
0 0 0 
##$DATE= 1703500127
##$DBL= (0..7)
120 120 120 120 120 120 120 120 
##$DBP= (0..7)
150 150 150 150 150 150 150 150 
##$DBP07= 0
##$DBPNAM0= <>
##$DBPNAM1= <>
##$DBPNAM2= <>
##$DBPNAM3= <>
##$DBPNAM4= <>
##$DBPNAM5= <>
##$DBPNAM6= <>
##$DBPNAM7= <>
##$DBPOAL= (0..7)
0.5 0.5 0.5 0.5 0.5 0.5 0.5 0.5 
##$DBPOFFS= (0..7)
0 0 0 0 0 0 0 0 
##$DE= 6
##$DECBNUC= <off>
##$DECIM= 32
##$DECNUC= <off>
##$DECSTAT= 4
##$DIGMOD= 1
##$DIGTYP= 9
##$DL= (0..7)
0 120 120 120 120 120 120 120 
##$DP= (0..7)
150 150 150 150 150 150 150 150 
##$DP07= 0
##$DPNAME0= <>
##$DPNAME1= <>
##$DPNAME2= <>
##$DPNAME3= <>
##$DPNAME4= <>
##$DPNAME5= <>
##$DPNAME6= <>
##$DPNAME7= <>
##$DPOAL= (0..7)
0.5 0.5 0.5 0.5 0.5 0.5 0.5 0.5 
##$DPOFFS= (0..7)
0 0 0 0 0 0 0 0 
##$DQDMODE= 0
##$DR= 18
##$DS= 0
##$DSLIST= <SSSSSSSSSSSSSSS>
$$ [...]
##$SUBNAM2= <"">
##$SUBNAM3= <"">
##$SUBNAM4= <"">
##$SUBNAM5= <"">
##$SUBNAM6= <"">
##$SUBNAM7= <"">
##$SUBNAM8= <"">
##$SUBNAM9= <"">
##$SW= 18.0517328524113
##$SWIBOX= (0..15)
0 0 2 0 0 0 0 0 0 0 0 0 0 0 0 0 
##$SW_h= 3612.71676300578
##$TD= 16384
##$TD0= 1
##$TE= 0
##$TE2= 300
##$TE3= 300
##$TEG= 300
##$TL= (0..7)
0 120 120 120 120 120 120 120 
##$TP= (0..7)
150 150 150 150 150 150 150 150 
##$TP07= 0
##$TPNAME0= <>
##$TPNAME1= <>
##$TPNAME2= <>
##$TPNAME3= <>
##$TPNAME4= <>
##$TPNAME5= <>
##$TPNAME6= <>
##$TPNAME7= <>
##$TPOAL= (0..7)
0.5 0.5 0.5 0.5 0.5 0.5 0.5 0.5 
##$TPOFFS= (0..7)
0 0 0 0 0 0 0 0 
##$TUNHIN= 0
##$TUNHOUT= 0
##$TUNXOUT= 0
##$USERA1= <user>
##$USERA2= <user>
##$USERA3= <user>
##$USERA4= <user>
##$USERA5= <user>
##$V9= 5
##$VALIST= <valist>
##$VCLIST= <CCCCCCCCCCCCCCC>
##$VD= 0
##$VDLIST= <DDDDDDDDDDDDDDD>
##$VPLIST= <PPPPPPPPPPPPPPP>
##$VTLIST= <TTTTTTTTTTTTTTT>
##$WBST= 1024
##$WBSW= 4
##$XGAIN= (0..3)
0 0 0 0 
##$XL= 0
##$YL= 0
##$YMAX_a= 231357
##$YMIN_a= -299421
##$ZGOPTNS= <>
##$ZL1= 120
##$ZL2= 120
##$ZL3= 120
##$ZL4= 120
##$ABSF1= 10
##$ABSF2= 0
##$ABSG= 5
##$ABSL= 3
##$ALPHA= 0
##$AQORDER= 0
##$ASSFAC= 0
##$ASSFACI= 0
##$ASSFACX= 0
##$ASSWID= 0
##$AUNMP= <proc_1d>
##$AZFE= 0.1
##$AZFW= 0.1
##$BCFW= 1
##$BC_mod= 2
##$BYTORDP= 1
##$COROFFS= 0
##$CY= 11.3945322036743
##$DATMOD= 1
##$DC= 2
##$DFILT= <>
##$DTYPP= 0
##$F1P= 15.7292609196834
##$F2P= 12.9074282941183
##$FCOR= 0.5
##$FTSIZE= 0
##$FT_mod= 4
##$GAMMA= 1
##$GB= 0.15
##$INTBC= 1
##$INTSCL= 1
##$ISEN= 128
##$LB= 0.24
##$LEV0= 0
##$LPBIN= 0
##$MAXI= 10000
##$MC2= 0
##$MEAN= 0
##$ME_mod= 0
##$MI= 1.114404
##$NCOEF= 0
##$NC_proc= 0
##$NLEV= 6
##$NOISF1= 3.799351
##$NOISF2= 2.8
##$NSP= 1
##$NTH_PI= 0
##$NZP= 0
##$OFFSET= 15.70392
##$PC= 1
##$PHC0= -24594.25
##$PHC1= 12.05273
##$PH_mod= 1
##$PKNL= yes
##$PPARMOD= 0
##$PSCAL= 0
##$PSIGN= 0
##$REVERSE= no
##$SF= 200.130013532006
##$SI= 16384
##$SIGF1= 3
##$SIGF2= 2
##$SINO= 400
##$SIOLD= 16384
##$SREGLST= <1H.CDCl3>
##$SSB= 0
##$STSI= 0
##$STSR= 0
##$SW_p= 3612.71676300578
##$SYMM= 0
##$S_DEV= 0
##$TDeff= 0
##$TDoff= 0
##$TI= <>
##$TILT= no
##$TM1= 0
##$TM2= 0
##$TOPLEV= 0
##$USERP1= <user>
##$USERP2= <user>
##$USERP3= <user>
##$USERP4= <user>
##$USERP5= <user>
##$WDW= 1
##$XDIM= 8192
##$YMAX_p= 0
##$YMIN_p= 0
$$ End of Bruker specific parameters
$$ ---------------------------------
##NTUPLES= NMR FID
##VAR_NAME=  TIME,          FID/REAL,        FID/IMAG
##SYMBOL=    X,             R,               I
##VAR_TYPE=  INDEPENDENT,   DEPENDENT,       DEPENDENT
##VAR_FORM=  AFFN,          ASDF,            ASDF
##VAR_DIM=   8192,          8192,            8192
##UNITS=     SECONDS,       ARBITRARY UNITS, ARBITRARY UNITS
##FACTOR=    0.0002768,     1,               1
##FIRST=     0,             0,               0
##LAST=      2.2672688,     0,               0
##MIN=       0,             -299421,         0
##MAX=       2.2672688,     231357,          0
$$ Real data points
##PAGE= N=1
##DATA TABLE= (X++(R..R)), XYDATA
$$ [...]
1971c55J224R73j587r13M92j93q0J760N41k162p52L41l74L49K109K53k702J09
1989i67M57p92J047K416r87k576J114N47r63J315J643j936k094J363N20o75J737
2006A169O00k820j407J557J321k31J469k06k925j279K380J523N1Q78p42l200j228
2023c090K742J723j72Q77j165l523p71L378J647o22O32o43l713k32L819Q73q61
2040H99Q21j299l158R27L532r3j252M40j677k302K232L164j004j559N1j189r02
2057b369K980K477j307k124n48r99K09L335J924k034k621n48n36N72L220K161
2073C792k616l369J32k29R11L304J841k756l447Q76K94L4L783J629m125k583J851
2090f78L5l31L854j12m514r91K893q68M88L400j344n091P53K992m12R92K207l063
$$ plain form
1971 -355 869 1842 255 -658 -166 -359 -439 1321 1862 -300 -1052 -711 -1085 -736 1373 1626 -1076 -967
1989 -967 -510 -1302 -255 2161 1174 -1402 -288 259 -704 611 2254 318 -1776 -413 107 -568 1169
2006 1169 1769 -1051 -2458 -901 420 189 1658 1452 -1473 -2752 -372 1151 1202 2080 1338 -1862 -3090
2023 -3090 -348 1375 1203 2080 915 -2608 -3379 -1 1646 1024 1656 1013 -2700 -2932 887 1760 899
2040 899 1720 421 -2737 -1810 1722 1629 377 817 -860 -3162 -930 2234 1230 -329 -278 -1467 -2369
2057 -2369 611 3088 1781 -343 -891 -1890 -1681 1654 3578 1544 -1077 -1625 -2161 -1589 1631 3792
2073 3792 1176 -2193 -2061 -2290 -1379 1925 3766 1010 -2437 -1561 -1267 -1233 2550 4179 54 -2529 -678
2090 -678 -643 -974 2880 2768 -1746 -2737 156 -712 -224 3176 1832 -3259 -2506 486 74 1066 3273 210
2108B10l883K050K431q6J407R72m374k710K522K216N59Q84m38l684k071K544K481
2125A030J023K53r75k862j494J980K455Q92k88j799j806r74J668K895m06j111
2141D81m87j645j027K790K431j849j102K71j085n00L504J502l270r91O89j196
2157a484L66L935k28l546q33J021j295J693L757j581l301j9L35j140K837L289
2173C806k309k816M70m34k26K811J923k444j960M23o13J27K303J115k145j271
2189a240K97m5O61J660Nj849n12N61L63P16O55n46j372o46Q05R32L38R5o70j468
2209a260l25J296J104J24n48m15j208l05J813R19l43p6m92j601k0J978N36q58
2227C19m4k66j476K14J799K14j128L55nj289R40J803p11j170O83k16p60J051R09
$$ plain form
2108 210 -3673 -1623 808 722 2129 3101 -1273 -3983 -1461 755 1314 2198 1760 -1924 -3995 -1451 1030
2125 1030 2053 2306 1331 -1531 -3025 -1045 1410 2302 2014 215 -1591 -2565 -897 1998 1592 481
2141 481 -6 -1651 -2678 112 2543 694 -408 -137 -1222 -1722 1782 3284 14 -977 -288 -1484
2157 -1484 -1118 2817 2589 -957 -1790 -769 -2064 -371 3386 1805 -1496 -1515 -1180 -2320 517 3806
2173 3806 1497 -1319 -849 -1283 -1509 1302 3225 781 -1179 -756 -1369 -1242 1061 2176 31 -1240
2189 -1240 -943 -988 -327 1333 1338 -511 -1023 -462 -99 617 1272 726 -646 -1292 -487 445 783 878 208 -1260
2209 -1260 -1585 -289 815 939 391 -24 -1232 -1537 276 1195 852 776 284 -1317 -1337 641 1177 319
2227 319 275 9 -1467 -1253 546 760 -368 -13 -18 -1307 -367 1436 725 -445 238 22 -738 313 1222
2246A222j197k82N64n08n25J031N44j488k4Q01q13n2J330J16j096J48L16n09L44
2265g8J106p44m60L67k35k00N64J65m45n51N19n19M53j06O3k61K75Q8l7M44j93
2286B15m51K81R9j80L36J74n76m03N54r2J4J23j21k89k4P00n81L08K86n81l48
2307e56O46M76l58PL07o47l03O37k39L42k76k39p34K96N54L33K95k64k80q22M63
2328c62O74L15l3k82m03n42M94Q89o8m28l18p79R6P58K70P7j91n90l09L63P40
2349C71J96k04m18l07l46P10O83j15k77l60n75k46Q94M90N9l57o73n48L48J032
2369C57K11J17n38r40k01Q82Q62j28K27q37r67J61Q93M33J32l81p34n99M06M48
2389a96Q09J77m17j079j44M39P91M84j21l93j204J67Q99K97J96j11r60q93L56
$$ plain form
2246 1222 25 -257 307 -201 -726 305 849 -639 -663 138 -675 -727 603 719 -377 -229 87 -422 -78
2265 -78 1028 284 -176 191 -44 -244 320 485 40 -511 8 -511 -58 -164 -101 -362 -87 1 -36 408 215
2286 215 -236 45 144 -36 300 474 -102 -505 49 -43 -29 94 -27 -316 -340 360 -221 87 373 -208 -556
2307 -556 90 566 208 215 522 -125 -428 209 -30 312 36 -203 -937 -641 -87 246 541 277 -3 -825 -362
2328 -362 312 627 594 312 -91 -633 -139 750 682 254 -64 -843 -747 11 281 358 167 -423 -732 -369 371
2349 371 567 363 -55 -362 -708 2 685 570 293 -67 -642 -888 6 496 555 198 -475 -1023 -675 357
2369 357 568 685 147 -793 -994 -112 750 622 849 12 -955 -794 99 532 664 283 -451 -1050 -644 -196
2389 -196 613 790 373 -706 -850 -411 380 864 743 350 -854 -687 212 509 705 594 -366 -1259 -903
2408i03J143K4O1l6j054m42J161M83J52O8o51q81M33O88K39J43qj020n88M61P62
2429B35M56j87m27n74m33K30J012L67j51n29k17l00M67R46j34o18l33j56k72N33
2449h5J054k25j120j95j63M3O18J096p54q36J56K1k74J248P50q77j073M01j82
2468c97P1R55L34j094l37K61k40O4J095k10r09n2O03k77P4N36R3r26k0M08K35
2489B67n8J67j74r78J34R17J76m48%M0q58J84Q79J56k76K17k53j208P08J442n77
2510D57m59O93n18j024P86Q64p99r3P17q49j141J059P12p59j6J014j028l92J005
2529B29K59q12L58O81q44l20Q37O8r37L82P45j073PJ208p46j052O07N80m33L9
2549b17P80j38j175K82P49k34m7Q98n94q57M22L99l69MP42l11j289P45O32j108
$$ plain form
2408 -903 240 264 325 289 -765 -1207 -46 437 589 657 6 -875 -442 246 485 628 620 -400 -988 -527 235
2429 235 691 504 77 -497 -930 -700 312 679 528 -1 -218 -518 -51 895 761 143 -190 -346 -618 -85
2449 -85 969 744 -376 -571 -734 -691 -73 1023 269 -567 -411 -390 -664 584 1334 457 -616 -215 -397
2468 -397 -326 629 963 -131 -468 -207 -447 -383 712 502 -407 -459 144 -133 -59 477 570 -356 -376 32 267
2489 267 209 376 202 -776 -642 275 451 3 3 43 -815 -631 248 404 128 345 92 -1116 -408 1034 457
2510 457 -2 691 173 -851 -65 799 0 -93 624 -225 -1366 -307 405 -354 -370 644 -384 -776 229
2529 229 488 -324 34 715 -129 -449 388 456 -481 -99 646 -427 -420 788 42 -1010 -403 177 -256 -217
2549 -217 563 425 -750 -468 281 47 0 898 304 -553 -131 268 -101 -97 645 334 -955 -210 422 -686
2569f86K36J367r01o90J072J72r42J17J058m62p65J087Q2j297J10Q86o37l93J256
2588F70k85j135M11L67p74K28J304p4j199P0O67n32p0J131m5j289M55M65j041
2607f76k17J615m99j007N96O34j310J67J421q72o26J292M67j843O15J057r03p34
2625h23J523j4j110L47M49j086o5J258n3j197P40L25j283M20R57j12l50N74k62
2644B38j007L80O31oN7J57j71n73k66M01K51k64K36L11o40m33M37P20o64K57O24
2665F76p39m51Q96O3q23M12J073j417q8J157q19j001J015M24j273N64J176r84
2683a39o10J012r1j198J467N72j284M2R91p02j051J488K74j199N11L35j009o4
2701f55P57J70q06O60J79q62K67N49J79k22M27l32o47K91J34O7J81j86k57l08
$$ plain form
2569 -686 -450 917 16 -674 398 570 -372 -255 803 341 -424 663 745 -552 -442 444 -193 -586 670
2588 670 385 -750 -339 28 -746 -518 786 712 -487 -417 250 -282 -352 779 734 -555 -100 365 -676
2607 -676 -893 722 223 -784 -188 446 -864 -697 724 -148 -774 518 985 -858 -243 814 -89 -823
2625 -823 700 686 -424 -77 372 -714 -779 479 426 -771 -31 294 -989 -569 388 276 -74 500 238
2644 238 -769 -389 242 236 293 450 279 -294 -560 -159 92 -172 64 375 -265 -698 -261 459 -205 52 676
2665 676 -63 -514 382 445 -378 34 1107 -310 -398 759 -60 -1061 -46 378 -895 -331 845 -139
2683 -139 -749 263 172 -1026 441 1013 -271 -229 762 60 -991 497 771 -428 83 418 -591 -655
2701 -655 102 272 -534 126 305 -557 -290 259 438 216 643 311 -336 -45 89 156 337 151 -106 -414
2721d14l4L04K05j9j36J84j21k55L94K59l03k00K29J05m45O99q3n98j89M02L6
2742B0p8L11j7o28RM17j21j0P02k83p20K84Q6j71P08L65n62q74M11J01l35O88
2764C03J47m05q35N12N4L28m3N78q42k99M47J15O2P39k97r02N7L28P2O4K42l43
2786H2o44K88L22k77L23J20l61l35J49K10J83O69j58o24j98j22K97M69K39k83
2806C49p50J19j5L72M08r5n74m52J91J99M37O80m26o34k35K10k9Q14J71n44m75
2827b79l6k84M20P74k4p98P0k43k12O38O93o68l34j4O9J2P00J12n80r7j65j47
2849c93L10P43k78m73l68P8j08N58N18k63o58Qk41K92O39J95l64k38r4j30L49
2870H2O63j54m10l70k77J60M76K84l82k04l38k53N63N26j28k10k19j38J8O64N7
$$ plain form
2721 -414 -448 -144 61 42 -94 90 -31 -286 108 367 64 -136 93 198 -247 452 369 -229 -418 -16 20
2742 20 -58 253 236 -392 -383 34 -87 -97 605 322 -398 -114 -28 -199 509 874 312 -562 -151 -50 -385 303
2764 303 450 45 -790 -278 -224 104 61 639 -203 -502 -55 60 122 861 564 -338 -281 47 119 183 425 82
2786 82 -562 -274 48 -229 94 214 -147 -482 -333 -123 60 729 571 -53 -251 -373 -76 393 632 349
2806 349 -401 -282 -297 75 483 388 -186 -638 -447 -248 189 869 443 -191 -426 -216 -245 569 740 196 -279
2827 -279 -315 -599 -179 595 571 -227 -157 -400 -612 26 719 51 -283 -297 -228 -216 484 596 16 -81 -246 -393
2849 -393 -83 660 382 -91 -459 -381 -489 69 587 324 -334 -326 -567 -275 364 559 195 -43 -137 -267 82
2870 82 745 591 181 -189 -466 -306 170 454 72 -132 -470 -723 -160 366 238 28 -191 -329 -311 353 410
2891D10r3j55j77m63J42P40O8m09r0l37k61K98M87j32J97k05l94J61L72L06J54
2912F19n06Mo45M21J06L26j21k93q8l49K55L54J49l31J0l3l58M56K59L7j83k8
2934F1l27J59R6L93k63Q8j17j35j19J38K86k19l13J22j39m7L46P8M5q1P6j59p9
2957a10M60j09j36k86K89j24jJ80j4k20m64M22l20O02j79Q7k88j8M23n61L77K09
2979B19k0l62L2K13r4k79N51r7n68J52K99j55K9J08K51l90n4M7k1k21N63k2j37
3002D4K66J1n82RP43j85m87k8L50l97j11P74k26l74J63K46p91N28O77m40m99K76
3024c3J95m37L41N08o42k40L14K1m67L91N52l84n93K08R3m6M45J68m35k50pM02
3046A04j86Q17Kj002j28K58k5n3P82k1j181k37Q03j39N1P20k40q23k7Q90n16L61
$$ plain form
2891 410 317 162 -15 -478 -336 404 472 63 -27 -364 -625 -327 160 28 225 20 -374 -213 159 465 619
2912 619 113 117 -528 -107 -1 325 204 -89 -177 -526 -271 83 232 -99 -89 -122 -480 -24 235 272 89 61
2934 61 -266 -107 -11 382 119 207 90 -45 -164 -26 260 41 -272 -150 -289 -336 10 88 133 52 128 -31 -110
2957 -110 350 241 105 -181 108 -16 -17 163 149 -71 -535 -113 -433 169 -10 77 -211 -229 194 -367 10 219
2979 219 199 -163 -131 82 -12 -291 260 163 -405 -253 46 -109 -80 28 279 -111 -165 -118 -139 -360 203 181 44
3002 44 310 321 -261 -252 491 306 -181 -209 141 -256 -367 407 181 -193 -30 216 -575 -47 630 190 -309 -33
3024 -33 162 -275 66 574 -68 -308 6 27 -440 -49 503 119 -474 -266 -173 -219 226 394 -41 -291 -298 104
3046 104 -82 735 737 -265 -393 -135 -160 -213 569 548 -633 -870 -67 -206 -155 565 325 -498 -525 365 -151 210
3068B10M9qp35M17L67k08J44L57n74p54N11M86O1l55L16o75m58O62O27j51j81
3089A08M62q34n04M85J046k20l76j15m54l88O51O53j69k84k20j5n62Q27M52l09
3109B34l57R4m51n12J344L83o16l33M64n92J50O97m7o54N2K3l97J22J021j88q59
3130d22j42M69l49M32J084n40p87j62N21l75N94N21o52r23L14R1o7O89P05r01
3150A00p88K07L41J09N19L13o95p58J91M27K82J67L18q95m57K70K41J50j0K78
3170C10p21n23O20O76n3k10K22n58l99R57K46j28J6k04j066J65J061K04m29r5
3190I1j04q31M66P02K15o73n0L46r99M26Q99O8m77J75l15n38N88O66m51m00J25
3211g1k11n68Q58P85p18k04J07k19j59P17J32n02o0p1j49K96N41l6m79k33O5k59
$$ plain form
3068 210 259 251 -484 -67 300 92 236 593 19 -735 -224 262 323 -32 284 -391 -849 -187 440 289 108
3089 108 570 -264 -768 -283 763 543 167 52 -402 -790 -139 514 345 61 -159 -174 -736 91 543 234
3109 234 -123 -29 -480 -992 352 735 119 -214 250 -342 -192 505 458 -196 -144 -121 -518 -396 625 437 -422
3130 -422 -564 -95 -444 -12 1072 532 -255 -417 104 -271 323 844 192 -731 -417 -326 -393 296 1001 100
3150 100 -688 -481 -140 -31 488 801 106 -652 -461 -34 248 415 733 -162 -619 -349 -108 42 32 310
3170 310 -411 -934 -314 362 309 99 321 -237 -636 321 567 439 455 251 -815 -650 411 615 186 91
3190 91 -13 -844 -378 324 539 -134 -184 162 -837 -411 488 556 79 254 -61 -599 -11 655 204 -196 -71
3211 -71 -282 -850 8 793 75 -129 -22 -241 -400 317 449 -53 -113 -184 -333 -37 504 468 -11 -244 -179 -438
3233d38N38J31K97n71l51j35N52L8K20Mm68l2K31L26m4K2j16Qm58K26J72q1j36
3256f5J54m33l9J41K39K18j99J13l07q9N51k49L18k00p1l15O7O33l07j93J68o13
3278d78P7L78k39J21k8M30m88j48M20M7J03J37p9m35M7P3K65m3j14p0l27L43J78
3301A70k69J77Q2l20j06J83Q1l8J06J46p6N3m26L27q7K88l1j27j27j73J46K26
3323B05n42K22k9n9k07M52j02j92J61O2N6l5J00k19M06k68N0q2j34M12r3q9j11
3346c6M8j47k91L86K32m47K10K9j32J88O0K32j8m7n7l76J47K75r0k53J54l20j49
3369d02K70L74k1l71M0Rj67O08j06oQ3l93l7N5L56N1j96j04k26j39K26J86R5l5
3393A50k33k08N6M09K0k07K52m05j21L97j59J65J43k90j89k80O58L6J8n9l04j07
$$ plain form
3233 -438 100 231 528 -43 -394 -529 23 61 281 285 -183 -215 16 342 298 320 204 212 -246 -20 152 71 -65
3256 -65 89 -344 -383 -242 -3 215 16 129 -178 -267 284 35 353 153 82 -233 -166 467 160 -33 135 -478
3278 -478 -401 -23 -262 -141 -169 261 -227 -375 45 92 195 332 253 -182 -135 -62 203 160 46 -24 -351 -8 170
3301 170 -99 78 160 -160 -266 -83 -2 -40 66 212 136 189 -237 90 3 291 260 133 6 -167 -21 205
3323 205 -337 -115 -144 -203 -410 42 -60 -252 -91 -29 27 -8 92 -127 279 11 61 -21 -155 257 164 75 -36
3346 -36 12 -135 -426 -40 192 -255 -45 -16 -148 40 100 332 314 267 210 -166 -19 256 166 -87 67 -253 -402
3369 -402 -132 242 221 -150 -110 -101 -268 340 234 228 311 -82 -119 -64 292 343 147 43 -183 -322 -96 90 185 150
3393 150 -83 -291 -235 174 194 -13 239 -166 -287 110 -49 116 259 -31 -220 -500 158 194 212 153 -151 -258
3415b58K45J26j57J47Pl63M1K50k8J57Q1j99j16l09K77K77j9J09n13M7o1P5N97
3438D13m17j37n7m17N24J7K43J82k72l45q7J87L94K12m46Pm23J07M55k36K09k62
3460a49N5j46O7K19q5L5j27o1M1K2N26m7j56l73j59J46M05J94j11m36j83K08k35
3483c50M15L86k53k50K10m70L69K87M2k48k45k7l1K43M49k04k92l38j0K15K66
3504A64J90l10k22k79J90K11Q7L97k03m15l8J44r5L44L32l08n81P0N42J56l01
3525G5J77j96p28L74L66J45j55K4P8p61L72L55O6k97L00k63l37L36N00j71k10
3546E0K66m98k05N72J33l48J82k5k81k09N67J9j88j21q3j63N22K23J4l13k34n9
3568a79o9J7J20N00m53k12R9q4Q0L71J27l75J81j28k4J25L55j28n17J29K54k18
$$ plain form
3415 -258 -13 113 -44 103 110 -253 -212 38 10 167 248 49 -67 -376 -99 178 159 268 -245 -198 -259 -184 413
3438 413 -4 -141 -198 -615 -91 -74 169 351 79 -266 -353 -166 228 440 -6 1 -422 -315 140 -96 113 -149
3460 -149 -94 -240 -173 46 -39 -4 -131 -192 -151 -129 397 350 194 -179 -338 -192 213 407 296 -140 -323 -115 -350
3483 -350 65 451 198 -52 158 -312 57 344 386 138 -107 -134 -165 78 527 323 31 -307 -317 -102 164
3504 164 354 44 -178 -457 -267 -56 31 428 225 -190 -228 -84 -179 165 497 189 -392 -322 220 376 75
3525 75 252 56 -672 -298 68 213 58 82 160 -601 -229 126 192 -105 195 -68 -405 -69 431 260 50
3546 50 316 -182 -387 185 318 -30 152 127 -154 -363 204 223 35 -86 -169 -332 190 413 427 114 -120 -179
3568 -179 -248 -231 -111 389 -64 -276 -177 -261 -181 190 317 -58 123 -5 -29 96 451 323 -194 -65 189 -29
3590b9k48N17k13j39M7J34r4J1L93n61k13K99L97l45N6M46l96l68K53L45n51L47
3612H8K0m73N7L26o0O2PL26n80j66M91K15k63J36K15m08p7L48l00p6L57J48l49
3635D4l13K54R1k65L77j41k35j70P27l48j71M72r6k11k47L87l97j36Q30k78l79
3656b05N5L36l48R7J33P8l31K51j45p6L4L37l35J06M8L7K7j63K42j45j97J93j16
3679h7L2m5J03j22k06J35M8J62J21J29k93l13K25L65j90K05K21o03l05L02P6j3
3701e3J0J58n4q66L57L84lJ40J91n21r4P59k47M2J23k02m60J57M40l06K71o8l57
3724a99J5J02M60l01k34K13l33j82K48L50J9k3k01j79K0K18K39J82k20l78k1q8
3746b93L67M58l96k15k24M6K83K7J48p5k29M9p8Q6L22J46m22j45K17j25J19R8
$$ plain form
3590 -29 -277 240 27 -112 -65 69 -25 -14 379 -182 -395 -96 301 -44 12 458 62 -306 -53 292 -259 88
3612 88 108 -365 -308 18 -42 20 27 353 -227 -393 98 313 50 186 401 -7 -84 264 -36 -112 245 393 44
3635 44 -269 -15 76 -189 188 47 -188 -358 369 21 -150 322 226 15 -232 155 -242 -378 452 174 -205
3656 -205 -150 186 -162 -65 68 146 -185 66 -79 -155 -121 216 -119 -13 35 72 99 -64 178 33 -164 29 -87
3679 -87 -55 -100 3 -119 -325 -190 -142 20 141 270 -23 -336 -111 254 64 269 490 -113 -418 -116 -40 -53
3701 -53 -43 115 61 -805 -448 -64 -67 73 264 -257 -351 408 161 203 326 124 -336 -179 261 -45 226 158 -199
3724 -199 -184 -82 378 77 -157 56 -277 -459 -211 139 158 135 -66 -245 -225 -7 232 414 194 -184 -205 -293
3746 -293 74 532 136 -79 -303 -257 26 53 201 126 -103 -54 -132 -46 276 422 0 -145 72 -53 66 164
3768A64j05q2m67L53m0K29K94j60k73l80L64K40n7J84p0n02k88L62M82P7j54o1
3790A10l32l51O65J57j27m1m5l69N0L62Q8K37j65k88k79r1P81M9j44l70Km46M19
3813a28M92j52q3j93j97k69N81K33J60k39k46l81K94M64p4p5l11j47J86j3M65
3834C67R2p0m95l48J78J19L25J71j86n84L0P8O24J11m7k06m32j17L44M87K6m15
3856E2M9p05M56O0K00L06k97o78J51n9K85M48p4j4j93l42J85K50K02K00k80p55
3878e53J94J57M67k00J85l72m18K21J21M06j6J3m7k80M3L79k49J95k56j60r5M07
3900A42J69m3r6l71L8P8j16N54l28q0j7k95Q2M50mo0j86mj66L13j15J07J25n10
3924c33O2j77L51K20m3r9j22P6j42J90J45P9k0l32J79M2K36o8m6k38j39k5N34
$$ plain form
3768 164 59 -23 -490 -137 -177 52 346 186 -87 -467 -103 137 80 264 194 -308 -596 -234 248 325 171 110
3790 110 -222 -573 92 249 122 81 36 -333 -283 79 167 404 239 -49 -328 -419 362 411 267 -103 -101 -547 -128
3813 -128 364 212 129 -64 -261 -530 51 284 444 205 -41 -422 -128 336 262 187 -124 -271 -85 -98 367
3834 367 459 389 -106 -454 -276 -157 168 339 153 -431 -401 -323 301 412 365 159 -273 -390 -46 441 467 52
3856 52 101 -604 -148 -88 112 418 121 -557 -406 -465 -180 268 194 180 -13 -355 -170 80 282 482 202 -553
3878 -553 -359 -202 265 65 250 -122 -540 -319 -198 208 192 205 158 -122 -79 300 51 246 -10 -170 -265 142
3900 142 311 268 172 -199 -161 -83 -199 355 27 -53 -70 -365 -283 167 163 103 -83 -87 -253 60 -55 52 177 -333
3924 -333 -271 -448 -97 123 80 -19 -141 -65 -207 -17 128 207 187 -145 34 76 312 244 198 -40 -179 -204 330
3947C30r2L6l05l53K45q1J12R7J83j69j35K1M23o2j63k8Jj65J10K84p6k24J57
3970A46k59m1j1J34J83LM3l52J59R3P4j22K00k31J17l8n1k25P5L57m15L03k00
3993e8K1M1M8j82K81j20K45l84J0R0K00k16K77k85O9k06N7J20J07k84K18p2k54
4016b77J51K21L0k43K20j98r9K35K83k81Lj84Q2k65L64K65k46p9kk44J55J16q9
4039h2M2j61M8J08p0L39K77l31l35O7j69K96J57L2j38k91O9J1K03K10j06l41l09
4062d74J83J0M07rk9l67K63K7J15Q4J66l74k39J45K72n1K12k49j4l46K95Q2m7
4085F2O5k6l39q1M30J15K9O5l94mk76M03K11n06L49j98o8q5N39r8j6k48K9j82
4109b24j4L45K49j78k73L3n2J80L02k3l34j35k88K01Q2L90r7l63j04Q2k70M69
$$ plain form
3947 330 238 274 -31 -384 -139 -220 -108 -11 172 3 -132 -111 312 250 87 59 60 -105 5 289 213 -11 146
3970 146 -113 -154 -165 -31 152 155 198 -154 5 98 172 50 250 19 136 98 47 -178 -103 254 -161 142 -58
3993 -58 -37 4 52 -130 151 31 276 -108 -98 -8 192 -24 253 -32 37 -169 -112 8 115 -169 49 -23 -277
4016 -277 -126 95 125 -118 102 -96 -195 40 323 42 45 -139 -57 -322 42 307 61 -18 -20 -264 -109 7 -82
4039 -82 -40 -201 -153 -45 -115 224 501 170 -165 -98 -267 29 186 218 80 -211 -142 -131 72 282 176 -165 -474
4062 -474 -291 -281 126 117 88 -279 -16 11 126 210 376 2 -237 -92 180 129 341 92 78 -268 27 109 62
4085 62 127 101 -238 -319 111 226 255 320 -74 -78 -354 49 260 -246 103 -95 -163 -248 291 193 177 -71 -42 -224
4109 -224 -238 107 356 178 -95 -62 -114 66 368 345 11 -124 -412 -211 -129 261 164 -199 -303 -221 -491 -22
4131b2L48k5j77l69N2M5J88N01k47m81L9q5m4L93J14J31n69kQ0n9J28L41l10l16
4155c46J76j21K61L42r6m26q5J93Q7J87J44r1l34j42J56N0K79K27n64k64J9N14
4177A66qO9R8j4o66R8K04L59j76j86k1j08k18O13j7k29P7j56n76L79K45J55N2
4200A40k39J36l23L22P3J48r9j61j37k08M84J84j28k12%r4l4L04j07q1j3j84k6
4223b55J64J98K04Lm53J82k88Q2M80m6r2k31%l90K23J88M45m47l01P9K7J85J74
4246A31n0j46j41Q9l8J14K40L6n02J97M9j43J85r8J6N6j51K45j11P5J93n53J59
4269a48J41j17M2r6L97m88K4M13k97M13k63K80l97J6K64l86J63K02k50N9k36l5
4291b99K47p6L42k15j32rJ51K26l49J11k42K16j4J61r1k44R1R4n1J89n2j33K80
$$ plain form
4131 -22 326 301 124 -245 -193 -148 40 541 294 -187 -148 -233 -277 116 230 361 -208 -210 -130 -189 -61 280 -30 -346
4155 -346 -170 -291 -30 312 216 -210 -295 -102 -15 172 316 225 -109 -251 -95 -45 234 461 -103 -367 -348 166
4177 166 158 227 325 311 -355 -257 -53 306 130 -56 -77 -185 -403 210 193 -36 41 -115 -691 -312 -67 88 140
4200 140 -99 37 -286 36 109 257 158 -3 -140 -348 136 320 192 -20 -20 -114 -148 156 49 -32 -45 -229 -255
4223 -255 -91 107 311 314 -139 43 -245 -163 317 271 179 -52 -52 -442 -219 -31 414 -33 -334 -255 -228 -43 131
4246 131 81 -65 -206 -117 -155 -41 199 235 -267 -70 -21 -164 21 -77 -61 -5 -156 89 -22 53 246 -307 -148
4269 -148 -7 -124 -82 -178 219 -269 -245 168 -129 284 21 301 -96 -80 184 -202 -39 163 -87 -28 -264 -299
4291 -299 -52 -128 214 -1 -133 -142 9 235 -114 -3 -245 -29 -43 118 27 -217 -126 -32 -83 106 54 -79 201
4314B01j98j35J26O8j32J18k74L9J99K9r0j63K65j01J32k53L50l65J34M3k2l6
4336f5N8K0K8k34J31r5l6K25nJ80l50J08L19j66j50l5M9j61m6M40m12J08pj45
4360b41L98l8M0L3k08j66J46L11Kp6K5j5j94k51J22J34q9l4k43J75m7L15rm9p2
4385c1j94K29n4O2PP3o3j78j48K15K32J9k6l60k00J45M04K74j45k52l9p8k4J76
4409D4L6N0l43r1K7L48J26M3k69n9j92K0L53J28k84P0l49j2K95K59J62m17m3j3
4433a11k18K32L53l6J8m07oJ57R1n7m9NO4k2j00K78j8M8j48k84Q4J72Q2K48j70
4458B06l57k7m4J88K74p3k47r2m6L51j7q0J37j35k2j36n3L89R1l16p8j64O4J98
4482A1Q1J54l25j06JK3L12J05Q5l75m9l72L10J73L2N3L0j78p0J94l0J43l17L6
$$ plain form
4314 201 3 -132 -6 62 -70 48 -226 -187 12 41 -49 -212 53 -48 84 -169 181 -184 -50 -7 -29 -65
4336 -65 -7 13 41 -193 -62 -157 -193 32 27 207 -143 -35 284 118 -32 -67 -18 -179 -225 215 -197 -89 -96 -241
4360 -241 157 119 159 192 -16 -182 -36 275 277 201 226 211 17 -234 -112 22 -67 -101 -344 -169 -216 99 90 41 -31
4385 -31 -225 4 -50 12 19 92 29 -149 -297 -82 150 169 143 -217 -417 -272 132 406 261 9 -30 -108 -132 44
4409 44 80 130 -213 -304 -277 71 197 240 -29 -88 -280 -260 93 221 -63 7 -342 -354 -59 200 362 -55 -98 -111
4433 -111 -329 -97 256 220 238 -169 -175 -18 73 16 -33 -28 36 14 -86 192 174 222 74 -210 -126 46 128 376 206
4458 206 -151 -178 -222 -34 240 167 -80 -172 -218 133 116 36 173 38 16 -120 -173 216 307 -9 -87 -251 -187 11
4482 11 92 246 -79 -185 -184 -161 151 256 341 -34 -83 -455 -145 28 60 113 143 -35 -105 89 59 202 -115 -79
4506g9m00N47j92J73r5Pj22r6J63L80q6j78kj77R9j01J32O8J43k77k6P1n1K45
4530A46m5k95L07k03J62r3J32K67n00L18j77j24K49k6O1j52j22M5p5J05J97j33
4552D4k13J42k66J93J99J75k20l83K94j4K20j15L51m71P5l8j34K89J4l6j19j44
4574a57j5K71j18q6nL9k39L86L2j8R0j06rk57J07L41j41k2P9j98l27L09pn7j3
4599a21J46k42O9J77k0k70L70jk95K60J27j68k30J68%p1K55jj17p9o6P1p6Jk5
4624a38K48r4P3K3k84J40J71j71m7R1MM3j60p9P6r8K36j58P7k2p0%j26L22j17
4649f0j72L15N1N4j72J75j75m9K23j03k25K83M8j42j44K75m22J84j7N1n9NK33
4672A57k21J35J4k00K20m1k8n9J71j7J12j26l39K22q2l7K68k03n2K61j97O1k1
$$ plain form
4506 -79 -479 68 -124 49 -46 -39 -161 -257 -94 286 200 22 20 -157 -58 -159 -27 41 184 -93 -119 -48 -99 146
4530 146 101 -194 113 -90 72 -21 111 378 -122 196 19 -105 144 118 179 27 -95 -50 -125 -20 177 44
4552 44 -169 -27 -293 -100 99 274 54 -329 -35 -49 171 56 407 -64 11 -27 -161 128 142 106 -13 -157
4574 -157 -172 99 -19 -105 -110 -71 -310 76 108 90 180 74 65 -192 -85 256 115 93 172 -26 -353 -44 -51 -108 -121
4599 -121 25 -217 -148 29 9 -261 109 108 -187 73 200 32 -198 -30 -30 -101 154 153 36 -43 -109 -38 -114 -113 -138
4624 -138 110 16 89 112 -172 -32 139 -32 -79 12 16 59 -101 -180 -104 -202 34 -124 -47 -69 -139 -139 -265 57 -60
4649 -60 -232 83 134 188 16 191 16 -33 190 87 -138 145 193 51 -93 182 -240 -56 -73 -22 -81 -76 157
4672 157 -64 71 85 -115 105 64 36 -23 148 131 243 117 -222 0 -82 -119 149 -54 -106 155 -42 19 -2
4695bK06j68J7q8j48L62r3L3R3o43N27j1m2m8k9p2j46J4oM19j64l7n2p1m2M24
4721B33j82K27k60p7j21J54J13l04K72m8k11J8J34j66J07j05j4J10n2K13j51J08
4743bk39J50M1j9q4J79k6J04m08R8R7K83j71j46j07M1J82j93N10l52%J90rk65
4767a46J77J10j66N6l7q3l7R5l25L84k02N5J23N6q6K29j92k12j4J5L21O7r4k10
4791a16P7O7j86K76k25J06j7j76r3K51K15K2j16k32R4r6K00o4J13m00J99m7K08
4814F0j01K36mq6l68l9K00M33k78J93j28k11l2K64l9k57J95k11L6j4M13k15P3
4837A20Km08L31J4K20n9n4l44j09J08K00L10j47k17r1K27N8k6J96j77l44q4O4
4860b10L78j2m7r1k12J00R6J4rQ5j58K22k17J47KM0J88j90j18n9J69k22K19j81
$$ plain form
4695 -2 204 36 53 -35 -183 179 86 119 212 -431 96 85 43 -5 -34 -106 -252 -238 -244 175 11 -26 -78 -149 -191 233
4721 233 51 278 18 -59 -180 -26 87 -217 55 7 -204 -186 -52 -218 -111 -216 -230 -120 -172 41 -110 -2
4743 -2 -241 -91 -50 -69 -153 26 0 104 -304 -206 -109 174 3 -143 -250 -209 -27 -220 290 -62 -62 128 119 -146
4767 -146 31 141 -25 31 -6 -89 -126 -31 -356 28 -174 -119 4 60 -26 203 11 -201 -215 -200 121 188 94 -116
4791 -116 -39 28 -158 118 -107 -1 -18 -194 -287 -36 179 201 85 -147 -53 -149 51 -13 100 -300 -101 -148 60
4814 60 -41 195 191 105 -263 -302 -102 331 53 246 118 -93 -125 139 100 -157 38 -173 -137 -151 262 47 120
4837 120 122 -286 45 59 279 220 166 -178 -287 -179 21 331 184 -33 -124 103 161 135 331 154 -190 -274 -210
4860 -210 168 156 109 18 -194 -94 2 16 7 92 -66 156 -61 86 88 128 316 126 8 -51 118 -104 115 -66
4884f6K10k89J17L32k79k7qk85k2L29r1K94l1k96L3O0J0o2Q8J57J4m50M37k38
4908f3J57k53j93M0M13j60L6K4k49R1O8j27J32K8M14l82L5J4q5P2L4J02m8k5j95
4933a20k5jK4L66l23l03L24j3Q8O6P8j58l27K64l7K01m1o5J6k3p7K14N2o3j60
4958d3p8K9J16J72j36rkK1k67L29j25J73k13m2N5R1l9K0m70K43K06J90j59qk00
4983a46K53j87K43j53j84J37m5J6q5jJ6J3K01k1m3L1j03J76l99J98J98m3k34K99
5007A37k30J82l6J26k38K34j35J44j82K59j67j69Q9J89m46q4L72p1o6j32J46O9
5029iQ8k71L20n5k32J06K36l18MJ31j17J10r6J15j28j6K58jp1k67K31P6j39L5
5053a0K4l40M19j09K98r2k82N5j82K57l2j21M19k19o6q9m3L2K17qnj91R6j88K10
$$ plain form
4884 -66 144 -145 -28 304 25 -2 -10 -295 -317 12 -79 215 184 -112 -79 -19 -9 -71 17 174 188 -262 175 -63
4908 -63 94 -159 -352 -312 101 -59 -23 1 -248 -157 -89 -216 -84 -56 358 -24 11 25 -60 12 46 148 100 75 -120
4933 -120 -145 -146 -122 244 -79 -382 -58 -71 17 83 161 3 -324 -60 -97 104 63 -2 14 -9 -86 128 180 117 -43
4958 -43 -121 -92 24 196 60 51 49 70 -197 132 7 180 -33 -75 -20 71 32 52 -418 -175 31 221 62 54 -146
4983 -146 107 -80 163 10 -174 -37 -82 -66 -151 -152 -136 -123 78 57 14 45 -58 118 -281 -83 115 72 -162 137
5007 137 -93 89 53 179 -59 175 40 184 2 261 94 -75 14 203 -243 -327 45 -26 -92 -224 -78 -9
5029 -9 79 -192 128 73 -159 -53 183 -135 -131 0 -117 -7 -103 12 -116 -132 126 125 54 -213 18 94 -45 -10
5053 -10 14 -326 93 -16 282 190 -92 -37 -219 38 6 -115 304 85 19 -70 -113 -81 136 128 123 -68 28 -160 50
5078E0M7j7q0J49k70J15j3j55K75j29Q9j54L47k88J98J97k80r4P3J41k46K68k97
5101g4J58k9j26J0O5j6l2J69l16K18N0k30N0m9J7j68K77k2K28k06j65K10l58K45
5125i4L49k68m5L1j26N7M1K78m31K18P9N4m42M55R1l33K38M2n32L96%N6p1k64
5149b21J16J2J47J02m9k73K13n6j79J82Jqj24J69n2J4K25l16L10k84M05m81L57
5172B10k1j96j37r1M2J33J99KJ53l76j62K50J45k18L13j88j43k0j14K73l0J04
5194A28J3K0m09N7K24k10K94k25l8k4K15J83k20L5K76o02M01k39J11N3O3j22j16
5217a32L20m9P6j92j42j42R6J60k3j32K24J21k65K04k14J20J64l01M15l63j38
5238a93K78J8o9o2k21L56l60J66M92l43J15j97j80R4K01M8J20l64n8J98j00K19
$$ plain form
5078 50 97 80 0 149 -121 -6 -19 -174 101 -28 61 -93 254 -34 164 361 81 -13 60 201 -45 223 -74
5101 -74 84 55 -71 -61 4 -12 -44 125 -191 27 77 -153 -103 -152 -135 -303 -26 -48 180 -26 -191 19 -339 -94
5125 -94 255 -13 -58 -27 -153 -96 -55 223 -208 10 89 143 -299 156 247 -86 152 194 -338 58 58 114 43 -221
5149 -221 -105 -93 54 156 107 -166 47 -9 -188 -6 -5 -13 -137 32 -20 -6 219 -97 213 -71 334 -147 210
5172 210 189 -7 -144 -235 -193 -60 139 141 294 -82 -244 6 151 -67 246 58 -85 -105 -219 54 24 128
5194 128 141 161 -248 -191 33 -177 117 -108 -146 -170 45 228 8 43 319 -283 118 -121 -10 43 106 -16 -132
5217 -132 188 139 215 23 -119 -261 -165 -5 -28 -160 64 185 -80 124 -90 30 194 -107 308 -55 -193
5238 -193 85 103 34 -28 -249 107 -253 -87 405 62 177 -20 -200 -106 95 143 263 -101 -159 39 -61 158
5260A58j58K3k58K11O6j13K95j11q3j39R9R2m9J59j25j04j52K22j6j44L84l58
5282a01P4OJ2J12j03K31j73k57o0K67Q5m5r5j04L16k43L67m17J66N4m6j79K10
5305G7J80k21j48K37k27J1K39k18m7j26K37n4K8J14N4j14j30J0J17j52O1K37l00
5328a35L18j29j15QK19j42k21J99J04j31k4JK37j01k11K1j6M43k37j28o0n0J18
5351c2l12K12l1R1m1L17J9mk49m3M8J99j87j40M1J6J28k13jmR6j00j27N10k69
5376g6J91p6L8r1O8o8JN8j30k00K18J09j46K38l53K35J7k51P5L12r5l25J41r8
5400b08J36k36M43k93K09jp0l9M7J0j33L3j35K68l26K22J18j05p5L50k63j6J78
5423A14k04J03j62P5K8j05K63Mj14j96J2K42p6J41k9j75j0Q1j13K15j24J0j9j10
$$ plain form
5260 158 0 23 -235 -24 42 -71 224 113 30 -109 -10 82 33 192 67 -37 -189 33 17 -127 257 -101
5282 -101 -27 -21 -9 103 0 231 58 -199 -259 8 93 48 -47 -151 165 -78 289 -128 38 92 46 -133 77
5305 77 257 36 -112 125 -102 -91 148 -70 -117 -243 -6 -60 -32 82 136 22 -108 -98 19 -133 -72 165 -135
5328 -135 183 54 -61 -53 166 24 -197 2 106 -25 -49 -48 189 88 -123 -102 -118 325 88 -40 -100 -150 -32
5351 -32 -344 -132 -163 -72 -113 204 223 219 -30 -73 -25 174 -13 -153 -112 -96 32 -181 -182 -186 -90 -190 -317 193 -76
5376 -76 115 39 77 -14 54 -14 -13 45 -85 -285 -67 42 -104 134 -219 16 33 -218 -143 169 74 -251 -110 -208
5400 -208 -72 -308 135 -158 51 50 -20 -59 -12 -2 -135 -102 -237 31 -295 -73 45 -60 -135 215 -48 -64 114
5423 114 -90 13 -149 -74 -46 -151 112 116 2 -194 -182 60 -16 125 96 -79 -89 -8 -121 94 -30 -20 -39 -149
5447a49K22n8p7J06J29k03m9L28j43M0o6K5j31o7J72k13N43n79k2J18J89j35J87
5470A67l6Jj95L6j36K61p6M3j76m4R4R5N4j75N9%j30J31K23l2j48J36k9l09K9
5495a57L54k64j55L77k61o2L11J3k35L11r8l02J95k1L80k18k36j91L13j90J75
5516C9J63l31m8M9J04p8K51j22R9k73J5J62N3j66nK72m52J21K78k00K33k19k92
5539c47J06J40L35j46k6pj50J65l1j4J31j4j00k56p5J83K08r6o0r7Q7J23K1j8
5563F2J0k1k21j78K08K75l65L32P9l86J98j89L29q8k44J59k18L30K47l36J24j34
5585b7j2L7J23p7O0k12P0n2k58L98k46R7O0M4q1Q6J18q1p4J4k3k2j45L71P6l94
5611a50N4J17j52J28N9k9Q2j91J64k40J53q8J31n4j50J57kKM4k9k02J67j28M28
$$ plain form
5447 -149 73 15 -62 44 173 -30 -79 249 106 146 80 105 -26 -93 79 -134 409 -170 -192 -74 115 -20 167
5470 167 131 132 -63 -27 -163 98 22 65 -111 -155 -61 34 88 -87 -28 -28 -158 -27 196 164 16 152 123 -186 -157
5495 -157 197 -67 -222 155 -106 -168 143 156 -79 232 134 -168 27 6 386 168 -68 -259 54 -136 39
5516 39 202 -129 -177 -128 -24 -102 149 27 126 -147 -132 30 83 -83 -88 184 -268 -147 131 -69 164 -55 -347
5539 -347 -241 -101 234 88 62 55 -95 70 39 25 156 142 42 -214 -289 -106 102 6 -54 -151 -64 59 80 62
5563 62 72 51 -170 -348 -140 135 -230 102 181 -205 -7 -196 133 45 -199 -40 -258 72 319 -17 107 -27
5585 -27 -39 -2 121 44 104 -108 -38 -90 -348 50 -196 -99 -39 5 -76 10 128 47 -27 -13 -36 -58 -203 168 244 -150
5611 -150 -96 21 -131 -3 56 27 109 -82 82 -158 -5 -93 38 -16 -166 -9 -11 -9 35 6 -196 -29 -157 271
5635B71l39O2r0J33p0R2o2l4J97L3m1j41L6Nm9k19J81j07K1L92l36J31K51k23
5659I4j43O6K08j32J81l86P6o0J17j4K1k45K52l94N11j63Nj01R4Q2j49J51k73
5682b02K76j9j26J53P4l59J03K18j23O1j6k23L6K45j15o9J15j90K15O1K6r4j3
5705C4R9J4k97Q2J09l5K3r9J75M7k06K24k93J3K85k85N1J39J77j20J62j61j7r1
5729C0j61J9o6J90k8Lj51L2R2k5J20L5K48l92j63K68j60J72j29Jj73L12k19L09
5753A64PJ45k83j0j04L74l43j06J60j37K40k08J12K20k52J04j08J72j3j07pj38
5775a18n4P6K22q5J00l46K96q4o6J5J92N9N5j81l21L65k05J11L53l47k09J70j45
5798a47K36K24k72m4KJ04j1M9N8o4k82q7K78k5N9m8j6Q3k52K96j97J82K40m27
$$ plain form
5635 271 -68 -6 -96 37 -33 59 -3 -37 160 193 152 11 47 52 3 -216 -35 -142 -121 271 -65 66 317 94
5659 94 -49 17 225 93 274 -112 -36 -96 21 7 28 -217 35 -359 152 -11 -6 -107 -13 69 -80 71 -202
5682 -202 74 55 -71 82 156 -203 -100 118 -5 56 40 -183 -147 98 -17 -86 29 -161 54 115 141 47 34
5705 34 133 147 -150 -68 41 6 29 -70 105 152 -54 170 -123 -110 175 -110 -59 80 257 137 299 138 121 30
5729 30 -131 -112 -178 12 -16 -13 -164 -132 -40 -65 55 90 338 -54 -217 51 -109 63 -66 -65 -238 74 -145 164
5753 164 171 316 33 23 -81 293 -50 -156 4 -133 107 -101 11 231 -21 83 -25 147 134 27 20 -118
5775 -118 -172 -96 126 41 141 -205 91 7 -59 -44 148 207 262 81 -240 125 -80 31 384 37 -172 -2 -147
5798 -147 89 313 41 -3 -1 103 92 141 199 135 -147 -234 44 19 78 30 14 97 -155 141 -56 126 366 -61
5822f1q0J62j69M9J50j54o8R0j33J58j84N14l24RK22l95J89J18N9k03Q2k98K97
5845C0j66K53k23J98j7j95K11n9o7K39m48J47J89K5j35j99J19j82m2J06K70O5
5867A19l05q4K16J34m6m3J96k34O5m3K7n1K73J79o10j8K82p4J37P0k93k7P9L8
5891a3o3L23o8j51Nk50K89k91K24O8L2k61r4P1M39r7j00k0m05M23J99k61J98k79
5915h2n0J58l1N6J75k94J83k00R3Kj20J37K13k14j89J56j25j72M58mr8l82K95
5938c5J49n7j55N9J71k76K06j2J39j61q5J58k05m4J28K15l77J35j10L16k36L0
5960d7l0L5j48Q6K93j71k20L18j82J91l73L26p9K25k78r3Jo7J58K85j44mj87j49
5984b54L14j28L3O0q9J0l6o1M8M5K38m02K17j20N0K48l34p6Lp4K67J26M7k17K30
$$ plain form
5822 -61 -141 21 -148 -99 51 -103 -171 -81 -214 -56 -240 274 -50 -41 181 -214 -25 93 152 -51 31 -267 30
5845 30 -136 117 -106 92 75 -120 91 32 -35 204 -244 -97 92 117 -18 -217 -98 -280 -322 -216 54 119
5867 119 -186 -270 -54 80 34 -9 187 -47 18 -25 2 -49 224 403 -207 -225 57 -17 120 190 -103 -130 -51 -13
5891 -13 -76 247 179 28 33 -217 72 -219 5 73 105 -156 -250 -179 260 163 63 43 -362 61 260 -1 197 -82
5915 -82 -132 26 -5 51 226 -68 115 -85 8 10 -110 27 240 26 -163 -7 -132 -304 154 150 52 -330 -35
5938 -35 114 57 -98 -39 132 -144 62 50 189 28 -57 101 -104 -148 -20 195 -182 -47 -157 159 -77 -47
5960 -47 -77 -42 -190 -104 189 18 -202 116 -66 125 -248 78 -1 224 -54 -147 -146 -213 -55 230 86 82 -105 -254
5984 -254 60 -68 -35 25 -64 -54 -90 -151 -103 -58 180 -222 -5 -125 -75 173 -161 -237 -234 -308 -41 85 132 -85 145
6009A45j59k14J72K48l6j70j83M9m6P8l5K91k40m7L93l15J7j01L3L4K64n3l8j28
6033d1J29j01j9PP3j61O2M1O7j6q2J13j04r2J53j54K23p4K34l43J00l08M58j01
6057F4j52J22j78K55j08J34k26J99k75K93j39RJ3k0k3k43L45k43k7J07J34Q5j32
6080fJ3J01J84k40K89l88m3J39R0L7k29J46k97r7J56k48N42k15J20k33J18J49
6102H8k36K86j65L1Mp9N8j50L1P2k50N4L7K23O8k01J16j65J38J1rK43p4q3Po7
6128a2J77l2p8k9j16K56m69K09P0J40r5j01l6j85K41j8J60j61OQn4K54k79K48
6152A04j77n3O3q4K21j18M7k48q8L15j65K68j52j69J53K72J55k83J73Pl86J27
6174a8N8p8J13M4o4j44Qk1N8n4%R8P7k19K88k20J0K20k53j98K26Pl8R5J12j7m41
$$ plain form
6009 145 -14 -228 -56 192 156 -14 -197 -148 -194 -116 -151 140 -100 -147 246 -69 -52 -153 -120 -86 178 125 87 -41
6033 -41 88 -13 -32 -25 48 -113 -51 -10 57 41 -41 72 -32 -124 29 -125 98 24 258 -85 15 -293 165 64
6057 64 -88 34 -144 111 3 137 -89 110 -165 128 -11 -2 11 -9 -32 -275 70 -173 -200 -93 41 126 -6
6080 -6 7 108 292 52 341 -47 -90 49 139 176 -53 93 -204 -301 -145 -393 149 -66 54 -179 -61 88
6102 88 -148 138 -27 4 8 -71 -13 -163 -132 -60 -310 -256 -219 4 72 -129 -13 -178 -40 -29 -38 205 131 48 55 -12
6128 -12 165 133 55 26 -90 166 -303 -94 -24 116 21 -80 -116 -301 -60 -78 82 -79 -73 -65 -119 135 -144 104
6152 104 -73 -126 -63 -147 74 -44 3 -245 -333 -18 -183 85 -67 -236 -83 189 344 61 234 241 -145 -18
6174 -18 40 -38 75 119 55 -89 -81 -102 -44 -98 -98 0 77 -142 146 -74 -64 156 -97 -295 -69 -62 -100 -5 107 90 -351
6201c51J82Q0L0l9J11j72l5Q4L31k46L4O6k20J01R0qJ45k36J66j44l9K75k70j53
6225b18J62L8j7Q2pl2J3r0JM3K8J29j13J23m21M79k20P6J49l4O7q9j57J8K38k90
6251d2K1LP3l70K86R0J38o3N4k11J86o3J76k82M0j28J25k12J07M2R9k69K2K28
6275E0M7k49L11p9q7k5j06K3J67j88J27l06L77J36K5k57MK6j84K9J41R0L3n0l07
6300b52K66O1J8J2jj44j63J61qk0m5m8J72L4m3J12k29j97L24j35J5k4K42k93K19
6325C4m1j6j54J23P6j36J19O5j46J49j31J85k59J74j16j4o2K98j09j1qJ35k47
6348i2J89j88K45j71q7K33J2j87R9l6Q6j62J13J5lk16R6J43k56m1J03J73R6k88
6372a24J61Ol6J67j14j29J07m0k07J97J10P2k63J57j82J90j96K76j82m0m6J83
$$ plain form
6201 -351 -169 -89 -59 -98 13 -159 -194 -110 221 -25 9 75 -145 -44 46 38 183 -53 113 -31 -70 205 -65 -218
6225 -218 -56 -18 -35 47 40 8 21 -69 -68 -25 3 132 19 142 -279 200 -20 56 205 171 238 149 -8 10 248 -42
6251 -42 -21 -18 55 -315 -29 61 199 136 190 -21 165 102 278 -4 36 -92 33 -179 -72 -30 69 -200 -178 50
6275 50 97 -152 159 80 -7 -32 -138 -115 52 -136 -9 -315 62 198 223 -34 -30 -4 -188 -159 -18 72 105 55 -252
6300 -252 14 75 93 105 104 -40 -203 -42 -50 -70 -115 -163 9 43 0 112 -117 -314 10 -125 -110 -134 108 -185 34
6325 34 -7 -23 -177 -54 22 -114 5 70 -76 73 -58 127 -132 42 -74 -88 -150 148 39 28 20 155 -92
6348 -92 97 -91 154 -17 -104 129 141 -46 53 17 103 -59 54 69 66 -150 -54 89 -167 -208 -105 68 164 -124
6372 -124 37 43 7 174 60 -69 38 -2 -209 -12 98 170 -93 64 -118 72 -124 152 -30 -70 -116 67
6394F7O8j36j22Q8j66L37l24K41j33J91j56Q6J2k8J42j62oj51K99j62l2J06l03
6417b44M13k08j80J28LJ55p6nK7n4n7j23P7j60L35J77k65L2Q9p3k3M7j92O7m2
6442a52L23j74J9m2L4j70J71J10l29K10j58J70L1k10pK42p2K06q4k63K63j67n1
6465a00J9j3p1M34m37J33j12P4l0K36k13J9J42k29J39J35rk3l7l86M10j07J37
6488A11q8J07k21M4j81J65K41l70K10j27L25k25J14M4k02j8m6J06JJ10j85K96
6510B11j9l45K17pm33L99J04l8l40J12J28r4J71k16k6R3J95p4J57k17qR0j00O1
6534B1L9j11j06L6L05j06j59m5K0J18k24K12l4J69j47M2J21k19R2J62k47J41k9
6557E1j1j8p9j5l9L22k17J47k93M39n75M52j39k1J89j10J3oL0k29L5P9O6jJ3J9
$$ plain form
6394 67 135 -1 -123 -35 -201 136 -188 53 -80 111 -45 41 53 25 167 5 -1 -152 147 -15 -47 59 -244
6417 -244 169 -39 -219 -91 -88 67 -9 -14 13 -41 -98 -221 -144 -304 31 208 -57 -25 64 -9 -32 15 -177 -110 -152
6442 -152 171 -3 16 -26 8 -162 9 119 -210 0 -158 12 43 -167 -174 68 -4 202 118 -145 118 -49 -100
6465 -100 -81 -94 -165 269 -168 -35 -147 -73 -103 133 -80 -61 81 -148 -9 126 117 94 57 -329 81 -26 111
6488 111 23 130 -91 -47 -228 -63 178 -192 18 -109 216 -9 105 149 -53 -71 -117 -11 -10 100 -85 211
6510 211 192 -153 64 57 -376 23 127 89 -251 -139 -11 -105 66 -150 -176 -83 112 38 195 -22 -30 60 -40 21
6534 21 60 -51 -157 -121 184 78 -81 -126 -106 12 -212 0 -34 135 -12 30 151 -68 24 186 -61 80 51
6557 51 40 22 -57 -72 -111 211 -6 141 -152 287 -288 164 25 4 193 83 96 90 120 -109 -74 5 71 70 83 102
6583A02l25L58q8N9j28j22L05p8m4k60K46m3R6j63J83r8K57k38j34L7Rj28P7L13
6607A93l19R8Q8j71Qj15K47K1p7R3n7J37j25m6J24l94K8K42Q1q3J21k02L24k23
6631gK50l16l0J66j78J25LK89j74Nj91K33l08L37j85p4J54k63J58j90J76K7m9
6654d2m5k7O0O2m0%M0r8n3KR3k3N9K83k98j22l6J57L9j94J16M3j95K59Q7j44k6
6681d3J54q6P8L4j10n5j26K82k10J51j86J94l10J20L1r5L1K17j97j0J88j38Q0
6704fJ04j10K12j50q6M5j39J73m7P0n8MJ32l96K02O3P3Pk55P8Q8K6Q3j40j5M8
6730Fk9r6j21K25J8l6N5j68J37l8R0k15Q0J39k22M2Q9o6K04m85L05m8L49J21l78
6755d2M3k4J59k03K42j76j25J00j81P0J08N7m7r3M12k41O4k42l4KK04j05K16j40
$$ plain form
6583 102 -223 135 47 106 -22 -144 161 83 39 -221 25 -18 78 -85 98 0 257 19 -115 -78 -69 -197 -120 193
6607 193 -126 -28 60 -111 -103 -218 29 50 -27 66 9 146 21 -25 99 -295 -267 -25 56 -27 94 -108 216 -7
6631 -7 243 -73 -103 63 -115 10 13 302 128 133 -58 175 -133 204 19 -55 99 -164 -6 -196 -20 7 -42
6654 -42 -87 -114 -54 8 -32 -32 8 -90 -143 -141 -48 -71 -12 271 -27 -149 -185 -28 11 -183 -67 -24 -219 40 127 -17 -43
6681 -43 111 25 103 137 27 -28 -154 128 -82 69 -117 77 -233 -113 -82 -177 -146 71 -126 -136 52 -86 -6
6704 -6 98 -12 200 50 -36 9 -130 43 -4 66 8 12 144 -252 -50 13 86 93 -162 -84 4 30 113 -27 -42 6
6730 6 -23 -119 -240 -15 3 -33 22 -146 -9 -47 43 -172 -92 47 -175 -133 -44 -110 94 -391 -86 -134 215 336 -42
6755 -42 1 -23 136 -67 175 -1 -126 -26 -207 -137 -29 28 -19 -112 300 59 123 -119 -153 -151 53 -52 164 24
6779B4J66j47j10p5p3Q3J19MK6NK10j65k24J71o9O7l9l0J83j70J0nOQ8j28OO6
6806aK54m41L03j25k1j20J92K65m68J50j94K17J64K07l07q4N2M0O8l39R8J55j28
6829f3j68J85N6O2n6J5p0L45l39N7J17j07r1J25J9j02%KJ52k1j13J12j46J28r0
6854IR3j88O5k72J86J53J9k52L93l30K20j59j2k3J80l2j66k5K40j79Q9p2j35J99
6878Aj62J91j29K60k7j34k31K30N4oN6O6p6Q9J3j27j17O5j73J24j57K47N9r4N6
6903G8r1J01P4j67k56M22k61J44l73L57P6j21O0o0j12NK35j78m3J7J86j12J6J48
6927A45k20k23K51P4K41j74N7j11K9j42J72j27K1k1j26L90j4l62J40k36K76j65
6949a25P8Jk9k2N0Q5r5L6l2M5j8j7NJ60j83MJ76M4k45O8L28j55k38R8j1J31Km3
$$ plain form
6779 24 190 43 -67 -142 -215 -132 -13 -9 17 22 232 67 -157 14 -55 12 -27 -57 126 -44 -34 -39 -33 55 -73 -67 -1
6806 -1 253 -188 115 -10 -31 -151 41 306 -162 -12 -206 11 175 382 75 -9 43 83 151 -188 -90 65 -63
6829 -63 -231 -46 10 72 16 31 -39 306 -33 24 141 34 -57 68 87 -15 -15 -13 139 118 5 117 -29 99 9
6854 9 102 -86 -21 -293 -107 46 65 -187 206 -124 96 -63 -75 -98 82 50 -116 -141 99 -80 9 -63 -198 1
6878 1 -161 30 -99 161 134 0 -231 -1 53 47 103 169 93 182 195 68 -49 16 -157 -33 -190 57 116 22 78
6903 78 -13 88 162 -5 -261 161 -100 44 -329 28 104 -17 43 -17 -129 -124 111 -67 -110 -93 93 -19 -3 145
6927 145 -75 -298 -47 27 268 94 151 40 69 -73 99 -28 -7 -28 -154 236 222 -140 0 -236 40 -125
6949 -125 -47 -46 -75 -97 -47 38 -57 -21 -53 -8 -26 -43 -38 122 -61 -57 119 163 -82 -14 314 159 -79 19 8 139 141 98
6977I8J1q9j18J34k3q2J93j05j08j1n1R2j7R8j19J34J33j76j05R1M8J4J6j06j63
7002b11K74L1p0n8r2L63m00J06k5l6J03n3J42nOJ07l66K72l0j84J02k3J29J34
7026B16l6m29J52Q2Q2N7j29J88j93n1J70k09J48p1J79k16l3R2J64k79J59r4J7
7049c4j30L2J97n3L0j68nj60J04M14k05l3JJ15k34K69k61j2m6J44J23l16N0J59
7073a9J19R2j32j89J12r8J91J02j57n3O9K1o1R1K5N4l20J47J48r3j64J76lj19
7097f1J6J48p5R3k92Q9j8N4j9R1K2kPq9K55j53o0J3j10J10q8j55k3K89J77l53
7123a34L49j18j21r3L2o1L25l3j32q0Q1J21k33K32k83J4q9J07K34mr8PL1o8J19
7148A05k54J03r4O0n8K46n8J62j19j31J6k22J72J54j06K6m5j48K09j66K77nm2
$$ plain form
6977 98 109 20 -98 36 13 -69 124 19 -89 -100 -151 -59 -76 22 -97 37 170 -6 -111 -20 28 42 58 -48 -211
7002 -211 63 94 24 -34 -126 237 -163 -57 -82 -118 -15 -68 74 69 75 182 -184 88 58 -126 -24 -47 82 216
7026 216 180 -249 -97 -15 67 124 -5 183 -10 -61 109 -100 48 -23 156 -60 -93 -1 163 -116 43 -51 -34
7049 -34 -164 -132 65 12 42 -126 -131 -291 -187 227 22 -11 -10 105 -129 140 -121 -133 -179 -35 88 -228 -178 -19
7073 -19 100 192 60 -129 -17 -115 76 178 21 -32 37 58 -3 88 113 167 -153 -6 142 49 -115 61 58 -61
7097 -61 -45 103 28 121 -171 -82 -100 -46 -65 26 48 46 53 -36 219 66 6 19 -91 19 -69 -224 -247 42 219 -134
7123 -134 215 97 -24 -117 -85 -146 179 146 14 -66 15 136 -97 135 -148 -134 -223 -116 118 114 16 23 54 -14 105
7148 105 -149 -46 -140 -80 -138 108 50 212 93 -38 -22 -244 -72 82 -24 2 -43 -191 18 -148 129 124 82
7171H2j36lK81j82O4j5j44J47j17J10l7k7L1j60J65q3L14k83j20N1Q6K1j57J14
7195BJ99k45J62k62K05K5r5j00p0R2Q8r7J71K5k72K39j54K10j89p2J96j39LK19
7219A41j37J54k33L3k1J83j28M2r7O7l0O9M6m3k9j03O0%N1J39j81J09q4j08J3
7244h7Q9J07o0j40o1N3Q9J41R1k62%m4J70J2q6Rj31J17k23J89N8j24K67m6l1p1
7270B6k9k60K56J3k9L5l2k4J07O3j39J67k99K94j87k4j6K94l89m4K85j69M6l7
7294i2r0J99j88K00l0QJ40j51r1K4M2J33j40j40j5K83j67O9k25J04K08o7Q2j09
7318a3K14l30K52K3m07j82M30P9n4Mn2o9j45J45K78R7j36kN0k24L5J2o9J17J59
7343B12j21n0K19k48k10J53r4N21k34k17J11m5k9J13r2r4M5m4R3j6o7p1p6K50
$$ plain form
7171 82 -54 -57 224 42 106 91 -53 94 -23 87 50 23 54 -106 59 -24 290 7 -113 -62 24 45 -112 2
7195 2 201 -44 118 -144 61 86 -9 -109 -179 -87 1 -96 75 100 -172 67 -87 123 -66 -138 58 -81 -78 141
7219 141 4 158 -75 -42 -63 120 -8 34 -63 4 -26 43 89 46 17 -86 -26 -26 25 164 -17 92 8 -100 -87
7244 -87 2 109 49 -91 -152 -99 -10 131 222 -40 -40 -84 86 98 12 21 -110 7 -216 -27 31 -93 174 128 97 26
7270 26 -3 -263 -7 6 -23 12 -20 -44 63 126 -13 154 -145 149 -38 -62 -78 216 -173 -217 68 -101 -55 -92
7294 -92 -182 17 -171 29 -1 7 147 -4 -95 -71 -29 104 -36 -176 -191 92 -75 -6 -231 -127 81 14 96 -13
7318 -13 201 -129 123 146 -261 -443 -13 66 12 16 -36 -105 -250 -105 173 270 134 132 182 -42 -7 5 -64 53 212
7343 212 91 41 260 12 -198 -45 -139 382 148 -69 42 -3 -32 81 -11 -105 -60 -104 -11 -27 -94 -165 -241 9
7367IQ3L3m7j29J00p2J88k78m3J86j08R1J39J52k69j06r5J33L5k11K13j8q3J42
7391D5oN7n8m2q5N9l3m9l6J49q4J61M7j58pJ32r8J9r3O0j99K85j48m9k5N2j02
7418b06J09nK67J3k88M31l52J52m0k57p1N03k81j36K08j29N2n3J64k4k05j22J96
7441g4k5j12J49JJ72J33k99J00k09L6K54r4Mm4P8j83N2n8M64n61N22m44L5J58
7465E5j03OO6J63l01J98j44l4l1K7J47o5k19K87j6r1J61N3k42P7P0p5l2N3k20
7490b10K90p3j2j8j23J04j20LK38k3L2J46l72K70L0k45J74k16O2k04L43l53K28
7513d9J82n0k13P2K13Q1l77O8m3jJ11l32L90R1k64J28m5O3L9j13P1j04K7j71K53
7538B7j44J08r1J03j44Q4R3j94K31q3K62m01K77p9q4L10l29n0K22j25R5j48pP5
$$ plain form
7367 9 92 125 78 -51 49 -23 165 -113 -156 30 -78 13 152 304 35 -71 -166 -33 2 -209 4 -14 -97 45
7391 45 39 96 38 -4 -89 -30 -63 -112 -148 1 -83 78 125 -33 -40 92 -6 13 -80 -20 -219 66 -82 -131 -156 -104 -206
7418 -206 -97 -102 165 178 -110 321 -31 121 81 -176 -247 256 -25 -161 47 -82 -30 -83 81 57 -148 -270 -74
7441 -74 -99 -211 -62 -61 111 244 -55 45 -164 -128 126 32 36 -8 70 -113 -61 -119 345 -216 306 -138 -103 55
7465 55 -48 -42 24 187 -114 84 -60 -94 -125 -98 49 -16 -235 52 36 -55 106 159 -83 -6 64 -11 -43 10 -210
7490 -210 80 7 -5 -23 -146 -42 -162 -159 79 56 88 234 -138 132 162 -83 91 -125 -63 -267 76 -277 -49
7513 -49 133 83 -130 -58 155 236 -141 -73 -116 -117 -6 -338 52 143 -121 7 -38 25 64 -49 22 -82 -55 -226 27
7538 27 -117 -9 -100 3 -141 -57 36 -158 73 -10 252 -149 128 49 -35 275 -54 -104 118 -7 88 -60 -67 8
7562Ho8P5J26K08n49J95r5J9P7QJ03j29n3K06k31J01K60j49j26L2R9r9R7P8k66
7587g3j4Q1j27L32k98J89l1p9J97j19l4K71l42L04k92j5J21j18R8L7k43j23J66
7610a12L59j30Jn5r4k21M19k01j55J36k06K62M7N6k29K2J07L3N6J60m78L53j27
7633Cj22P5J21j47K61K4j42p6j45Q9j31K72j48J08k60L20k36J80q6l8R9n8J17
7656H0l2m06K08J43r7J62k45K56J01k30llj76L95l55K79j01M4O5j64R5J79k85
7679i0Q8j7Q1O9k18K22k37J19J1k89K76N6J02j99K05j39J4Jq1L7r5J89O5k19o5
7704a14R7j32J45k13J24J01K9K34k84L38l46P1k16l7M1m7K42Q9k07K66j38K8l
7727F8r5p1J78J70k52K65l70K4L3J76k55J08k31L15k03J0m0L40k00J2j0J61j16
$$ plain form
7562 8 -60 15 141 349 -200 -5 -100 -81 -4 4 107 -22 -75 131 -100 1 261 112 -14 18 117 18 115 193 -73
7587 -73 -87 -6 -133 199 -99 90 59 -20 177 58 24 295 -47 257 -35 -50 71 -47 51 88 -155 -278 -112
7610 -112 247 117 118 63 -31 -252 167 -34 -189 -53 -259 3 50 106 -123 -101 6 39 95 255 -223 130 3
7633 3 -119 -44 77 -70 191 215 73 -3 -148 -59 -190 82 -66 42 -218 102 -134 46 -40 -78 21 -37 80
7656 80 48 -358 -150 -7 -104 58 -187 69 170 -60 -63 -66 -242 153 -202 77 -24 20 85 -79 16 195 -90
7679 -90 -2 -19 62 131 -87 135 -102 17 28 -261 15 71 173 -26 179 40 54 55 -26 11 -84 105 170 -49 -114
7704 -114 -17 -149 -4 -217 -93 8 37 271 -13 325 -21 50 -166 -203 -162 -209 33 122 -85 181 43 71 68
7727 68 -27 -98 80 250 -2 263 -107 -83 -50 126 -129 -21 -252 63 -140 -130 -170 170 -30 -18 -28 133 17
7750A7%m1R5mj33n6K22j13n5k0j25K03r7M2J92n3N7j73K59k43m0L11k66Q4o9J52
7776A46j87O4k66K41J68r3pN8r3j2k62K99J03o7j18J2J18j0l99K00Q5j79K30P5
7800A06k86J82j93K13Q5j06J36k12j16L34j12j35j11K94p2P5K23p8k57J17o3j29
7822a05J48r5K04k1j45K23j88o0K38k90J03O0o4o2J70m19K37k0J53r5M5lOR7q9
7847B8KJ07k35l0L6j20L16k38J78P6l09J11Jk8M0j0K82j76J1j56r3J40J47RJ09
7872A98m31J30J72R9k44K10j34M1j08l7Q1O0l8Q0l5j65K42j87K22j58j07J53j9
7895B5N3j63o4K39j61O4J8KN6j47J57k98K07p5J26o1Q3j56M8J2LL0L4J6K1J43
7921B12r4k21n0K20RK5K2m8J17j67J9j25m3J89j4M8j88p8J05J39k19K67M6k39
$$ plain form
7750 17 17 -24 71 67 -66 -122 100 -13 -68 -88 -213 -10 -107 -65 127 74 131 -42 217 -26 -66 245 -21 63 -6 146
7776 146 -41 23 -243 -2 166 73 66 124 31 19 -243 56 159 92 -26 -14 104 94 -305 -105 -20 -199 31 106
7800 106 -180 2 -191 22 107 1 137 -75 -191 143 31 -104 -215 79 7 82 305 227 -30 87 24 -105
7822 -105 43 -52 152 131 -14 209 21 -39 199 -91 12 72 8 -54 116 -303 -66 -86 67 -28 17 14 20 117 28
7847 28 30 137 -98 -128 -92 -212 104 -134 44 120 -189 -78 -77 -105 -65 -75 207 31 42 -114 -207 -67 80 89 198
7872 198 -233 -103 69 168 -76 134 0 41 -67 -104 -23 37 -1 79 44 -121 121 -66 156 -2 -109 44 25
7895 25 78 -85 -149 90 -71 -7 11 13 69 -78 79 -219 -12 -87 39 -22 61 -95 -47 -35 -32 -2 32 48 69 212
7921 212 118 -103 -153 67 76 101 123 75 192 25 44 -81 -124 65 51 99 -89 -167 -62 77 -142 125 171 -68
7945f8K27k40N9j49N8n6K13k89K04K0j03R4j17K27j61J37q9n0J46j04o2l7P2k3
7969i1J39j63M64l35mk62l0J91K26Rl42K38M4j78J34K23l27O2j9K31l93J51k4
7992e6J57j7k25L5J40j21m3Q3N2j94J40O7J13j52J16j15O5j33P3l3J37k15nL15
8016A84k95J83m4k58K22P4R1n3r1j81J53L38n14J98j16P7K58k99J11J3j35QQ0
8039Dk05M5J26j1r5J20PJ45k32J07J59l67K51j10kp6kJ3J89j76M6K9K09l28N1
8064a03J15j51O5Q7j71K23O6Nj96j37M20k12N0j61J18n6L1l50L96J49Qq1j31q7
8088a03J9k95L17L0L3M9j87J06L3o0M7m4J14J95k13M0j67K85k75k6K66j28k1j2
8112CJ23J9j01jo8m3n8K67k4o3k34L37k35R3j95K03M7k02J48lp5J91K9j88o9j3
$$ plain form
7945 -68 159 -81 -22 -171 -113 -169 44 -245 -41 -21 -124 -30 -147 80 -81 56 -33 -83 63 -41 -103 -140 -68 -91
7969 -91 48 -115 349 14 10 -252 -282 -91 135 144 -198 40 84 -94 40 263 -64 -2 -21 210 -183 -32 -56
7992 -56 101 84 -141 -106 34 -87 -130 -47 5 -189 -49 18 131 -21 95 -20 45 -88 -15 -48 89 -126 -131 184
8016 184 -111 72 28 -230 -8 66 157 104 13 -168 -15 323 -191 7 -109 -32 226 -73 38 51 -84 -76 4
8039 4 -201 -156 -30 -41 -136 -16 -9 136 -96 11 170 -197 54 -56 -58 -134 -136 -123 66 -110 -64 -35 174 -154 -103
8064 -103 12 -139 -74 13 -158 65 131 136 -60 -197 223 11 61 -100 18 -38 -7 -357 39 188 196 115 -16 -103
8088 -103 -84 -379 -62 -32 1 50 -137 -31 2 -58 -11 -55 59 254 41 81 -86 199 -76 -102 164 36 15 3
8112 3 126 145 44 43 -25 -68 -126 141 117 54 -180 157 -78 15 -180 23 70 -132 16 13 -62 129 158 -30 -99 -112
8138a12J82K65k93J3M5j30m5J28j85K49j92Q2O5L3p6J31r4j67J97j29J69k39Q1
8161b2L38l37o1K55p5j70L47l11j52J46J25M3M5M8O5l87L34l95o6K64q3J25j35
8184e9K72j14k1n1r5oM5
$$ plain form
8138 -112 70 335 42 55 100 -30 -75 53 -132 117 -75 7 72 105 29 160 66 -101 96 -33 136 -103 -22
8161 -22 316 -21 -82 173 98 -72 275 -36 -188 -42 83 126 171 219 284 -103 231 -164 -230 34 -49 76 -59
8184 -59 213 99 78 27 -68 -74 -29
8191b9
$$ Imaginary data points
##PAGE= N=2
##DATA TABLE= (X++(I..I)), XYDATA
0@%%%%%%%%%%%qJ6j6J6k4L2m0M8n6P2q8J04j20J36j60J91k22K55k91L32l79M32
33B30m90N53o24P03p89Q83r86J100j224J357j503J664j839K031k241K469k721
50a427K998l302L638m011M430m899N430o038O738p559Q535r716J1182j3061J5569
65H507j9094K4458l3703N3973j79265J17188K42027k52295R4122J11894k69144
76a01332j31288K87074L5376j03691J00597j9781k24941O7868J60200o1555N160
87A3687J15822j32413j32532J26639O8588r1841L0217M1725q7683j6319R6818
98C2708K7972j5848k8420o9632j3527O0950J9118K8253M2980q5147j06640N7552
110d9681O6905j893O5307J6575j48788o2578Q0215N095K3418J28378l6155j68326
$$ plain form
0 0 0 0 0 0 0 0 0 0 0 0 0 -8 8 -8 8 -16 16 -24 24 -32 40 -48 56 -64 72 -88 103 -119 136 -155 177 -202 230
33 230 -260 293 -331 372 -417 466 -520 580 -644 713 -790 874 -965 1066 -1175 1294 -1427
50 -1427 1571 -1731 1907 -2104 2326 -2573 2857 -3181 3557 -4002 4533 -5183 5999 -7062 8507
65 8507 -10587 13871 -19832 34141 -145124 -27936 214091 -38204 55918 167812 -101332
76 -101332 -232620 54454 89830 -13861 86736 66955 -157986 -90118 70082 8527 13687
87 13687 129509 -2904 -135436 -8797 59791 -32050 -1833 39892 -47791 -64110 32708
98 32708 60680 44832 16412 -53220 -66747 -5797 13321 41574 84554 -593 -107233 -49681
110 -49681 17224 15331 80638 97213 -51575 -114153 -33938 -28843 -5425 122953 86798 -81528
122h1528J7312P6081n3349M3152J25708q5134j38531N5329M4121m4121P0767P0614
134A00421j00600o1341N9485j0092k1073Q0584K622j03907M874P1795k0885m788
146b905O5378k7250r5348J2236O5880k057o927K6089k7814o3034J1263O0569K0472
159C6552o139m956l8093m8312J6979N6461J9347j892L70l8841m5449K8237N3618
172B7882j575j0092N878l5803l9674L3760M6127p619r460L823k5961k0709K7356
185f067K4380q897p473l139j3377J403K3360J0916j1501j2922m281k142K271J6273
199H804J4239j9107k5877Q614J3591o855J2957K3818k5963l4207J8141J6221j2642
212h266J7673K1344l2163k0657K4618j450j3422K9708O775m0831J276K7490k1233
$$ plain form
122 -81528 -64216 11865 -41484 1668 127376 42242 -96289 -40960 3161 -40960 29807 100421
134 100421 -179 -61520 -2035 -12127 -33200 47384 50006 -53901 -49027 22768 1883 -2905
146 -2905 62473 35223 -60125 -47889 17991 15934 9007 35096 7282 -55752 -44489 16080 36552
159 36552 30413 25457 -12636 -60948 -43969 12492 31839 29947 30317 -8524 -53973 -25736 27882
172 27882 26307 16215 22093 -13710 -53384 -19624 26503 18884 9424 13247 -12714 -33423 -6067
185 -6067 18313 9416 1943 -1196 -14573 -13170 10190 21106 9605 -3317 -7598 -9740 -7469 8804
199 8804 23043 3936 -21941 -13327 264 -6591 6366 30184 4221 -29986 -11845 4376 -8266
212 -8266 9407 30751 -1412 -22069 2549 1099 -12323 17385 24160 -16671 -15395 12095 -9138
225i138q582L7863n486l6171J7658J8921k7078J079K8633j4398j6233K2475N77
238A0120k2023J1785J1889j9075K779J8531j3986j3097J5492Q40j2690J0932Q974
251A0471j4878n248R074n63J269Q137l176p576n2r26J863J0918K68j2335l813
266f567K040j788P483J0990n723j1753l897j392N524J5368K464j2102n756k727
280g836m064J2428K0154l969j8553o756k298j211J4786J6435o995j6610p851l224
294a5564P291J9501P781j2900j3139o924k343J2907K2187K084j7517j2390l220
307a2246K451J3524J5942m521k0445j2979Q82J1389J7852R550j1049j9896j0523
320b0069L603J6041J9001L073j7634j9162m095R273J7818J6626k120k3277k1215
$$ plain form
225 -9138 -17720 20143 14657 -21514 -3856 15065 -12013 -10934 17699 3301 -12932 9543 10120
238 10120 -11903 -118 11771 -7304 -4525 14006 20 -13077 2415 3255 -9435 1497 10471
251 10471 -4407 -9655 -581 -1144 125 8262 5086 -2490 -2542 -3468 -1605 9313 9581 -2754 -6567
266 -6567 -4527 -6315 1168 12158 6435 -5318 -9215 -10607 -5083 10285 12749 647 -5109 -7836
280 -7836 -11900 528 20682 16713 -1840 -8596 -10894 -12105 2681 19116 12121 -4489 -12340 -15564
294 -15564 -8273 11228 19009 6109 -7030 -13954 -16297 -3390 18797 20881 3364 -9026 -12246
307 -12246 -9795 3729 19671 15150 -5295 -18274 -17392 -6003 11849 21399 10350 -9546 -20069
320 -20069 -16466 -425 18576 21649 4015 -15147 -19242 -9969 7849 24475 22355 -922 -22137
333b2137j18J5352J7871J0309o901k1714j7089M625K0317J8757L834j5191k3035
346a5120r602J1257K0275J6671J54k0191k3854l025J8078J9729P860p373k1649
359f790k0103K666K3500K1104L465j4653k1793j2515R047K3434J6961l383j8956
372A984k0573n850J6547K4497R275j1424j9524j7158k500K0405K5049J707j8015
385D420j6897j0025M264K3904K2001n883k2791j6112n235J0422K5340J4847j2523
398A5732k1908j3631q55J6045K4266N422j9727k1167p237N498J8852K2571J053
411B4914k4041k1227L18J2887J6329J4790k553k6013k1074P764J7879J2327R978
424B2278o071k9333j5169J6696J5207O121J0670r319l2654l320K5941Q260J091
$$ plain form
333 -22137 -22255 -6903 10968 21277 14376 -7338 -24427 -19802 515 19272 23106 7915 -15120
346 -15120 -24722 -13465 6810 23481 23635 3444 -20410 -23435 -5357 14372 22232 14859 -6790
359 -6790 -26893 -24227 -727 20377 23842 9189 -12604 -25119 -16072 7362 24323 20940 1984
372 1984 -18589 -24439 -7892 16605 25880 14456 -5068 -22226 -24726 -4321 20728 22435 4420
385 4420 -12477 -22502 -18238 5666 27667 21784 -1007 -17119 -22354 -11932 13408 28255 15732
398 15732 -6176 -19807 -20662 -4617 19649 25071 5344 -15823 -23060 -17562 1290 23861 24914
411 24914 873 -20354 -20036 -7149 9180 23970 21417 -4596 -25670 -17906 -27 12300 22278
424 22278 16207 -13126 -28295 -11599 3608 9729 20399 11080 -21574 -24894 1047 9307 10398
437A0398J0650j6098l2054R097K7580O69k9O809k4904k3359K1876K3241m239L185
451A2822j625l1506j1071K9848J6829l035M804j0820l0269r0K7567J2040L25q37
465A4982j7344k0412M496J8537J3126L056r807j5184o422K735J1063J5173q33
478A3166j5909m689K494k224J1694J4267j5038j6290J0383K047p176J8616Q961
491B0302l0782j0445K2331k165n115K6101j661l8191m70K2796p356N121K9235
504B9701j5835l6236J0515J4060j2839J6082K6833k6561k8323J6715M769j4436
516a5555K1777K0130k7079j5876J7332k791j1226K0557J0410k1968l579J5494
528G626q176q158J5526Q15j6638N708J3683r744o858J0086m905j2793J0610J4964
$$ plain form
437 10398 21048 4950 -27104 -18007 9573 10242 10213 17022 -7882 -31241 -9365 13876 9637 12822
451 12822 11197 -20309 -31380 -1532 15297 12262 17066 6246 -24023 -24113 3454 15494 15819 14982
465 14982 -2362 -22774 -18278 259 13385 16441 6634 -8550 -14972 -12237 -1174 13999 13166
478 13166 -2743 -7432 -4938 -7162 4532 18799 3761 -12529 -2146 -99 -7275 11341 20302
491 20302 -10480 -20925 1406 -759 -5874 20227 18566 -19625 -20095 2701 -4655 466 29701
504 29701 13866 -22370 -11855 2205 -10634 5448 32281 5720 -22603 -5888 -1119 -15555
516 -15555 6222 26352 -727 -16603 729 -2062 -13288 7269 17679 -4289 -7868 7626
528 7626 -550 -8708 6818 7633 -9005 -3297 10386 642 -6216 3870 -1035 -13828 -3218 11746
542A1746o661o778M096o336r357R460J4597k59o534k280n404p094M118J2741N040
557A1095o929l870j279r370k323J5910O867j1096K687P721j7475q487K2367K977
571H795j7125J3961J4091k7210q410K5693q336j9143K8213J1185l4388K130K4718
584A4174k4863j2440M0355K81l4088J8563J6037l7393P88M0426j4027k3281K9763
597A4295P04l6995J3742K6085k4054n064K9069j2821k2553K0623M974k3645J1000
610d640J9093j6129l119J6827j1770j5045J4568N757p927R861M361j5618m057
623g838L623l160Q595J1385q943n694J955j1549j249K1289J710j1538Q169l147
637C608k0443J0512J9677j3186k273J7508j6609j8169K4409O115k3384J2070J5848
$$ plain form
542 11746 5085 -1693 2403 -3933 -13290 -3830 10767 10508 3974 1694 -3710 -10804 -6686 6055 11095
557 11095 4166 296 -983 -10353 -12676 3234 10101 -995 1692 9413 -8062 -16549 5818 8795
571 8795 -8330 5631 19722 -7488 -15898 9795 1459 -17684 10529 21714 -12674 -10544 14174
584 14174 -10689 -23129 17226 17507 -16581 1982 18019 -19374 -18586 21840 7813 -15468 14295
597 14295 14999 -21996 -8254 17831 -6223 -11287 17782 4961 -17592 3031 8005 -15640 -4640
610 -4640 14453 -1676 -4795 12032 262 -14783 -215 5542 -2385 7476 11837 -3781 -7838
623 -7838 -4215 -7375 1220 12605 3662 -2032 -77 -11626 -12875 8414 10124 -1414 6755 3608
637 3608 -16835 -6323 13354 168 -2105 15403 -1206 -19375 5034 11149 -12235 -165 15683
650A5683k6071m162L0042j0796k1983K1971N763k6287J3578K5176k3767j3657
662a4510K2342p197j7791K5343J3812k6803l701J3998j5761n070K8029L458k1450
675e301K562M221j5954M696K3268k055j2327K739l380j0496Q593J3736l234o027
689A041Mn075m345P297O602k225m001k104j083J793K928K504m64n181k939M779
705d69M966j126l13o78p590k616R699M986m238K88k241j0358m6J3597K879m958
721A782K006l720j1839L863J4592p3m181L600o458j1610P709J2259m128k672M594
736E724r643q820J1875Q255p472N34L468j0192l158J3557K573p353K618O29r870
751g275L124J2032k755n923K460l495o593P690P997m761l206O19n830j099R477
$$ plain form
650 15683 -10388 -14550 15492 4696 -17287 4684 10447 -15840 -2262 22914 -853 -14510
662 -14510 7832 635 -17156 8187 21999 -4804 -8505 5493 -10268 -15338 12691 16149 -5301
675 -5301 -2739 1482 -14472 -9776 13492 11437 -890 1849 -1531 -12027 -3434 10302 7068 1041
689 1041 1045 -4030 -8375 -1078 5524 3299 -702 -2806 -3889 -2096 832 3336 2872 -2309 -5248 -469
705 -469 4497 3371 3058 2380 -5210 -7826 1873 6859 2621 2909 668 -9690 -9736 3861 6740 1782
721 1782 3788 68 -11771 -7908 6684 6611 2430 6030 -428 -12038 -4329 7930 3802 1130 5724
736 5724 -3919 -12739 -864 7391 -81 453 3921 -6271 -9429 4128 6701 -652 1966 2595 -7275
751 -7275 -4151 7881 5126 -797 1663 -1832 -8425 -735 7262 2501 -705 -86 -5916 -7015 2462
766B462L561m360n32j702n708L211P593M86k367j092m324k442M594L987j091l80
782A896k563m891J881N472N4j114N71l755k285M895L525j434J1j837m780J277
798c077O044M99j445L34m497m310M016N531r34m07k67n890k003N858L620r75J156
815C253j711n519M24M861J089M78M68l461l960J841K920j42Q72K10l983j307K790
832h77J654r7M77j074j743N10K408L40L38o69j964n32J286J275K30n38k043j118
850b137M63P19J712J282k207k208R59Q45L18K600O06l445r88J808p12Q80K707
867C202j459l558N28P80j443K218K321l245k024K068m30p51L533O31l358L2J877
884I22j188K03K667j238k009M70m28j82J846m47j630P54k94j755J862J926k591
$$ plain form
766 2462 6023 1663 1131 -571 -6279 -3068 4525 5011 2644 1552 -2772 -5214 -620 3367 2276 1896
782 1896 -667 -5558 -3677 1795 1849 735 1306 -2449 -4734 161 3686 2252 2263 426 -4354 -3077
798 -3077 2967 3466 2021 2355 -2142 -6452 -2436 3095 2161 1754 1487 -4403 -6406 -548 3072 2097 3253
815 3253 1542 -3977 -3553 1308 2397 2875 3343 -118 -4078 -2237 683 541 1413 1623 -2360 -3667 -877
832 -877 777 680 1157 83 -1660 -1150 1258 1598 1936 1267 -697 -1229 57 1332 1562 1024 -1019 -2137
850 -2137 -1674 -955 757 2039 -168 -2376 -1417 -572 -254 2346 2952 -493 -1481 327 -385 495 3202
867 3202 1743 -1815 -1287 -507 -1950 268 2589 -656 -2680 -612 -1042 -1793 1740 2371 -987 -955 922
884 922 -266 -63 2604 1366 -643 -173 -601 -783 1063 616 -1014 -260 -554 -2309 -447 1479 -1112
901a112L27K413k663m24M213j812k869M020L42m958K718L561n941q11O291l307
917a2m176O334K55p705L804N493o212o63P905l314o703O305K386o740K797N558
933E312n703k563N092j847l784L860J738l734Q32J665k087n35J494K54O59N75
949A228p82M24o18k134J902K631k718L49L476n126m003O724J88o045O255M298
965F049j0676j325R926m298n621J1325J402j2598M047Q118r910j160J2522m254
979C547r505Q653J551j0988M240Q223p732k275R406l555p556O187K111o236L755
994a74N789m211k478K076k394j280L461K181P8j463m421n26K221j518K186P325
1010F852m476p736N064M73p382P437J0205j0039m507R498o481r135J4055N391
$$ plain form
901 -1112 -785 1628 -1035 -1459 2754 942 -1927 2093 2435 -2523 195 3756 -2185 -2996 3295 -12
917 -12 -4188 2146 2401 -5304 -1500 3993 -2219 -2882 5023 1709 -4994 1311 3697 -3043 -246 5312
933 5312 -391 -2954 2138 291 -3493 367 2105 -1629 -797 868 -1219 -1754 -260 -6 653 1228
949 1228 446 870 252 -1882 20 2651 -67 282 3758 -1368 -5371 1353 1541 -4504 1751 6049
965 6049 -4627 -5952 3974 -324 -5945 5380 6782 -5816 -1769 6349 -3561 -4721 7801 3547
979 3547 -5958 2695 4246 -6742 -2502 5721 -2011 -4286 5120 1565 -5991 196 2307 -3929 -174
994 -174 5615 1404 -1074 1002 -1392 -2672 789 2970 3048 1585 -2836 -3362 -1141 -2659 -473 6852
1010 6852 2376 -5360 -296 177 -7205 232 10437 398 -4109 5389 -1092 -10227 3828 9219
1024I219j4181M082J0132j4570n239J6944l363j2366J3190N614j7038K670J3189
1037H283j1627n805J7150j062j2999Q487M527j4854R74J3541m511m731Q881k712
1051C542j2059K837P278k413J751N571m189o459j36K144K496K335J188K30l720
1066C96n306J962M840k367M92O077m783p888N722L771r053L777J0176q086n688
1081e958J1030j535j2215P390Q442r784J90J2172p324j1331R259K696r661P111
1095D82J0306j1419o538Q616k251p747J0549Q493j0544m040O725m076n826R175
1109A905O761p330l322L713l490m063N984M945m726j954L345k912m377N086L391
1124B956m741R25N207m027m163N252J329o882L169O855m549m240N312j626o860
$$ plain form
1024 9219 -4962 -880 9252 -5318 -10557 6387 3024 -9342 3848 9462 -7576 -4906 8283
1037 8283 -3344 -9149 8001 6939 -6060 2427 6954 -7900 -6926 6615 2104 -2627 6254 3542
1051 3542 -8517 -5680 1598 -815 936 6507 2318 -4141 -4277 -2133 363 2698 3886 4116 396
1066 396 -4910 -2948 1892 -475 17 6094 1311 -6577 -855 2916 -6137 -2360 7816 -270 -5958
1081 -5958 5072 3537 -8678 -1288 7154 -2630 -2440 9732 2408 -8923 336 3032 -6629 482
1095 482 10788 -631 -7169 1447 -804 -8551 1998 10491 -53 -4093 2632 -1444 -7270 1905
1109 1905 8666 1336 -1986 1727 -1763 -5826 158 5103 377 -1577 1768 -1144 -5521 -435 2956
1124 2956 -1785 -860 4347 320 -3843 1409 2738 -4144 -975 5880 1331 -2909 2403 777 -6083
1139f083M176O477l383k022L146l374n299M085M965j189L98J821m243m173K708
1154a990L871p7J22J538k393n212L45M870j5j910L279J40o647%O013j795l049
1171b910O202O42p327K370N329o482j655Q553k348o804O601K865j0402Q63R225
1186D722n876l870R983n63j0581L815O067p316Q27R826m341p131N649P47o888
1201d930M732O033n658k385M744l451m452O042K437m887J373K336l716o97L774
1216A295m85j679K297l75j391R62J5j371J279J78j612J554O21k916N59J768k218
1233a519k00L930j492k952L064N25l931K192M084l884j194M115k463l558M410
1248A127J678m807J096L462m345j485N101j045l692L535J535m365J149L499k682
$$ plain form
1139 -6083 -1907 4570 1187 -835 2311 -1063 -6362 -2277 2688 1499 1897 3718 -525 -4698 -1990
1154 -1990 1881 1804 1926 3464 1071 -4141 -3796 1074 1059 -851 2428 2568 -4079 -4079 1934 139 -2910
1171 -2910 3292 3934 -3393 -1023 4306 -2176 -3831 4722 2374 -4430 2171 5036 -5366 -4503 4722
1186 4722 -1154 -5024 4959 4396 -6185 -2370 3697 -3619 -2792 7034 2693 -4438 1211 1958 -4930
1201 -4930 -198 5835 177 -2208 2536 -915 -5367 675 3112 -1775 -402 1934 -1782 -2479 1295
1216 1295 810 -869 1428 1053 -338 624 639 -732 547 725 -887 667 1288 -1628 -1069 699 -1519
1233 -1519 -1719 2211 719 -2233 831 1356 -2575 -383 3701 -183 -1377 2738 275 -3283 1127
1248 1127 2805 -2002 -906 2556 -1789 -3274 1827 782 -2910 625 2160 -2205 -1056 2443 -239
1263b39j222L821j100l192K738J488l669L37K889k330j227K704l41k721J761J081
1279G78k158R96J656j336p62J681k69j282J611J81j319L97N58j170J29R03r54
1296c60n35Q48m24m17R39K51q12M44M09p24J37J255n21n82R02o45q10J241L28
1315I24j016l08Q16j343k42J153J29m44K68K37r09K40J346n05n52R60p2r34N96
1334C44O34p64k85K41m34l80J020N4j107j04N00o87L49J276j13o89J76l16l25
1353f10R19R56j56m36l49r01m80O34P71n6k1l13r40r3O81L89J29Q9j50l56J79
1374a14L99N13j37l96o0q7l7O9L96n29r48J95O12j89K06M97o65p58L36O78K12
1395A93O99L04j259p13Q76L86j1N60J4j842o05J179M07j24O10l93j578m14J384
$$ plain form
1263 -239 -1461 2360 1260 -1932 806 2294 -1375 -1038 1851 -479 -1706 998 657 -2064 -303 778
1279 778 -1380 -384 1272 -64 -826 855 586 -696 915 1096 -223 174 732 -438 -309 594 -360
1296 -360 -895 -47 -471 -888 51 302 -510 -66 343 -381 -244 1011 490 -92 810 165 -645 596 924
1315 924 -92 -400 416 -927 -1169 -16 113 -331 -63 174 -735 -495 851 346 -206 754 682 -252 344
1334 344 978 214 -71 170 -264 -644 376 430 -677 -781 -281 -968 -619 657 544 -145 31 -285 -610
1353 -610 309 1265 1109 673 324 -577 -1057 -423 348 292 271 -42 -982 -1075 -394 -5 124 213 63 -293 -114
1374 -114 285 798 661 265 205 118 81 150 546 17 -931 -736 -124 -313 -107 390 -275 -1033 -697 -19 193
1395 193 892 1196 -63 -776 100 486 475 1035 1049 -793 -1398 -219 188 64 674 281 -1297 -1711 -327
1414c27J038j07K61l45j598o32K159J185o42p6j79j968q60K233J062j030L40K92
1432H06k844k79K805L82j571J596j23k845J052L205j513j646K390n61k976J997
1448a25K925k644j521K038j343j973L044K024l149p91J651j473n44L538J161k647
1464A71o39L02j025J55K730Q73k047j103j10o71p8K266J454k372j799J487Kj321
1482a725K495J627k977j067K735l7k389K838J005m736L8M439j596k472M067p94
1498A451n812K038M848k462j314M575k487n615L638L932l399J280L703m612l785
1513d021L909J401k349K619K371n005k256K911M00j211K142J306l135j447K265
1528a00M95j098J284J537j668j649J509J096k019o21K376m44k377K362J432m198
$$ plain form
1414 -327 711 604 865 520 -1078 -1710 449 1634 992 916 737 -1231 -2091 142 1204 174 514 806
1432 806 -2038 -2317 488 870 -701 895 772 -2073 -1021 2184 671 -975 1415 854 -2122 -125
1448 -125 2800 156 -1365 673 -670 -2643 401 2425 -724 -1515 136 -1337 -1881 1657 2818 171
1464 171 -468 -166 -1191 -1036 1694 2567 520 -583 -693 -1364 -1442 824 2278 -94 -1893 -406 -404 -1725
1482 -1725 770 2397 -580 -1647 1088 1051 -1338 1500 2505 -2231 -2193 2246 650 -1822 2245 1451
1498 1451 -4361 -2323 2525 63 -1251 3324 837 -4778 -1140 2792 -607 673 4376 -236 -4021
1513 -4021 -112 1289 -1060 1559 3930 -1075 -3331 -420 -20 -1231 911 2217 -918 -2365 -100
1528 -100 395 -703 581 2118 450 -1199 310 1406 -613 -1234 1142 698 -1679 683 2115 -2083
1544b083n90L812j733j588M851N44n934O63M010l614k73O622j089o420K023K492
1560A693n014J511O641k786m881L462o0n229L248N520l689j993L733j679m304
1575c827L197L404k975j49L297j752l716J650J919k193M16K864o74l130L55J417
1591A03j570j29L648K15l148J2K011k479q98M502N75l823J466J515l848j475N036
1608A713m60l394L177J934n269m50M435j839k306M683J259n016N13K364k799o48
1624b103M750L37l534K96J223l667l97M771J013l179P74K17l420o08M843J282
1640B598k458Q54M33l685m40M355P95k727J350M21l760l09M342q37k692K411P89
1657A440l866J115L714k271k711L160N75k787K385K318l244k491K706N8j110L198
$$ plain form
1544 -2083 -2673 1139 -594 -2182 2669 3213 -2721 -2058 1952 -1662 -1935 4687 3598 -2822 -799 1693
1560 1693 -3321 -1810 4831 2045 -2836 626 566 -4663 -1415 4105 416 -1577 2156 477 -3827
1575 -3827 -630 2774 -201 -350 2947 1195 -2521 -871 1048 -1145 -729 2135 1461 -1669 -1314 103
1591 103 -1467 -1596 2052 2267 -881 -869 1142 -1337 -2235 2267 2842 -981 485 2000 -1848 -3323 1713
1608 1713 1253 -2141 1036 2970 -2299 -2749 1686 -153 -2459 2224 3483 -1533 -1020 1344 -1455 -2103
1624 -2103 2647 2984 -550 -254 969 -2698 -3095 1676 2689 -490 284 501 -2919 -3527 1316 2598
1640 2598 140 994 1427 -2258 -2698 1657 2452 -275 1075 1496 -2264 -2573 1769 932 -1760 651 1440
1657 1440 -2426 -1311 2403 132 -2579 581 1156 -1631 754 3072 -172 -2663 43 101 -1009 2189
1673B189Q98l994k155K102k19Q04L054O7l717k113J379P83J477K572k61l188k252
1690b574Q79J607Q78J662L35l336k737J523K302k81R54P64l691k041L625J674
1706A543j406J450L12m704l6M613L97j688J383j438m428J917M523q64j005J158
1722A727l244l470L846L668p73p26q1l822j182M532K623j089j24j651l507M86
1738b787L610J650k52j080k552j897J018L008J818l36k432k333J00J457K270J821
1754C083j281k877j360Q47J268K629J245k785l278pJ348J223K842k3l851k769
1770c746J711J096J632L090j147m488r39J552J132K550J740k884l936m42J558
1785a521J629K620O02l687k671J44J531K094K514r52l350j638O26J586K698J130
$$ plain form
1673 2189 3087 -907 -3062 -960 -1179 -375 2679 2746 -971 -3084 -1705 -922 555 3127 2866 -322 -2574
1690 -2574 -1695 -88 790 2452 2787 -549 -3286 -1763 539 258 1212 1976 -1715 -3756 -131 1543
1706 1543 137 1587 1899 -2805 -2841 1772 2169 481 1864 426 -4002 -2085 2438 1574 569 1727
1722 1727 -1517 -4987 -1141 2527 1754 1028 947 -2875 -4057 475 3098 2009 1885 234 -3273 -2787
1738 -2787 823 2473 2221 1141 -1411 -3308 -2290 718 2536 2200 -232 -2565 -2465 -1008 1262 3083
1754 3083 1802 -1075 -2435 -1588 -320 2309 3554 769 -2509 -2516 -1168 55 2897 2874 -977 -3746
1770 -3746 -2035 -939 693 3783 2636 -1852 -2791 -1239 -107 2443 4183 1299 -2637 -3079 -1521
1785 -1521 108 2728 3330 -357 -3028 -2884 -1353 741 3255 2303 -1047 -2685 -2059 -473 2225 3355
1801C355j673l152q71N73K252K429m16k435k209p58J391K888J142j053k019j577
1817b133l69K177K574O03k017j794j383L63L060J871q71j697j889j403J462K980
1833A534R21j130j846k036k87K629K124K61r58k146j543P49K816J453k21j234
1849A086k568j074J535K005J171o50j747k186m9J824J896O60m94k374j273Q87
1865a351J448J637L63j234k478j07J219J256P71J94j978j808O92J070R51J078
1881A723p06k156p55J257O90J051Q13j227k039J58J159M67R49L01j992j081N07
1898h81M72P29P89o35j308l95M27O25Q47M47r63p18k94N97P94N20l08l93m13p71
1918h32M51J336n26p82M72k76q19N43J271q80p78J318m29q43J231N57j584J9J390
$$ plain form
1801 3355 1682 -1470 -2341 -1768 484 2913 2497 62 -2147 -2905 -1514 1374 2516 1463 -556 -2133
1817 -2133 -2502 -325 2249 2852 835 -959 -2342 -1979 1081 2952 2081 384 -1505 -2908 -1446 1534
1833 1534 2455 1325 -521 -2557 -2844 -215 1909 2170 1212 -934 -2477 -1728 1088 2541 2320 1086
1849 1086 -1482 -2556 -1021 984 2155 1505 -242 -2428 -2477 -653 1243 1903 1409 -965 -2238 -1351
1865 -1351 97 1734 2097 863 -1615 -1722 -503 753 1524 1718 -260 -2068 -1376 -306 645 1723
1881 1723 1017 -1139 -1894 -637 53 1104 1917 690 -1349 -1191 -32 435 1384 1685 -307 -1388 -881
1898 -881 -409 320 1109 474 -834 -1229 -802 -177 670 1117 154 -564 -858 -261 533 1053 745 352 -61 -832
1918 -832 -381 955 429 -353 119 -157 -976 -433 838 -42 -820 498 69 -774 457 1014 -570 -551 839
1937H39p19o45J557l10j646O43Q29j200J99J224p87j104J331K98j249N33R69q22
1955f0m89J640q1j369L14M24p36K93Q53J34j443p51N33K52L20J061K39j669j090
1974a625J086P87j72J234L61k169r85J648J44J35J295k42k918k98J837l45k34
1991d61K258j071l052J222J847q48L65J456j898k102K087J644r68M45P03k689
2007a062j487K427J917j268j57r0k375m87K729J855q43o85q08k033L3L335J880
2024B881j183j081r59k442M18L657J586j805j147n85k139K89M491N73k575j38
2040a59m83k182J546L807l61k450P8n00r96J724L227j859k819K61O4j82K328K135
2058C179k831k607M22O90O48K524J175k947k877N61J333J159K309O31l517l330
$$ plain form
1937 839 120 -525 1032 722 -924 -281 548 -652 -453 771 -16 -1120 211 509 -740 -207 762 -60
1955 -60 -549 1091 1010 -359 -45 379 -357 -64 789 923 -520 -1271 -738 -486 -166 895 1134 -535 -1625
1974 -1625 -539 248 76 1310 1671 -498 -1483 165 309 444 1739 1497 -1421 -1719 118 -227 -461
1991 -461 1797 726 -2326 -1104 743 -105 260 1716 -182 -2284 -197 1447 479 924 1627 -1062
2007 -1062 -2549 -122 1795 527 370 280 -2095 -2582 147 2002 1159 474 -334 -2367 -2334 1001 2881
2024 2881 1698 617 -342 -2784 -2366 1291 2877 1072 -75 -660 -2799 -2510 1981 2554 -21 -159
2040 -159 -642 -2824 -1278 2529 2168 -282 -204 -704 -1700 24 3251 1392 -1427 -1166 -1102 -1284 1044 3179
2058 3179 348 -2259 -1837 -1147 -499 2025 3200 253 -2624 -2063 -730 429 2738 3369 -148 -3478
2074c478J055K142R21J603O44l732l126K080K083J40J864O75m473k275L472J477
2090A072p36K095p4m526p27L740M08r60J647j136m333J276L960n35r09J219k370
2107h89l125K926L722j111n53K74l118j777L435L193r84n82j507k814k05L210
2123I5K491m06j343j744j848L1L166K235k96j625j822j149L81K552K177j250k206
2140e61j87n25r9K489J851k514k380J284o3l04K649J082l680j270J726M39j17
2157a80L070m97m203m63K229J76N94K479j837m311P30J954k50J263K483k844l653
2174c260J536J736l63K022J574l416k466J779Q24J00J938Q6k792j582J527N36
2190b21M77J124m90k300j74J410O71q7M89m88j705L57J294R66n16n09p34q54K55
$$ plain form
2074 -3478 -2423 -281 640 2243 2887 -845 -3971 -1891 192 332 2196 2871 -1602 -3877 -405 1072
2090 1072 336 2431 2357 -2169 -2896 844 1252 292 1939 803 -3530 -2254 1706 1171 262 1481 -889
2107 -889 -4014 -1088 2634 1523 970 1244 -1874 -3651 -216 2977 1993 1411 -96 -2910 -3115 95
2123 95 2586 2180 837 -907 -2755 -2724 442 2677 2381 756 -1066 -2215 -1834 718 2895 1645 -561
2140 -561 -748 -1273 -1372 1117 2968 454 -1926 -642 -705 -1009 1640 2722 -958 -2228 -502 -63 -180
2157 -180 2890 2393 -1810 -2273 -44 132 726 3205 1368 -2943 -2213 -259 -509 754 3237 393 -3260
2174 -3260 -1724 12 -351 1671 3245 -171 -2637 -858 -34 66 2004 2090 -702 -2284 -757 -221
2190 -221 256 1380 890 -1410 -1584 -174 497 410 899 411 -1294 -937 357 1323 807 298 -436 -1290 -1035
2209a035J613Q23p67j013n55n91O73J483P30r65p92j94m41Q1K188O98j743m91
2227b98K04j010N59J965j82j726K18M6j214P81J754n59j338L80M06q25R58J259
2245A378j090r76R25J59p75R67L76j371o12J295m06k27O40Q0j350M59L70n9M55
2264B38M72o90m18K23M27o0l6M17n88M0N5Q0r6K89l17k63k13K38rK52k43j31L74
2287D1Q3q4No6P1k28O24l18R1K49l59n39q5O58n1q0J3k90m84P16N04l21k22L56
2311B84n01k64Q67L66k73m37j63m38L41P13J80n70r0o51j06M79Q85k44l01k81
2331b04k25k46R17O06o5n46l61m16k8J063L74l70p20k46k48L65Q18L8n46m25l13
2352g78K5J023M13o5o27k65k69K20J025K78k89r13k13K0M36O27J73r42k76n93
$$ plain form
2209 -1035 578 1401 634 -379 -934 -1525 -852 631 1361 396 -396 -590 -1031 -950 1238 1936 193 -298
2227 -298 -94 -1104 -545 1420 1238 -488 -270 -224 -1438 -657 1097 538 -800 -420 -14 -839 119 1378
2245 1378 288 -688 237 396 -379 588 964 -407 -1019 276 -130 -357 283 363 -987 -528 -158 -217 238
2264 238 710 20 -398 -175 252 192 156 573 -15 25 80 160 64 353 36 -227 -440 -202 -211 41 -202 -333 41
2287 41 124 40 45 -21 50 -178 446 128 219 468 109 -430 -515 143 92 12 25 -265 -749 -33 471 150 -72 284
2311 284 -217 -481 386 752 479 42 -121 -559 -218 495 675 105 15 -636 -742 -263 622 378 77 -204
2331 -204 -429 -675 242 848 783 237 -124 -540 -568 495 869 499 -221 -467 -715 -350 468 506 -40 -465 -778
2352 -778 -753 270 683 618 -9 -274 -543 -323 702 980 691 -222 -435 -415 21 648 821 -121 -397 -990
2372i90K04R63P47m30n19n76l23Q06J101J34m75o51p67j26Q32Q15p5m22m64r82
2392a198K18J219M69m77J09p58p07P42R08K66l03J13r04p21J249P86n45k14m12
2411a60q06J60R84O03n73k83n04m25P12R67L49p74k80m83j78N02J078o5m25p16
2431c17m20J91O79N36J58p75q79N1K01P11Q14m48o97n90M39L83O62L15n76q77
2451d39l56P03o1M84P26q21j441N11N57K3N53O03j109r09N48L18J60P68P8j210
2471c14l14N37L11j07M04J68j271j31P50j3K1M43l45p69K24N29K32k54l3k27m50
2492f09L51J006j32o44P7Rn75J12J040l3r72l0K28p43L52J394m01q05R5R4o91
2513h77P28J256p18o06O94m41q43R60Q69q64n75Q45n65p76J109N42j252O9Q65
$$ plain form
2372 -990 -786 177 924 494 -25 -601 -924 -118 983 1117 642 -9 -776 -902 -70 745 670 248 -216 -1198
2392 -1198 -980 239 708 231 340 -418 -1125 -383 525 791 488 601 -303 -1024 225 1011 466 252 -160
2411 -160 -966 -806 178 781 208 -75 -579 -1004 -292 675 1024 250 -30 -513 -691 -189 889 824 399 -317
2431 -317 -737 -546 133 669 827 52 -827 -776 -575 136 950 502 -195 -785 -346 37 699 1014 438 -439
2451 -439 -795 -92 -153 331 1057 236 -1205 -694 -137 -114 439 1042 -67 -976 -428 -110 50 818 896 -314
2471 -314 -628 -91 220 113 517 685 -586 -717 33 20 41 484 139 -630 -406 123 355 101 68 -159 -609
2492 -609 -258 748 616 -28 49 58 -517 -405 635 602 -370 -400 -172 -915 -563 831 430 -375 -280 -186 -877
2513 -877 -149 1107 389 -217 477 36 -807 153 1022 158 -417 428 -137 -913 196 738 -514 -445 420
2532D20n46m16J092j05j007M00P60k03o70Q07k2j338N61P27l64m79Q19j27j224
2551i15K39R74j96j72M13L2j050M09J019p31j21P54n52p84K37Q65o79M2Q22j90
2571D16j308P66M14p51J18R43k40p64N75N70j054k52J281n55m27Q74K67j377j83
2590f87J002m42K1L03J34j148J59R45l43l41J137n4j321K05R59o16k16J260j68
2609G89j377J88P96o59m68J603n41j297Q68P10j384L08J126m66q71J184J2j254
2627g33M51P91q37m68J895m04j184L56M19r95n2J508k95r46M67l71m37N32J094
2646G91l89j61J19l61m30J31Q48j66r3l80K85l68n37N99K81j49k07N74l82p65
2666g60Q61L00p95L20J260j320m43J403l32j354P65R22j168k78J311o61j154J374
$$ plain form
2532 420 -126 -542 550 445 -562 -162 598 395 -275 532 510 -828 -267 460 96 -383 436 309 -915
2551 -915 -676 298 102 -70 343 375 -675 -266 753 22 -99 655 103 -681 -444 421 -258 -216 606 416
2571 416 -892 -126 288 -463 -345 598 358 -406 169 739 -315 -567 714 159 -268 606 873 -504 -687
2590 -687 315 -127 -106 197 331 -817 -658 287 -56 -397 740 686 -635 -430 529 -87 -303 957 789
2609 789 -588 -400 396 -263 -731 872 331 -966 -98 612 -772 -464 662 196 -675 509 521 -733
2627 -733 -282 509 -328 -796 1099 695 -489 -133 286 -709 -761 747 452 -494 -27 -398 -835 -303 791
2646 791 402 241 360 -1 -431 -300 548 382 289 -91 194 -174 -711 -112 169 20 -187 387 5 -760
2666 -760 101 401 -394 -74 1186 -134 -577 826 494 -860 -95 827 -341 -619 692 31 -1123 251
2684B51K75j483P44J136j437l38J192o2j013J129N43j197j32P68o90n3J083p6
2702F40r96J70K71q17K68O74j3l84L90l1n06Q8N84k15J06l9M3k07j03K98m0j09
2724G2k97k92K51Q8K91J96n52j28K52K29l13M15K93p08k02N88k22j88O46k07p43
2745e31L8Q79k49l70O31j90j102K77N99K05M4L35o51l32K64K90n6N34j71l40p37
2766f33N88J91k18Q8K86p48l97O99N95m91L69j91o77O2L03M09P5J71j16p00J40
2787a95O35j90Q7r2n45k65L82K76J24K6j88m54k06M35L87N1M2o54k44J22N82K77
2809C93M46k87j024J42J88oK81L97m24j013L62J57L86P33p8p16m86M68O0K17O79
2830H75m29q85k42N86m6N42K64p19o18J99L77J69M26l6p08m23M67K94L16K65k81
$$ plain form
2684 251 526 -957 -213 923 -514 -852 340 278 -735 394 937 -260 -392 376 -314 -367 716 640
2702 640 -356 -186 85 -732 -464 210 197 -187 203 172 -334 -246 338 123 229 190 233 26 -77 221 181 72
2724 72 -225 -517 -266 -178 113 309 -243 -371 -119 110 -203 212 505 -203 -405 183 -39 -227 419 212 -531
2745 -531 -493 386 137 -233 398 208 -894 -617 -18 187 231 566 -85 -417 -153 137 81 615 444 104 -633
2766 -633 -45 146 -72 16 302 -446 -843 -144 451 -40 329 138 -539 -477 -174 235 310 481 365 -335 -195
2787 -195 440 250 337 245 -300 -565 -183 93 217 243 55 -399 -605 -170 217 268 310 -344 -588 -466 116 393
2809 393 839 552 -472 -330 -142 -148 133 530 106 -907 -545 -388 -2 731 653 -63 -549 -81 -21 196 875
2830 875 446 -439 -681 -95 -141 401 665 -54 -672 -473 -96 73 499 463 -245 -668 -201 93 409 674 393
2851C93n66r2P8M78J03O9n2r62J03L57j3Q15l50n09m98L04J29M29L90j74o52m8
2873b68K3Q1R40l14k60m50l71J87M64L57j01m67k24l2L31J13O64k94m33k01j33
2894c88K97P18j85m49j95j42L47O2O11m53m20o3k28L50K35O22o48m01n3L7M24
2915G8K72J13l58K2k27j00Q5M90J33n80l34K61j42L91M2j04k68M8j17L58J7L91
2937D71l79j18k44J86R0J89L08k75n02K01j4J29j47J84lo48O11k52j11M51K19
2958C46n27l8K87rJ3L0J36k57k51L24k96K03L06L9n29j19L37J86j11L18j34m39
2980a85rL30j38o6N43l09m03K2j0K52j11L24J54o07L6K01m60K91M57j34k91k64
3002c77L13m2J42K11J37n02O5J59k28N8M78o6q08L06J70l14J01N96n18k40qN43
$$ plain form
2851 393 -173 -265 -187 291 394 463 411 -551 -448 -91 -104 711 361 -148 -646 -342 -213 216 606 432 -220 -268
2873 -268 -245 -164 776 462 202 -248 -619 -432 32 389 288 -179 -403 -435 -104 9 673 379 -54 -255 -388
2894 -388 -91 627 442 -7 -202 -344 3 65 676 223 -197 -260 -488 -138 97 719 71 -330 -383 -346 78
2915 78 350 463 105 127 -100 -200 -115 375 508 -72 -406 -145 -287 104 146 42 -226 -178 -295 63 80 471
2937 471 92 -26 -270 -84 6 195 503 228 -274 -73 -87 42 -105 79 76 -572 39 -213 -324 127 346
2958 346 -181 -219 68 59 72 102 238 -19 -270 54 -242 -39 267 306 -223 -342 -5 181 70 388 254 -185
2980 -185 -194 136 -2 -68 475 166 -237 -215 -225 27 -84 240 394 -213 -177 24 -436 -145 312 178 -113 -377
3002 -377 -64 -106 36 247 384 -118 -53 106 -122 -64 414 348 -460 -154 16 -298 -197 399 -119 -359 -367 176
3024A76n55N66M28n73l93K08M83m46L64M17o88o77P37k8K3R2M07j043l37M83M61
3045A05r3J98J89n64n78P58M23n02M25K36j109j65P41J02n9K31j89p54j1O02K79
3066B65j33k4O6p65L92R04l78o0P5l23o47N77N04j95l97K01m28j18O44M75j15
3087E20p29K1k41l2O38O53l66m72l65J36k32O79P46m90p23M1M6l01Q70L83q59
3108g7p25N03l21J8Q14O62q05m98M44j39j03P96J72q32l29N53k46J03O96j67j306
3129g87R3O08J3J15N64o14q64J29Q58J84L35L24j109n50M22L59L60N2J05p47p10
3150h60L42P26J89m8L8q00n45O75P00q5p0p2m04k45M80N90k97r0j38l85l02N88
3172a3L17P5k99m21j01j14R26J78m81k61l5M1m58J382K99q97l87Q3j38jJ007O4
$$ plain form
3024 176 -379 187 615 42 -351 -143 340 -106 258 675 -13 -690 47 19 42 134 541 -502 -839 -356 105
3045 105 12 210 399 -165 -743 15 438 -64 361 597 -512 -677 64 166 107 338 149 -605 -616 -14 265
3066 265 132 108 174 -591 -199 705 327 267 342 19 -628 -51 453 258 -139 62 -366 -484 160 635 520
3087 520 -209 -188 -429 -461 177 830 464 -8 -373 -237 -469 210 956 466 -257 -216 -170 -471 399 782 -77
3108 -77 -802 -299 -620 -602 212 874 69 -429 15 -124 -227 569 741 -91 -420 133 -113 -10 686 519 -787
3129 -787 -694 -86 -73 42 606 -8 -872 -743 115 299 634 958 -151 -701 -279 80 440 492 597 -150 -860
3150 -860 -518 208 397 349 387 -413 -958 -283 417 332 262 190 -214 -459 21 611 314 224 86 -299 -601 -13
3172 -13 304 379 80 -341 -442 -556 370 548 67 -194 -229 -188 -646 736 1035 138 -249 -166 -304 -305 702 766
3194G66j078oR3k31J06R73l62p57J89K14r8M92L21k80o47R7J56l02Q65M69r78
3215Bo11M84k77M0O70K39r33o1J76N4K28M49l19m41q0K72N8K68M7ro09J11O4K34
3239E6N2lj99j69J2K08L41m2J8k75m24J36K79M89j74j56j5l11k62N63K30n67J07
3262a06L5o23J83N95k7Jj85J1j26L64K47r8k32K00l07r1J07K56j0m31M05k57j48
3285b37N33Oj46j87Or0k32Q46k92k07R3k43K1R6R6O0p6q2K7l59N23qk97K11p1
3310ik52O2J10O3j34P0K41j57R2j25K28j36R9q7p9jM7n4KQL8j37m2j15J95P5o
3337dN0k18K82l94L95J26l37L84j89k63P6J09r7J65j82J04k00P3K14l7k25J67
3359al07M11l2Q1l3K8J92n29ML60J3q8l2r4l51J34K69j46n3K52j80O4K4L87l16
$$ plain form
3194 766 -312 -318 -225 -456 -350 623 261 -496 -307 -93 -191 301 622 342 -305 -208 -52 -354 511 980 2
3215 2 -609 -125 -402 -362 308 547 -386 -447 -271 -217 11 460 141 -300 -380 -108 -50 218 265 256 -353 -242 -178 56
3239 56 108 105 -94 -263 -251 -43 298 256 274 -1 -425 -289 -10 479 305 149 134 -177 -439 124 354 -213 -106
3262 -106 -71 -694 -511 84 57 58 -127 -116 -242 122 369 271 39 239 -68 -159 -52 204 194 -237 168 -89 -237
3285 -237 296 302 156 -31 -25 -115 -347 499 207 0 93 -150 -129 -33 63 123 47 -35 -8 -367 156 148 -149 62 -9
3310 -9 -261 -199 -89 -26 -160 -90 151 -6 86 -39 189 53 152 65 -14 -15 32 -22 -20 -12 26 -111 -153 -268 -73 2 -4
3337 -4 46 -172 110 -284 111 237 -100 284 95 -168 -92 17 -80 85 -97 7 -193 -120 94 57 -168 -1
3359 -1 -308 103 71 152 119 147 339 -190 -186 174 187 99 67 -27 -378 -244 25 -121 -174 78 -102 -38 -14 373 57
3384E7q6n3R5nQK04k53q2j13J15L3K38L98o16n1j50m9M11K16j93P3l82j07M8O31
3409C87k74q1j07o5l56L77K33p2n4j68q5J42K11p6M6R2m71r5L94M96k4k23p7l81
3433b31j16M16L08k69l1k19l14N4M30M7p0k7j90M0K61J04J03k22J75l99j49M03
3455A04J41j04J15m22L8l51O47J21L3k63k29p3J51L27N5k15m43L26q2JM63O3k07
3478A96l92k7K95j59N07m0l02l51j56J98J52M59J83q98p2K04K75j62J32N44p94
3499b08K04k7J56K45m3k58m61J7L80J61q6nj21J5k41N52K8k53j01J95m63M22M14
3522E22k56l7k38p8n34L58M03K01m61J52k67l51M44M08r7j50j19n1p4K89J67J26
3544C57l65K10m06j5M29J68n21l41O13l92K19N07j99n33k5K97k09N09O1O9m39
$$ plain form
3384 57 -29 -82 13 8 16 220 -33 -115 -228 -113 -80 158 556 -60 -111 -261 -310 101 317 124 197 -185 -292 -244 387
3409 387 113 32 -75 -140 -496 -119 114 42 -12 -180 -265 -123 88 12 58 150 -321 -416 -22 474 450 227 150 -231
3433 -231 -347 69 377 108 77 -142 -456 -402 28 75 5 -22 -212 -172 89 193 296 74 249 -150 -299 104
3455 104 245 141 256 -166 -128 -479 168 289 322 59 -170 -243 -92 235 290 75 -368 -42 -124 -123 340 403 196
3478 196 -196 -223 72 -87 420 380 78 -273 -429 -231 -79 380 563 -335 -407 -203 72 -90 42 586 -208
3499 -208 -4 -31 125 370 327 69 -392 -375 5 166 80 75 -46 -31 -272 280 308 55 -46 149 -314 108 522
3522 522 266 229 -9 -87 -621 -263 140 341 -120 32 -235 -586 -142 266 169 19 -100 -151 -225 64 231 357
3544 357 -8 202 -204 -219 210 378 -143 -484 129 -263 -44 463 264 -269 -294 3 -206 303 364 433 -6
3565fk27K23j57R8M50Q6n31j59J17k3j6M06M6o22p6O34l25k0K76r3j85k21K25
3588a00qj2L30k58k24o4N46n10K33M38n10j7L7J10j29L47j68o5k08K64J19p7j16
3611d2O2O6k11J97JQ0l30K93l78q1M35L7j84k2L91j93k05j6N71o14J64R9k41k01
3635c22N33J07m86K75L05p55J00M46n9l74J64L01n37j12O31k06j47L29J44p66
3655d29L33M1L5q2J89Kl86K85L9q7j01K12l8j09J30J49r4l83J93J39j86K55Q9
3678A96K6p9j23l67K56o9J14J76j19j0k39l53N26J39k7j0J73m19j04L43K46k81
3700ej52L91n01k22O49K94n15Q9k01j54OM86n9j68J45k32j6r6N75l6k30j24P2
3723dr4K02K12p6n81j2J01J12J06K48M2n37k1K17R2L17J48j74o20J31J55N4K27
$$ plain form
3565 -6 -233 -10 -167 -69 381 467 -64 -223 -106 -129 -145 261 307 -315 -391 243 -82 -102 174 81 -104 -325 -100
3588 -100 -108 -120 210 -48 -272 -336 210 -300 -67 371 -139 -156 -119 -9 -138 209 41 -24 -232 32 151 74 -42
3611 -42 20 86 -125 72 73 153 -177 116 -262 -343 92 129 -55 -77 314 121 -84 -100 471 -143 21 120 -121 -322
3635 -322 211 318 -168 107 412 -343 -243 203 144 -230 -66 235 -302 -414 217 11 -136 193 337 -429
3655 -429 -96 -55 -20 -102 87 89 -297 -12 27 -60 -161 51 13 -96 34 183 89 -294 -101 38 -148 107 196
3678 196 222 143 20 -347 -91 -160 -46 130 11 1 -238 -591 -65 74 47 37 210 -209 -313 30 276 -5
3700 -5 -157 234 -267 -489 160 454 -61 28 -173 -327 -321 165 106 -62 83 -149 -165 -261 314 278 48 -76 -4
3723 -4 -98 104 316 240 -341 -353 -252 -140 -34 214 256 -281 -302 -85 7 324 472 298 -322 -191 -36 18 245
3746B45R7k63l97mK71K09K71o8m02k90k71P23P0n1J96m14l71K58J38L11J75j75
3768B58k65l99K59K10L72j63J8o01k05N40K62k27J77l03l47K08K19O33k48l34
3788F4r1k27l9L46L79k01n23J32l27K21N79J2k85K32o88j54O66K14o0l07j08k19
3810c84K22K50K47k35j0l13j65J81L65K21l05o0l57J4L93J93J58j76k75m12M75
3831B7J34J67r3k25k27j06J97L82J14k62j14n10n1M71M40m0k16k29k79J23K87
3852a0M82jn47k6k32J89L26K79m95k7k20j48N44K45r9m1o03j19P4P12O5j98j28
3875B2j64o5K45j05L54j66l14lj69L45J18J56nm64M7QM6L79j19K9k20j59j56M09
3899D9J84J83m77j21l6J25J28L02k12j25m13K63J8J78L81m22j82r8L19K29m1r1
$$ plain form
3746 245 342 79 -318 -322 -51 158 429 361 -41 -331 -602 121 191 140 336 -78 -449 -191 -53 258 433 258
3768 258 -7 -406 -147 63 435 272 290 -311 -516 24 286 59 236 -67 -414 -206 13 646 398 64
3788 64 -27 -254 -293 53 432 231 -292 -160 -487 -266 313 325 40 272 -416 -570 96 310 250 -57 -165 -384
3810 -384 -162 88 335 100 90 -223 -388 -207 158 379 74 14 -343 -329 64 257 415 239 -36 -448 27
3831 27 161 328 235 10 -217 -323 -126 256 370 108 -6 -516 -567 -96 344 304 88 -141 -420 -297 -10
3852 -10 472 471 -76 -102 -334 -145 181 460 -35 -62 -282 -430 114 359 260 219 -384 -503 -429 283 348 150 22
3875 22 -142 -207 38 -67 287 121 -193 -196 -365 -20 98 254 249 -215 -168 -160 -114 265 146 175 -45 -204 -360 49
3899 49 233 416 -61 -182 -218 -93 35 337 125 0 -413 -150 -132 46 427 5 -177 -275 44 273 232 141
3921A41j22k28R2J87k16K14K41k86j12j73K00O4J40j8k76J46J47j93M54j72k37
3942gj79Q4J55j5J33m6k06k09J97KL03n8N2l87J77r6K81m06M19m2k20k48M05J3
3966A02j7K6j29J4J09p0J23j12M6P6m56K99J64k84K0K61m7k16j01K78k44J71o0
3989d7o6K73k58M2O2L6K04j79p0r5J41k37R4J56J7p0m9J28o6j1J81l25j9J16j86
4014b28k0M03K5k94p1K7K23k46J13K49k17k4j22J04J47R2J37l55M3j71L41J00
4036B56o5m1k98P3M6m3Q5K70n8m91N0R3O4J70j91K07m10j73M04K30p6J87k03l32
4060b46P0N85j95r9P6k06k74QL99K50k84J15m13J4P7L53N4j9j99l18k38M10M46
4083C66J9j59K5o37j88P13K91l94J07n1l96R7K97L87m61p8j29l08K32M40L30l52
$$ plain form
3921 141 19 -209 -117 70 -146 68 309 23 -89 -262 -62 2 142 124 -152 -6 141 -52 402 230 -7
3942 -7 -186 -102 53 38 171 125 -81 -290 -93 -91 212 154 206 -181 -4 -100 181 -225 194 152 -68 -316 89 102
3966 102 85 111 -18 -4 105 35 158 46 92 168 -288 11 175 -109 -89 172 125 -91 -192 86 -158 13 -47
3989 -47 -113 160 -98 -56 6 42 246 67 -3 -98 43 -194 -100 56 73 3 -46 82 16 5 186 -139 -158 -42 -228
4014 -228 -248 155 180 -114 -185 -158 65 -181 -68 181 -36 -60 -182 -78 69 161 298 -57 -14 -185 156 256
4036 256 191 150 -148 -75 -29 -72 13 283 225 -266 -216 -123 -59 111 -80 127 -283 -456 -52 178 102 289 86 -246
4060 -246 -176 409 214 115 191 -15 -289 -281 118 368 84 199 -214 -200 -123 230 284 265 66 -252 -490 -80 366
4083 366 385 226 251 -386 -574 139 430 36 143 92 -304 -207 90 477 16 -62 -191 -499 -267 173 503 151
4105A51k94R9qJ81R3J76l84k24J17j38J83M83J1o13J10r5L2K81L45m18J7k98J14
4128g9K50n8K82k42n03K08O3J61J31J27m42k10LL7K69N42j32k90n10J1M66J4L0
4151A28J0j73l1j94M11R8K82n96p7j65K61L05r0nj2m44K2N61J2J10j54l16m81
4174e38L83M92j30j33J93l80l67L11K77q2mj3P7l42M40q1K20j11l23J11k41K11
4196c0M44l56p0j23j24K3N7N16j90l63P0K7p0K08M67j08k66k41rJ02R2M02l95
4219F3l35K61l02K01K87J34j36l47J7M3n7M10k2k55j62l8L02j88M37j73j85l4
4241g9P4K4N4J69k57j41j16K51K21j99m9j18K4N3j33M10n4m2l08p8J53K15J46
4264B20j05rj04k45K05J61k04J28J9j03L9kJ79j93Q5K8k96J47J29j9J65j80m7
$$ plain form
4105 151 -143 -44 -52 129 222 398 14 -210 -93 -231 -48 435 446 -167 -57 -152 -120 161 506 88 105 -193 -79
4128 -79 171 113 395 153 -350 -142 -79 82 213 340 -102 -312 -309 -272 -3 539 407 117 -393 -382 84 98 128
4151 128 138 -35 -66 -260 151 249 531 -65 -142 -307 -46 259 169 164 152 -292 -270 291 303 413 259 -57 -538
4174 -538 -155 337 207 74 267 -113 -480 -169 108 26 22 9 86 -256 184 103 323 212 -111 0 -241 -30
4196 -30 414 58 -12 -135 -259 -236 -179 337 147 -216 -146 -119 -189 19 486 378 112 -129 -138 -36 56 458 63
4219 63 -272 -11 -313 -112 175 309 173 -174 -157 -114 -171 239 217 -38 -200 -238 64 -124 313 140 -45 -79
4241 -79 -5 19 73 242 -15 -156 -272 -21 200 1 -48 -166 -142 -89 -222 188 134 92 -216 -294 -141 74 220
4264 220 115 106 2 -243 -38 123 -81 47 66 -37 2 0 179 -14 71 99 -197 -50 79 60 225 45 -2
4287bK23k96L22k38p1J08k00o4j8K65k0R2k77M04l01NL05j44J43n34M01k60K83
4310A26k21lj54J23M2J35j52J27M2k71K35K4pJ45k66k33L40r1J22l4J9K6j39J78
4334A13l27N0K59k79K15J9j31O8K4k5J58k78k1J96K90l63o2j4R3j1Pj22K27k58
4358a72J6j39L30j14L08k08j52J21k6J75j56J21j85o6q0L29j19q6PO7R1q8L84
4381C58m18K38l17p4N4J46K18j30J7m3k11J70N4j01K7l4J9l13L07j10L02l12j
4404a54q3K03nK06j02p8Q2q7o1K22Q4J09l52L4j48K44J05m8j69R3l70M0K77p4
4428c2N2j41j68P4K40P2J61k15o3k80J95J76m8N07m76k88N7pR0J10Q5m9j15j25
4452a88J58J80M0k79J34j74MK7J04J1J74J2l72m8J66K43k66%R1k86K55J7L42l21
$$ plain form
4287 -2 221 -75 247 9 -62 46 -154 -218 -236 29 9 101 -176 228 -73 -68 237 93 236 -298 103 -157 126
4310 126 -95 -98 -252 -129 -87 48 -104 23 65 -206 29 53 46 191 -75 -308 32 -59 63 29 48 74 -65 113
4334 113 -214 -164 95 -184 31 50 -81 -13 11 -14 144 -134 -155 41 331 -32 -94 -108 -15 -26 -19 -141 86 -172
4358 -172 -156 -295 35 -79 229 21 -131 -10 -36 139 -17 104 -81 -147 -227 102 -17 -103 -96 -29 62 -26 358
4381 358 -60 178 -139 -213 -159 -13 205 75 92 49 -162 8 62 -39 -12 -46 -27 -340 -33 -143 159 -153 -154
4404 -154 -237 -34 -39 167 65 -13 69 -18 -79 143 227 336 -16 18 -130 114 219 171 2 95 -275 -235 42 -32
4428 -32 20 -121 -289 -215 25 97 258 43 -20 -300 -105 71 23 530 54 -234 -177 -184 -94 16 101 52 -63 -188
4452 -188 -30 150 190 -89 45 -129 -125 -98 6 17 191 203 -169 -217 -51 192 -74 -74 17 -269 -14 3 345 24
4476B4r9n6J20m7M7K44k39K7J45o51L18L75q1K0k81j1j41K90J38j4j44l3n8n6
4500a63J19P8Rj89J06J98m17K22K03lk35k28J02j41M01J4l8r8Kj47L15J30q5l50
4524a95J33M4J2M17r3l53Q6k13K12n7k4p9R3k05J72K1j77K39On7k21O2J18L9M0
4549B0J52K6k30L9N5m5J60Oj06l26J47j71K96J77k10M6j39J11R3k8n1J95k09k36
4573b28J24L2R9J82j84j97Q2R5R7J8m6k52J67j08J84N9k5M5k38j12K47m6m7N4
4597Bj20J80q4j17L82j5k35m0j02j2J40K80k85L1m3J04k29P2J73lk40R8O7l9%
4622c5j90J75p3J13Q8l05J87K0k1OR1p7n3J06qkj9K0K8no1Jj1k7J22k36J4J88
4650C6r5n4R7J74m4l06L49j37pK9l7nj91M01l03N6Q2L3m7r3n8J40k43J79q7m7
$$ plain form
4476 24 -75 -131 -11 -58 -11 233 -6 21 166 -485 -167 208 127 147 -134 -145 -286 4 142 128 -16 -49 -107 -163
4500 -163 -44 34 43 -146 -40 158 -259 -37 166 163 -72 -300 -198 -339 62 76 38 -60 -58 -205 110 240 155 -195
4524 -195 -62 -18 -6 411 318 -35 51 -162 50 -7 -31 -110 -17 -222 -50 -29 -206 33 39 -18 -239 -177 -59 -20 20
4549 20 172 198 -32 7 62 17 177 183 77 -249 -102 -273 23 200 -10 36 -103 8 101 73 22 217 8 -228
4573 -228 -104 -72 27 209 25 -172 -90 5 102 120 74 -178 -11 -119 65 124 99 144 -94 -206 41 -5 -52 2
4597 2 -118 62 -22 -139 243 228 -7 -47 -149 -161 -21 259 -26 5 -38 66 -163 -91 82 79 -161 -63 4 -35 -35
4622 -35 -225 -50 -123 -10 78 -227 -40 -20 -41 -35 56 -21 -74 32 24 22 3 23 51 46 -15 -14 -25 -52 70 -166 -152 36
4650 36 -59 -113 -16 158 114 -192 157 20 13 42 5 0 -191 210 -93 -37 45 78 31 -62 -120 20 -223 -44 -131 -178
4676a78M17k14J33q6k0J19r6n8L8q5K0L7N5mo0m6J26j60k17L36l07K64O2q5J65
4701A56Lj10j84O0L43k39Q6j37K6o1J47K26k80j21L6j97L0L08k06J42m4O5k10
4724a61Q1L7M05k88L3k53J17P7M3L40n06j80J54L44k63j07p7L16k90J22jq4R0
4747e1p3j09JK65O2j39j80K92j30r8L12pk79J03J75m01J67O7p7J25M9P0j11K7
4771F0j38K93k49l9L7j94j3M17j98K5Q6m37J40L42rk3l4J34j06q6j81K27M3j3
4795H4r2k80L06j34M20k10j84o1P7l9K59m5J27l66O8J56k68L10k5n6Q2j76j73
4818b20J11M04k82L16m33k02L5R8J28K74j92J3j77j12K33O1P4k02J33k45R1K63
4840A69L4J85m78j8k1jK81n1l5j75R8l37L83j75J61j80R7K8j57L84N0k28J05k93
$$ plain form
4676 -178 239 25 158 72 52 171 75 17 55 -30 -10 27 82 78 18 -28 98 -62 -279 57 -250 14 76 -9 156
4701 156 159 49 -135 -75 268 29 115 -22 4 -57 90 316 36 -85 -49 -246 -216 92 -114 28 -16 49 -161
4724 -161 -80 -43 362 74 107 -146 -29 48 91 431 -75 -255 -101 243 -20 -127 -204 112 -178 -56 -57 -141 -51
4747 -51 -124 -233 -232 33 95 -44 -224 68 -62 -160 152 145 -134 -31 144 -257 -90 -23 -100 25 74 144 33 60
4771 60 -78 215 -34 -73 -36 -230 -243 174 -24 1 87 -350 -210 132 123 100 66 200 94 8 -173 54 97 84
4795 84 -8 -288 18 -116 304 94 -90 -151 -74 -113 146 101 228 -138 -70 86 -182 128 103 47 129 -47 -220
4818 -220 -109 295 13 329 -104 -306 -271 -173 -45 229 37 50 -127 -239 -6 55 129 -73 60 -185 -94 169
4840 169 203 388 -90 -108 -129 -130 151 100 65 -110 -12 -349 34 -141 20 -160 -63 -35 -192 192 242 14 119 -174
4864a74k3R0J57J2J85l92r5L14J24j05J21k36k88J53J71J13m3Pj41q9L80k70J17
4887H8m1j56N9o3J05M2K06l75l8j2l9J35J17L3ll4l4j90L29k0j87K35r1q0j31
4912a45K73o4L5k88N9k77J32M30j09R6k47j86R9K97J0j71M4J29j09j55P8P0K14
4935B15l07q6J56j74R4K06J72l05o5j0J32j14J71l4J49l45K70Q2l48J91k5P4l46
4958b47J09K04J72q8j40o7J91j97J60lp5M0k09J65K48k27o3L1q0r1J84k14J77
4981b0Q1K2m27L24m7oqK09m10K36K19k08nN4L42m51n3J29j39J82j56J30K95n76
5005b83L2L12o1rn9P5n1J05J8j54k5K21j41J67q6j72J53j12K8k61L84j27k0j10
5029a76L26nl96K32p4K49j6j91J21j18R0J04r3j22o4j17M67l51K26j5k39J94K62
$$ plain form
4864 -174 -197 -107 50 62 247 -145 -240 74 198 93 214 -22 -310 -157 14 127 84 91 -50 -139 241 -29 88
4887 88 47 -109 -50 -113 -8 34 240 -135 -173 -185 -224 -89 28 61 58 24 -10 -200 129 109 -78 157 66 -14 -145
4912 -145 128 64 99 -189 -130 -407 -275 155 46 142 -105 -291 -192 105 115 -56 -12 117 8 -147 -69 1 215
4935 215 -92 -178 -22 -196 -102 104 276 -29 -94 -104 28 -86 85 51 200 -145 125 207 -141 50 25 99 -247
4958 -247 -138 66 238 150 10 -57 134 -63 97 94 19 59 -150 15 263 36 -27 4 -76 -167 17 -197 -20
4981 -20 61 83 -344 -20 -67 -73 -81 128 -282 -46 173 -35 -40 14 356 -95 -148 -19 -158 24 -132 -2 293 -283
5005 -283 -251 61 0 -9 -68 7 -44 61 79 -75 -100 121 -20 147 61 -111 42 -70 -42 -303 81 -46 -66 -176
5029 -176 150 145 -251 -19 -93 156 140 -51 70 -48 42 146 53 -69 -133 -250 217 -134 92 77 -162 32 294
5052B94k77j09O8l5L60l17P9j6p6Q0O3L8o0l4k00L4j2j30M67k51K20j29j25j08
5076a76M18l18J32K5l10J95j19M69k74m8k19J71n0M70m67K64J76n70J40m3K25
5097I1j24P8j33J65k41K04NK0J50j64m9M2k18J62M9k19L59k44J6O7R9J98m29J46
5121C0k12J0L09Q6j28q9p7J13k9Q6J12l40P5K97j89L0K19j98k18R5o9R6j55J14
5145c2J36l16J94l9J78Op3k77P3j1o4K1L24k60K69l19j09J48J29J76j88j17n9
5168b10L00j69P3K3m3j12o3J11M13k41j45N9J31k17n6L03m6j2j65k54K51r4L67
5191B04k77K92j54j39M3J02l8J32j50j65L16j69L95m30j6KM1k02L34j77J65N2
5213A61j54j85J03Q3L8J56j05m0j71J92J4r8k0l4J63k06J89lk78M96n70K30K99
$$ plain form
5052 294 17 -92 -24 -59 301 -16 63 47 -29 51 114 152 92 58 -142 -108 -120 -250 217 -34 186 57 -68 -176
5076 -176 242 -76 56 81 -229 -34 -153 316 42 -6 -225 -54 -104 366 -101 163 339 -231 -91 -134 91
5097 91 -33 45 -88 77 -164 40 45 65 215 51 2 44 -174 -12 37 -182 177 -67 -51 16 115 313 -116 30
5121 30 -182 -172 137 223 95 6 -71 42 13 99 211 -129 -54 243 54 84 303 105 -113 -18 -87 9 -146 -32
5145 -32 104 -212 -18 -57 121 127 54 -223 -150 -161 -225 -204 120 -140 129 -190 -299 -151 -22 154 -34 -151 -210
5168 -210 90 -79 -6 17 -26 -138 -201 -90 323 82 -63 -4 127 -90 -146 157 111 99 -66 -320 -69 -163 204
5191 204 -73 219 65 -74 -31 71 33 165 15 -150 166 -3 392 -38 -54 -52 -11 -213 121 -56 109 161
5213 161 7 -178 -75 8 46 202 97 57 -114 78 92 -6 -26 -60 103 -103 86 83 -195 301 -269 -39 260
5236B60j68MJm4j00J33l7J29M7r5j10k48L92l07J38jj58N1j21M08j49p9J89rp7
5261D9j17K07k38P2L6J02k96J93N07j84k48o2M5M0j15l35K37R4LL6m5j74K35%
5285D2M5r9p7L7o4J41N8r7k0P9j40K14rk35K01k50J21q1k6L74j53o1N5Qp5N8K8
5312G4o4k64K08L4J0K31m8k87k8J19K8m2K21j28Ll0r8L8j89J60P8K7J75k80Q9
5337C7J6j26j4n6j2K52j20J88K5l09J60l7J58k10J66L2k52J96m4j00J81N2k20
5360c7j96J37O5l4kk9N3K87m09L29J6l04q5M90k04j41J96j91k98M07k17J82r4
5383g9J31k65L14l4N8Ok30K31k72K20R4n3j34q9J31J44j65O0qP7j59l9K09k33
5407h5J20J11j89j07Q6mK11m7M6j27k16K35j8K0K5j34J87j18j30K69j36j7J9J68
$$ plain form
5236 260 92 96 97 53 -47 86 49 178 225 130 20 -228 164 -143 -5 -6 -164 -113 -234 174 25 -54 135 126 49
5261 49 -68 139 -99 -27 9 111 -185 8 515 331 83 21 66 106 -9 -344 -107 -13 -10 26 -19 -193 42 42
5285 42 87 -12 -89 -52 -116 25 83 -14 -34 45 -95 119 110 -125 76 -174 -53 -134 -160 214 61 0 55 63 -12 46 74
5312 74 10 -254 -46 -12 -2 229 181 -106 -134 -15 13 -29 192 64 67 37 -61 -23 -212 -52 26 53 228 -52 37
5337 37 53 -73 -87 -143 -155 97 -23 165 190 -119 41 4 162 -48 118 150 -102 94 50 -50 131 183 -37
5360 -37 -233 -96 -31 -65 -67 -96 -43 244 -165 164 180 -124 -209 281 77 -64 132 -59 -357 50 -167 15 -79
5383 -79 52 -213 101 67 125 131 -99 132 -140 80 174 121 -13 -102 29 173 8 68 60 137 -22 -61 148 -85
5407 -85 35 146 -43 -150 -64 -68 143 96 142 15 -201 34 16 36 61 -73 114 -4 -134 135 -1 -18 1 169
$$ [...]
8191B4
##END NTUPLES=NMR FID
##END=
