##TITLE=1H_E3eN3-1
 CDCl3
 8 sc, 
 25.12.2023
##JCAMPDX= 6.0         $$ Bruker NMR JCAMP-DX V2.0
##DATA TYPE= NMR FID
##DATA CLASS= NTUPLES
##ORIGIN= UXNMR, Bruker Analytische Messtechnik GmbH
##OWNER= root
$$ XWIN-NMR		Version 3.5
$$ Mon Dec 25 14:18:15 2023 Russian Standard Time (UT+4h)  she@DPX200
##.OBSERVE FREQUENCY= 200.1313
##.OBSERVE NUCLEUS= ^1H
##.DELAY= (6, 6)
##.ACQUISITION MODE= SIMULTANEOUS
##.ACQUISITION SCHEME= undefined
##.AVERAGES= 8
##.DIGITISER RES= 18
##SPECTROMETER/DATA SYSTEM= spect
##.PULSE SEQUENCE= zg30
##.SOLVENT NAME= CDCl3
##.SHIFT REFERENCE= (INTERNAL, CDCl3, 0, 15.7039)
##AUDIT TRAIL= $$ (NUMBER, WHEN, WHO, WHERE, WHAT)
$$ ##TITLE= Audit trail, XWIN-NMR		Version 3.5
$$ ##JCAMPDX= 5.01
$$ ##ORIGIN= Bruker BioSpin GmbH
$$ ##OWNER= she
$$ F:/spectra/data/she/nmr/H-F/1/audita.txt
$$ ##AUDIT TRAIL=  $$ (NUMBER, WHEN, WHO, WHERE, WHAT)
(   1,<2023-12-25 14:17:02.04 +0400>,<she>,<DPX200>,
      <created by zg, POWCHK disabled, PULCHK disabled
       configuration hash MD5:
       00 E9 B6 7A A2 85 ED C7 34 08 36 98 17 FE 4E 26
       data hash MD5: 16K
       3F 48 D8 C0 93 59 F2 6A CB 42 16 60 7E 1B 5F 97>)
$$ ##END=
$$ 
$$ hash MD5
$$ 45 50 EC AA BA FB 32 F4 FD E8 18 01 28 DD 8A 3B
##$RELAX= 
##$RELAX= 
##$RELAX= 
##$RELAX= 
##$RELAX= 
##$RELAX= 
$$ Bruker specific parameters
$$ --------------------------
##$DU= <F:/spectra>
##$EXPNO= 1
##$NAME= <H-F>
##$PROCNO= 1
##$TYPE= <nmr>
##$USER= <she>
##$AMP= (0..31)
100 100 100 100 100 100 100 100 100 100 100 100 100 100 100 100 100 100 
100 100 100 100 100 100 100 100 100 100 100 100 100 100 
##$AQSEQ= 0
##$AQ_mod= 1
##$AUNM= <au_zg>
##$AUTOPOS= <>
##$BF1= 200.13
##$BF2= 200.13
##$BF3= 200.13
##$BF4= 200.13
##$BF5= 200.13
##$BF6= 200.13
##$BF7= 200.13
##$BF8= 200.13
##$BYTORDA= 1
##$CFDGTYP= 0
##$CFRGTYP= 5
##$CHEMSTR= <none>
##$CNST= (0..31)
1 1 145 1 1 1 1 1 1 1 1 1 1 1 1 1 1 1 1 1 1 1 1 1 1 1 1 1 1 1 1 1 
##$CPDPRG= <>
##$CPDPRG1= <>
##$CPDPRG2= <>
##$CPDPRG3= <>
##$CPDPRG4= <mlev>
##$CPDPRG5= <mlev>
##$CPDPRG6= <mlev>
##$CPDPRG7= <mlev>
##$CPDPRG8= <mlev>
##$CPDPRGB= <>
##$CPDPRGT= <>
##$D= (0..31)
0 1.2 0 0 0 0 0 0 0 0.06 0 0.03 0 0 0 0 0.0002 0 0 0 0 0 0 0 0 0 0 0 0 
0 0 0 
##$DATE= 1703499421
##$DBL= (0..7)
120 120 120 120 120 120 120 120 
##$DBP= (0..7)
150 150 150 150 150 150 150 150 
##$DBP07= 0
##$DBPNAM0= <>
##$DBPNAM1= <>
##$DBPNAM2= <>
##$DBPNAM3= <>
##$DBPNAM4= <>
##$DBPNAM5= <>
##$DBPNAM6= <>
##$DBPNAM7= <>
##$DBPOAL= (0..7)
0.5 0.5 0.5 0.5 0.5 0.5 0.5 0.5 
##$DBPOFFS= (0..7)
0 0 0 0 0 0 0 0 
##$DE= 6
##$DECBNUC= <off>
##$DECIM= 32
##$DECNUC= <off>
##$DECSTAT= 4
##$DIGMOD= 1
##$DIGTYP= 9
##$DL= (0..7)
0 120 120 120 120 120 120 120 
##$DP= (0..7)
150 150 150 150 150 150 150 150 
##$DP07= 0
##$DPNAME0= <>
##$DPNAME1= <>
##$DPNAME2= <>
##$DPNAME3= <>
##$DPNAME4= <>
##$DPNAME5= <>
##$DPNAME6= <>
##$DPNAME7= <>
##$DPOAL= (0..7)
0.5 0.5 0.5 0.5 0.5 0.5 0.5 0.5 
##$DPOFFS= (0..7)
0 0 0 0 0 0 0 0 
##$DQDMODE= 0
##$DR= 18
##$DS= 0
##$DSLIST= <SSSSSSSSSSSSSSS>
$$ [...]
##$SUBNAM2= <"">
##$SUBNAM3= <"">
##$SUBNAM4= <"">
##$SUBNAM5= <"">
##$SUBNAM6= <"">
##$SUBNAM7= <"">
##$SUBNAM8= <"">
##$SUBNAM9= <"">
##$SW= 18.0517328524113
##$SWIBOX= (0..15)
0 0 2 0 0 0 0 0 0 0 0 0 0 0 0 0 
##$SW_h= 3612.71676300578
##$TD= 16384
##$TD0= 1
##$TE= 0
##$TE2= 300
##$TE3= 300
##$TEG= 300
##$TL= (0..7)
0 120 120 120 120 120 120 120 
##$TP= (0..7)
150 150 150 150 150 150 150 150 
##$TP07= 0
##$TPNAME0= <>
##$TPNAME1= <>
##$TPNAME2= <>
##$TPNAME3= <>
##$TPNAME4= <>
##$TPNAME5= <>
##$TPNAME6= <>
##$TPNAME7= <>
##$TPOAL= (0..7)
0.5 0.5 0.5 0.5 0.5 0.5 0.5 0.5 
##$TPOFFS= (0..7)
0 0 0 0 0 0 0 0 
##$TUNHIN= 0
##$TUNHOUT= 0
##$TUNXOUT= 0
##$USERA1= <user>
##$USERA2= <user>
##$USERA3= <user>
##$USERA4= <user>
##$USERA5= <user>
##$V9= 5
##$VALIST= <valist>
##$VCLIST= <CCCCCCCCCCCCCCC>
##$VD= 0
##$VDLIST= <DDDDDDDDDDDDDDD>
##$VPLIST= <PPPPPPPPPPPPPPP>
##$VTLIST= <TTTTTTTTTTTTTTT>
##$WBST= 1024
##$WBSW= 4
##$XGAIN= (0..3)
0 0 0 0 
##$XL= 0
##$YL= 0
##$YMAX_a= 45972
##$YMIN_a= -61349
##$ZGOPTNS= <>
##$ZL1= 120
##$ZL2= 120
##$ZL3= 120
##$ZL4= 120
##$ABSF1= 10
##$ABSF2= 0
##$ABSG= 5
##$ABSL= 3
##$ALPHA= 0
##$AQORDER= 0
##$ASSFAC= 0
##$ASSFACI= 0
##$ASSFACX= 0
##$ASSWID= 0
##$AUNMP= <proc_1d>
##$AZFE= 0.1
##$AZFW= 0.1
##$BCFW= 1
##$BC_mod= 2
##$BYTORDP= 1
##$COROFFS= 0
##$CY= 11.3945322036743
##$DATMOD= 1
##$DC= 2
##$DFILT= <>
##$DTYPP= 0
##$F1P= 15.7292609196834
##$F2P= 12.9074282941183
##$FCOR= 0.5
##$FTSIZE= 0
##$FT_mod= 4
##$GAMMA= 1
##$GB= 0.15
##$INTBC= 1
##$INTSCL= 1
##$ISEN= 128
##$LB= 0.24
##$LEV0= 0
##$LPBIN= 0
##$MAXI= 10000
##$MC2= 0
##$MEAN= 0
##$ME_mod= 0
##$MI= 1.114404
##$NCOEF= 0
##$NC_proc= 0
##$NLEV= 6
##$NOISF1= 3.799351
##$NOISF2= 2.8
##$NSP= 1
##$NTH_PI= 0
##$NZP= 0
##$OFFSET= 15.70392
##$PC= 1
##$PHC0= -24594.48
##$PHC1= 13.45273
##$PH_mod= 1
##$PKNL= yes
##$PPARMOD= 0
##$PSCAL= 0
##$PSIGN= 0
##$REVERSE= no
##$SF= 200.130013532006
##$SI= 16384
##$SIGF1= 3
##$SIGF2= 2
##$SINO= 400
##$SIOLD= 16384
##$SREGLST= <1H.CDCl3>
##$SSB= 0
##$STSI= 0
##$STSR= 0
##$SW_p= 3612.71676300578
##$SYMM= 0
##$S_DEV= 0
##$TDeff= 0
##$TDoff= 0
##$TI= <>
##$TILT= no
##$TM1= 0
##$TM2= 0
##$TOPLEV= 0
##$USERP1= <user>
##$USERP2= <user>
##$USERP3= <user>
##$USERP4= <user>
##$USERP5= <user>
##$WDW= 1
##$XDIM= 8192
##$YMAX_p= 0
##$YMIN_p= 0
$$ End of Bruker specific parameters
$$ ---------------------------------
##NTUPLES= NMR FID
##VAR_NAME=  TIME,          FID/REAL,        FID/IMAG
##SYMBOL=    X,             R,               I
##VAR_TYPE=  INDEPENDENT,   DEPENDENT,       DEPENDENT
##VAR_FORM=  AFFN,          ASDF,            ASDF
##VAR_DIM=   8192,          8192,            8192
##UNITS=     SECONDS,       ARBITRARY UNITS, ARBITRARY UNITS
##FACTOR=    0.0002768,     1,               1
##FIRST=     0,             0,               0
##LAST=      2.2672688,     0,               0
##MIN=       0,             -61349,          0
##MAX=       2.2672688,     45972,           0
$$ Real data points
##PAGE= N=1
##DATA TABLE= (X++(R..R)), XYDATA
0 0 0 0 0 0 0 0 0 0 0 0 0 0 0 0 0 0 0 0 0 0 0 0 0 -4 8 -8 8 -8 8 -8 8 -13 16 -16 16 -20 22 -24 28 -30 33 -37 41 -45
44 -45 51 -55 61 -67 74 -82 90 -99 109 -119 135 -150 165 -186 209 -237 274 -317 374 -453 567
65 567 -740 1043 -1668 3433 -17895 -61349 7249 22193 -22573 10878 44478 -11198 -28527
78 -28527 12440 1460 -15438 23883 23489 -24535 -19095 8249 -7322 -8968 15690 6827 -13362
91 -13362 -2479 4662 -3999 2251 10734 -1082 -11447 -4138 9421 12228 2944 -1995 1185 -6226
105 -6226 -13287 3896 16257 -220 -8661 -2575 -12986 -13984 14297 19313 -3901 -1427 5927 -15478
119 -15478 -14331 18080 17057 -5375 1563 3631 -16676 -7756 18054 7371 -8271 2525 -784
132 -784 -18561 -5976 13586 2801 -6032 3796 -136 -9162 4195 13499 71 -5163 4041 -1403
146 -1403 -8141 4985 12327 -2317 -8762 28 -1135 -6057 4202 9292 -4925 -10418 -998 -602
160 -602 -3307 8153 12454 -2304 -7548 786 430 -1618 7587 8267 -4669 -7133 -234 -2718 -2896
175 -2896 6561 5539 -6328 -6313 436 -2021 -2337 5029 4703 -3228 -2351 3281 1718 29 4677 3259
191 3259 -4053 -3119 2797 1037 -2529 901 586 -5677 -4099 2808 1582 -2574 1325 1329 -5219 -2015
207 -2015 6247 3147 -1262 3438 2611 -4652 -1258 5638 897 -2717 2407 -292 -6938 -1567 4028
222 4028 -2372 -3213 3489 100 -5417 762 4638 -1674 -634 5111 670 -2790 2981 3227 -3026 -441
238 -441 3704 -1418 -3683 1340 175 -4424 -1191 2121 -1541 -2091 1712 206 -2093 1218 3422 611
254 611 -84 2157 816 -1089 1358 2476 -625 -2111 -493 -985 -2310 -70 1789 -1050 -2924 -887
270 -887 -140 -964 1246 3547 356 -1764 794 1458 598 2711 3770 -1092 -3417 -520 -586 -1588 1435
287 1435 2058 -3370 -4273 -505 74 -630 2551 2291 -2425 -2495 1359 1524 1455 4043 2318 -2759 -2265 1394
305 1394 1038 153 1791 -799 -5235 -3455 630 715 550 2027 -696 -4217 -1467 2837 2475 2052 2566
322 2566 -865 -3694 -575 3276 2418 1262 595 -3029 -5400 -1526 2216 1078 -79 -471 -3029 -4042
338 -4042 569 4207 2837 1134 128 -2480 -2412 2091 4728 2200 277 -727 -3318 -3136 1546 3478
354 3478 428 -2217 -2517 -4012 -2256 2720 4253 1019 -1275 -1195 -1922 38 4572 4551 97 -1969 -1667
371 -1667 -2357 -57 3843 2872 -2072 -3719 -2602 -2497 39 3655 2350 -2418 -2971 -1136 -425 2320
387 2320 5483 2847 -2110 -2182 -540 -182 1900 3984 385 -4351 -3344 -828 -214 1437 2897 -970
403 -970 -4672 -2895 308 1319 2874 3782 -358 -3463 -1034 2296 2417 2929 2639 -1793 -5383 -1935
419 -1935 1600 1075 1184 1423 -2860 -5335 -1256 2410 1431 1773 1921 -2083 -3849 1285 3945 1341 1754
436 1754 2055 -3047 -3885 1874 2629 -764 -143 -246 -4627 -3443 2665 2253 -788 228 -452 -3866 -811
453 -811 4636 3157 343 1139 -870 -3580 177 4123 2372 -315 -783 -2770 -4032 -847 2325 1539
469 1539 -279 -1297 -1908 -1784 45 2828 2958 257 -521 150 -368 -98 2924 2297 -1921 -1508 731
486 731 -1406 -1454 1999 229 -4538 -1656 1693 -1117 -69 3896 -17 -4134 655 2923 -414 1685
502 1685 4643 -1246 -4501 755 1108 -1753 1891 3091 -3344 -4484 272 -286 -1981 2563 2983 -2592
518 -2592 -2368 1784 135 -470 3475 3047 -1740 -1059 1356 -776 -1473 1453 1011 -1995 -1290 515 -934
535 -934 -1929 123 251 -1187 142 2036 682 -628 510 833 -578 823 3004 1018 -1103 -316
551 -316 -394 -1907 -856 1861 523 -1802 -1030 -458 -2515 -1060 2380 1589 -798 1089 1464 -2052 -966
568 -966 3101 1521 -1286 1871 1764 -3075 -2233 1943 -658 -2921 1806 1676 -3716 -1619 2289 -1792
584 -1792 -2185 4048 2543 -2774 828 2928 -2584 -1365 4639 1328 -2608 1696 1327 -4307 -1617 2829
600 2829 -1238 -2393 2039 73 -3689 265 2054 -1316 -18 2842 512 -833 1757 727 -1100
615 -1100 189 1288 -182 54 182 -1214 -1422 -1126 -1000 231 1030 -315 -453 22 -1671 -822 2666
632 2666 1798 216 2165 882 -2612 -238 2941 -305 -730 2426 -927 -4467 204 1654 -2414 -348
648 -348 2735 -1791 -2931 2331 1269 -2149 1758 2944 -1935 -904 3697 151 -1960 1774 806 -2928
664 -2928 -279 2320 -1397 -2105 731 -1012 -2770 888 2383 -512 -531 1213 -845 -1096 1866 2431
680 2431 304 337 624 -903 -1235 760 999 -4 -872 -783 -1341 -1469 82 764 86 -514 -55 55 -223
699 -223 1105 1853 506 -362 394 447 -259 324 983 -693 -1580 -403 -54 -978 -41 563 -1113 -1663 404
718 404 802 -117 1293 1607 -653 -984 1157 993 -89 1342 1080 -1605 -1275 434 -364 -791 864 45
736 45 -2188 -1127 912 -280 -205 1587 526 -1274 356 1707 51 637 1634 -106 -1340 311 628
753 628 -576 -438 285 -1477 -1468 -90 37 -503 243 264 -667 -481 995 863 484 945 394 -56 -164 649
773 649 376 -98 -356 -452 -1000 -867 73 -69 -327 -566 -294 -458 16 826 1159 302 162 587 222 454 1087
794 1087 886 -194 -460 -283 -627 -643 457 145 -1128 -842 -271 -674 -81 999 462 -346 207 678 176
813 176 570 1106 585 -265 163 188 -588 -277 -106 -561 -941 -341 -355 -759 -84 451 -366 -458 503 573 177 615
835 615 778 60 116 578 513 -126 -36 -211 -863 -706 -248 -374 -481 -319 -292 -944 -357 568 619 99 411 729
857 729 9 60 821 753 -39 353 -20 -657 -517 237 -492 -871 -175 -304 -982 -386 589 -72 -143 437 519 32
879 32 689 758 76 233 444 96 -109 85 -23 -606 -640 -354 -604 -728 -38 31 -307 -221 134 391 405 401 872
902 872 422 160 425 483 -205 -253 420 -110 -912 -398 -185 -950 -526 101 -270 -587 401 791 -469 409 999
923 999 65 91 1397 489 -440 629 346 -587 -260 414 -496 -948 -166 -238 -1033 -487 434 -403 -133 387
943 387 359 -157 276 706 707 544 422 496 -283 -627 -72 -85 -534 -661 76 -641 -1206 -156 -109 -805 256 1132
965 1132 -143 -347 1103 431 -577 1174 1303 -337 -88 817 -723 -1113 524 15 -1450 -45 395
982 395 -1360 -899 707 -114 -527 708 812 -316 213 1046 29 18 689 464 277 189 -279 -377 -859 -754
1002 -754 46 21 -278 -445 6 -906 -781 1021 775 -69 941 1187 -735 -349 1349 214 -577 1260
1020 1260 208 -1944 -454 673 -1334 -963 1328 -372 -1799 634 848 -1575 295 1990 -135
1035 -135 -464 1728 527 -1306 317 1001 -904 -8 1357 -438 -1304 -154 -749 -1268 285 695 -96
1052 -96 -145 -158 -539 -67 730 983 838 790 -31 -317 130 -138 74 824 -269 -1126 -309 -662 -1230 313 874
1073 874 -603 -623 705 -393 -1081 1231 1125 -762 720 1673 -590 -662 1145 -174 -1437 409 726
1090 726 -1199 -606 603 -1147 -1729 513 912 -458 291 758 -693 -843 1017 953 207 1130 974 -888
1108 -888 -737 177 192 -375 321 281 -965 -1293 -293 -271 -389 432 856 62 -568 278 375 49 489 971 284
1129 284 -111 346 -71 -605 -428 180 -564 -524 204 -196 -994 -175 71 -49 131 771 704 -186 234 285 386
1150 386 453 1011 666 -297 -468 -300 -879 -499 401 54 -616 -256 105 -931 -367 1145 510 -107 592 734
1170 734 -543 140 1233 91 -345 585 168 -1087 -261 396 -737 -873 394 -309 -1011 353 418 -794
1188 -794 -94 748 88 -82 1000 420 -559 167 651 106 -127 664 -99 -1023 -271 -55 -567 -75 144 -280
1208 -280 -303 -58 -60 196 592 655 340 269 256 214 244 223 14 13 -221 -696 -276 -268 -475 -640 -19 -383 -302 135 190
1233 190 -293 188 673 88 -43 822 361 48 310 306 -662 31 295 -407 -616 169 -348 -970 34 412
1253 412 -226 -11 600 -30 -39 854 459 -78 476 267 -301 -59 249 -340 -405 64 -191 -650 -245 -103 -497
1274 -497 -358 217 72 48 465 346 298 328 474 192 207 499 293 -137 -84 -91 -377 -485 -271 -145 -350 -427 -351
1297 -351 24 -23 38 335 248 189 403 343 427 287 207 24 -83 184 -103 -299 -187 -43 -294 -313 -67 -180 -358
1320 -358 83 467 128 93 443 -9 255 381 185 213 193 268 25 -56 6 -250 -377 -424 -332 -479 -126 -47 -91
1343 -91 -16 241 331 -74 598 586 224 110 464 120 65 59 -61 100 -353 -437 -396 -445 -335 -125 -238 -200 -161 125
1367 125 154 335 423 421 352 469 131 163 -35 52 -140 -239 -193 -97 -275 -410 -375 -606 -373 -92 -10 54 76 90 32
1392 32 30 394 573 118 192 185 35 -34 -93 2 -190 -148 -209 -427 -278 175 -58 -58 -173 -72 20 354 394 470 151
1417 151 241 50 35 -57 149 93 -230 -546 -259 -147 -369 111 -131 -128 -501 -116 -68 250 510 307 124 124 433
1440 433 88 225 393 72 -73 -296 -90 -315 -264 -156 -323 -475 -195 124 -48 244 376 22 -43 300 489
1461 489 364 291 247 -211 -363 3 240 101 -121 -98 -464 -577 -366 229 280 -133 20 230 -200 142 641
1482 641 410 139 220 311 -220 -45 663 99 -430 -52 -159 -752 -234 130 -451 -368 225 51 -488 107 441
1503 441 -58 316 653 254 0 553 86 -393 -57 63 -202 -161 46 -390 -517 -460 -407 -124 163 167 333 -73
1525 -73 -5 233 260 270 572 523 -79 -490 -46 117 -308 192 233 -305 -663 -88 -406 -505 265 631 -180 -53
1547 -53 541 151 -178 622 392 -236 321 575 -227 -286 219 -252 -765 34 148 -573 -393 89 -450 -234 455
1568 455 340 33 170 285 -63 26 381 510 286 243 -63 -361 -367 -140 -303 65 -254 -181 -219 -369 -111 256
1590 256 398 70 497 385 -193 95 437 -38 -14 835 150 -549 -275 -178 -664 -538 417 -223 -600 54 -14
1611 -14 -540 135 763 4 92 750 197 -286 277 309 -205 -11 508 -75 -325 -95 -177 -491 -198 -43 -297
1632 -297 -124 -76 10 -260 208 706 398 416 373 282 -347 -133 236 467 22 46 -185 -647 -861 -216 -25 -81
1654 -81 129 33 -392 -370 269 188 353 618 388 -194 -44 251 164 -46 367 -144 -484 -465 -207 -307 -197 -89
1676 -89 -90 -327 -30 275 419 150 71 26 46 319 626 152 161 -94 -131 -291 42 279 -186 -317 -601 -645 -574 226
1700 226 467 233 -34 -4 -61 -50 627 804 262 -61 -182 -313 -185 216 211 -190 -401 -293 -520 -308 161 152
1722 152 -291 -193 -50 -128 418 788 462 -125 -46 -106 164 398 317 26 -322 -628 -572 -112 0 150 -164 -398
1744 -398 -554 -25 149 460 549 335 -147 -91 123 455 511 310 -119 -420 -730 -86 68 43 200 -410 -712
1765 -712 -376 -12 177 321 399 -143 -156 106 389 606 449 217 -368 -387 10 26 335 57 -357 -657 -233
1786 -233 -136 1 338 113 -304 -334 103 306 572 507 416 -329 10 -6 281 468 366 -136 -301 -462 -103 -253
1808 -253 122 72 -320 -517 -97 -79 415 738 100 208 -118 -73 404 534 331 -55 -207 -469 -468 75 23 -170
1830 -170 -296 -248 -482 -106 291 321 99 -83 -92 79 216 461 546 19 15 -193 -295 388 250 -97 -307 -299 -471
1853 -471 -293 243 107 75 -8 2 -227 129 542 357 365 5 -63 -43 31 164 168 -152 -435 -618 -115 -221 -186 -208
1877 -208 31 -125 -31 267 362 442 207 -37 29 364 265 204 244 15 -315 -389 -106 -89 -87 -21 -66 -225 -233 -263 -412
1902 -412 87 245 75 164 61 284 159 123 156 -232 101 -95 -58 -40 -255 -359 -258 -184 -114 -178 154 19 -26
1925 -26 258 286 6 138 233 151 71 345 228 -51 112 -277 -146 -178 -18 -191 -187 -310 -247 -424 81 120 186 126
1949 126 74 186 118 417 426 145 80 206 -113 -15 -60 -35 -31 -404 -302 -25 -37 -253 55 -20 -294 150 383 -56
1973 -56 13 202 121 11 48 385 -113 -60 -62 -210 -485 -239 -13 -248 79 6 -400 -410 259 285 52 315 416
1996 416 -93 38 264 253 97 284 -97 -342 -383 34 -226 -243 -11 -143 -435 -318 168 168 -106 51 102 272
2018 272 223 284 396 138 -14 -43 -318 52 43 53 -289 -262 -363 -412 -48 411 67 25 -75 -165 -34 311 696
2041 696 180 -236 -122 -99 145 242 482 200 -412 -176 -275 -345 15 480 -12 -280 26 -161 -176 286 577 32
2063 32 -205 102 -140 260 349 339 -120 -487 -114 -106 -395 106 -11 -514 -383 157 126 -11 374 251 -408 -222
2085 -222 98 261 167 564 134 -356 -288 25 20 137 181 -117 -556 -590 -245 33 97 167 63 -471 111 181 375
2108 375 312 439 67 -186 -273 247 -30 91 3 -113 -308 -277 70 -140 -286 -4 -90 -284 189 494 156 60
2130 60 235 121 -154 181 379 264 -184 -293 -436 -271 85 379 -34 -245 -220 -181 -272 256 608 31 -3 278
2152 278 19 -68 378 540 224 101 -22 -311 -64 184 -49 -232 -392 -104 -371 -179 170 -40 -111 -184 153
2173 153 128 230 226 109 -175 -15 -25 89 201 284 -122 -156 -247 -261 131 -240 -9 -124 -356 -225 143 141 221 343
2197 343 314 -53 -140 250 159 39 221 -120 -433 -414 -78 -191 -150 18 -57 -210 -52 298 57 292 100 -230
2219 -230 94 326 235 39 -92 -10 -202 -93 114 8 -371 -332 -151 -303 -127 -22 12 94 -54 176 149 240
2241 240 173 71 190 87 -140 -19 -138 121 177 -173 -114 -12 -40 -93 69 11 -189 -130 -75 62 100 125 265
2264 265 30 42 200 167 91 -200 -99 -284 -34 -75 126 -67 -277 -56 -182 -197 -6 -115 -106 -247 161 154 -93
2287 -93 84 224 152 115 61 -60 17 -130 -22 -87 -156 -113 -1 -71 80 27 1 47 -43 -18 215 54 90 115 244
2312 244 78 342 279 -52 64 -227 -211 -231 -15 -116 94 -91 -11 47 -117 242 89 -24 205 172 24 335
2334 335 179 -21 -23 -29 -122 -98 48 -74 -181 -156 -319 -115 -163 -25 96 157 -41 -40 -7 497 173 155 176 -28 -244
2359 -244 99 24 80 -167 82 -107 -131 -371 -58 -146 -250 -148 -58 -102 21 196 212 101 79 1 155 98 221
2382 221 51 -28 -130 -177 -41 3 21 44 -202 -31 128 -115 254 88 102 143 201 162 252 76 2 102 31 -94
2406 -94 -14 30 48 90 -213 -131 -134 -255 28 198 111 48 187 291 142 281 162 97 123 296 72 175 44 -153
2430 -153 -28 -179 -221 -203 -86 -34 -242 74 7 -234 70 220 250 197 65 -58 114 152 71 192 0 -90 -182
2453 -182 -139 -180 28 -95 31 -144 66 -23 107 118 68 43 87 -130 217 31 338 177 11 -348 -88 -127 -140
2476 -140 -205 -85 -77 -210 243 101 9 -188 39 116 79 72 223 169 6 79 -24 10 31 115 -58 21 -48 -185 -15
2501 -15 -3 135 -164 -65 172 -41 9 -119 171 63 181 470 13 -66 -57 -95 -129 135 159 -228 13 -110 -177 -19
2525 -19 -152 42 16 -109 195 158 184 74 142 28 82 164 104 -14 -88 -74 -245 -317 -23 46 -175 -97 -212 -114 -35
2550 -35 -40 104 143 -84 103 -21 -108 -98 233 171 -5 -22 -226 -319 15 -21 -240 -134 -8 -325 -250 -50 -204 -203
2574 -203 34 94 -149 115 317 16 51 375 -79 71 84 286 -1 -388 -48 -167 -116 -172 -40 -109 -197 29
2596 29 86 21 74 62 191 67 -36 21 -111 36 -125 -172 -124 -160 -43 -187 -129 -82 -223 -6 150 -234 124 8
2620 8 204 119 0 150 -70 97 194 149 -3 -6 -85 -24 -76 -210 -184 -97 -13 67 -105 51 6 303 121 39 217
2645 217 248 -181 -116 359 -161 81 43 -66 -152 79 -60 -200 1 106 -105 -23 279 -24 -15 -53 73 298 -132
2668 -132 228 4 -112 19 -123 -277 -81 -63 -178 -56 47 40 -257 -49 -69 -179 -280 63 30 -34 94 71
2690 71 123 18 -118 -104 93 -20 -78 -69 -77 -61 -79 -133 -254 -97 -140 -16 -28 107 112 284 283 68 -68 90 89 88 -88
2717 -88 124 -37 -142 -49 -69 -136 53 -11 -122 -238 -218 175 269 180 267 42 -317 116 305 78 150 -85 -152 -148
2741 -148 -15 11 -233 -31 -211 -260 -42 -156 -99 -37 -22 57 -179 14 123 211 -148 102 30 55 10 -31 91 32
2765 32 -140 -46 62 -144 -44 77 15 0 38 -295 107 38 181 186 -69 -138 -144 110 215 362 -15 -265 -271 -94
2789 -94 -151 -28 -140 -100 -103 -340 19 93 190 -113 -310 83 64 -47 132 275 -15 -183 -287 113 -67 -69 32
2812 32 -126 -218 -205 -186 98 -110 120 -48 -8 -47 157 204 53 279 50 -109 -96 -202 93 77 -220 -219 -17 -145
2836 -145 -100 14 -14 -194 -116 -58 -124 18 136 -103 52 159 -197 13 183 273 -144 -41 -159 -38 -126 -2
2858 -2 -116 68 -50 -183 -121 263 175 24 -143 46 -203 89 177 -41 -22 123 -187 -259 -45 46 69 44 -107
2881 -107 -61 -21 235 46 128 76 -122 201 -10 212 128 148 6 -28 -213 -110 -58 -57 -83 -78 -141 -161 -230 43 -154
2906 -154 -60 -56 41 99 235 -41 205 60 34 11 148 55 -16 174 -81 -1 4 -157 67 93 2 -19 -128 33 -45
2931 -45 -161 30 97 7 27 38 184 22 -80 7 -158 -269 88 6 -67 -111 -272 -95 65 -189 21 -102 239
2954 239 88 134 -60 98 227 134 152 108 229 17 -6 -117 98 -438 -75 -65 -69 79 -189 -121 73 27 -17 -133
2978 -133 259 170 141 129 49 -18 56 -40 -47 63 213 -55 -19 69 -76 47 53 30 144 -60 146 126 75 138 -60 201
3004 201 -16 221 -59 -14 -159 -117 -85 -199 -31 -123 -38 48 -87 68 41 -8 -28 81 216 217 -111 -64 30 -32 81
3029 81 154 -163 58 164 -169 -116 -139 17 -76 -206 62 171 59 26 92 179 226 -250 -89 136 188 285 92 -45
3053 -45 -27 24 -39 152 -98 62 -233 11 177 205 20 -141 -235 -81 149 50 5 184 165 40 -191 -113 214
3076 214 73 72 -120 -120 -374 -183 239 102 -172 62 -159 49 75 113 189 134 -17 -84 -25 153 208 -380 -29 -16
3100 -16 -47 -318 60 -5 175 -149 -48 -350 -167 102 197 -33 -123 92 17 -7 204 272 -74 -210 -38 -26 -26 50
3124 50 -186 -34 -268 -142 -81 -52 156 7 -59 -148 -32 -44 155 134 195 26 -75 17 69 38 248 24 -70 -146
3148 -146 -49 -86 -86 -66 78 30 -117 301 203 -28 51 -26 -114 10 176 -103 151 139 -119 -57 -11 -35 -201 -96 -88
3173 -88 15 -123 149 98 27 218 -94 -110 -152 218 112 256 219 -174 -140 71 -163 -12 188 93 -249 -231 25
3196 25 43 -31 336 -46 87 -300 17 330 78 177 -71 -92 -62 -24 84 -28 -311 -156 -145 11 -38 77 258
3219 258 -115 -22 -214 -167 207 -17 131 85 49 -6 124 -48 47 -118 -213 -138 54 -96 -2 202 -183 -28 -307
3242 -307 67 37 69 -69 -35 87 269 169 189 223 -41 59 -180 -153 88 -130 -8 -142 -191 -138 -73 26 -173
3265 -173 48 39 -43 96 22 -99 88 29 146 -69 -191 139 -185 -194 98 -188 -217 -33 85 206 21 50 -182
3288 -182 84 75 -85 141 -92 85 -38 1 41 -57 19 -128 -104 48 -264 -108 56 106 -204 287 -42 -142 -253
3311 -253 129 -55 -217 59 191 -14 -39 232 -128 -45 -86 -66 -93 -65 -1 -177 -56 -9 82 53 -14 76 -114 72
3335 72 -175 -8 76 1 139 -155 -2 -76 -126 -159 -65 -154 -213 122 -96 -65 86 -56 178 291 93 91 -149 -237
3359 -237 80 -171 252 167 -152 -206 9 -77 42 -16 -32 -53 -246 -217 -33 -141 126 -70 -27 -15 -44 126 -61
3382 -61 102 147 212 54 -57 -130 -30 -87 26 -45 -122 -13 -166 -125 -68 -46 53 -138 -104 188 114 57 125 41 -92
3407 -92 119 160 60 -138 142 -193 -26 145 129 112 -18 -1 -166 -104 -49 167 32 -16 1 -54 44 347 226 8
3431 8 -129 -61 -224 -108 44 92 -95 134 -246 -311 41 -2 30 6 -178 164 6 46 119 -80 132 193 37 -37
3455 -37 18 143 -147 -156 -269 -134 -109 -107 -183 55 50 -44 -19 -1 269 -81 87 -146 61 -13 21 -47 -66 -126 -111 111
3481 111 -107 -146 -149 -74 -43 -105 50 -435 -64 -43 36 99 9 49 28 27 117 6 -58 -27 62 -132 -35 76 -194 -167 157
3508 157 142 26 83 12 71 13 3 21 220 -82 152 181 -336 -83 -165 -127 -5 -29 -75 11 -85 -161 89 -22 -101
3533 -101 88 -61 -196 325 105 -80 198 5 -78 228 193 -146 -1 -88 -89 -18 157 -127 -23 -28 -209 -126 88
3556 88 213 212 -58 -90 118 191 85 43 1 59 10 -1 -83 -176 6 69 -98 -300 1 153 -23 106 45 -75 3
3581 3 -93 58 117 78 -104 172 13 139 -14 -60 -109 -12 -101 -45 37 -113 -259 -73 -98 -90 -24 12 108 146 73 66 -213
3608 -213 -150 156 -149 177 -136 20 -145 -38 -111 -263 -93 -144 2 -166 27 -84 97 62 112 177 -48 -20
3630 -20 153 -16 -3 -14 -168 -45 25 -192 -68 101 138 25 -115 -146 135 73 -41 79 -95 -16 -6 -33 -8 -47
3654 -47 38 186 -16 -63 -71 -111 -162 -48 70 -84 -62 -245 -175 117 62 -43 96 -181 86 146 62 -30 -15 -54 7
3679 7 13 -6 60 6 -16 -32 47 -190 -19 92 113 -40 154 -31 136 12 92 192 15 -41 97 -5 -133 -141 38
3704 38 -185 -150 -86 98 93 -85 -45 96 -179 58 220 -68 -28 -150 -81 14 97 -113 -111 119 -298 -264 124 -85
3728 -85 169 -55 61 -214 -8 -143 45 193 8 51 30 43 30 -22 114 75 -38 -81 -282 109 59 50 -153 184
3752 184 -132 34 -57 190 -44 6 -178 -43 -137 105 274 -66 -212 -19 121 232 10 -15 -138 -226 -255 41
3774 41 190 -151 117 -64 -20 -131 -45 292 269 303 30 2 -61 118 195 203 -8 -42 76 -68 -34 59 228 -9
3798 -9 -42 -103 -45 -250 340 264 -12 -82 220 36 153 -79 105 -9 137 104 -90 133 185 0 -125 75 94
3821 94 30 -34 23 42 72 -32 -118 237 93 -37 -164 -14 -106 -53 43 165 -75 -154 0 -46 -207 -157 -4 -228
3845 -228 -5 131 34 140 63 97 -7 48 -25 -13 239 151 -116 -88 -203 133 58 54 127 135 -71 -169 3 -40 253
3870 253 69 108 167 165 120 -32 196 -187 -33 -44 4 -5 -46 147 29 112 -58 -174 -228 -22 88 -60 45 -85
3894 -85 77 -47 125 88 64 6 -104 -60 20 111 82 -37 78 -41 1 -58 -13 -249 -64 91 -98 -62 10 65 70
3919 70 243 -179 169 117 -36 77 215 -159 -123 -121 -236 -40 22 7 131 -103 -47 -9 225 3 115 -74 155
3942 155 -65 65 90 1 1 -77 21 20 78 204 -117 41 -137 -15 125 59 -195 -104 -74 -81 -48 -86 -46 -110 135 22
3968 22 142 136 138 -36 34 -14 6 27 -58 73 -62 -32 36 100 -94 64 213 -30 -61 140 -28 -128 24 -177 -62
3993 -62 22 -162 -56 119 -31 109 -47 65 -17 180 -133 -50 -52 185 132 -95 66 -60 -190 -40 14 -84 -39
4016 -39 -13 -75 -106 238 -81 -125 20 -26 -16 126 119 69 -58 -79 -58 50 -243 50 76 -176 81 -224 -228 155 21
4041 21 70 36 -119 -165 -65 41 88 -25 -133 -43 -95 217 -41 78 130 100 -48 47 -134 78 74 81 54 9 -116
4066 -116 -65 -114 69 175 -126 9 -126 12 187 25 -67 -95 135 -32 -89 -173 -67 -187 -121 -107 187 -138 102
4089 102 77 -49 61 99 31 -60 267 25 -56 6 76 44 131 -33 80 101 30 28 122 38 -17 -100 130 -44 102 7
4115 7 -33 -37 -9 9 -134 181 -8 97 93 -126 -44 -44 -2 -13 -122 55 -118 -16 -24 29 109 185 53 -103 -49 -183 238
4142 238 13 -47 227 -53 -103 37 13 49 -176 30 -120 -49 298 61 102 -99 -26 -67 71 74 -44 -60 35 -115
4166 -115 -169 140 189 68 59 -157 127 -167 -269 109 51 -5 5 -28 -176 -71 167 48 -94 63 114 -102 -103 29
4190 29 -75 16 -64 -22 50 -209 -53 -72 -135 -113 73 52 -39 -14 118 38 -5 48 41 158 -110 176 -51 76 -38
4215 -38 -55 -126 102 -225 -93 -162 81 113 -169 91 32 -67 -196 -23 80 246 79 -39 107 63 -159 -28 276
4238 276 -231 -268 -68 -199 11 -7 -102 -98 155 -50 285 172 56 32 243 -7 27 34 -39 227 24 0 82 -83
4262 -83 182 -25 -23 38 -40 -29 210 76 158 280 127 318 186 91 -8 -75 97 -84 -120 -22 23 142 -86 91
4286 91 -221 81 -9 32 -129 -210 -31 73 82 91 8 -75 10 64 99 100 154 96 -134 139 44 -185 -37 -80 -103 50 126
4313 126 79 -52 132 138 137 -24 -119 105 -142 84 32 -77 -44 65 -175 59 -72 -57 31 25 36 10 88 -15 113
4338 113 -88 8 165 28 19 92 -242 -254 -157 -60 -124 17 -22 92 35 141 -3 -91 -109 125 -119 -17 101 -106
4362 -106 66 -70 6 150 24 5 -19 -18 -133 -120 -45 -75 193 -14 81 -123 58 -29 41 -10 -97 134 32 130 55
4387 55 70 140 78 128 -93 156 -67 29 -44 86 -6 23 -1 -171 61 19 84 -179 9 30 -34 126 7 42 -2
4412 -2 96 39 38 -25 -78 117 -4 -210 -155 -69 -101 42 6 -63 120 -113 111 -21 -110 145 10 -102 -111 -195 -156 85
4438 85 120 44 44 63 -19 43 -18 6 158 36 -38 209 181 29 97 39 -45 78 88 -139 183 -123 79 56 -127 -4
4464 -4 -214 -18 -89 14 145 148 210 -167 -113 198 -11 13 125 -45 98 -345 23 103 -37 -85 38 -156 -72 -69
4488 -69 -87 -167 -101 14 16 -86 125 25 75 -3 -47 248 132 -195 -43 -116 69 98 36 -30 -108 141 163 117 113 24
4514 24 13 122 -23 28 74 6 148 39 147 -18 3 -227 -232 83 -137 10 -21 -171 2 61 -21 153 65 -13
4538 -13 -27 181 11 66 203 130 136 16 -45 -42 69 -264 -193 -58 -5 61 -146 -31 33 119 -49 25 -123 121 -111
4563 -111 200 107 -81 291 -44 213 -198 50 -18 105 -4 61 -17 -225 35 139 -76 46 63 -95 219 125
4585 125 139 88 -24 -38 -171 153 50 125 -64 -47 150 -8 -173 174 64 169 -28 140 -56 -222 -104 -161
4607 -161 9 60 282 3 55 60 122 -91 46 145 19 143 -31 44 114 105 13 45 111 73 -42 154 -262 19 -122
4632 -122 497 -29 -39 -91 153 53 19 -22 -179 -126 38 39 -104 104 27 68 25 -75 56 143 -94 72 22 197
4656 197 -164 64 20 110 -81 86 -74 -18 -19 9 -135 -158 -24 -94 88 -156 82 -43 63 498 138 65 64 -46
4680 -46 -60 28 -84 53 -249 -40 23 -99 92 -171 16 -145 -34 -13 -154 -73 200 31 76 -100 101 133 -30
4703 -30 -59 225 51 -13 95 114 90 -102 67 150 92 26 169 104 93 -184 -139 144 46 224 107 33 155 -28
4727 -28 166 -79 13 -50 100 12 1 94 -121 -75 -74 -334 -166 65 49 104 40 126 -14 -56 -6 49 28 56 -182 107
4753 107 -209 -100 42 19 119 146 268 -148 88 6 -73 78 -109 171 105 147 113 -83 82 -84 34 22 -317
4776 -317 -78 -77 -66 -33 192 -110 63 19 -40 -101 -96 -5 -2 110 137 -16 -15 -182 100 110 116 -7 118 168 -137 -102 -70
4803 -70 34 -35 -3 37 16 83 -35 -113 126 92 -125 -150 70 -45 15 11 32 -142 -220 23 60 -23 8 17 -36 14 77
4830 77 -6 3 21 -202 -32 46 -160 21 -19 -39 169 -79 -142 -43 -102 82 -163 23 144 -150 -215 92 40 66 -132
4855 -132 -19 182 -17 -81 -1 -174 131 -23 146 6 -69 72 -113 -10 -125 -55 81 44 -95 -69 -111 63
4877 63 -53 60 9 -120 -2 182 53 -131 91 20 -73 127 5 -99 -63 -130 -98 -235 37 -85 -159 -45 3
4900 3 82 -205 -117 -55 -49 -21 -24 79 80 -41 -63 -245 -139 -130 -4 -120 -56 -40 -199 23 28 -52 -164 -71 35 26 -99 -1
4928 -1 30 -29 -145 31 107 11 -182 68 169 -96 47 16 -157 -200 26 -43 -110 122 216 -237 -4 145 69 -97
4952 -97 167 142 -298 -179 -45 9 -66 -163 142 -52 82 -103 -148 39 -15 -55 -149 -110 14 -46 50 91 -108 127
4976 127 -109 117 4 138 103 48 -26 64 213 166 -46 7 -64 -128 -25 17 8 -30 -90 30 4 -102 18 14 2 -131
5002 -131 -142 113 -119 145 274 -33 244 64 -50 -182 71 109 -145 2 35 -11 -38 -19 64 -128 5 31 -132
5025 -132 -12 218 84 47 67 -35 43 37 -22 -23 67 74 -101 -51 -97 -76 150 32 -77 104 -253 -20 46 -61 -280
5050 -280 -24 -16 -78 119 65 -132 271 -94 152 -100 -139 55 -233 -7 -126 -98 -102 64 38 219 -1 -155 62
5073 62 -56 56 -53 -23 37 24 167 3 28 -57 59 -18 23 97 -19 -66 98 94 -5 -5 -33 -14 42 -26 -66 -123 -56
5100 -56 -24 -97 -61 33 22 45 16 -25 -5 -188 48 -91 -39 -235 84 -96 66 50 -95 -129 -12 -122 113 132 -48
5125 -48 13 28 -80 -112 -92 -68 149 -201 32 17 -52 -182 -149 53 95 -36 116 -32 20 133 -14 59 36 -94
5149 -94 -120 -183 -52 186 136 -177 5 -85 -59 -107 -65 -80 57 -126 95 26 -221 76 0 -212 -47 285 -261 -193
5173 -193 52 243 166 108 12 77 -90 -233 132 -210 91 12 -139 -112 95 -176 43 -163 81 57 46 -9 -53
5196 -53 -138 41 30 -106 29 97 41 113 130 -2 -74 -18 -53 -172 14 178 -1 83 104 16 68 -128 19 39 -68
5221 -68 -157 -62 48 17 92 14 -24 26 129 -113 -82 230 54 -202 139 -46 -99 50 8 -16 -102 32 95 -221 71
5246 71 -46 84 -48 -166 -13 142 4 88 47 92 64 40 -23 119 75 156 20 133 25 62 150 119 -30 -145
5270 -145 -4 0 -32 -143 -13 -110 -23 -9 156 80 -78 63 157 -20 -46 27 229 28 -23 216 -40 79 93 23
5294 23 18 -109 161 217 138 197 -8 35 49 -58 -41 13 76 -94 105 74 113 -155 37 128 84 115 -64 -4 20 37
5320 37 -37 109 22 124 -4 201 -92 -6 116 -115 57 -6 87 -68 14 169 21 -146 -65 -85 207 -46 -104
5343 -104 -55 29 25 269 205 -216 -181 83 -161 -28 140 20 -103 -238 73 -7 -95 -87 103 -42 153 -29 -191
5366 -191 33 134 148 -182 -115 -74 45 -96 139 -67 -162 54 -107 70 31 123 164 -226 197 31 27 6 68 -43
5390 -43 -34 20 96 25 -155 -60 110 48 -61 -27 -29 -109 -124 42 -83 25 -93 98 64 61 92 114 145 -148 -44 148
5416 148 113 -15 -46 25 72 -20 162 140 87 6 37 -13 61 40 -22 98 20 45 -135 -59 -171 109 108 -2 42 125 74
5443 74 121 87 -108 -15 93 10 11 11 90 -22 133 -63 68 10 -14 -15 -4 101 44 -164 162 201 11 -75 78 -77
5469 -77 -89 -139 -166 -79 15 160 -110 59 44 133 -58 -183 -168 1 -132 65 50 25 145 107 3 128 -137 23
5493 23 2 -49 -125 -88 4 72 26 -64 81 -69 -107 -76 66 12 134 107 -206 281 -172 55 -3 16 81 -136 -17
5518 -17 39 0 -15 233 -18 126 53 -55 -62 -10 -60 8 9 -120 52 -106 -51 26 110 33 -119 -190 142 96 183 61
5544 61 85 -41 87 -32 38 86 39 0 50 -31 -37 -111 -183 308 -211 -126 -84 -222 -41 -30 6 -36 141 -49 51 75
5570 75 -56 -59 74 211 -36 -167 -238 -170 -97 -114 14 -105 79 2 143 57 -200 -267 -19 -50 -49 -23 129 212 153
5595 153 -18 -3 -11 -47 150 -172 -28 -37 163 96 -206 -27 92 76 -45 -172 -79 -83 -142 -137 -81 -19 -70 77 -124 -75
5621 -75 -123 -14 18 -151 97 -205 -128 -4 131 -101 160 110 110 -44 143 -103 -111 -113 -91 -8 60 -105 -79 -28 77
5646 77 115 -6 -123 -11 177 -40 -20 187 239 204 -198 -42 7 115 -147 -82 29 116 95 -103 101 -90 -81 39
5670 39 -175 181 91 0 64 -41 184 -61 54 53 -141 10 -235 -123 195 -42 -49 -3 189 89 -81 179 115
5693 115 -118 95 -99 54 -64 80 -25 -36 88 35 45 -34 -96 11 -170 -8 30 -120 35 -139 40 -61
5715 -61 -38 32 -50 -47 36 -48 -69 -15 -57 -93 -6 -95 10 340 205 16 -22 37 6 -193 -237 77 82 81 -318 220 126 -125
5743 -125 -66 -91 -81 -7 173 11 47 126 133 19 34 85 64 -11 58 41 -10 -49 -131 7 -174 -87 -71 219 37 26 265
5770 265 124 23 23 60 92 -22 -5 -52 -11 -83 34 126 -34 50 -8 -3 141 92 -78 78 0 -15 104 -26 -93 -93
5796 -93 -21 -162 66 -105 -49 28 69 54 -115 89 76 -18 -42 -187 114 -85 -1 -28 43 -48 -172 -19 41 -138 -115
5821 -115 80 33 161 -144 -76 56 -153 -65 -102 279 -52 -206 -92 -17 -37 154 22 142 -58 -213 -61 -84
5843 -84 -134 -32 28 179 -50 15 -62 -260 110 -141 -29 -97 -128 33 27 82 -286 2 152 99 175 -208 -58 -190
5867 -190 1 82 -21 71 -127 -157 15 31 -9 52 10 35 84 27 -139 182 208 181 154 -9 138 -114 -100 79 -197
5892 -197 -111 69 131 99 -5 -112 7 96 102 0 30 -82 -87 -25 -84 -86 -24 44 -8 -121 -28 8 -8 25 110 -32 2
5919 2 -65 -49 49 -65 185 -226 -84 -75 3 -47 -9 -126 -36 21 -89 -3 -244 -26 36 67 129 -42 69 29 90 -155
5945 -155 158 15 -26 -61 -172 -15 -161 -283 55 -5 -84 -29 49 -104 41 -181 -12 -79 -53 98 152 7 -150
5968 -150 -4 -105 -81 -61 163 14 68 100 10 67 -172 31 72 -115 133 -122 79 36 -81 -136 56 72 43 59
5992 59 93 9 94 42 -114 90 58 89 63 39 117 -38 -76 -30 -78 -57 -76 -33 -8 -56 176 22 34 2 -184 30 -48
6019 -48 -70 97 43 -80 -21 -89 132 -121 -87 -79 152 174 -44 8 -107 55 167 -32 121 -44 67 120 81 179
6043 179 187 -107 -82 180 104 -71 75 7 -38 -259 -113 39 99 -73 -148 -82 138 136 -76 15 -70 42 -75 -171 -144
6068 -144 -36 -25 46 32 -207 186 93 113 -32 -107 92 13 200 54 39 75 81 99 18 -172 17 95 -124 28 124
6093 124 -99 61 -64 -92 29 -4 96 -157 115 163 -84 -129 -48 187 147 35 93 69 -181 -34 -77 -4 3 23
6117 23 87 -149 2 -80 -33 59 -123 103 -25 47 26 -189 -37 9 138 -146 -12 5 102 46 104 61 -24 -90 -68
6142 -68 68 37 -38 -5 86 -77 -12 19 113 45 -37 -69 -42 -140 -37 80 183 -147 -84 -146 -76 -159 95 -213 -79 -60
6168 -60 -158 -16 28 311 -29 -39 46 1 125 253 -39 -15 -61 22 -157 176 170 -120 -66 -37 19 3 11 -144 -39 118
6194 118 76 -20 71 91 -67 25 24 74 -47 106 27 25 100 -44 129 -172 -126 30 -91 34 119 248 126 -3 63
6219 63 135 -6 115 148 91 -131 32 73 113 -42 -17 -22 35 -95 -69 149 100 35 29 87 -116 53 116 -57 63 12
6245 12 63 -16 67 -302 -100 291 129 -20 -190 -214 59 188 -47 174 118 32 91 -72 4 -192 16 16 4 -20
6269 -20 -50 3 83 -51 82 93 9 5 -46 -50 143 43 87 -102 152 -96 165 107 35 -39 221 114 22 65 70 233
6295 233 -156 -131 -111 -47 36 173 1 -73 61 71 45 87 43 183 113 -63 -243 135 36 -106 37 -190 -52 -100
6319 -100 168 -58 -35 -42 -41 -7 -51 97 -28 41 -72 -8 41 62 31 72 -111 50 -36 -109 22 -108 -80 59 61 121
6345 121 77 -133 -18 71 22 136 -15 104 13 0 90 52 132 -88 -72 147 239 -58 -32 -52 51 63 35 42 -7 248
6371 248 -12 33 -120 11 -168 -20 -6 70 -199 110 -77 160 -116 -183 177 -74 -12 76 -8 -54 59 70 -92
6394 -92 121 -48 9 84 137 -102 7 -80 8 -32 283 -15 59 90 -20 87 23 31 122 -202 -29 187 -84 254
6418 254 195 163 -290 -25 57 9 -50 -39 8 -48 206 -13 -115 190 153 60 83 37 -94 -110 93 169 -110 79 -101
6443 -101 -65 -115 -100 19 23 -146 -104 -173 23 -60 -41 -105 -69 -147 -27 82 -63 -88 -185 94 -100 81 144 31 -19
6468 -19 -70 -156 98 200 -178 -194 340 33 -180 147 7 -102 115 -221 153 -135 29 49 31 170 -39 -140
6490 -140 -185 3 16 -56 -139 -84 54 -86 123 -141 -206 93 -59 140 -72 80 -24 -79 -29 295 -37 64 41
6513 41 27 -47 33 14 -122 45 48 50 90 26 93 1 40 -81 -80 -2 -190 270 -15 68 -61 38 -146 -125 5 33 30 142
6541 142 -12 197 103 -207 27 -141 74 109 120 -96 59 -34 -5 64 65 -162 8 -51 68 -148 12 51 155
6564 155 24 -159 110 -39 27 -31 -109 -127 -103 165 -80 -259 -118 -130 187 -31 164 -79 73 59 -57 -130 -217
6587 -217 18 -36 116 23 -6 84 127 -228 -60 -44 -16 42 -22 89 -140 -97 -78 -14 6 78 -115 -13 21 -129 34
6612 34 -89 139 18 78 -121 85 96 39 -4 -112 66 -64 -114 -9 272 -32 141 -75 166 -33 -82 5 -20
6635 -20 84 -18 111 -117 -17 142 54 137 -118 -143 166 -48 104 -52 166 -40 110 118 117 196 107 73 -212 -133
6659 -133 -21 52 259 -11 -5 72 -125 172 31 -161 -27 -93 -33 58 -87 -180 -116 158 -99 -10 -56 -171 -22 -19
6683 -19 189 -334 85 -38 32 -42 191 -152 259 141 -87 19 -27 82 159 146 -122 -30 41 89 80 -128 68 222
6707 222 61 80 2 43 35 114 -144 -47 -7 194 7 30 -187 -37 -109 39 -127 -130 19 54 87 122 -39 196 110
6732 110 66 150 -41 86 34 -99 -19 130 -61 -45 -173 101 169 -128 -72 42 -47 99 -49 -8 149 34 21
6755 21 -26 349 89 -34 -52 171 -172 -222 -128 31 13 -57 -134 111 35 -133 58 -36 -245 -94 165 -189 5
6778 5 -133 59 -110 29 7 3 -260 -36 171 27 112 199 39 35 149 30 -150 -47 72 230 -26 -21 -11 79
6802 79 67 167 96 -28 -170 -113 -54 105 138 72 20 68 -184 -178 -50 -24 73 -20 3 90 10 -44 -8 196 176 -21 -91
6829 -91 185 28 -126 120 -2 -198 132 -33 -184 -42 -69 -64 -12 -18 -10 -5 -175 91 -120 -126 -28 -62 -26 -34 51 88 59
6856 59 -92 -203 -83 -60 -98 74 67 61 -152 82 79 -95 -209 35 -11 -86 28 -210 -128 -77 5 -52 145 -181 273
6881 273 -183 67 14 -178 83 113 -138 105 18 18 94 33 -140 -118 -4 -24 -41 21 -1 114 152 -115 -165 -21 -70
6906 -70 -10 -218 18 -232 -6 108 -75 24 0 -49 -1 -31 -133 -37 -17 -98 -44 -150 -10 41 -53 130 21 22 193
6931 193 176 102 25 21 100 183 -6 44 -62 -37 -90 33 -61 -77 147 7 8 110 88 -80 128 127 10 130 113 -109
6957 -109 108 59 164 -78 -18 38 81 -192 122 22 -208 20 -144 143 -10 83 23 55 80 126 -27 -83 -99 -12
6981 -12 -35 69 -104 172 132 -35 -60 11 -171 -40 113 -132 -15 -142 68 228 48 239 -97 27 52 36
7003 36 68 -67 87 130 49 -166 -71 115 -97 148 138 32 -238 49 -99 203 -18 -117 28 95 74 144 -32
7026 -32 154 -20 -170 23 132 -73 78 32 -73 -114 -88 102 -96 -135 -364 -44 62 -5 -65 -51 19 -2 -75 112
7050 112 107 -200 8 141 -8 -134 28 42 -26 115 -64 -60 20 4 87 -47 97 187 47 153 -81 -230 -86
7073 -86 18 -132 -50 22 -143 44 13 94 -20 -67 -68 -162 36 -15 6 18 -103 -125 -13 -137 -19 106 -114 -72 129
7098 129 122 -55 188 -73 -188 -172 151 -30 55 95 55 -108 -70 86 -67 165 166 -212 -88 16 -2 142 -134
7121 -134 -163 -66 61 -65 -270 -42 -74 -123 -94 134 55 -101 58 -154 51 -74 255 27 -183 -56 -183 25
7143 25 -86 65 -129 60 -9 -22 39 -10 -54 74 180 194 58 -114 105 241 -46 -162 110 34 -62 13 -74 -61
7167 -61 -26 32 38 266 83 -13 -37 118 -64 -112 301 -17 -19 110 42 58 -119 85 -84 97 103 -182 -95 -228 -144
7192 -144 -114 58 58 53 -242 191 -145 -33 211 -2 -48 134 97 54 -74 -39 -185 -10 -45 151 -38 -101 -2 -31
7216 -31 -117 -103 -53 63 128 -16 147 44 -3 -308 -72 194 -167 -147 174 74 64 50 128 -177 -101 42 -15 5
7240 5 -137 55 175 21 58 68 46 158 -284 -116 36 -164 -96 -49 162 -189 -16 -233 66 -2 72 148 204 -4
7264 -4 -16 121 69 -60 45 128 49 143 -58 26 167 124 -57 74 -27 111 -34 43 -42 44 169 56 -3 16 -150
7289 -150 -104 -168 -14 215 -37 235 69 -224 -87 61 14 -30 -64 16 -181 -27 82 -83 212 32 -21 -55 -54
7312 -54 -49 68 8 30 -147 -249 -4 -28 -208 89 -88 -189 73 -88 -72 44 -215 96 -14 -102 115 51 166
7335 166 13 -169 104 216 -95 33 69 117 -85 -140 59 -71 -164 85 156 108 -39 220 10 60 126 67 -173
7358 -173 -5 135 28 13 -48 40 -34 -140 101 -207 -36 128 -77 5 -17 37 55 114 57 128 116 -83 7 -132
7382 -132 43 265 -38 210 111 81 -17 136 -109 -92 133 112 -49 -133 37 -19 -212 49 -269 61 -78 -29 -31
7405 -31 -342 104 -163 67 128 -67 -99 89 64 -78 64 42 -5 141 17 91 -56 -249 132 -130 89 -66
7427 -66 -9 90 36 93 -176 -121 21 -76 -88 194 -222 -7 36 -73 -13 -150 293 75 102 20 -36 -23 67 11 52 -154
7453 -154 -63 25 -35 -36 160 40 -175 -39 -117 43 -83 149 30 -13 10 116 142 7 -128 74 -236 95 103 -77
7477 -77 -39 6 -182 -19 39 100 109 -46 195 16 -184 23 80 -62 51 38 125 37 54 57 0 -116 101 -171 223
7502 223 39 50 0 -8 82 -183 134 44 73 54 -115 -123 -113 -135 4 69 119 101 44 128 51 -10 -65 19 -154 46 -4
7529 -4 -22 -7 20 -87 -41 -61 97 76 95 40 33 31 -15 43 88 102 -14 116 126 168 4 224 18 -37 61 213 -73
7556 -73 55 37 -101 53 99 -68 56 11 3 -138 -45 -41 113 21 -1 144 -110 98 -82 -206 -99 -75 25 196
7580 196 24 -51 -26 40 72 104 -93 18 104 91 104 269 117 67 -33 -108 75 180 98 -163 79 -13 -193 -56
7604 -56 -81 -101 -27 124 -128 -32 -90 -27 209 51 166 -79 -5 -92 -82 -179 30 52 113 57 25 -77 56 181 -174
7629 -174 -1 78 39 -103 1 94 -105 -88 -225 29 44 188 133 130 -86 -14 14 -131 60 171 -100 -172 139 -67
7653 -67 165 -60 -98 -208 30 19 120 285 -45 -86 336 18 -65 64 123 85 81 76 3 44 112 -15 -85 -110 81
7678 81 61 74 66 -87 -95 184 73 121 147 59 2 76 -151 -30 -15 69 39 -173 231 -38 -209 97 13 49 -18 68
7704 68 31 -208 57 47 19 133 -15 63 207 20 57 12 175 -54 6 35 -8 -20 -304 122 -13 -43 127 140
7728 140 94 2 56 -53 -121 -97 -246 48 -187 -24 -69 -52 -63 47 -75 67 -81 -21 -114 49 58 -189 -35 -56
7752 -56 82 88 -31 -79 -65 -121 220 124 134 97 44 -94 206 -18 -35 -43 46 146 -90 144 -45 76 8 58 26 -170
7778 -170 -102 95 -22 39 197 49 21 261 100 301 32 -5 159 -67 -60 175 -8 112 -44 69 116 58 99
7801 99 -4 6 -75 -67 -26 -2 35 214 106 -59 103 1 25 -42 -32 -59 -106 -196 89 122 3 167 -115 45 92
7826 92 -52 -84 -69 55 95 72 -59 107 106 48 -78 -65 -111 92 65 -17 149 15 38 -16 -279 -45 15 -85 66
7851 66 -138 78 62 -119 9 -45 62 -289 -93 -43 -62 78 -60 -54 -132 -142 102 -76 -185 67 -39 134 -157
7874 -157 186 14 -59 -84 -219 -10 -76 114 -70 97 -28 36 128 48 -112 53 26 53 56 -27 185 -15 4 -80
7898 -80 -109 -210 -68 -84 -158 13 -51 -212 94 -72 10 45 -168 -97 146 158 -100 -19 -49 70 -76 31 -72 -86
7922 -86 -66 80 23 94 110 54 -88 104 -37 -69 39 -89 -5 -38 -9 -41 -183 89 -79 -38 -59 45 -92 26
7946 26 -100 -165 -55 -190 139 68 25 28 -80 134 -286 141 -6 -136 -115 143 106 -155 42 119 29 38 1 225
7970 225 -77 72 -186 26 97 -89 92 55 16 -82 270 43 51 55 161 -69 -2 -67 2 -11 8 -5 -47 56 -18
7995 -18 21 56 -91 -6 139 -107 -37 -82 24 -173 57 44 -131 133 90 32 83 -64 124 -154 68 -16 10 -36
8019 -36 -30 -15 -118 -152 56 91 128 12 257 32 94 -113 56 171 44 -19 -47 -75 191 6 -137 77 65 -226
8043 -226 -73 76 -2 -37 -136 240 82 103 -165 -39 -193 -94 -171 32 244 16 35 -39 26 64 -10 -27 -8 218
8067 218 291 -52 -180 -15 -108 -139 -18 85 -76 48 45 42 -14 20 -173 134 130 -1 35 84 -96 85 68 96 -6
8092 -6 -127 30 -17 77 81 -72 -106 -76 -97 54 -18 166 -268 -59 -19 164 58 300 85 24 -187 -171 -39 44 -162
8117 -162 -44 51 -117 90 225 -70 215 10 69 -189 -133 -206 -50 -139 -77 147 -158 -64 -175 25 -178 39
8139 39 -36 10 50 -31 -119 65 142 -118 -144 140 -39 137 -24 -266 -14 -50 -84 -14 -20 49 54 43 -99 169 -183 -20
8165 -20 -27 61 -153 91 -121 -78 -1 29 -105 -69 39 49 13 -127 -155 -29 64 158 172 175 -125 -136 136 85 99 159
8191A59
$$ Imaginary data points
##PAGE= N=2
##DATA TABLE= (X++(I..I)), XYDATA
0 0 0 0 0 0 0 0 0 0 0 0 0 0 0 0 0 0 6 -8 8 -8 8 -8 16 -16 16 -24 24 -26 32 -38 40 -48 56 -64 70 -80 88 -98
38 -98 110 -122 138 -154 170 -186 207 -227 251 -277 304 -336 369 -409 449 -497 548 -606 674 -750
58 -750 838 -943 1070 -1222 1413 -1663 2006 -2496 3273 -4687 8106 -37950 -5219 45972 -18242
73 -18242 -1192 33131 -11866 -41240 13941 16490 -9778 15400 23458 -25507 -21279 17258 7864
86 7864 -6849 14441 7288 -16977 -7766 6642 -4047 -3513 4597 -4442 -12955 -850 11852 10658
100 10658 -1052 -6178 -693 -610 -4693 8204 18049 -909 -14037 -3090 -3371 -6055 14912 17435
114 17435 -11491 -14859 694 -10507 -11554 18702 17910 -11390 -7841 4773 -8048 -3135 21814
127 21814 11032 -12171 -2600 2814 -11949 -2922 16740 3890 -11778 -1902 408 -8777 1172
140 1172 11049 -2990 -10325 1831 2487 -4453 6076 13109 -1815 -9624 2236 5248 -1970 3677
154 3677 7534 -6308 -12531 33 3860 -1877 4167 7092 -7245 -12315 373 4207 -67 5632
168 5632 6834 -5497 -6935 3675 4254 1077 6475 4720 -7328 -7626 1714 896 -2469 2646 2097
183 2097 -6045 -5113 2473 1846 -1234 2144 2191 -3523 -1893 5299 4093 -605 1186 2410 -3120 -2332
199 -2332 4425 2539 -4006 -1979 -183 -5432 -3155 5032 2112 -4356 -350 1804 -3872 -955 6952
214 6952 2851 -2639 1956 2417 -3958 112 6185 -325 -4197 2071 344 -6168 -1190 3935 -2609
229 -2609 -3682 3012 264 -4199 1614 3886 -1607 -563 5104 899 -2540 2561 2750 -2861 -646
244 -646 2934 -1278 -3495 49 -160 -3413 -699 1827 -1023 -2271 651 677 -856 1339 3214 410
260 410 -857 1172 1556 71 992 2263 -732 -3258 -1044 147 -1211 -396 958 -1662 -3859 -406
276 -406 1679 229 1453 2585 -889 -2603 1381 3111 817 2089 2266 -2314 -3784 728 1767 -875
292 -875 279 -219 -4272 -4168 1103 1777 126 1629 773 -2983 -1539 3361 3109 1043 1829 21 -3261
309 -3261 -1101 3456 2141 -420 -558 -2440 -4788 -1732 2764 1682 -814 -769 -2139 -3156 920 5223
325 5223 3037 191 220 -1673 -2492 1567 4741 1750 -1528 -1682 -2858 -2834 1087 3521 502 -2773 -2531
342 -2531 -2841 -1639 2934 4833 982 -1610 -830 -980 310 4207 4582 -316 -3290 -2335 -1679 -336 3090
359 3090 2766 -2311 -4117 -2473 -1387 612 3670 2689 -2182 -3383 -432 921 2528 5252 2859 -2573
375 -2573 -3419 -657 528 1582 3104 311 -4616 -4300 -721 715 1819 2453 -325 -4328 -2868 1096
391 1096 2329 2834 3564 80 -3714 -1349 2630 2470 1633 1502 -2081 -5291 -2292 1612 1618 796 356 -3007
409 -3007 -4699 -611 3362 2734 1367 938 -2059 -3240 1033 4962 2926 829 268 -2929 -4258 55
425 55 3529 652 -1407 -1066 -3469 -4000 1562 4253 358 -938 661 -1903 -1970 3773 4707 -264 -583
442 -583 823 -2301 -1637 3959 2664 -2694 -2224 -1457 -3427 -713 4242 1856 -2645 -1513 -922 -1853 1635
459 1635 5415 2479 -1373 -1132 -1251 -1515 1549 4033 1390 -2116 -2625 -2121 -1374 325 1846 1005 -1938
476 -1938 -2512 -477 149 569 2641 2309 -1461 -1118 2265 1149 -323 2348 1132 -3709 -1383 2424
492 2424 -386 -1447 1518 -1039 -5388 -560 3322 -480 -222 2899 -1407 -4235 2061 4373 -46
507 -46 1460 3184 -2630 -4037 1647 2093 -1204 972 1787 -3995 -3945 1015 752 -1369 1755 1880 -2569
524 -2569 -1786 2249 1063 -256 2398 2096 -1065 -539 1561 84 -1540 308 285 -1488 -809 731 -726
541 -726 -2339 -626 266 -658 504 2547 681 -1566 -147 1253 206 841 2966 1413 -1865 -1102
557 -1102 62 -1336 -936 1726 572 -2409 -1347 -66 -2089 -1232 2864 1859 -1433 590 2273 -1639
573 -1639 -1486 3536 1719 -1882 1499 2200 -3428 -2448 2299 -865 -3020 2142 2038 -4383 -1827 2558
589 2558 -1707 -1733 4560 2257 -3037 1236 2885 -2553 -568 4302 507 -2491 1529 561 -3714 -812
605 -812 1996 -1765 -1605 1586 -264 -2269 442 837 -983 579 2044 730 285 1135 -242 -517 340
622 340 622 602 634 -960 -1661 -982 -1632 -1186 1492 884 -1658 -108 351 -2120 -38 3783 1062 -928
640 -928 2159 691 -2846 784 3447 -1121 -1130 1992 -1784 -3921 1275 1170 -2957 -251 2308 -2186
656 -2186 -1982 3048 866 -2416 1554 2276 -1629 145 3497 -24 -2281 991 185 -2343 602 1938
672 1938 -1525 -2220 -73 -1113 -1825 1087 1992 -655 -672 424 -16 -171 1901 2152 199 -379 -178 -619
690 -619 -465 589 628 -462 -1333 -977 -408 -686 7 757 -514 -1080 239 1062 332 793 1809 144 -819
709 -819 836 1299 -84 -208 510 -1238 -2063 152 581 -910 -390 257 -1615 -1760 1077 1542 86 842
727 842 1084 -887 -522 1615 1324 -268 876 501 -1713 -1104 1063 -177 -1161 203 -679 -2065 -566
744 -566 1100 45 -169 995 322 -903 1070 1830 335 0 987 -396 -991 671 659 -592 -403 -448
762 -448 -1440 -1074 210 325 -641 -227 -223 -436 69 1145 1266 408 84 159 112 334 638 606 -468 -780 -788 -374
784 -374 -742 40 17 -868 -1036 -179 117 196 965 760 -121 -36 502 653 415 1070 260 -698 -658 86 -311 -487
806 -487 -9 -435 -1231 -837 -37 -142 -151 795 466 -434 426 916 442 559 1259 197 -321 253 332 -691 -315
827 -315 23 -1075 -1357 -73 89 -736 -284 119 -414 34 645 860 537 609 382 131 81 553 380 -165
847 -165 -134 -464 -739 -846 89 -163 -805 -548 -58 -593 -361 633 708 253 173 785 314 160 864 579 23
868 23 247 9 -786 -619 191 -755 -1026 -255 -197 -584 -6 310 -124 -4 556 514 268 815 861 241 61 345
890 345 204 -386 -223 -55 -752 -676 -636 -526 -464 -605 57 103 -438 136 520 350 47 1124 631 -28 422
911 422 670 -258 -456 503 -377 -1231 51 -64 -1185 -554 463 -527 -562 529 335 -428 540 919 35
930 35 249 1068 265 -349 490 352 -641 -249 338 -700 -845 -127 -245 -797 -398 194 144 -6 230 520 194
951 194 314 455 830 191 179 528 -221 -749 -128 104 -734 -347 208 -792 -1253 149 -136 -812 409 1285
971 1285 -546 -78 1198 201 -348 1544 1261 -829 154 965 -877 -1046 642 -279 -1146 -147 186 -1103
989 -1103 -525 287 -84 -20 601 601 -64 374 230 -50 376 342 572 663 -140 -773 -361 -534 -938 367 424 -730
1011 -730 -448 301 -988 -738 1584 855 -517 1140 1198 -972 198 1958 39 -559 1304 197 -1992
1028 -1992 -99 621 -1658 -841 1287 -423 -1442 597 482 -1359 334 1612 -111 57 1651 344
1044 344 -981 330 732 -550 210 799 -765 -1358 -491 -743 -521 311 125 60 -388 -525 -142 507 505 874
1064 874 870 153 -770 -153 190 -663 238 1127 -542 -1281 205 -407 -1578 466 912 -1055 -246 1203 -367
1083 -367 -1008 1148 987 -679 895 1808 -440 -767 941 -293 -1405 693 952 -950 -747 117 -1119
1100 -1119 -1464 632 906 -289 215 322 -661 -490 1182 1058 328 698 543 -834 -804 344 355 -2 -131
1119 -131 53 -927 -1209 -305 98 -238 134 472 95 -183 197 292 30 496 933 42 -18 554 135 -793 -478
1140 -478 302 -414 -351 93 -32 -947 -526 263 139 175 980 521 -203 -151 463 416 216 943 186 -906 -382
1161 -382 164 -721 -726 600 -65 -1073 -361 264 -432 -415 979 209 -491 659 701 -420 227 1144 153 -450
1181 -450 626 207 -841 -175 236 -969 -772 480 -253 -801 126 243 -529 213 951 431 11 755 399
1200 399 -190 452 640 31 -98 180 -252 -812 -412 -354 -325 -86 -172 -303 -171 -35 58 449 397 307 364 308 312
1223 312 411 462 -149 -70 41 -394 -462 -405 -174 -710 -520 57 -422 -243 349 108 -229 472 410 131 85 897
1245 897 146 -308 299 -72 -566 -120 128 -494 -477 -148 -193 -649 156 156 -321 -54 644 -112 98 743 341
1266 341 136 434 459 -52 -191 93 -198 -264 165 -313 -658 -149 77 -359 19 265 -210 173 521 195 310
1287 310 304 477 389 216 138 -87 -4 -146 -250 -135 -173 -270 -236 -279 -221 -276 83 79 49 338 421 222 464 352 142
1312 142 308 451 224 4 -81 -54 -335 -383 -329 -353 -194 -157 -375 -349 -12 194 103 228 440 292 310 395 390 207
1336 207 134 102 -117 -106 -2 -174 -379 -537 -287 -411 -364 -72 33 -88 -59 463 206 380 585 104 137 71
1358 71 248 31 -3 -15 -303 -215 -478 -127 -309 -362 -100 -338 -205 253 304 261 88 249 213 294 389 254 418
1381 418 232 -204 -207 -237 -166 -260 -323 -241 -442 -366 -225 -56 249 35 165 182 246 320 545 468 248 150 112 31 104
1406 104 -43 -105 -214 -715 -373 -285 -225 80 -260 -342 -236 118 90 284 584 511 162 13 288 235 159 146 200
1429 200 -320 -427 -213 -240 -330 -104 -73 -486 -102 231 276 -13 476 447 -48 133 361 253 20 84 120 -329
1451 -329 82 56 -177 -235 -305 -237 -337 -347 -47 308 2 112 49 78 559 691 322 195 76 -85 -37 83 259
1474 259 106 -435 -445 -373 -315 -153 157 -47 -364 44 242 -51 211 711 449 -207 289 205 -327 63 229
1495 229 -156 -460 0 -312 -741 -56 82 -410 -394 117 36 -79 248 138 -148 10 725 393 239 307 132
1516 132 -120 -330 -24 57 -41 -254 -431 -630 -420 -372 356 146 114 305 -41 -315 311 440 394 456 458 -146 -505
1539 -505 78 77 -383 -60 163 -557 -789 119 -147 -709 310 408 -320 179 641 43 -299 718 417 -89
1559 -89 472 387 -273 -559 94 -381 -488 181 33 -508 -347 -204 -235 -162 259 472 133 103 -47 56 210 404
1581 404 436 281 192 -131 -116 -540 -357 -68 -204 -274 -186 16 -418 -109 365 -87 3 459 604 -175 10 600
1603 600 200 -23 727 68 -626 57 -158 -515 -386 107 45 -321 124 -57 -513 307 613 3 130 562
1623 562 298 -129 107 298 -212 77 173 -149 -473 -186 58 -394 -172 117 54 -193 54 -32 -83 -78 507 619
1645 619 323 281 133 -103 -202 255 619 23 -207 -216 -648 -773 -57 90 -159 157 -11 -323 -144 431 351 186
1667 186 405 293 -68 15 301 200 136 -42 -134 -364 -304 212 -107 -403 -459 39 -271 266 300 112 -55 164
1689 164 51 243 283 713 105 -143 -218 -204 -289 274 301 -346 -459 -587 -499 -188 322 593 -27 -438 136 155
1711 155 279 646 433 113 -161 -95 -34 206 307 -229 -536 -531 -124 -304 21 117 134 -227 -294 242 498 434 405
1734 405 134 -95 -8 46 506 336 -6 -351 -721 -625 -82 25 263 -61 -423 -414 -384 174 478 346 87 -62
1756 -62 -184 -85 472 767 285 -12 -140 -568 -285 192 292 -42 -148 -495 -404 234 317 245 312 225 -472 224
1778 224 443 447 478 267 -67 -369 -171 366 142 -140 -387 -544 -593 -180 25 188 118 -263 -219 41 346 746
1800 746 722 183 -146 -133 -28 406 284 311 -113 -388 -639 -308 61 90 216 -172 -535 -253 57 217 656
1821 656 471 -208 -51 243 330 520 430 123 -461 -197 -320 -121 151 105 -333 -392 -572 -251 144 355 238
1842 238 -47 -137 65 416 394 390 29 -142 -232 -354 -23 340 132 -251 -451 -486 -335 -32 380 208 -43 -252
1864 -252 -288 238 242 522 177 90 -87 -75 163 274 97 -108 -348 -390 -431 -181 111 -81 -112 -335 -344 12 89 100
1888 100 187 63 -16 153 43 320 219 -130 -37 -319 -111 -33 -44 -147 60 -320 -222 -35 156 34 351 222
1910 222 -115 65 295 210 474 370 -21 -74 -151 -122 -203 278 -32 -329 -182 -200 -88 -125 161 -45 53 209 67
1933 67 189 253 266 126 72 388 -14 -318 -15 -301 -359 -205 -134 -376 -47 -71 -206 -28 -34 197 -16 86 292
1956 292 67 150 131 187 133 101 -4 161 76 -237 -53 -149 -444 -94 -186 -239 -139 44 100 -210 227 289 399 226
1980 226 206 -172 -31 119 215 -121 -63 -110 -475 -500 63 19 -330 -256 -59 -295 -281 207 262 43 110 207 -239 221
2004 221 211 268 128 -33 8 -152 -82 126 -96 -277 -131 -484 -406 61 394 41 37 34 16 14 102 366 84 35 -403
2029 -403 191 -159 -103 195 58 -627 -385 -137 -285 -32 292 44 -275 -397 43 238 412 488 262 -80 95
2050 95 48 34 218 319 -141 -468 -299 123 -359 -27 217 -316 -569 -239 315 97 237 172 -1 -139 232
2071 232 147 223 404 -40 -361 -284 128 134 -63 -125 -249 -544 -394 321 219 57 359 -37 -249 153 312 482
2093 482 310 211 -54 -278 21 341 196 -46 -136 -362 -653 -316 -81 78 61 -68 -81 -271 -66 435 381 65
2115 65 117 -159 -267 98 198 117 -265 -362 -27 -315 18 260 -209 -380 -159 -85 -55 228 478 122 -161 144
2137 144 19 131 325 577 17 -327 -100 -257 -93 -31 499 -255 -484 -102 -167 -111 353 263 -204 -20 102
2158 102 116 97 458 323 -186 -307 131 -184 79 151 -154 -370 -66 -119 -60 147 13 -52 -87 -191 230 431
2180 431 206 154 47 -181 67 78 71 107 -331 -85 -379 -174 -101 7 -54 -71 -242 -300 -116 302 255 56 80 30
2204 30 -138 180 -14 251 -82 -55 -21 -166 -236 84 -32 -273 -159 -82 -246 1 279 66 -44 68 115 292
2226 292 340 336 -26 -72 19 -233 -78 148 -33 -274 -240 -88 -132 -467 -62 -71 -76 -17 -111 25 -52 321 253 17 52
2251 52 67 250 -75 -38 -74 -237 -296 -29 -150 -152 -54 14 55 -109 109 -5 109 6 -30 -53 126 367 323 -107
2275 -107 22 -44 -33 -69 194 -171 -316 -32 -268 -157 -128 61 12 -14 108 244 115 216 242 -131 140 125 -2
2298 -2 102 86 -12 -71 -230 -35 -255 -194 -53 6 -23 -10 109 129 137 53 62 87 86 -60 78 13 -58 -29 1 -105 -111 -241
2326 -241 -145 -98 -16 -68 150 -122 6 18 163 200 330 231 79 134 -31 -55 -55 96 167 112 59 41 -159 -220 -113
2351 -113 -199 -128 -308 -29 10 80 -81 117 189 101 122 40 73 15 -38 -120 -95 -354 -188 -139 -264 -134 27 -96 -211
2376 -211 -181 -109 148 55 98 -19 272 169 313 84 40 -48 30 -282 -110 -228 -98 -113 -59 -82 -83 -82 -103 -34 -19 -148
2402 -148 95 130 183 54 223 85 95 36 -67 -47 -71 -132 -54 -216 -268 -151 -31 201 4 47 112 -97 -42 45
2426 45 293 320 -17 137 -3 -33 14 202 -124 -19 97 -111 -81 -26 -80 -20 -35 60 -91 -71 155 110 124 199 236
2451 236 -190 33 155 -11 187 -169 -268 -147 -89 -360 -167 -53 -138 -40 -240 112 -36 51 130 82 -112 67
2473 67 156 208 113 217 -33 -8 -47 -38 -39 -332 -370 -56 -4 -46 128 164 20 -64 129 -18 93 362 130 -93 -27
2498 -27 25 -69 30 174 50 -284 83 -31 -181 -48 100 19 -106 259 -140 -55 111 86 247 148 109 2 -70
2521 -70 188 -30 -29 100 198 -286 -177 142 -11 -36 -13 -108 2 127 63 221 72 -89 59 176 135 191 232 -300
2545 -300 -218 173 -67 -35 49 238 -209 -273 -173 44 -26 236 26 -101 54 97 98 52 295 285 -55 131 108 -287
2569 -287 -17 -22 -136 -398 -187 174 -264 -125 103 -89 100 38 56 -168 46 185 286 102 138 171 -147 -68
2591 -68 33 -194 -307 -79 -102 -74 58 -117 -306 -127 169 154 -11 88 347 131 -34 27 229 171 167 83 -43
2614 -43 -403 -84 -90 -163 12 -206 -149 -67 -44 101 -153 210 206 173 74 164 162 -143 -10 131 -86 -139 54 -168 -247
2639 -247 -106 -5 -238 -160 -15 -83 -162 186 314 -63 130 242 217 31 190 4 -22 -74 2 -120 -254 38
2661 38 -62 -149 -197 -51 -258 -122 224 95 -84 -15 254 173 337 48 -9 -241 -114 71 -37 -29 154 -68 -18
2684 -18 -63 84 -220 139 93 -13 -113 -59 -53 56 200 34 -99 -57 12 60 243 -109 39 -101 -241 -184 -84
2707 -84 -108 -147 128 84 -72 57 151 134 11 331 -62 -138 257 369 210 -59 167 -74 -42 -11 -143 38 -50
2730 -50 -63 -283 6 105 -67 4 59 -54 -59 51 200 171 64 135 174 -262 46 -100 134 -174 -223 -144 -71 -62 -241
2755 -241 199 -64 -220 -226 70 201 122 82 -210 41 87 157 83 -13 -92 -19 -191 -137 -121 -115 262 189 -185 -230 50
2780 50 -7 301 395 150 -50 -164 59 -56 76 105 66 -30 -182 -20 -269 -57 24 -91 -154 -152 92 43 245 275
2804 275 -38 -218 60 56 135 123 235 16 -115 -105 -99 10 48 -6 -129 -75 -28 -130 -74 69 -167 -173 -181 -18 47 318
2830 318 175 -43 -182 8 40 129 -18 9 -176 -94 -196 -111 -22 53 119 -205 -395 -78 323 52 -43 281 -181
2853 -181 108 119 156 252 16 -129 -144 -121 -39 174 89 25 -54 -122 3 260 91 248 27 9 82 -41 172 308
2877 308 98 163 -223 -216 -114 25 -25 -124 -6 -121 -1 152 40 32 16 104 20 -54 33 25 191 22 45 -165 -2
2902 -2 -131 4 32 -169 21 35 -106 -35 69 -2 -198 -47 2 -23 249 275 -92 143 -4 -128 121 123 -169 75
2926 75 5 5 -6 -74 -50 -120 -70 96 -83 -66 55 -209 100 8 -16 98 48 275 -211 59 -59 -198 -130 -76 -214
2951 -214 -23 111 -96 -58 -116 -96 -113 91 185 2 -120 -31 -18 -39 4 35 -88 12 124 126 35 -5 -41 -194 -38
2976 -38 -72 25 94 -65 95 66 31 118 51 81 372 83 80 91 -36 -51 -153 69 -68 -97 -67 -93 -139 13 108 -64
3002 -64 29 -43 92 82 235 65 171 -51 -24 -177 -42 140 -23 -30 -261 -67 -136 -170 -86 97 -66 14 86 73
3026 73 -66 233 47 169 27 -282 44 12 55 -60 177 -226 -242 -91 -377 287 70 -30 -156 -55 164
3047 164 113 75 72 103 -122 230 181 37 18 224 51 -60 49 71 84 -112 -263 -263 -262 55 11 101 -177 112 86
3072 86 -173 31 348 21 -93 101 9 -41 254 63 57 -338 -60 -83 -218 273 -33 -58 -21 -31 -41 -68 157 212
3096 212 48 90 -4 -26 238 144 38 -300 -34 166 -79 11 -136 -32 -111 -133 -133 47 82 36 134 -184 -22 139
3120 139 110 78 281 17 -163 -82 22 -149 -97 67 -275 -43 -318 -147 12 35 192 -199 -153 -19 109 11
3142 11 193 112 -23 -42 -182 -119 -113 106 -97 -100 -78 -257 153 -122 -113 16 -158 148 174 137 68 45 -83 -94 36
3167 36 34 56 -141 13 -131 -180 -325 -83 127 78 -41 -230 -203 -48 44 243 123 -16 -39 -126 135 302 65
3190 65 -97 11 81 -75 60 -11 -10 -246 37 -118 11 68 -45 111 -36 -254 -141 -69 -27 163 -41 -54 36
3213 36 -29 -67 143 318 -9 -225 42 -103 45 -194 -47 -66 -53 -108 90 69 -100 -16 21 -113 83 42 -3 134
3237 134 106 35 -53 -58 239 -32 -204 160 -112 -178 -219 -12 -45 147 123 -207 71 -103 92 27 -89 158 -90
3260 -90 -103 -80 155 -9 23 -18 -51 24 -107 134 19 -27 3 -94 87 19 82 -60 -10 19 125 230 32 -63 66
3285 66 -324 -42 -288 -151 73 111 250 56 243 -88 347 99 66 78 33 2 -156 137 -191 38 -15 -83 17
3308 17 -243 -101 9 -116 -53 43 79 -24 -248 149 111 2 111 -134 -117 27 -2 47 88 31 -16 -97 -17 -177
3332 -177 -63 165 45 -210 96 207 68 -10 174 -23 88 198 -57 -69 96 180 217 73 24 -26 84 -28
3354 -28 -75 -115 -74 -26 -11 -143 69 31 13 45 -176 144 244 244 -79 64 -188 -52 -103 -14 40 -27 -15 -19 -282 26
3380 26 -75 -31 -90 53 100 -120 110 91 -2 -71 -85 -139 245 10 -24 -185 -58 -63 14 153 121 51 -91 -39 27 69
3406 69 64 -17 143 4 176 -20 40 141 -34 53 -306 -17 -203 -106 -106 6 -28 -363 -20 47 -110 166 -31 -114
3430 -114 53 49 82 158 266 207 38 -98 61 11 -60 -95 150 -244 -139 -67 -31 77 78 -60 30 -138 46 30 -5
3455 -5 244 25 46 -102 -13 8 -52 -199 -226 38 -32 25 157 14 -40 79 -224 76 3 59 107 154 -122 -127 -34 236
3481 236 92 -92 -206 68 -184 -212 20 -171 -40 0 -21 0 106 58 115 14 176 -2 -75 85 15 149 74
3504 74 -259 -3 -61 147 238 -69 -158 -192 -147 -9 19 125 -129 -31 -66 145 -160 240 -49 -25 -34 -117 -129 13 -127
3529 -127 4 -141 -285 -68 -65 -53 11 22 83 138 123 120 58 23 92 -31 219 -186 -94 -147 64 -213 -65 -171 41
3554 41 -313 -132 -151 -54 -165 84 -20 178 50 66 -5 -54 -68 113 62 -9 105 -246 -41 -71 -99 -166 -254 -39
3578 -39 -10 -292 142 22 74 -1 -85 -75 -79 108 281 42 -131 7 15 -192 -38 10 -162 -154 -97 -23 199 -130 17
3603 17 69 -107 42 69 -15 -254 68 -123 -13 48 20 32 -99 -128 15 -182 -92 -161 -291 60 -46 -17 -89 -22
3627 -22 -74 -13 56 80 -126 145 148 -244 -28 -54 -30 -25 3 9 70 14 8 -21 148 -229 51 4 44 30 -158 26 135
3654 135 244 19 6 -6 42 6 131 55 82 40 -69 35 -188 -27 -53 -134 -64 -19 64 -41 109 51 25 85 -34
3679 -34 14 78 95 -40 11 -88 43 -175 -124 77 -96 -178 84 23 3 115 -68 176 -7 191 -42 68 40 102
3703 102 86 203 -164 -71 -7 -154 191 -55 183 -161 -39 -186 -56 101 149 -57 206 40 61 27 -22 197
3725 197 -5 -77 127 -2 193 -132 -154 -32 59 261 -87 10 -22 -50 4 47 9 -62 221 -84 -124 -38 148 -12
3749 -12 -160 67 136 -147 122 113 -74 97 -93 140 -146 -51 -52 10 -53 99 78 2 173 50 -149 15 122 67
3773 67 -66 37 -42 -190 -151 117 -187 -86 133 -1 -49 -126 195 54 -3 105 10 -128 188 114 112 -1 -109
3796 -109 26 -27 -235 42 14 -122 -69 -161 -3 -8 -98 -20 -48 84 -146 -131 245 81 -11 134 -35 -57 -63 -259 252
3821 252 -16 -156 -100 138 23 36 11 16 -47 222 9 30 -85 100 -45 19 -164 -55 122 178 110 -114 -192 41
3845 41 -171 -62 52 44 -140 -174 259 22 270 228 99 113 62 -102 91 92 103 -18 -129 22 59 -74 193 60
3869 60 25 -160 43 -138 -86 41 130 -23 -49 -144 -37 115 2 50 -36 -48 -103 24 65 47 111 -7 -86 -62 -27
3894 -27 -157 -118 -217 -150 53 84 57 132 215 40 -15 63 63 -103 -11 169 148 -105 -173 -157 265 -43 -1 -17 -150 121
3920 121 124 -14 37 -14 75 -94 -51 7 -18 73 -54 -200 -69 -97 65 0 -176 -71 58 -21 56 -41 17 107 49 49
3946 49 -42 -35 27 13 -165 -74 -24 -29 -11 -169 17 -76 -151 -76 -193 -91 39 16 -95 104 110 -65 84 75 55 162 201
3973 201 91 20 -131 -104 -89 -54 -69 85 97 -178 -63 -329 217 -36 0 -196 168 36 30 -59 49 122 -52 166
3997 166 -166 -382 -129 107 30 116 34 61 81 -180 173 49 60 -88 -26 39 40 167 177 111 46 100 -45 49 -141
4022 -141 121 -224 -103 114 16 61 81 76 138 62 -13 190 -256 25 17 -170 94 180 133 -94 14 112 150 -53 156
4047 156 68 -10 -68 -94 199 11 -42 -29 137 39 -133 -27 115 -116 -37 -26 -41 160 55 127 12 -22 -32 -164
4071 -164 -98 29 -143 91 91 76 39 59 23 153 -66 -219 -65 -82 -58 -170 65 -83 -197 58 -26 99 154 -61
4095 -61 -12 -67 93 1 33 222 31 -74 41 -126 87 91 263 -162 99 -8 77 35 -28 18 99 -39 -63 19 44
4120 44 40 -14 95 69 90 140 103 97 -81 197 -218 -29 -174 39 15 -69 -151 -14 148 -26 98 14 261 -33 -112
4145 -112 5 78 104 49 -64 -35 -53 134 -1 -28 -133 -76 -50 49 -65 87 -95 57 27 184 87 67 224 38
4169 38 74 109 205 -78 -134 204 -75 3 132 -99 -74 100 167 -48 135 -19 56 60 -226 250 5 -31 -23 30 -48
4194 -48 413 22 171 74 -7 -70 -23 -147 -81 113 -246 -78 -195 -115 -31 -29 0 17 19 314 269 238 51 -54 -159
4219 -159 145 -40 -269 -39 -55 77 -116 32 154 68 272 181 -171 -65 -154 35 66 102 6 -57 -50 106 -150
4242 -150 -100 -197 4 -146 -15 -2 7 -9 -84 -59 5 -54 52 23 250 241 199 -3 -113 76 -26 -14 -79 68 -96
4267 -96 94 148 -106 62 -58 -27 131 96 188 -20 -38 162 40 -183 65 150 -8 23 -164 -5 57 -17 -104 -109
4291 -109 9 -25 59 -5 129 45 134 53 54 4 82 232 -125 134 83 44 -215 286 -60 139 -69 10 106 -228 -95
4316 -95 24 -126 -198 -166 -163 209 170 118 50 6 15 67 98 67 -303 -271 26 -226 12 -15 -86 34 -44 55 49 -232 87
4343 87 264 95 -169 73 34 -106 -2 61 70 36 1 -151 -106 16 89 109 -62 44 -20 -92 -78 -146 22 100 -149
4368 -149 91 -82 -7 154 81 68 -56 6 -132 -53 -177 -60 -4 -26 -80 -80 -124 -61 81 89 -141 160 77 198 165
4393 165 73 22 151 46 -58 -135 42 156 -176 -111 27 -81 1 -25 -115 46 30 -135 2 137 58 167 180
4416 180 -64 -62 151 127 194 -12 -7 -213 38 -73 99 -4 12 -13 -123 51 0 -130 -136 -59 107 -92 -162 -134 123
4441 123 123 -140 -87 210 -26 -79 -116 -163 68 -58 -43 -82 115 25 70 -106 93 -60 59 123 -40 -117 -35 -56 -103
4466 -103 39 134 -80 101 117 -204 -17 -20 185 -32 -183 51 -48 146 222 29 10 67 108 143 -66 6 -12 -107
4490 -107 -4 76 -47 10 -115 149 -355 -105 130 -85 -12 -91 -10 -39 -32 39 -68 11 -63 -129 103 -199 14 -64
4514 -64 56 -8 -46 -28 -179 -40 117 36 -62 -72 -24 192 126 50 155 -18 114 8 70 -51 -92 -138 -78 -105 91
4539 91 217 111 11 23 118 -207 115 252 40 -142 -140 96 -22 159 18 -111 15 15 97 -165 -67 -134 165
4562 165 72 168 21 116 -73 -10 207 44 -103 88 -22 26 102 166 -213 96 81 26 -99 24 9 -44 -31 -75
4586 -75 -120 -98 114 -80 -203 115 -65 -93 -31 -56 154 105 -128 -193 -19 0 45 59 -10 -41 9 62 101 159 94 -2
4612 -2 91 114 4 -28 -74 -9 -152 -258 -65 82 273 149 -163 -155 33 70 144 -7 -61 -203 -130 109 -63 -59 -101
4637 -101 -69 182 -81 71 67 130 76 -98 -59 -110 -20 -2 -64 96 -94 -2 177 156 125 55 4 -209 -37 29 210
4662 210 164 31 34 -247 -21 95 -51 -107 12 50 -241 27 141 31 -6 -18 37 -263 3 114 -5 -50 -65
4685 -65 93 54 48 13 93 105 -80 36 85 114 -32 80 -212 159 -211 -45 14 25 -218 -70 -90 45 -58 -119
4709 -119 -89 -147 -84 31 126 -105 -161 22 -70 77 -57 -1 -12 -122 -40 -71 102 6 4 -262 81 -199 -135 -48 -50 -86
4735 -86 -3 -71 -43 -173 -3 92 121 51 71 -243 62 236 164 7 188 -129 63 159 -205 -119 -166 17 -121 -147
4759 -147 16 -93 -46 -361 -14 -36 -198 256 192 110 16 60 -61 35 -141 -232 -131 48 -96 -90 -13 210 163 -1
4783 -1 -182 35 -184 183 -27 43 -29 -49 0 -113 -39 33 -65 -15 -119 158 209 38 137 81 2 5 -47 -61 167 3
4809 3 -54 -63 -34 -189 -6 -80 57 71 8 -29 38 274 34 13 -79 106 82 -46 -25 -151 -147 -77 15 -93 -278 21
4835 21 -18 -34 0 -54 -44 157 26 -68 92 -21 -51 19 217 81 89 -125 -174 -128 -225 -149 259 -6 16 -8 52 61 42
4862 42 31 15 -15 -50 -93 -86 -90 -68 80 18 -74 10 24 -84 51 -216 -147 -170 24 258 -132 71 -35 -107 83 -135
4888 -135 8 33 -71 134 -241 8 55 9 66 -22 -119 -172 22 212 50 104 -227 74 150 56 -47 -46 72 -245
4912 -245 -10 -39 -14 -228 -83 -28 -23 -22 -112 123 125 109 29 0 -115 -86 31 103 -165 28 -103 -3 197 145 -120
4937 -120 92 98 114 -116 42 -58 35 -200 63 215 -63 88 -60 93 138 -170 76 128 11 43 133 66 -76
4960 -76 -190 -84 114 -42 -121 9 8 65 50 101 81 180 -81 48 -57 -108 28 -18 112 -68 -61 -59 55 -165 -83
4985 -83 84 -62 -35 -83 52 -90 37 7 152 2 -19 -28 -54 200 66 -75 -108 -21 -2 24 70 274 129 -155
5009 -155 -89 18 3 -49 123 -5 274 -36 193 -29 7 8 -41 360 -83 -171 -69 -89 -104 34 -148 36 -64
5032 -64 -34 108 91 -45 52 -76 5 96 25 -173 -37 61 -32 -38 -59 -130 -39 17 176 4 -204 -96 -83 -114 60 69
5058 69 151 242 168 86 -134 -213 -128 149 -24 -83 52 -55 131 -231 -47 115 -41 -108 -124 130 -395 -28 -206
5081 -206 -173 87 25 -124 84 177 -239 24 169 -21 115 83 -29 -49 12 110 -167 18 -86 -77 28 11 -138
5104 -138 28 8 40 -70 -74 -60 -136 -215 7 87 -146 66 -49 113 6 -29 -69 204 -9 -46 109 195 111 126 -48
5129 -48 -132 197 -83 -13 -22 104 -346 7 -77 5 138 -61 51 -38 24 22 18 -78 -118 -107 230 -99 -124 41 -13 -10 27
5156 27 130 70 -330 30 -158 -88 17 -28 46 -123 -135 114 34 79 -29 -61 78 115 145 -28 -14 -65 74 -46
5180 -46 -99 -12 75 22 -28 152 102 22 0 -222 -28 -116 -1 -128 -258 -5 197 67 -185 165 -88 -4 -46 -46 -73
5205 -73 49 -86 -102 79 -124 -28 -83 -13 109 140 -126 -24 -65 38 151 119 112 -125 48 41 -115 85 169 10
5229 10 -50 106 57 127 143 -197 -137 61 -1 -95 52 196 -19 -56 -127 -88 -28 -125 -132 186 163 45 -104 -176 33 9
5255 9 -10 136 -119 -3 195 -38 -27 114 45 -62 -21 192 -224 -100 -60 -9 26 41 -324 -65 40 -57 -1 -108
5279 -108 77 98 78 -9 -170 155 79 25 -7 -9 -138 -206 46 -17 -143 -149 109 -181 -57 70 26 -83 119 47 29
5304 29 -158 93 69 68 -27 82 -113 63 45 8 77 -94 78 -73 -41 -93 36 -1 25 192 106 -230 166 144 81
5329 81 -43 128 36 -124 85 -45 -142 38 -79 -156 82 -28 -1 107 -19 149 18 244 -140 44 174 -183
5351 -183 197 25 77 125 57 148 -134 107 144 -33 10 -13 -31 0 -127 75 -83 50 -27 66 -68 -134 -86 27
5375 27 105 23 100 87 169 -34 -80 -39 29 -127 -73 -42 -50 159 -132 -5 73 -29 -18 184 69 6 210 155 -164 -22
5401 -22 131 95 -127 -99 117 35 -107 -49 173 -60 -180 -156 70 -68 76 203 -71 88 -108 65 108 -53
5423 -53 -106 -77 221 4 14 169 -17 -199 -72 -41 -130 127 44 -7 -27 11 -116 -191 23 20 -20 128 165 -35 -151
5448 -151 -205 -164 -28 -60 29 -135 95 -28 39 0 58 234 -191 109 33 113 149 38 153 50 39 -152 -67 113
5472 113 45 -8 19 65 -157 -67 124 -3 -76 60 -45 166 -83 65 -21 -43 4 -105 -76 33 -107 -54 8 62
5496 62 48 -127 145 -84 154 -215 -45 -158 4 145 117 18 -8 -90 47 -53 83 68 -87 -126 33 1 -23
5519 -23 -26 43 226 200 3 -103 -113 49 17 -17 38 -112 -137 -43 -87 141 123 52 -206 134 -137 2 248 -92 52
5544 52 -76 -26 66 132 -8 78 -20 80 -127 -96 104 -52 80 37 118 74 -138 -18 183 -142 -45 19 -15 52 -31
5569 -31 126 3 -30 -144 -99 80 -56 -32 -21 141 32 26 -27 -71 157 -52 -45 -105 13 -17 -86 -95 35 171 125 84
5595 84 45 -20 -95 17 -47 73 -152 136 171 212 -100 -15 2 -10 88 -171 39 4 87 135 4 -80 -143 -152 -111 -68 -42
5622 -42 -52 228 -118 -50 76 -65 -266 -24 -8 85 8 -61 116 -65 -27 41 100 -32 168 -154 47 10 119 86
5646 86 109 48 -7 -103 202 78 -49 15 38 96 -166 33 40 115 -26 -64 -2 23 -17 96 39 33 -224 224 -111 -3
5672 -3 104 -111 99 92 -306 108 13 46 -45 -107 -85 86 77 152 18 -41 -87 -2 121 57 129 -39 55 194 -91 -38
5698 -38 -5 -152 -21 -163 7 -159 114 61 -57 107 -422 55 89 69 141 -136 -34 59 121 -286 -65 50 116
5721 116 74 -129 20 170 51 36 179 -39 59 119 -40 -162 -281 17 -10 96 36 -14 21 -100 -93 -168 -74 -205
5745 -205 89 -32 -100 131 -81 164 206 -13 -35 88 -61 63 -192 38 10 7 23 -21 -65 -115 47 14 -138 -170
5769 -170 37 87 93 -113 28 149 101 -9 -90 -90 74 -215 130 -29 -181 -19 -30 -40 -21 125 -68 -99 239 -29
5793 -29 -8 -206 101 -84 -9 58 10 136 46 77 46 -14 49 -107 -123 111 -3 28 111 -9 42 -179 -266 55 -120
5818 -120 -231 18 44 -62 1 138 109 -77 -122 -105 20 -36 24 -33 99 -155 -45 -271 11 123 -9 151 -164
5841 -164 79 -18 2 -35 27 10 130 -19 141 308 38 226 -49 -9 -68 81 -99 20 281 -69 -65 89 -347
5864 -347 -159 -35 286 6 -12 201 9 98 49 46 19 -117 -33 34 -39 59 -214 58 -259 -150 7 151 -192
5887 -192 -22 -66 156 -110 69 1 30 170 -145 -101 64 6 33 98 -24 -97 -103 -25 352 29 -156 92 -63 -64
5911 -64 -96 -187 -15 -107 51 -101 -2 -38 -6 14 132 171 -25 -73 -30 3 -266 -129 -110 189 -103 -80 -89 216 -60
5936 -60 9 60 215 -136 37 55 41 -12 7 66 -92 -59 -71 -8 67 -30 -49 56 147 274 77 12 35 58 -15 -79 196
5963 196 27 54 90 -200 -24 75 30 65 -45 -128 -63 71 -91 -41 210 -3 188 -122 133 131 89 90 -12 73 160
5988 160 98 -77 -118 -46 -162 150 -6 -135 7 -83 -204 22 111 73 32 -38 68 -34 65 -44 71 -79 -145
6011 -145 80 -212 -294 29 -58 -12 -79 -88 152 68 -123 -111 -138 -168 -42 56 44 54 -214 -129 85 224 -97 -132 -22
6036 -22 -18 5 -105 109 -1 216 97 -5 -1 -111 138 -23 111 106 -206 140 -109 -63 -11 39 146 -136 16 95
6060 95 -142 22 -144 84 64 46 139 52 -102 -48 88 -99 -158 17 -24 -160 -151 -217 -88 -146 -152 56 -43 20 9 1
6086 1 34 -79 9 22 -68 5 -37 75 110 88 138 -131 -22 14 -11 -90 -5 -267 133 71 210 80 50 -271 -140 -20
6112 -20 30 8 77 87 -66 96 64 90 -20 -233 27 -142 -151 39 -200 -49 -124 73 -81 47 94 -93 145 -82
6136 -82 42 54 56 -90 1 98 -11 -101 -148 -142 105 -18 -102 -186 4 -231 100 23 -142 22 32 54 -182 -9 27
6161 27 157 -87 59 -84 31 8 146 -53 33 -179 -95 17 -13 84 -87 151 119 0 96 -71 106 24 21 -62
6185 -62 -200 -55 8 179 222 -34 255 -54 -101 79 115 -170 -101 135 -134 47 0 -42 -184 -112 117 81 60 6
6209 6 -121 91 -106 -25 51 90 -198 -30 4 20 18 -34 51 -140 -209 170 134 -112 12 191 137 110 32 0 -16 -58
6235 -58 -23 90 26 -96 -112 -83 -17 -80 -10 129 -97 -89 -79 60 104 -6 228 -77 -233 156 -12 25 67 103 -23
6260 -23 -75 -161 -200 -196 68 -44 -24 101 90 5 37 231 -63 -43 262 -2 -50 196 -169 -118 -53 117 1 -50 30
6285 30 103 -131 104 19 62 -85 -119 -80 -21 -191 128 80 -25 26 140 -105 -15 -82 -49 30 102 -78 86 177 58
6310 58 71 57 -107 82 59 -120 6 36 19 -32 79 -55 -123 12 112 -24 -48 -105 -64 29 154 -59 -69 19 -183
6335 -183 -82 4 -78 53 -4 -75 46 -124 -74 37 -56 -56 -14 -31 -60 -97 -62 73 79 -41 -17 -247 39 -13 211 -93
6361 -93 -11 20 127 50 -56 38 119 -12 -248 31 -8 -78 40 -78 39 52 -62 134 88 156 -7 -2 -7 -120 134
6386 134 237 153 89 -43 -164 -83 15 -62 5 83 -106 171 -20 -60 -10 39 243 53 145 -73 103 67 -132 -156
6410 -156 4 -152 -186 5 -31 131 220 -173 -31 259 217 74 -34 -35 -135 24 -5 -29 -98 -59 -131 -179 50 -17
6434 -17 105 -130 -203 29 8 32 -14 293 -151 -6 1 24 31 133 71 19 81 -44 98 32 9 14 93 43 -172 188
6460 188 -121 -193 -72 -203 83 60 -28 -151 160 65 -5 4 130 -6 -13 -108 -43 62 -70 -79 -120 13 -102 -156 -151 216
6486 216 37 -59 192 -146 -62 36 39 -135 68 143 -55 2 54 -211 142 -158 -80 -5 -120 97 -58 -21 163 -28
6510 -28 159 273 -43 -33 -67 -22 274 63 195 -85 -97 103 60 -319 -36 -142 73 -28 -65 -5 -23 103 181
6533 181 -41 -40 -7 -133 54 79 3 135 -99 -30 -49 -47 21 32 -124 -64 -38 -161 -46 98 113 -147 1 -34 22
6558 22 60 2 29 135 -251 -176 239 208 45 -120 12 20 -43 -19 56 37 54 1 71 -106 -267 -185 -154 -41 115 -9
6584 -9 -25 -58 -27 37 -92 21 -36 -27 -235 -157 12 -102 -36 204 -11 134 -48 -102 -74 -40 140 161 98 132 -51 -20
6610 -20 -155 178 80 101 92 55 -5 56 -249 115 76 1 14 41 -28 -85 31 -5 -29 -249 41 -74 -33 -70 15 -31 -69
6637 -69 27 63 -170 -305 24 69 -86 147 111 75 -49 14 73 108 -126 -41 -104 -27 93 -197 96 -152 -72 -82 91
6662 91 34 61 -70 149 165 -22 7 -69 167 -1 -218 -15 31 -61 179 -101 187 -214 -1 60 78 156 -20 31
6686 31 259 -49 -30 -22 4 51 -76 -291 -9 -61 -99 -19 -149 54 36 55 55 -79 -71 79 -126 -156 33 80 43 -41
6712 -41 -25 -182 20 89 124 -56 10 -55 52 104 -19 17 -31 -260 -138 24 22 72 -14 314 120 94 155 -24 -161
6737 -161 -65 -36 -103 -4 -15 133 -82 -65 -34 -226 30 5 215 -38 -75 55 13 201 -31 -9 65 -161 -83 -19 91
6762 91 -70 -14 -40 -142 -83 -138 136 -60 145 255 106 1 -155 82 96 -111 58 15 75 -55 213 58 83
6785 83 -111 131 29 -23 196 -183 3 15 21 -15 -114 112 32 -129 -95 24 12 164 116 105 -47 50 -124 40
6809 40 67 -54 60 -72 35 59 45 -98 -82 -130 33 -184 28 191 72 -36 -83 60 -24 109 -54 -85 91
6832 91 -36 -36 -4 -80 60 -203 280 130 -43 53 5 87 17 9 -90 180 -16 60 -78 157 50 80 29 0 -129
6857 -129 -70 6 -24 66 -50 -136 -146 -63 -61 121 26 8 111 -119 125 -36 13 -58 -163 -73 -134 48 -38 -101 -70 -96
6883 -96 112 -53 66 -2 17 -17 -22 62 -30 27 -43 -129 73 -141 -144 -160 -52 -41 -118 84 -105 -76 3 28 160 126 -58
6910 -58 214 -41 -9 22 63 38 -36 127 156 106 -116 181 174 25 -93 -82 212 -54 -94 241 22 65 85 -22 65
6935 65 33 141 98 -3 56 -47 -36 -157 -65 73 -51 20 -113 4 34 43 107 100 122 -105 152 -21 153 69 -59
6960 -59 35 -48 117 102 -53 99 -47 37 -38 125 -132 -54 -85 -14 -125 34 46 16 8 -25 42 29 10 189 133 163
6986 163 32 -235 108 -163 180 14 78 58 -110 -33 102 -247 -60 -55 -161 -49 -10 3 63 -56 12 15 54 -15
7010 -15 23 60 42 -11 158 -101 105 70 127 40 -148 186 -116 135 3 -230 60 -32 -146 -150 21 125 57 66 -47
7035 -47 2 112 8 -40 82 -67 13 51 217 71 61 30 245 -15 -54 99 150 109 239 -185 -36 91 41 -102
7059 -102 -57 147 -30 151 4 32 -47 -154 241 -2 18 340 -27 -100 72 37 -76 14 25 -136 -50 113 -118
7082 -118 116 227 -20 31 -66 -59 53 -5 -140 64 27 -169 143 -94 -21 -262 -46 -36 -24 40 91 15 -24 -22 67
7107 67 -53 -215 -57 -58 297 -13 70 -167 -99 116 90 5 -76 78 -112 131 68 55 -86 -91 -137 -70 127 21 109
7132 109 -82 35 0 132 50 30 53 66 -94 -35 116 69 -125 105 29 -73 -43 -143 80 46 -23 6 -43 -150
7156 -150 29 106 -117 150 -98 -1 290 75 -138 -89 147 -40 5 -25 56 -25 26 21 -48 -71 -118 96 -159 114
7180 114 19 89 48 48 -96 287 -165 -29 60 128 -95 -47 -168 36 -149 36 -29 -16 66 -151 30 177 -156 211
7204 211 -63 47 -16 13 -16 -215 14 21 2 -62 -95 171 3 43 -53 -223 -341 164 -33 62 41 127 59 35 2
7229 2 -43 172 10 23 -171 -160 18 101 7 72 7 44 22 -85 229 159 176 122 -21 6 144 11 151 22 -187
7254 -187 21 120 -113 175 -2 29 55 116 -82 18 3 -208 -34 -71 102 7 45 62 66 92 -133 -21 79 44
7278 44 -331 63 -135 -8 37 -16 55 -208 -37 -47 -294 -94 163 75 -80 -21 -72 15 196 -102 -86 -17 -50 -102
7302 -102 101 46 -15 188 4 33 40 -123 -390 77 84 -27 -16 25 59 8 31 110 81 -94 -23 -10 66 2 82 -88
7328 -88 -121 -40 -81 -18 134 130 7 20 -127 6 -134 64 -78 14 102 -51 41 16 -109 127 -117 60 -82 -14
7352 -14 90 152 19 44 9 66 25 -56 19 37 9 -10 128 8 40 -139 152 -32 28 69 13 73 29 3 -237 118
7378 118 40 109 102 -1 -38 -8 144 73 -125 3 70 -2 -70 74 47 122 -71 -58 191 40 21 134 40 -71 84
7403 84 -125 161 -80 70 -16 -47 75 46 107 -89 120 96 -112 178 -127 -22 71 87 63 -201 -87 163 157 5
7427 5 145 -25 -138 39 -32 -32 -2 140 -83 173 -165 -80 26 -17 -65 91 92 183 9 -23 5 -87 -15 18 -152 153
7453 153 -86 141 72 95 113 62 -1 28 -72 57 249 137 -121 -59 106 -18 97 52 -88 53 212 88 -9
7476 -9 170 96 -21 118 -7 1 -250 -184 -49 35 225 -143 189 59 -84 -57 104 -65 -23 -52 -65 -30 37 -99
7500 -99 68 117 76 260 68 25 -73 6 -116 111 -90 107 69 110 -112 -7 -133 114 -51 19 117 -74 131
7523 131 -23 -32 -76 -72 -55 29 -136 19 -32 -9 145 61 -33 112 -74 -117 38 25 108 160 39 -111 16 -36 82
7548 82 60 -17 245 -13 -106 34 -212 85 -55 -80 -26 -103 100 -196 -102 -61 44 -74 50 -216 153 -65 -18
7571 -18 1 -114 22 27 195 -59 110 161 -58 -26 46 66 -49 208 -97 -229 -42 33 23 3 98 50 -175 214
7595 214 38 -26 15 4 -98 13 -117 46 4 147 12 -85 79 58 183 52 121 34 -42 -23 -245 -129 34
7618 34 -27 -90 120 23 -9 -128 83 6 -4 30 17 40 -129 80 -55 0 -106 -48 25 -41 -61 -49 30 234 -218 -149
7644 -149 -38 62 -94 -42 92 -10 -15 -75 162 80 -113 -89 -107 55 -116 -118 159 -172 -16 -108 62 -37 -112 241
7668 241 -73 -41 77 -117 105 -74 138 36 -34 30 86 40 16 111 -152 124 -153 140 121 37 52 6 34 -2
7692 -2 -157 69 105 -88 146 35 -11 -9 -188 214 -28 157 -73 -152 -55 -79 -10 88 35 -124 -51 -24 -69 -51 159
7717 159 -28 -107 -15 149 -53 79 20 -23 -13 43 34 95 -6 -40 -80 -38 62 -77 -107 195 -6 -154 -215 -8 28
7742 28 -170 49 -27 91 89 -223 -37 -104 -38 17 -61 -116 -4 100 -115 -128 -8 -162 -26 101 -131 -23 81
7765 81 -11 -51 77 -142 33 -149 73 155 -196 -82 29 -98 -68 81 -102 3 172 -36 105 67 2 -15 253
7788 253 62 19 160 -55 -135 -68 -4 92 3 160 -70 115 -32 -110 85 276 55 -15 -176 8 137 62 37
7811 37 -26 63 74 -51 67 59 -38 -77 -15 272 -115 29 60 -124 119 -76 30 -165 28 -85 -64 -195 170 -87
7835 -87 -26 268 -53 86 -28 71 67 -42 -138 208 -87 66 -23 -76 -222 9 20 94 66 87 183 11 105 -54 -85
7860 -85 24 -44 31 -64 -35 -70 136 -148 -151 97 85 -287 -209 30 181 -12 -53 177 -172 -138 -115 12 -85 32 -246
7885 -246 4 -37 -13 -33 47 127 97 237 -47 -105 5 -117 -95 -223 61 -72 55 -52 66 178 -35 123 26
7908 26 -80 93 118 259 79 -24 90 -10 -6 -171 12 75 -12 94 45 49 -185 -243 -74 47 -86 83 -48
7931 -48 -19 127 25 34 -21 166 -1 -12 2 -115 77 -151 -7 40 42 76 -66 -88 54 -5 -45 94 214 63 -157
7956 -157 27 205 -88 -46 -59 -104 -98 18 35 -41 76 200 72 42 -19 -197 24 173 0 -31 113 71 -37 -232
7980 -232 54 161 -49 180 34 112 -233 -1 -84 -159 60 48 112 -123 7 -123 71 -84 -70 21 46 -27 -35 -67
8004 -67 -141 81 131 89 -176 42 173 66 -105 119 4 -254 46 -126 -121 25 -55 -222 -28 -4 48 170 180
8027 180 -73 3 60 6 20 14 -34 66 88 74 44 33 75 132 -199 13 -188 28 -106 -79 26 6 44 107 -113 2
8053 2 11 -113 19 -3 69 50 -186 -25 6 -82 23 -72 -5 43 -150 -71 28 -19 -17 -33 219 -80 4 -148 285 8
8079 8 -88 -78 80 -41 66 206 -142 -44 -118 -45 8 -36 -83 -97 -164 -197 -69 -39 -50 -44 -2 -92 18 70 142 37 35 -130
8107 -130 -189 52 -81 -108 -76 24 187 15 280 -20 15 -99 -183 131 -239 25 -202 -8 -174 -2 -158 -92
8129 -92 -67 106 73 -70 -162 45 33 -146 48 -46 144 -163 -52 -41 118 -6 143 84 -134 39 45 12 77 -81
8153 -81 -111 174 -55 -200 -71 165 36 -57 6 -16 -180 -65 206 30 -76 -214 -111 -80 50 6 46 189 -29
8176 -29 -203 -75 57 30 -29 -16 188 9 -59 269 104 -131 -71 -88 130
8191A30
##END NTUPLES=NMR FID
##END=
