##TITLE=1H_E3e200GRT
 CDCl3
 8 sc, 
 5.7.2023
##JCAMPDX= 6.0         $$ Bruker NMR JCAMP-DX V2.0
##DATA TYPE= NMR FID
##DATA CLASS= NTUPLES
##ORIGIN= UXNMR, Bruker Analytische Messtechnik GmbH
##OWNER= root
$$ XWIN-NMR		Version 3.5
$$ Wed Jul  5 13:58:56 2023 Russian Standard Time (UT+4h)  she@DPX200
##.OBSERVE FREQUENCY= 200.13135
##.OBSERVE NUCLEUS= ^1H
##.DELAY= (6, 6)
##.ACQUISITION MODE= SIMULTANEOUS
##.ACQUISITION SCHEME= undefined
##.AVERAGES= 8
##.DIGITISER RES= 18
##SPECTROMETER/DATA SYSTEM= spect
##.PULSE SEQUENCE= zg30
##.SOLVENT NAME= CDCl3
##.SHIFT REFERENCE= (INTERNAL, CDCl3, 0, 15.7039)
##AUDIT TRAIL= $$ (NUMBER, WHEN, WHO, WHERE, WHAT)
$$ ##TITLE= Audit trail, XWIN-NMR		Version 3.5
$$ ##JCAMPDX= 5.01
$$ ##ORIGIN= Bruker BioSpin GmbH
$$ ##OWNER= she
$$ F:/spectra/data/she/nmr/H-F/1/audita.txt
$$ ##AUDIT TRAIL=  $$ (NUMBER, WHEN, WHO, WHERE, WHAT)
(   1,<2023-07-05 13:57:40.65 +0400>,<she>,<DPX200>,
      <created by zg, POWCHK disabled, PULCHK disabled
       configuration hash MD5:
       00 E9 B6 7A A2 85 ED C7 34 08 36 98 17 FE 4E 26
       data hash MD5: 16K
       39 A5 A6 37 8A 65 A7 CD 80 48 05 35 56 77 5E C3>)
$$ ##END=
$$ 
$$ hash MD5
$$ C9 E9 98 6C 73 3F 55 3F F1 B5 C9 4B 96 E5 8B 61
##$RELAX= 
##$RELAX= 
##$RELAX= 
##$RELAX= 
##$RELAX= 
##$RELAX= 
$$ Bruker specific parameters
$$ --------------------------
##$DU= <F:/spectra>
##$EXPNO= 1
##$NAME= <H-F>
##$PROCNO= 1
##$TYPE= <nmr>
##$USER= <she>
##$AMP= (0..31)
100 100 100 100 100 100 100 100 100 100 100 100 100 100 100 100 100 100 
100 100 100 100 100 100 100 100 100 100 100 100 100 100 
##$AQSEQ= 0
##$AQ_mod= 1
##$AUNM= <au_zg>
##$AUTOPOS= <>
##$BF1= 200.13
##$BF2= 200.13
##$BF3= 200.13
##$BF4= 200.13
##$BF5= 200.13
##$BF6= 200.13
##$BF7= 200.13
##$BF8= 200.13
##$BYTORDA= 1
##$CFDGTYP= 0
##$CFRGTYP= 5
##$CHEMSTR= <none>
##$CNST= (0..31)
1 1 145 1 1 1 1 1 1 1 1 1 1 1 1 1 1 1 1 1 1 1 1 1 1 1 1 1 1 1 1 1 
##$CPDPRG= <>
##$CPDPRG1= <>
##$CPDPRG2= <>
##$CPDPRG3= <>
##$CPDPRG4= <mlev>
##$CPDPRG5= <mlev>
##$CPDPRG6= <mlev>
##$CPDPRG7= <mlev>
##$CPDPRG8= <mlev>
##$CPDPRGB= <>
##$CPDPRGT= <>
##$D= (0..31)
0 1.2 0 0 0 0 0 0 0 0.06 0 0.03 0 0 0 0 0.0002 0 0 0 0 0 0 0 0 0 0 0 0 
0 0 0 
##$DATE= 1688551060
##$DBL= (0..7)
120 120 120 120 120 120 120 120 
##$DBP= (0..7)
150 150 150 150 150 150 150 150 
##$DBP07= 0
##$DBPNAM0= <>
##$DBPNAM1= <>
##$DBPNAM2= <>
##$DBPNAM3= <>
##$DBPNAM4= <>
##$DBPNAM5= <>
##$DBPNAM6= <>
##$DBPNAM7= <>
##$DBPOAL= (0..7)
0.5 0.5 0.5 0.5 0.5 0.5 0.5 0.5 
##$DBPOFFS= (0..7)
0 0 0 0 0 0 0 0 
##$DE= 6
##$DECBNUC= <off>
##$DECIM= 32
##$DECNUC= <off>
##$DECSTAT= 4
##$DIGMOD= 1
##$DIGTYP= 9
##$DL= (0..7)
0 120 120 120 120 120 120 120 
##$DP= (0..7)
150 150 150 150 150 150 150 150 
##$DP07= 0
##$DPNAME0= <>
##$DPNAME1= <>
##$DPNAME2= <>
##$DPNAME3= <>
##$DPNAME4= <>
##$DPNAME5= <>
##$DPNAME6= <>
##$DPNAME7= <>
##$DPOAL= (0..7)
0.5 0.5 0.5 0.5 0.5 0.5 0.5 0.5 
##$DPOFFS= (0..7)
0 0 0 0 0 0 0 0 
##$DQDMODE= 0
##$DR= 18
##$DS= 0
##$DSLIST= <SSSSSSSSSSSSSSS>
$$ [...]
##$SUBNAM2= <"">
##$SUBNAM3= <"">
##$SUBNAM4= <"">
##$SUBNAM5= <"">
##$SUBNAM6= <"">
##$SUBNAM7= <"">
##$SUBNAM8= <"">
##$SUBNAM9= <"">
##$SW= 18.05172834244
##$SWIBOX= (0..15)
0 0 2 0 0 0 0 0 0 0 0 0 0 0 0 0 
##$SW_h= 3612.71676300578
##$TD= 16384
##$TD0= 1
##$TE= 0
##$TE2= 300
##$TE3= 300
##$TEG= 300
##$TL= (0..7)
0 120 120 120 120 120 120 120 
##$TP= (0..7)
150 150 150 150 150 150 150 150 
##$TP07= 0
##$TPNAME0= <>
##$TPNAME1= <>
##$TPNAME2= <>
##$TPNAME3= <>
##$TPNAME4= <>
##$TPNAME5= <>
##$TPNAME6= <>
##$TPNAME7= <>
##$TPOAL= (0..7)
0.5 0.5 0.5 0.5 0.5 0.5 0.5 0.5 
##$TPOFFS= (0..7)
0 0 0 0 0 0 0 0 
##$TUNHIN= 0
##$TUNHOUT= 0
##$TUNXOUT= 0
##$USERA1= <user>
##$USERA2= <user>
##$USERA3= <user>
##$USERA4= <user>
##$USERA5= <user>
##$V9= 5
##$VALIST= <valist>
##$VCLIST= <CCCCCCCCCCCCCCC>
##$VD= 0
##$VDLIST= <DDDDDDDDDDDDDDD>
##$VPLIST= <PPPPPPPPPPPPPPP>
##$VTLIST= <TTTTTTTTTTTTTTT>
##$WBST= 1024
##$WBSW= 4
##$XGAIN= (0..3)
0 0 0 0 
##$XL= 0
##$YL= 0
##$YMAX_a= 213291
##$YMIN_a= -215401
##$ZGOPTNS= <>
##$ZL1= 120
##$ZL2= 120
##$ZL3= 120
##$ZL4= 120
##$ABSF1= 10
##$ABSF2= 0
##$ABSG= 5
##$ABSL= 3
##$ALPHA= 0
##$AQORDER= 0
##$ASSFAC= 0
##$ASSFACI= 0
##$ASSFACX= 0
##$ASSWID= 0
##$AUNMP= <proc_1d>
##$AZFE= 0.1
##$AZFW= 0.1
##$BCFW= 1
##$BC_mod= 2
##$BYTORDP= 1
##$COROFFS= 0
##$CY= 11.3945322036743
##$DATMOD= 1
##$DC= 2
##$DFILT= <>
##$DTYPP= 0
##$F1P= 15.7292609196834
##$F2P= 12.9074282941183
##$FCOR= 0.5
##$FTSIZE= 0
##$FT_mod= 4
##$GAMMA= 1
##$GB= 0.15
##$INTBC= 1
##$INTSCL= 1
##$ISEN= 128
##$LB= 0.24
##$LEV0= 0
##$LPBIN= 0
##$MAXI= 10000
##$MC2= 0
##$MEAN= 0
##$ME_mod= 0
##$MI= 1.114404
##$NCOEF= 0
##$NC_proc= 0
##$NLEV= 6
##$NOISF1= 3.799351
##$NOISF2= 2.8
##$NSP= 1
##$NTH_PI= 0
##$NZP= 0
##$OFFSET= 15.70392
##$PC= 1
##$PHC0= -20628.46
##$PHC1= 9.85272
##$PH_mod= 1
##$PKNL= yes
##$PPARMOD= 0
##$PSCAL= 0
##$PSIGN= 0
##$REVERSE= no
##$SF= 200.130013532006
##$SI= 16384
##$SIGF1= 3
##$SIGF2= 2
##$SINO= 400
##$SIOLD= 16384
##$SREGLST= <1H.CDCl3>
##$SSB= 0
##$STSI= 0
##$STSR= 0
##$SW_p= 3612.71676300578
##$SYMM= 0
##$S_DEV= 0
##$TDeff= 0
##$TDoff= 0
##$TI= <>
##$TILT= no
##$TM1= 0
##$TM2= 0
##$TOPLEV= 0
##$USERP1= <user>
##$USERP2= <user>
##$USERP3= <user>
##$USERP4= <user>
##$USERP5= <user>
##$WDW= 1
##$XDIM= 8192
##$YMAX_p= 0
##$YMIN_p= 0
$$ End of Bruker specific parameters
$$ ---------------------------------
##NTUPLES= NMR FID
##VAR_NAME=  TIME,          FID/REAL,        FID/IMAG
##SYMBOL=    X,             R,               I
##VAR_TYPE=  INDEPENDENT,   DEPENDENT,       DEPENDENT
##VAR_FORM=  AFFN,          ASDF,            ASDF
##VAR_DIM=   8192,          8192,            8192
##UNITS=     SECONDS,       ARBITRARY UNITS, ARBITRARY UNITS
##FACTOR=    0.0002768,     1,               1
##FIRST=     0,             0,               0
##LAST=      2.2672688,     0,               0
##MIN=       0,             -215401,         0
##MAX=       2.2672688,     213291,          0
$$ Real data points
##PAGE= N=1
##DATA TABLE= (X++(R..R)), XYDATA
0@%%%%%%%%%%%%%%%%Nj3J6j6J6j6K0k8L2l2L8m6N2o0O8p6Q5r7J12j24J35j51J70
$$ 0 0 0 0 0 0 0 0 0 0 0 0 0 0 0 0 0 5 -8 8 -8 8 -8 12 -16 16 -16 22 -24 28 -32 36 -40 45 -52 60 -64 71 -80 90
39I0j89K09k32K58k85L15l49L82m18M60n07N58o13O77p50Q30r22J029j151J295
$$ 90 -99 110 -122 136 -149 166 -183 199 -219 241 -266 292 -321 356 -394 436 -486 543 -608 687
59F87j470J685j956K306k776L445m461O167r496J8080p5322j52290K43464k2998
$$ 687 -783 902 -1054 1252 -1524 1921 -2540 3627 -5869 12211 -63111 -215401 28063 5065
73E065r6056K49234l7600l09084J16205J47179j54796R6255J75793k24029j05131
$$ 5065 -90991 158243 120643 -188441 -72236 74943 -79853 16402 192195 -31834 -136965
84a36965J84261m3496p7727J45492k1507j37828N2909N5021l2221J2396l352j5185
$$ -136965 47296 3800 -73927 71565 50058 -87770 -34861 20160 -12061 335 -3017 -18202
96a8202K5488n904J1668M4639p1709o8378R4128L1725n9452O1646l724j36186
$$ -18202 7286 1382 13050 57689 -14020 -82398 11730 43455 -15997 45649 41925 -94261
108i4261L5873R8393k9054L6893K4558j27527j2229R2511l0252K6594R4153j21805
$$ -94261 -58388 40005 10951 47844 72402 -55125 -67354 25157 -5095 21499 115652 -6153
120f153j11612J27777J8580q4251J18216K8811j84572K1073J29833o4394j2931
$$ -6153 -117765 10012 28592 -55659 62557 91368 -93204 -72131 57702 -6692 -19623
131a9623R4366o4159q6735P2872L9031m1854J9972O059n5526J2297M1814j2116
$$ -19623 74743 10584 -76151 -3279 35752 -6102 13870 19929 -35597 -23300 18514 6398
143F398J152j32l5086N922L7718M421j2435q383j2444j1277J7521L6369n104l7044
$$ 6398 7550 7418 -27668 -21746 15972 20393 7958 -425 -12869 -24146 -6625 29744 24640 -12404
157a2404q688O401k406K0520L2257k1568m6479J1372K2348q753K6550J9567m8228
$$ -12404 -21092 -14691 -17097 3423 35680 14112 -32367 -20995 1353 -7400 19150 38717 -9511
170i511k2016K9215N839J844J8556j1455l4190k47K5199N469k99N045j6932j6613
$$ -9511 -31527 -2312 3527 5371 23927 12472 -21718 -21965 3234 8703 8404 13449 -3483 -20096
184b0096J3672J7958O39q537k770o770j1333J8480J7399k1195m047R975j8128
$$ -20096 -6424 11534 12173 3636 866 -5904 -17237 1243 18642 -2553 -6600 3375 -14753
197a4753N524K8615j2823j7212J5540l947j5200K5629R722l3970O928J9857k7857
$$ -14753 -9229 19386 6563 -10649 4891 944 -14256 11373 21095 -12875 -5947 13910 -13947
210a3947P800L2040k9557j5275L0046j0401j5119K7594p50k8471J1581J3726j8401
$$ -13947 -6147 25893 -3664 -18939 11107 706 -14413 13181 12431 -16040 -4459 9267 -9134
223i134P129J6202k0957k682J5916j2359J741J4834j3354k409J1857r522l014
$$ -9134 -2005 14197 -6760 -9442 6474 -5885 -4144 10690 -2664 -5073 6784 -2738 -5752
236e752J2606m230p535J0083J08j2244O409N768r585P249M241j2293M016J854
$$ -5752 6854 2624 -4911 5172 5280 -6964 -555 5213 -4372 2877 7118 -5175 -1159 695
250F95p413J0996K783j3364L639L981r263N766J2647r988j0107J1152j012p630
$$ 695 -6718 4278 7061 -6303 -2664 1317 -7946 -2180 10467 479 -9628 1524 512 -7118
264g118J5562J066j7679M666M923n468Q808L698j0786k925K219K59O072O172p797
$$ -7118 8444 9510 -8169 -3503 1420 -4048 4760 8458 -2328 -5253 -3034 -2775 3297 9469 1672
279A672q610N263o8p45J2717m281j4862L819L410j350P604J442q902n409L840
$$ 1672 -6938 -1675 -1743 -2488 10229 5948 -8914 -5095 -1685 -3035 4569 6011 -2891 -8300 -4460
294d460O632K931J622m445q499K253N228M089N175p618j0097J686K788N749O114
$$ -4460 2172 5103 6725 2280 -6219 -3966 1262 5351 10526 2908 -7189 -5503 -2715 3034 9148
309I148m223q597n123L976Q943L102j0n828j0215J419P171N588J350p644o441
$$ 9148 4925 -3672 -8795 -4819 4124 7226 7216 1388 -8827 -7408 -237 5351 6701 -943 -7384
324g384j153K718J0094L743o708m845l102K892Q633L187j684p262o768K844N718
$$ -7384 -8537 -5819 4275 8018 1310 -3535 -6637 -3745 4888 8075 6391 -871 -7639 -4795 923
339I23M933J37q064m779p5M102R285Q23o216m521l807M378Q241O62k607o665n967
$$ 923 5856 5993 -2071 -6850 -6925 -2823 6462 7285 1069 -3452 -7259 -2881 5360 6022 3415 -3250 -9217
356i217L566O961M283j354o145l731r22O934R069l320l650k808o722N406R658
$$ -9217 -5651 1310 5593 4239 -1906 -5637 -6559 375 9444 6124 2474 -334 -7056 -1650 8008
371H008k166l323l512o008J105Q083M499m367l113k021m235O787Q794n778k480
$$ 8008 5842 2519 -993 -7001 -5896 2187 6686 2319 -794 -2815 -7050 -263 8531 2753 273
386B73r63p048M689Q516k122k747k637m472K052P408L362l576k471l319l018Q209
$$ 273 -690 -7738 -3049 5467 3345 598 -2039 -6511 -4459 2949 6311 2735 264 -3055 -6073 2136
402B136N598m871J61m856p253Q235N065k988K120m033q516M726P869j741m48K230
$$ 2136 7734 2863 3024 -1832 -9085 -850 4215 1227 3347 -686 -9202 -4476 3393 1652 1204 3434
418C434q218l868J2536L32o512O673n861r504J2353N058p212K782p77r209M047
$$ 3434 -4784 -8652 3884 4216 -2296 4377 -1484 -10988 1365 6423 -789 1993 1216 -7993 -3946
433c946J1566j353n164K051o808m986J2519L831n137R70p178o608P797N701J139
$$ -3946 7620 6267 1103 3154 -3654 -8640 3879 7710 2573 3543 -3635 -10243 -2446 3255 4394
448D394L5n934m731J549M520M812J587m310o237J240L269j191N746J44j1389L922
$$ 4394 4429 -1505 -6236 -4687 -167 4645 6232 1922 -4315 -3075 194 -997 4749 4893 -6496 -2574
464b574P153p134M195N232j2008j070J2354j693n668N479m641j2096J0350J1273
$$ -2574 4579 -2555 1640 6872 -5136 -6206 6148 4455 -1213 4266 -375 -12471 -2121 9152
478I152r016P19K138j5345J400J6560J2k484J739r162q212Q701J1068r15k003
$$ 9152 136 855 2993 -12352 -10952 5608 5620 3136 4875 -4287 -12499 -3798 7270 6355 4352
493D352j488j0558k194J1032M817n02j689m885l760k98O828N825o101j735K603
$$ 4352 2864 -7694 -9888 1144 5961 5459 3770 -1115 -4875 -5173 1655 7480 1379 -356 2247
508B247o246L3Q106k996n750N308K932p082K192N952j0485q42J4204m070n999
$$ 2247 -3999 -3966 4140 1144 -4606 702 3634 -3448 -1256 4696 -5789 -6631 7573 3503 -2496
523b496Q446o844j0172J1292Q048o537O81K674j2142l610J5350J798o194O105
$$ -2496 5950 -894 -11066 226 8274 1737 2418 5092 -7050 -10660 4690 6488 294 6399
537F399n336j2559P285Q580k505R53J508p492n703O678N044k990K806J474q458
$$ 6399 1063 -11496 -4211 4369 1864 2817 4325 -3167 -8870 -2192 2852 -138 2668 4142 -4316
552d316q34N363m47K23L296N69n159k285M632j300k317P747m21p581J547K058
$$ -4316 -5150 213 -234 -11 3285 3854 -1305 -3590 1042 -258 -2575 5172 4751 -2830 -1283 775
568G75l924J571P031j961p882M264J461p959O495P150r674r47P519o338l169R418
$$ 775 -3149 -1578 5453 3492 -4390 -126 1335 -6624 -129 7021 -2653 -3600 3919 -2419 -5588 3830
584C830l56q482N269N682j0283Q71J0040q612k498J2128m824q081O581L72o528
$$ 3830 3474 -5008 261 5943 -4340 -3469 6571 -2041 -4539 7589 2765 -5316 1265 1637 -4891
599d891O032P371q663n079N967l081k165J1426p83j0843P55J170r39N386N765
$$ -4891 1141 8512 -151 -5230 737 -2344 -4509 6917 6134 -4709 -3954 -2784 -3723 1663 7428
614G428m198q674m56M496Q85N515L401q961o982L070N255K685K242K01r709n963
$$ 7428 3230 -5444 -5900 -1404 -519 4996 8397 -564 -7546 -4476 779 3464 5706 5907 -3802 -9765
630i765J0201M259l145M306m007j1528M972J0229k490l104K877o428o143J2188
$$ -9765 436 4695 1550 5856 1849 -9679 -4707 5522 3032 -72 2805 -3623 -9766 2422
644B422N823j0524O79K153q625O661J2268p005q727K167m39o18J1133M446j4152
$$ 2422 8245 -2279 -1600 553 -8072 -1411 10857 3852 -4875 -2708 -3147 -3765 7368 11814 -2338
659b338o131N673r77O449J0971q720j3277J08M235M738P947K107j2951j0481O161
$$ -2338 -8469 -2796 -3773 2676 13647 4927 -8350 -8242 -4007 731 8678 10785 -2166 -12647 -6486
674f486O338M441O267o831j3338j49P449O860L267k682q015o999N021J0567J723
$$ -6486 -148 4293 10560 3729 -9609 -9758 -2309 4551 7818 5136 -2879 -9878 -4857 5710 7433
689G433k589n117p617J807R262N854l510q181l584j36N466J0694r62j1942m324
$$ 7433 4844 -273 -7890 -6083 3179 9033 5523 -2658 -6242 -6378 -912 9782 8820 -3122 -7446
704g446J005L182R994M616r761j1476J223N943M799Q938k490j6539k789P975L518
$$ -7446 -6441 -3259 6735 11351 1590 -9886 -8663 -2720 2079 11017 8527 -8012 -10801 -2826 692
719F92P883K960j3242r704N465P649M055M021n539j4207J95J0840L112L413j369
$$ 692 8575 11535 -1707 -11411 -5946 1703 5758 9779 4240 -9967 -9772 1068 4180 7593 6224
734F224j3265l961Q912O121K783j423q774o953M494R853L181k024n812q786K318
$$ 6224 -7041 -11002 -2090 4031 6814 5391 -3383 -10336 -5842 4011 7192 5168 -644 -9430 -7112
749g112R898M358M96o692r349J436P380O049K877o279r725j751O152P338K904
$$ -7112 2786 7144 7640 948 -8401 -6965 415 6464 9341 3062 -6663 -8414 -2262 5076 7980
764G980k594r398o616O416P531K384J385p847r267M001P288L407K231n376q538
$$ 7980 5386 -4012 -10628 -4212 3319 5703 7088 -759 -10026 -6025 1263 4670 6901 1525 -7013
779g013n51P349N511j94j816o899m464P042O247m04m85o535n224M916O160K023
$$ -7013 -7564 -215 5296 5102 3286 -3613 -8077 -1035 5212 4808 4323 -2212 -7436 -2520 3640 5663
795E663j763n599m626J040O964M286k521l937n066j020O799M546p16k402o259
$$ 5663 3900 -1699 -6325 -5285 1679 5965 3444 -493 -5559 -6579 220 4766 4050 1648 -4611
810d611j716N311M139K143k498n577k091K301N212K788k384l472l925P91N706
$$ -4611 -6327 -1016 3123 5266 2768 -2809 -4900 -2599 2613 5401 3017 -455 -4380 -3589 2117
825B117J758m54k776n175P62M204K014J074k785m265l64K243L533J411k239k760
$$ 2117 3875 3421 645 -4530 -3768 436 2450 3524 739 -3526 -3890 -1647 1886 3297 1058 -1702
841a702k203K007L935K33k21k162l417K327K579N01Q91k886k303J312J454J854
$$ -1702 -3905 -1898 2037 2270 2049 -113 -3530 -1203 1376 1877 2768 -118 -2421 -1109 345 2199
857B199J27k143j613o79K169J574p70R8k668j292L089p2M07J282l282q46K607
$$ 2199 2326 183 -1430 -2109 60 1634 864 962 -1706 -2998 91 19 426 1708 -1574 -2420 187
874A87l67P80R84j931j322J467J292r79O49R51l159N66L149k884J125J802m090
$$ 187 -180 600 1584 -347 -1669 -202 1090 111 760 1711 -1448 -882 2267 -617 508 2310 -1780
891a780P27K739k174l5J702j624j391J928N57k181J420J498l357J565J407l297
$$ -1780 -1053 1686 -488 -523 1179 -445 -1836 92 649 -1532 -112 1386 -1971 -406 1001 -2296
907b296K053J969k837J642P76k869J257J462j160Q65O94k043r70K570n22j002
$$ -2296 -243 1726 -1111 531 1307 -1562 -305 1157 -3 862 1556 -487 -1457 1113 591 -411
923d11L045k456l110L928q45k106M752k203m131M114l0l078L550J148m925J336
$$ -411 2634 178 -2932 996 151 -1955 2797 594 -3537 577 547 -2531 1019 2167 -2758 -1422
939a422M321m342m89N742m970k586P546k663m047N816k145m582N412J934m440
$$ -1422 2899 -1443 -1932 3810 -1160 -3746 3800 1137 -2910 2906 761 -3821 1591 3525 -915
954i15R84J340m126P30N293k066j993K103l623j193M858n03l36J144m006k88K481
$$ -915 69 1409 -2717 -1987 3306 1240 -753 1350 -2273 -3466 1392 889 553 1697 -2309 -2597 -116
971a16m95K056J001l595n43K358j333j77M117k017m140N275o36o092O462J210
$$ -116 -611 1445 2446 -1149 -1692 666 -667 -844 3273 1256 -2884 2391 1755 -4337 2125 3335
987C335p783N506L947q687J804N342o352m94Q700l830o748O649m50o890P837L712
$$ 3335 -4448 1058 5005 -3682 -1878 3464 -2888 -3382 5318 1488 -5260 1389 939 -5951 1886 5598
1003E598q743J841L436n850K248N822k725k888J643o11j753K914K080k446j316
$$ 5598 -3145 -1304 2132 -3718 -1470 4352 1627 -1261 382 -229 -1982 932 3012 566 -750
1018g50N00P4j60J94J899p69m137L310K474o131K710M820p153N39P282n651m012
$$ -750 -250 -176 -336 -142 1757 988 -3149 161 2635 -3496 -786 4034 -3119 -2580 4702 -949 -4961
1035d961P631q23o636P456K464j0610L187P502q456J996R188r336m504Q700k299
$$ -4961 2670 1847 -4789 2667 5131 -5479 -2292 5210 -3246 -1250 7938 -1398 -5902 2798 499
1050D99l365P772m30r088J558M931l643J641N667n437m224K984L77M95J803K68
$$ 499 -2866 4906 4476 -4612 -3054 1877 -1766 -125 5542 105 -4119 -1135 -758 -263 1540 1808
1066A808j369l637J227M012k702j44M181l727l023N707r1o350M160M579p151J543
$$ 1808 439 -3198 -1971 2041 -661 -805 3376 -351 -3374 2333 2242 -4108 52 4631 -2520 -977
1082i77P955r444m586J1432k897n605J0308k485j2075N729O168n930L605O335
$$ -977 6978 -2466 -7052 4380 1483 -4122 6186 3701 -8374 -2645 3523 -2407 1198 7533
1096G533j0530m530R024j914j728R330l972r548M563K686k636M229K623n580l505
$$ 7533 -2997 -7527 1497 -417 -2145 7185 3213 -6335 -1772 914 -1722 2507 5130 -450 -3955
1111c955L387J769j314K007O81l753j477K618K192k438j317L599k594k944O750
$$ -3955 -568 1201 -113 1894 2575 -1178 -2655 -37 2155 -283 -1600 1999 -595 -3539 3211
1126C211j207p299N084L042o142M210M559q602k444Q410k217l155Q965l219j1086
$$ 3211 2004 -5295 -211 2831 -3311 899 5458 -3144 -5588 2822 605 -2550 6415 3196 -7890
1141g890O948M616o585N810M258j0764j770O903j510p88O051k891q065L324L648
$$ -7890 -942 3674 -2911 2899 7157 -3607 -5377 1526 16 -772 5279 2388 -5677 -2353 1295
1156A295l093L374K591o239j365L418k07M36Q10m7j999j195L026J038l004R94
$$ 1295 -1798 1576 4167 -2072 -3437 -19 -226 210 1020 973 -1026 -2221 805 1843 -1161 -167
1172a67J376k040M80L317j772m302K976K272m101L372K989p392l31N509l371K61
$$ -167 1209 -831 -351 2966 1194 -3108 -132 2140 -1961 1411 4400 -2992 -3323 2186 -1185 -924
1188i24N392m199m757L823J753k922L437K041o521k86M805k727O86M020l538k618
$$ -924 4468 269 -4488 -665 1088 -1834 1603 3644 -2877 -3163 1642 -1085 -399 3621 83 -2535
1204b535K582J71l79J637K6k227l34J500j01k31P82q94n37J68L8J109r88q93K055
$$ -2535 47 218 -161 1476 1502 -725 -1059 441 340 109 891 -3 -540 -372 -334 775 -213 -1106 949
1223I49j556o62K751j508k010K555J91j947J341J318k584j11L381k049j348L449
$$ 949 -607 -1269 1482 -26 -2036 519 710 -1237 104 1422 -1162 -1273 2108 59 -1289 2160
1239B160j802k659L916n21k655K757o0k315J191J314j974m44K138j091j318K432
$$ 2160 358 -2301 1615 1094 -1561 1196 1136 -1179 12 1326 -648 -1092 1046 -45 -1363 1069
1255A069r38k246K385j4j023J625r42j080Q82K9P83L75n58o28o45J034K35M34
$$ 1069 131 -2115 270 256 -767 858 -84 -1164 -282 -253 530 905 347 -281 -926 108 343 777
1273G77O03j859m27J205m72J140P78k597k43Q61n56J322O99j452j130K52P61L75
$$ 777 1380 -479 -906 299 -173 967 1745 -852 -1095 -234 -790 532 1231 -221 -1351 -1099 -338 37
1291C7P46K14k516J19J611n70J390L18k429j37J113M24J087j87j336j041K94J596
$$ 37 783 997 -1519 -1400 211 -359 1031 1349 -1080 -1217 -104 320 1407 1220 -116 -1157 -863 733
1309G33L87Q9o42k324L16J622M32Q93j209j989J39N44J485J278j312j318p64J91
$$ 733 1120 1209 567 -1757 -1441 181 613 1506 297 -1692 -1553 -1009 476 1754 442 -876 -1640 -1449
1327a449J949R56l45r74j743P86J078Q82P81j873j396Q99k9J785O08k152p18k58
$$ -1449 500 1456 1111 137 -1606 -820 258 1140 1921 48 -1348 -449 -478 1307 1915 -237 -955 -1213
1345a213M84K035K18j140j401r36J171J162J069q9k620n66Q30M84K186J60k437
$$ -1213 -729 1306 1524 384 -1017 -1953 -782 380 1449 1360 -1260 -1826 -996 -512 1674 1834 -603
1362f03m31l04R10K006l5j070j131n83J062J038Q39r56j884M11K62O50J877j249
$$ -603 -1034 -1338 -428 1578 1543 473 -658 -1241 -179 859 1698 742 -1142 -731 -469 181 2058 809
1380H09k298N44m41J242J916p20j883n74J78O11J561J112j968j854J102l5Q65
$$ 809 -1489 -945 -1386 -144 1772 1052 -831 -1405 -1227 -616 945 2057 89 -1765 -663 -698 167
1397A67K260j591j869P46o26P87J759l87j454o68N15K79N08J002j455j192Q34
$$ 167 2427 836 -1033 -287 -913 -126 1633 1246 -208 -876 -361 -82 426 1428 -27 -1219 -385
1414c85rM49P55j006n40m4M4J448k10p27m1n26J53J270K70p09p25M33k2n0J699
$$ -385 -394 55 810 -196 -736 -780 -736 712 502 -225 -266 -792 -639 631 901 192 -533 -100 -122 -172 1527
1435A527m86k079J072J36j032K046O7k169O00K48n83N21J323q24j646J045Q3j081
$$ 1527 1041 -1038 34 170 -862 1184 1251 -918 -318 -70 -653 -132 1191 367 -1279 -234 -151 -1232
1453a232J886K76j901P54L25p77N57Q91n8j122J20P42p60O1J393q32p95J047l38
$$ -1232 654 930 -971 -217 108 -669 -112 779 721 -401 -281 461 -299 -238 1155 323 -472 575 237
1472B37p05mJ296n43r54J492n52k193K180O58k177J636Q87k386N4K073j111q91
$$ 237 -468 -472 824 281 -673 819 267 -1926 254 912 -1265 371 1258 -1128 -1074 999 -112 -1003
1490a003K314l72k728J762J314k710J447K252k776j65J977j665o10J951K04j851
$$ -1003 1311 939 -1789 -27 1287 -1423 24 2276 -500 -665 1312 -353 -963 988 1192 -659
1506f59L55R97j764j0K309p49j165R85m24j296O27J641J44j874J244N7k478J679
$$ -659 -304 693 -1071 -1081 1228 479 -686 299 -125 -1421 -794 847 991 -883 361 418 -2060 -381
1524c81K552k353m0J679k113j157K830Q44k824J497J502m042M80M119l046q70
$$ -381 2171 -182 -222 1457 -656 -1813 1017 1861 -963 534 2036 -2006 -1526 2593 -453 -1323
1540a323L815k278k801L093M84k771J535K506l242r89L288j757j798L796l31k732
$$ -1323 2492 214 -2587 506 990 -1781 -246 2260 -982 -1971 1317 -440 -2238 1558 1227 -1505
1556a505J822N22k056M30K515p62j838J490Q1k275J310K209j808o19J442p94j942
$$ -1505 317 839 -1217 -787 1728 966 -872 618 699 -1576 -266 1943 135 -484 958 164 -1778
1573a778J291K098k068l89K799k509k166L727l43k384K730R11l789J79L075j772
$$ -1778 -487 1611 -457 -846 1953 -556 -2722 1005 662 -1722 1008 1919 -1870 -1691 1384 -388
1589c88r01M140j439m322L010J018l188L114K280m326q91K652r26j344L452K14
$$ -388 -1289 2851 1412 -2910 100 1118 -2070 1044 3324 -1002 -1893 759 -167 -1511 1941 2155
1605B155m285J166K149k517R07K819k522j902K191L07j379Q98J364k187p25K898
$$ 2155 -2130 -964 1185 -1332 -425 2394 -128 -2030 161 468 -911 -13 1351 -836 -1561 1337
1621A337p57j669J937l83j862J551J948j606j604J380k30j477K939J136l803l40
$$ 1337 580 -1089 848 465 -1397 154 2102 496 -1108 272 42 -1435 1504 2640 -1163 -1503
1637a503J917j890J053L194j540l509P50J673j465J979K786m259k412L146k00
$$ -1503 414 -1476 -423 2771 1231 -2278 -1528 145 -1320 659 3445 -814 -3226 -80 -280
1652b80l05L326j021l875L94K351k54M79J950k945l161L157J692j406J529n64
$$ -280 -585 2741 1720 -2155 -1761 590 336 815 2765 -180 -3341 -184 1508 102 1631 1067
1668A067l321M07K892K25r97J15j140k003K306K885j725j239k2j362O31K948P19
$$ 1067 -2254 -1847 1045 1270 273 388 -752 -2755 -449 2436 711 -528 -550 -1912 -1281 1667 2386
1685B386k230j598M43j10J398K997j377l577P8O95R26K187P25l005k935J606J639
$$ 2386 156 -1442 -999 -1109 289 3286 1909 -1668 -1590 -895 31 2218 2943 -62 -2997 -1391 248
1702B48L75K079r05m681J57K680N91J103N27l256k316J992K880k54L41r48l469
$$ 248 623 2702 1797 -2884 -2727 -47 544 1647 2174 -1082 -3398 -1406 1474 1220 1561 613 -2856
1719b856N97L736J55k27n56k639n19K426K291m62j801j217j220R65L286N99k010
$$ -2856 -2259 1477 1632 1405 849 -1790 -2309 117 2408 1946 145 -1072 -2292 -1327 1959 2558 548
1736E48j775j250R13K556J448q51k706j555J376J139K098N28k641k200M79J701
$$ 548 -1227 -2477 -1564 992 2440 1589 -1117 -2672 -1296 -157 1941 2469 -172 -2372 -1893 -192
1752a92K162O58j578k851q34K408J799M37q1k913j940K030K222N50k69j921k066
$$ -192 1970 2628 1050 -1801 -2635 -227 1572 2009 1928 -985 -2925 -895 1327 1877 1608 -313 -2379
1769b379L40K635J512o46j207k195p57K752J776l14r15k162p25J662K072P69j197
$$ -2379 -2039 596 2108 1462 255 -1940 -2697 55 1831 1517 602 -1560 -2285 -623 1449 2218 1021
1786A021k150o64M89K447J324j051j870j459L24K159J418k91j596k123J82J630
$$ 1021 -1129 -1793 -1304 1143 2467 1416 -454 -1913 -1589 570 1988 1697 101 -2022 -1840 -210
1802b10J375P55j660j821m54J375J679P34j166j529j008P88K106N41k97j417j714
$$ -210 1165 1920 260 -1561 -2015 -640 1039 1773 607 -922 -1930 -1142 964 1505 1208 -209 -1923
1819a923P39J580J141K28j722j350K54R20J520J71j376j128o89R84J489L30n16
$$ -1923 -1184 396 1537 1765 43 -1307 -1053 -133 1387 1558 182 -946 -1635 -651 838 1168 652
1836F52j555p71J001Q75Q31j33j689l33M52N19J256j05j144o47k6P69J080P1n34
$$ 652 -903 -1674 -673 202 1033 900 -789 -1122 -670 -151 1105 1000 -144 -791 -817 -48 1032 1103 569
1855E69j246o4P17L35P39l92j685L21O25J6R83m65r51k86J60O49K85N5m00o59
$$ 569 -677 -741 -24 311 1050 658 -1027 -706 -81 -65 918 453 -498 -784 -624 25 310 365 -35 -694
1875f94K55N59kN52m64q55O54K10j15M43n36k31M37k35L20J21k49l68R2J21j2
$$ -694 -439 120 118 670 206 -649 5 215 100 543 7 -224 213 -22 298 419 170 -198 -106 15 3
1896Ck24N54o80j00R69q03p1N17n64P6P14l72l50K17J64j26J95O60r65k22O81
$$ 3 -221 333 -347 -447 522 -281 -352 165 -399 -323 391 19 -331 -114 50 -76 119 779 -186 -408 273
1917B73m05L02Q98r23o98P61l12K96L48k56m33n33M61M04L8K46p78o12O22J60
$$ 273 -132 170 1068 145 -553 208 -104 192 540 284 -149 -682 -221 183 221 467 -311 -923 -301 -141
1937a41N36P9r10k94r1N96J345o29o88o4l54L34J278J37r38p59N9P4O30J619j137
$$ -141 395 474 -436 -730 -821 -225 1120 491 -197 -261 -615 -281 997 1134 196 -563 -504 -430 200 1819 682
1958F82j687O45l18OK065m91j507k56L7K29J103O39r43j322M14N06K48J276m73
$$ 682 -1005 -360 -678 -672 1393 902 -605 -861 -824 -595 508 1147 204 -1118 -704 -198 50 1326 853
1977H53j828M57K82N59Q52n32o69r72L55J517Q7l93n86j047m9J238J309n42j343
$$ 853 -975 -518 -236 323 1175 643 -26 -998 -643 874 961 568 -18 -1065 -1114 124 1433 891 -452
1996d52l00m50O1K605J83k260Q3m59p57K285J713j901j132J73n03K08K763J22
$$ -452 -752 -1202 -1141 1464 1647 -613 -530 -989 -1746 539 2252 351 -781 -608 -1111 -903 1860 1982
2014A982k751P0L60r85K337J302k424r07M36l17Q48J608n05k019k00Q80L02N50
$$ 1982 -769 -699 -339 -1324 1013 2315 -109 -1016 -580 -897 -49 1559 1054 -965 -1165 -285 17 567
2032E67O29j760r47R07P73O10j47p12p42n76J676J437j202j81m98j537J126K337
$$ 567 1196 -564 -1511 -604 169 779 632 -80 -822 -1398 278 1715 513 332 -166 -1703 -577 1760
2050A760l7j860m1n82j274K487K413k676q81P36k073P96L490q19k159M22m83j129
$$ 1760 1723 -137 -178 -760 -2034 453 2866 190 -691 45 -2028 -1232 2258 1439 -720 -298 -781 -1910
2068a910K388J975k287j168J049j315L13K963r64j891L39K75k42J094P76j352
$$ -1910 478 2453 166 -1002 47 -1268 -955 2008 1044 -847 -508 -233 -475 619 1395 43
2084D3j340Q77O72r5P16l04j641j37J008J093m57q4k69j870O63K656o38j054P97
$$ 43 -1297 -420 252 157 873 569 -1072 -1209 -201 892 435 351 82 -1788 -1125 1531 893 -161 636
2103F36j523j109K450J471j731l81O85j896L1L346n49k284J349p13j933K901J305
$$ 636 -887 -1996 454 1925 194 -187 498 -1398 -1367 1979 1430 -854 495 -218 -2151 750 2055
2120B055k338k76P08j308L09K294j73k310P61L74j359J695J123j432r70N89N8
$$ 2055 -283 -559 149 -1159 -850 1444 1271 -1039 -278 96 -1263 432 1555 123 -847 -258 -200
2137b00J2Q98M30j683n19J516j59l15J066o63j332N43J287j72r67Q62p75j571
$$ -200 -188 710 1140 -543 -1062 454 295 -20 1046 383 -949 -406 881 709 -258 604 -171 -1742
2155a742J826J153j536N02J99j919O40J962l64j021N40m38j362J732J565j736
$$ -1742 84 1237 -299 203 402 -1517 -877 1085 721 -300 240 -198 -1560 172 1737 1
2171AN7N89j572K6J995m74o88J20J7j047P65J424j096p56R66m73n82J170J20r32
$$ 1 58 647 -925 -899 1096 622 -66 54 71 -976 -211 1213 117 -639 327 -146 -728 442 562 -370
2191c70n4N05L0l72O60j2j291P35P71r09K74N57p61l43R48J68n66L72L13j289
$$ -370 -424 81 111 -261 399 387 -904 -169 602 -307 -33 524 -237 -580 368 536 -30 342 655 -634
2211f34K21J286r07j24Q15r05l82P92J35m44Q8M62o34l88Q43j05o02R46l39o17
$$ -634 -413 873 -34 -158 657 -248 -630 162 297 -147 -59 403 -231 -619 224 119 -483 463 124 -493
2231d93M39L3l4p4M50J1p42K17L86m65M41O32p97m69N37o2ML07K2q52r6P67l63
$$ -493 -54 -21 -55 -129 321 332 -410 -193 193 -272 169 801 4 -465 72 10 14 321 343 -509 -605 162 -201
2254b01NP82q91m61P96J34j38J27j10n15J36M08M62l91J72o21l04Q14K54k32J55
$$ -201 -196 586 -305 -766 30 164 26 153 43 -472 -336 72 534 143 315 -306 -610 204 458 226 381
2275C81p33k30M01M57L87k14p99j46J33K39O72j24o27o05m1Q50K94M50m53j237
$$ 381 -352 -582 -181 276 663 449 -350 -496 -363 -124 548 424 -203 -808 -849 1 295 745 292 -945
2295i45L34M96J42Q38j52j294r5N00O06L66J6p27q44J76R96O3M66m08j628J66
$$ -945 -611 -115 27 865 713 -581 -676 -176 430 796 812 85 -759 -583 413 476 942 534 -1094 -928
2315i28P35N09O43n71j121k00N69R62K18l79p52j083P72J016K43L99j112j176
$$ -928 -193 316 959 388 -733 -933 -364 598 816 437 -315 -1398 -626 390 633 1032 -80 -1256
2333a256N40P88R19L17j181r52j58Q22J101J57n39j034q53Q57R46M19o3j403p36
$$ -1256 -716 72 991 1308 127 -825 -983 -161 940 1097 558 -476 -1329 -472 474 893 830 -573 -1309
2352a309N55P46J041j04j135j024K65Q66J101O7p79j164n61J306Q78L56l77j491
$$ -1309 -754 -8 1033 929 -206 -1230 -965 -99 1002 1069 290 -874 -1435 -129 749 1105 728 -763
2370g63n93R16J053M36j1j514o15J99J064J015k88q72j121k28J326R56Q6o58j575
$$ -763 -1356 -440 613 1049 1038 -476 -1091 -892 172 1187 899 27 -1094 -1322 4 960 1046 388 -1187
2389a187r9R28R46Q52q77j388l41M27J215R98o18j085q85K76J123R44J06j402
$$ -1187 -1286 -358 588 1440 563 -825 -1166 -739 476 1474 856 -229 -1114 -838 285 1229 1335 -67
2407f7j101L33O31R35P05j068j575L54L73J129N01o03j137p35Q29R32N33j55r56
$$ -67 -1168 -835 -204 731 1436 368 -1207 -853 -480 649 1150 547 -590 -1325 -496 436 969 814 -142
2426a42j100O14P65P10L10j081r98M8P35J171L2p77r22n75R19J104J78m56j033
$$ -142 -1242 -628 137 847 1157 76 -922 -874 -139 1032 1064 287 -635 -1210 -291 813 991 535 -498
2445d98n78O00P10Q06m02j071n77K57M46J185J5j131m89q3O56R60K15p04j151
$$ -498 -1076 -476 234 1040 638 -433 -1010 -753 -307 878 893 -238 -727 -810 -154 806 1021 317 -834
2464h34m5P53M15Q05m14j379n9L19L69Q72K30j330m55J25P83K20L19m13j250R8
$$ -834 -879 -126 289 1094 680 -699 -758 -439 -70 802 1032 -298 -753 -628 155 375 694 281 -969 -871
2484h71R03J73L00q2r69J21m6R46J54l61l52l83j38J100J52m55k14l22j00M98
$$ -871 32 205 505 423 -546 -425 -471 475 629 268 -84 -467 -605 495 647 192 -22 -344 -444 54
2504E4N70n2q70n1L48n20J002L30j080j61K10nJ0Q18k55j054L56L79j44J37R31
$$ 54 624 572 -298 -349 -1 -521 481 811 -269 -430 -220 -225 -215 603 348 -706 -350 29 -115 22 953
2525I53j120m89Q50k34j61P11j95o01j54Q22k21k98N65k47r07Q76J22n15K29K41
$$ 953 -167 -656 194 -40 -201 510 315 -286 -440 382 161 -137 428 181 -726 150 272 -243 -14 227
2545B27n36m8M42%n77M43L00o41M05N13p18r2P02l46k91M21P2m64J40N46n06k30
$$ 227 -309 -357 85 85 -492 -49 251 -390 15 528 -190 -282 420 74 -217 204 276 -188 -48 498 -8 -238
2567b38N28k45l87N05M8k50k00N18k25n52R56k96p89N11N62q86M81K83o47k08
$$ -238 290 45 -342 163 211 -39 -239 279 54 -498 458 162 -627 -116 446 -440 41 324 -323 -531
2587e31O46J64l64L02J03j002M56J138q25k42O46o93m54J000L15p14r9L86q01
$$ -531 115 279 -85 217 320 -682 -226 912 87 -155 491 -202 -656 344 659 -55 -154 232 -569
2606e69M5J218j76r26L75r4q75J109N01m45l14nj61k35J145o5r40J28M07n18M86
$$ -569 -524 694 518 -408 -33 -127 -1002 107 608 163 -151 -156 -317 -552 593 528 -412 -284 123 -395 91
2627I1N59n89m38K02L36j35J85K67p64m57R65n2j60M37l78r47L07Q93L4k75K51
$$ 91 650 61 -377 -175 161 26 211 478 -286 -743 222 170 10 447 69 -878 -571 322 356 81 332
2648C32n77q55J211O97o06J35l47o87J83J192Mm08k42j02p55R24J126j046n25
$$ 332 -245 -1100 111 808 202 337 -10 -697 -514 678 682 274 32 -70 -825 99 1225 179 -346
2667c46N15p49J23J057k3p81k45K16j88O01N91p55p11N20k9J24N08R8p91l14M83
$$ -346 169 -580 -457 600 577 -204 -449 -233 -421 180 771 16 -695 -175 -204 -80 428 526 -265 -579 -96
2688i6J77J77M33m66j026L73Q06m0L26n14n87l53P45N16r6j64l00n35l5R93J08
$$ -96 81 258 691 225 -801 -428 378 338 664 150 -437 -790 -45 471 375 211 -89 -624 -659 334 442
2709D42m10P2n39k94N51Q40r8o67K0m59N4J008M63r28j70j90r6O09M70l70o71
$$ 442 32 104 -435 -729 -178 662 564 -103 -83 -542 -488 520 983 55 -115 -305 -401 208 678 308 -363
2730c63J09J81k42Q71K55j229j80L33j7M82M01n35m96o8L15L43J58J62j093k87
$$ -363 -254 -73 -315 556 811 -418 -598 -265 -282 200 601 66 -430 -498 -183 160 318 480 -613 -900
2750i00Q44Q3L89O3o64l26J37M85N65l38l60j81m53N15O54j55j74m84l02K95N62
$$ -900 -56 27 416 479 -185 -511 -374 111 676 338 -22 -203 -656 -141 513 358 184 -300 -602 -307 255
2771B55K71k51o41l6l2M59N66l86m74P7j63J94N25K43m67n10K79J05K5N39k08
$$ 255 526 275 -366 -402 -434 25 591 205 -269 -192 -355 -161 364 607 140 -370 -91 14 39 578 370
2792C70p45K60n4L18L49l04k12m83J74M34ON9r0m82J07L11P0K85l57l43M4J1N17
$$ 370 -375 -115 -169 149 498 194 -18 -501 -327 107 113 172 82 -400 -293 18 88 373 16 -327 -283 -272 245
2815B45P3l20M8m49K22K83J07P0l80m9K3J97J63K58n46n8j75j43O65J70m44Pm24
$$ 245 318 -2 46 -403 -181 102 209 279 -101 -150 -127 70 233 491 -55 -113 -288 -431 234 404 -40 -33 -457
2838d57J22M93j58K18l25k32J50J65J5L50m24j85J93P4J72k4r7k5j66L7K60j39
$$ -457 -335 158 0 218 -107 -339 -189 -24 -9 341 -83 -268 -75 -1 171 147 50 25 -141 -104 156 17
2860A7K61j81k78M3J03K24l04P3J26j42J8J52K4M2rm89K06K41j87R0J44m25J33
$$ 17 278 97 -181 -138 -35 189 -115 -42 84 -58 -40 112 136 178 169 -320 -114 127 -60 30 174 -251 -118
2883a18J21K3j23O1J50l44N26q1l13R2J18l57K62N5j83O9Q2O1p5Ok04J84l0J97
$$ -118 3 26 -97 -36 114 -230 296 215 -98 -6 112 -245 17 72 -111 -42 40 101 26 32 -172 12 -18 179
2907A79m28L52q0j38L26j00j06J02j89n5K72k61N8K09j88Q5R2M4%l33K23k77L9
$$ 179 -249 103 23 -115 211 111 5 107 -82 -137 135 -126 -68 141 -47 38 130 174 174 -159 64 -213 -174
2930a74L68j30j85J41l03J0L88l8k76K00j13j17J26L19R0n41J92o1L4L59j57j
$$ -174 194 64 -121 20 -283 -273 115 77 -199 1 -112 -229 -103 216 306 -235 -43 -104 -70 289 132 131
2952A31K0l70J20K08J70l04n2k13L11k78M40J15m05p4Q5K10J03k33J32k97k76
$$ 131 151 -219 -99 109 279 -25 -77 -290 21 -257 183 298 -107 -181 -96 114 217 -16 116 -181 -457
2973d57M84J94k15J37m01n2K90Q5J46m7p6k85j24Q03k23k05K23l25l02M29K57
$$ -457 27 221 6 143 -258 -310 -20 65 211 164 88 -197 -321 482 259 54 277 -48 -350 79 336
2994C36k29J2k55j66J13L60K8l41N0j43qJ88L87l11q8o7r3K96L18q2k81m19K14
$$ 336 107 119 -136 -302 -189 171 199 -142 -92 -235 -243 -55 332 21 -67 -134 -227 69 387 305 24 -395 -181
3017a81K47L6M14l80m99K10J18R3O5L0q1o81N64L54l55L55m8q11K97N53l85K00
$$ -181 66 102 516 136 -363 -153 -35 58 123 153 72 -609 -45 309 -46 309 261 -550 -253 300 -85 115
3039A15K71m35l83M10M90n45J68L07n73j13O70k18k10K1j05k90L85L82l02m37
$$ 115 386 -49 -432 -22 468 -77 91 398 -175 -288 382 164 -46 -25 -130 -420 -35 347 45 -392
3059c92M46j28k14N98j19n45L11n2j40K45L04p9o26J56K10k03N29Q4n52j84K12
$$ -392 54 -74 -288 310 191 -354 -43 -95 -235 10 314 235 -391 -235 -25 -228 301 385 -167 -351 -139
3080a39J83j88M28Q5q43J38N97l71R5M42o65l32O99n0k35J81n2r8k67N55j47k31
$$ -139 44 -144 284 369 -474 -336 261 -110 -15 427 -238 -570 129 79 -156 25 -27 -125 -392 163 16 -215
3102b15L30j06l35M66J81l90oK98k85k14M66K32n04JK86n19K84N00l38l55K25
$$ -215 115 9 -326 140 321 -69 -75 223 -62 -276 190 422 -82 -81 205 -314 -30 470 132 -223 2
3123Bj08l02M76L83o72m4M73l54j69P30l39n47M47%j39K34L97m03m78N92P7m98
$$ 2 -106 -408 68 451 -221 -265 208 -146 -315 415 76 -471 -24 -24 -163 71 468 65 -413 179 256 -242
3145b42O35q3o65J20L06k20J91J03p8n77L52L10k74N6R1j13j73M04Oj94l7R0j26
$$ -242 393 310 -355 -235 71 -149 42 145 67 -510 -158 152 -122 -66 25 -88 -261 143 149 -45 -82 8 -118
3168a18j11M87J9n40M34j47m97O17L11n52ML32jm44M31k8m66J74K36m77N20K12
$$ -118 -229 258 277 -263 171 24 -473 144 455 -97 -93 239 238 -206 225 197 -269 -95 141 -336 184 396
3190C96n45MJ55q2j29L35l4k61N6K86m71L08K42k67j03J13j25J84M1P5j87k09
$$ 396 -149 -145 10 -72 -201 134 100 -161 -105 181 -290 18 260 -7 -110 3 -122 62 103 178 -9 -218
3212b18L94J00k84O1K47l96l4K51k26R1K6Q5k80J89M76p06J28N04n02j37N84k99
$$ -218 176 276 -8 53 300 -96 -130 121 -105 -14 12 97 -183 6 482 -224 -96 408 -94 -231 353 54
3234E4o1l9K36l61O5L53k00k26L23j08k99M60k77rJ93J7l36L7L22n7l16K84M4
$$ 54 -7 -46 190 -171 -106 247 47 -179 144 36 -263 197 -80 -89 104 121 -215 -178 144 87 -229 55 99
3257I9k80M9K69l19K50m2k81J36P6K32k15PJ97j49k61N67l83J67k52k6J05L4J29
$$ 99 -181 -132 137 -182 68 26 -255 -119 -43 189 -26 -19 178 29 -232 335 -48 119 -133 -159 -54 -20 109
3280A09O3k33J43j46j86L45j0l08J78L3J34K1j74M5j6l0N1Q0m2K86m20J2j13N4
$$ 109 172 -61 82 -64 -250 95 85 -223 -45 -12 122 143 -31 14 -2 -32 19 99 57 343 -77 -65 -178 -124
3304a24L41k27J03q7k06N6J15Q3j45J1j32Q8MK64l1j05k70K6K95N0j69J63p8m86
$$ -124 217 -10 93 6 -200 -144 -29 54 -91 -80 -212 -124 -120 144 113 8 -262 -236 59 109 -60 103 25 -461
3328d61M80J02l6K8l19J67l6pM36j99k46l2o7Q5M51m39J57J8l92M00L9r0M1j60
$$ -461 19 121 85 113 -206 -39 -75 -82 354 155 -91 -123 -190 -105 346 -93 64 82 -310 90 129 39 80 -80
3352h0J1m2K67N4l22n4K14j38p2K08j8J6j98k03M87j44N1M8j16p0J54o2J81j32
$$ -80 -69 -111 156 210 -112 -166 48 -90 -162 46 28 44 -154 -357 130 -14 37 85 -31 -101 53 -9 172 40
3376D0k67pK22J98r2N6k30M8k4K67n3L5lk95o6J52L4P3k13j9K3K8L06j72j7M4
$$ 40 -227 -234 -12 186 94 150 -80 -32 -56 211 158 193 190 -105 -171 -19 15 88 -125 -144 -121 -93 213 41 24 68
3402F8j33j6L01j14l3l2p2K3qK98k10l83J56o0J70L76j18j82kk85J94K37k89K29
$$ 68 -65 -81 220 106 73 41 -31 -8 -16 282 72 -311 -155 -215 -45 331 213 31 29 -256 -62 175 -114 115
3426A15l56k2K81m0R9P2k55J6q3J54L01l05Q9j62j28K90j2p2kk09M7J56J89l6
$$ 115 -241 -263 18 -22 77 149 -106 -90 -173 -19 282 -23 66 -96 -224 66 54 -18 -20 -229 -182 -26 163 127
3450A27j68q9K7j5K62j34r0J27k09K2K41r7J48j42j15Q2M4P5J12k8k88L23k12
$$ 127 -41 -130 -103 -118 144 10 -80 47 -162 -140 101 4 152 10 -105 -23 21 96 208 180 -108 215 3
3473CR4q6J71k28jq0J95j10m0R6l88K69J71j56J33J26l39J68J71K7k22m7L1n3
$$ 3 97 11 182 -46 -47 -127 68 -42 -82 14 -374 -105 66 -90 43 169 -170 -2 169 196 -26 -73 -42 -95
3497i5P6J67j60qL3j76K82j7j66J10NJ7j07n8K19p4k51J78K1j1n6R3L2k58J12
$$ -95 -19 148 -12 -20 13 -163 119 102 -64 46 51 68 -39 -97 122 48 -203 -25 -4 -15 -71 22 54 -204 -92
3522i2J21j76K04O1l78L91L3k60K85l0j16j0L4j6j01j22L53l67J59P0j07k4J06
$$ -92 29 -147 57 118 -260 131 164 -96 189 159 43 33 67 51 -50 -172 181 -186 -27 43 -64 -88 18
3545A8M0j37J73p1q4j15K05j52L9K54m6l01K74l2j99N9K09j98m6K32l5l46L64
$$ 18 58 -79 94 23 -61 -176 29 -123 -84 170 124 -177 97 65 -134 -75 134 -64 -110 122 87 -259 105
3568A05mk31L07k32r7J93R8j96k1J07J61l41j23L72o7j03J96j04j62K74j83m7
$$ 105 101 -130 177 -55 -152 41 139 -57 -78 29 190 -151 -274 98 31 -72 124 20 -142 132 -51 -98
3590i8o1L13j57j15K15J1j79J65M8l40K01K93l50L3J30N1l08J59J24l60J41L83
$$ -98 -159 154 -3 -118 97 108 -71 94 142 -198 3 296 -54 -21 109 160 -148 11 135 -225 -84 299
3612B99m14l2K32j76n9O5P9j7r9J72k61K27J53k02j08J66J17r0m3O9q5L6Q5J53
$$ 299 -115 -147 85 -91 -150 -85 -6 -23 -122 50 -211 16 169 -33 -141 25 142 52 9 78 -7 29 114 267
3636B67l08L8K4k63M63O0l24J3L4j68O7J1K62l59M9K27k40K95J45m04L1m7J15
$$ 267 -41 -3 21 -242 221 281 -43 -30 4 -164 -97 -86 176 -183 -134 93 -147 148 293 -111 -80 -127 -12
3659a2r3K54j7p3k66L37j67j98M18K6l97K03J44l4mj55Mm39K15L24k1P5J14n28
$$ -12 -105 149 132 59 -207 130 -37 -235 183 209 -188 15 159 125 121 -34 -30 -469 -254 70 49 124 238 -290
3683b90J64M11j89nj82K4l87M11L64l7l81K23l56o7O04Rk57j78oqL55j02k2k47
$$ -290 -126 285 96 91 -91 -67 -454 -43 321 284 -97 126 -230 -297 307 316 59 -119 -125 -133 222 120 98 -149
3707a49N5j6n1M32r2m37NJ82O8J44k3M4k05l52N44o2P7J44m32L0NJ07K75k55l4
$$ -149 -94 -110 -161 271 179 -258 -253 -71 -3 141 118 162 -43 -395 149 87 164 308 -124 -94 -89 18 293 38 4
3732Dk95J2M68N9o1K6k88k18K77K98j84j51j09P5k44M25J04j89j23j29J48r7M99
$$ 4 -291 -279 189 248 187 213 -75 -293 -16 282 98 -53 -162 -87 -331 94 198 9 -114 -243 -95 -192 307
3755C07k97r5q3j6K07J41J56l36j73K53j55L32M3l14rj80J02K23L2n0k86j85O4
$$ 307 10 -85 -168 -184 23 164 320 -16 -189 64 -91 241 284 -30 -39 -219 -117 106 138 88 -198 -383 -319
3778c19M17q7Q9l75o0M04k13N18j81k06n8j21M3K80N2m5j53k66J46J32R9P7k70
$$ -319 98 11 100 -275 -335 69 -144 374 193 -13 -71 -192 -149 131 183 138 -15 -281 -135 -3 96 173 -97
3801i7J24n5J3K97k67r3m2j34L29P7j06o5l56L01L9J60m7j96J07l5J04j53J94
$$ -97 27 -28 -15 282 15 -78 -120 -254 75 152 46 -19 -375 -74 -35 125 78 -118 -11 -46 58 -95 99
3824I9Jk86M2J4J32Q4K3k11m7O0J02Q2o8Nl6j32pM09j76j84l1j62J37K44K73m76
$$ 99 100 -186 -144 -130 2 86 109 -102 -149 -89 13 95 27 32 -4 -136 -143 266 90 -94 -125 -287 -150 94 367 -109
3850a09J75k85o8M13k2j49K7k37K60o7J92Ok81l2K27j27K58l5j68j9r3m7K08J35
$$ -109 66 -219 -287 126 104 -45 -18 -255 5 -62 130 136 -145 -177 50 -77 181 146 -22 -41 -134 -181 27 162
3874A62k30Pk7K5Q2P2o2r7m7P3k2J00m0j10K84k58J80J8l1L2k48J11J58j60J32
$$ 162 -68 -61 -88 -63 19 91 29 -68 -115 -42 -64 36 -4 -114 170 -88 92 110 79 111 -137 -26 132 -28 104
3899A04j10O1l25J56J42k9j3J00j48m9K07j51Or1K27m3L2n7j26q4K23J75j57j6
$$ 104 -6 55 -270 -114 28 -1 -14 86 -62 -111 96 -55 -49 -140 87 44 76 19 -107 -191 32 207 50 34
3923C4Q0k37Q2J68r0j14l8o1J88j01RK08j41K4j16P1J04R1k07r1Q0J71j72J34
$$ 34 114 -123 -41 127 37 -77 -115 -176 12 -89 -80 128 -13 11 -105 -34 70 161 -46 -137 -57 114 -58 76
3947G6Q3j18j33n3J92k4R6k50J5N7K22L4k50M6j31L5K34k31M9n6m9j5L08l5j0
$$ 76 159 41 -92 -145 47 23 119 -131 -116 -59 163 197 -53 -7 -138 -103 131 -100 -51 -107 -156 -171 137 102 92
3972I2q5l1K6l9J96r8n5p2j47J23L16j81J7m0k67K67RK1J17l56J58j1J62p2j1
$$ 92 7 -24 2 -37 159 61 6 -66 -213 -90 226 45 62 22 -245 22 31 52 169 -187 -29 -40 122 50 39
3997C9j08j20p6L15j4j7K2j87j43K95J76j67j48n4k1J43J93J45l15O8q2j75N66
$$ 39 -69 -189 -265 50 36 19 41 -146 -289 6 182 15 -133 -187 -208 -65 128 273 -42 26 -56 -231 335
4020C35o1l56J90k49p0K91%P0k28j71L10p5j8K38k58p1J06K1N3p2K62k71q1k7
$$ 335 274 -82 108 -141 -211 80 80 150 -78 -249 61 -14 -32 206 -52 -123 -17 4 57 -15 247 -24 -105 -132
4044a32J15n5L27l21j84K26l6J32O3j88j25NJ68J87q5j41Kq0R3J76Qk34J74m01
$$ -132 -17 -72 255 -66 -250 -24 -60 72 135 -53 -178 -173 -5 182 97 -44 -42 -122 -29 147 155 -79 95 -306
4068c06J96J97m6j10J03o8j74K48J63o6k77K12k05J21L19k02J3k01K13M9q8k8
$$ -306 -110 87 41 -69 34 -34 -208 40 203 137 -140 72 -133 -12 307 105 118 -83 130 179 91 63
4090F3nl32K02r6J84n8K60k28k46J69K69l10J82r1k20J61K95j25J23j11l6k5o7
$$ 63 58 -274 -72 -168 16 -42 218 -10 -256 -87 182 -128 54 -37 -257 -96 199 74 197 86 50 25 -42
4113d2K85q7q6j7j33j64M88k7k64m7O6p2LM0J07j13J25j39l3J40J39k49m5Q5m1
$$ -42 243 156 70 53 -80 -244 244 217 -47 -94 -28 -100 -97 -57 50 -63 62 -77 -110 30 169 -80 -125 -40 -81
4138h1O4O6p2j35J96J83k97P2Q8k02M4k7jj12L07j84O2M2O0j30l0J88o5j94J94
$$ -81 -17 49 -23 -158 38 221 -76 -4 84 -118 -74 -101 -102 -214 93 -91 -29 13 73 -57 -87 101 36 -158 36
4163C6j5k1P9Ok2j59J34l2j83J48R1j42L2K01L2k53R1M1j42N2P0P4l34L51k57
$$ 36 21 0 79 85 63 -96 38 6 -177 -29 62 -80 -48 153 185 -68 23 64 -78 -26 44 118 -216 135 -122
4188a22n0J94k23K38j28J09j2P1j24J42j16J12j34j60K15J66j66J12J07m01K11
$$ -122 -172 22 -201 37 -91 18 6 77 -47 95 -21 91 -43 -203 12 178 12 124 231 -170 41
4209D1j02M9o7O4J45j90j20L76k56L3J60l01m7L67o6j19R5m2n3R0j8n9n7lj09
$$ 41 -61 -12 -79 -15 130 -60 -180 196 -60 -27 133 -168 -215 152 86 -33 62 20 -33 57 39 -20 -77 -80 -189
4234a89J09n2L0P3K8J53k38L4Q6J16j61q0J28k54K80r3J95j56r0l3M9J30K21k05
$$ -189 -80 -132 -102 -29 -1 152 -86 -52 34 150 -11 -91 37 -217 63 -30 165 9 -81 -114 -65 65 286 81
4258H1j39R0k6p2N4J22j89P9j94K60o5J80n6k43N3N2q4L18p7k94R3K28r8P1o8
$$ 81 -58 32 6 -66 -12 110 -79 0 -194 66 1 181 125 -118 -65 -13 -97 221 144 -150 -57 171 73 144 76
4283G6q8J03J5q9kO2j27j71K28J52m9J5k89Q3j05J90J8L1j0J26k38j22L80n5j58
$$ 76 -12 91 106 17 15 77 -50 -221 7 159 110 125 -164 -81 -186 4 22 53 43 169 -69 -191 189 134 -24
4308b4k31J05J49N1J81l6r0j06j97K82K17j80M6j47n1l5J45j54K40k38K5q0M4
$$ -24 -255 -150 -1 50 231 195 105 -1 -198 84 301 121 167 20 -31 -66 79 -75 165 -73 -48 -128 -84
4331h4J98K3j63k03J20Q4L09j67k79O8q0J92qR1p6l59R7K86J65j94P4n3q2j70
$$ -84 114 137 -26 -229 -109 -25 284 117 -162 -94 -174 18 10 101 25 -334 -237 49 214 20 94 41 -41 -211
4355b11L89r2L9k13k1NP9KR1j7k86K83o9J18R9k11k23J95J4J25J89j97k12k02
$$ -211 178 86 125 -88 -109 -104 -25 -23 68 51 -235 48 -21 97 196 -15 -238 -43 -29 96 285 88 -124 -326
4379c26L89J37j00k4o8j69J55L5J61k5l32M3j0R6K90q7k00k72j1L96L30k68L6
$$ -326 63 200 100 76 8 -161 -6 29 190 165 -167 -124 -134 -38 252 165 -35 -307 -318 78 408 140 176
4402A76k15k47L31j6O7K4l70rJ02M17j47L1k42j2j74L57J98ql16o7K6J48J9Q2
$$ 176 -39 -286 45 29 96 120 -250 -259 -157 260 113 144 -98 -110 -284 73 271 263 -53 -120 -94 54 73 155
4426A55O0k38k09J97pJ30j69j5J61l14L87N9j69j54j92J54K24L08k29k8m51J82
$$ 155 215 -23 -232 -35 -42 88 -81 -96 65 -249 138 197 28 -126 -318 -164 60 368 139 111 -340 -158
4448a58LO4M68k29k55k42J68K44L5ok35pl8M20j98j12K1R0j74K26R4Kl59J17M5
$$ -158 -155 -91 377 148 -107 -349 -181 63 98 92 -143 -150 -188 232 34 -78 -57 33 -141 85 179 181 -178 -61 -16
4473a6MJ09K3l0k63nR6J5L8K16q5k80L2K07J02r7j53P9k6M0J91rr2j74j3J75J04
$$ -16 -12 97 120 90 -173 -178 -82 -67 -29 187 102 -178 -146 61 163 66 -87 -8 -34 6 197 188 96 -78 -91 84 188
4500A88j96K53l45O9J13NR2mk74rj0L16Pk95K83j69m1Jl8J14j08R4j70L1K43o
$$ 188 -8 245 -100 -31 82 87 179 175 -99 -108 -118 198 205 -90 193 24 -17 -16 -54 60 -48 46 -124 -93 150 144
4526A44q0l09K61j61K40j03j15O6n5J38N4k09K96j64N7n5n2K23k21J35k35K18
$$ 144 64 -245 16 -145 95 -8 -123 -57 -112 26 80 -129 167 3 60 5 -47 176 -45 90 -145 73
4548G3j74J56p2L3J09j98J05j44j49K19J33j09k00J25J5J53m4J22l20K87k38R7
$$ 73 -101 55 -17 16 125 -73 32 -112 -261 -42 91 -18 -218 -93 -78 75 31 153 -167 120 -118 -21
4570b1n5J52Q5k8j37m5k0n1K72m5J8j43l9m0J79L1j97J33O7j88P7N7l6j32J16
$$ -21 -76 76 161 133 -4 -49 -69 -120 152 107 125 -18 -57 -97 82 113 -84 49 116 -72 5 62 26 -106 10
4595A0QJO9J27l45N0K75k07K16o7k49J52n1n0J66m8J69l97J18J00L8j30Q1j37
$$ 10 18 19 88 215 -130 -80 195 -12 204 137 -112 40 -11 -61 105 57 226 -171 -53 47 85 -45 36 -101
4619a01L5Q3j02L02j92J05k12q0L51p0j71k5j51J39J07K4L4j79J15j75J45k8J73
$$ -101 -66 17 -85 217 25 130 -82 -162 189 119 -52 -77 -228 -89 18 42 76 -103 12 -163 -18 -46 127
4642A27q4p0j4J5L8J69k49k4J30pj4p3P8J00k19Q7J07j47J19j28P0k30K01N6N8
$$ 127 43 -27 -41 -26 12 181 -68 -92 38 31 17 -56 22 122 -97 -10 97 -50 69 -59 11 -219 -18 38 96
4667I6m0k04M8J43k3J28k62K28j17l1K07j61R1j72R9j37OL33j10j14P0r9n6J0
$$ 96 56 -148 -100 43 20 148 -114 114 -3 -34 173 12 103 -69 30 -107 -101 232 122 8 78 -21 -77 -67
4691f7L25k69j20J93k43M6K46%j30j37P5J49OM4lk09r9K49Q1j64L15m92K13Q0
$$ -67 258 -11 -131 62 -181 -135 111 111 -19 -156 -81 68 74 118 115 -94 -193 56 137 -27 288 -204 9 89
4715H9n1J71j85n2P7j84J25Kj6L3j73Q3L20n9l27Ol0J54K0p1J7m9J7j54J86J71
$$ 89 38 209 24 -28 49 -135 -10 -8 -24 9 -164 -81 239 180 -147 -141 -171 -17 3 -68 -51 -100 -83 -237 -51 120
4741A20Lj38o3m5J91q2O0L4k01P2l6Q1q4K81j24r7o6PK78k03J14k27K12m1m4J2
$$ 120 123 -15 -78 -123 68 -14 46 80 -121 -49 -85 -4 -88 193 69 -28 -94 -87 191 -12 102 -125 87 46 2 14
4767A4P8%k33J96j01M8J13q7J8k26QK43m7r1M4k10N6K96q6r3J66n9l5j61J71Q3
$$ 14 92 92 -141 55 -46 2 115 28 46 -180 -172 71 24 -67 -23 -233 -177 119 33 -60 106 47 12 -149 22 105
4793A05j07j7%lo6Q7J18OJ15l03nj6J51lj46k1J19L7j75J05L6j66Q9j59O4J23
$$ 105 -2 -19 -19 -22 -88 -1 117 123 238 -65 -70 -86 65 62 -84 -105 14 51 -124 -19 17 -149 -60 -219 -155 -32
4819c2K3n4Q8J69l88L06k50J66m5j17L4P0J27q3K18j8j34o5P7J03j58J8q9j20
$$ -32 -9 -63 25 194 -194 112 -138 28 -17 -134 -100 -30 97 14 232 214 80 15 92 195 37 55 -34 -154
4843a54Q3Q0P0o3k08J78l8l2K09k4j52L8N3M3q8J3M3l6J05j93L4QO7j58J96J01
$$ -154 -71 9 79 16 -192 -14 -52 -84 125 101 -51 -13 40 83 -5 8 51 15 120 -73 -39 -31 36 -122 74 175
4869A75j77J24j2j84p0K80j14O0m5P0l14K89j42J01j01O8m7Kk4J34j74J32K8l1
$$ 175 -2 122 110 -74 -144 136 22 82 37 107 -207 82 -60 41 -60 8 -39 -37 -61 73 -101 31 59 28
4893B8q0O2j10J66j87m9K53p2m6O9j53J99j45N6k0K15p0k51J13m1Q5l1J09j83
$$ 28 -52 10 -100 66 -121 -170 83 11 -35 34 -119 80 -65 -9 -29 186 116 -135 -22 -63 22 -9 100 -83
4917h3M5M1J38k32l1J05R6k00K21P4j71K3j68R4J43j46o1K66j86p4J80p4o0K08
$$ -83 -38 3 141 -91 -122 -17 79 -121 100 174 3 26 -142 -48 95 -51 -112 154 -32 -106 74 0 -60 148
4941A48j78q0J12K37j45n6p9j04J02O8J76k23m3j08L05r6n3o7J09j69K16j01k1
$$ 148 -30 -110 2 239 94 38 -41 -145 -43 25 201 -22 -65 -173 132 36 -17 -84 25 -144 72 -29 -50
4964e0K69m9K0k12M2Q3j2j8j21R8k35L13j94J88k19l5j22P6K35n2J5N6j18p6J01
$$ -50 219 170 190 -22 20 103 91 73 -48 50 -185 128 -66 122 -97 -132 -254 -178 57 5 20 76 -42 -118 -17
4989a7o0J42J19j93P2K8k7m8M3r8j73K47R3j83kR9j9L2J15n2q4j68J77LM0m2O8
$$ -17 -77 65 184 -9 63 91 64 16 59 -39 -212 35 128 -55 -57 42 23 55 170 118 34 -134 43 46 86 44 112
5016A12N6l51K70L2L4qk03Q1n0j16K49m7o5m2k8J83p8Q0J1k70J89r3J71k9l4q0
$$ 112 168 -183 87 119 153 145 -58 23 -27 -143 106 59 -6 -48 -76 107 29 109 120 -150 39 -54 117 88 54 -26
5042b6j28j0L07p6Q4k02l08J71J12L09J2p5j65j62J94m9Lj0Q5k65K42L9L7k7j08
$$ -26 -154 -164 143 67 151 -51 -359 -188 -76 233 245 170 5 -157 37 -12 -9 -19 66 -199 43 82 119 92 -16
5067a6K4j43K79n5o7l5j44R3o5K74j73Q2j39KJ03J21r3q7o%J39J22q4J06j22k34
$$ -16 8 -135 144 89 22 -13 -157 -64 -129 145 -28 54 -85 -83 20 141 48 -39 -45 -45 94 216 132 238 116 -118
5093a18J9J65J21p3j71m9n3K18J18j19p5N9j27J0R9M4n2k83Q4J28J87lr8l6j30
$$ -118 -99 66 187 114 -57 -106 -159 59 177 58 -17 42 -85 -75 24 68 16 -267 -183 -55 132 129 31 -5 -135
5118a35M2J36P3r6oj27j06L10m6J82k75q8J06J64j75K28j49n5J38j83J33L2Nk17
$$ -135 -93 43 116 20 14 -113 -219 91 45 227 -48 -136 -30 134 -41 187 38 -17 121 -62 71 103 108 -109
5142a09J70n4N5L6k1l1j93K57o4J7j2O8j51q3K22O1n3qj77j14J71J29j32K0l4
$$ -109 61 7 62 98 77 46 -147 110 46 63 51 119 -32 -115 107 168 115 107 -70 -184 -13 116 -16 4 -30
5167c0j7K1K8J37o3n9k1Q8j75J77M3k02J21n6Q8q2p9j0R2J1j0j43K12q9pq6Q3
$$ -30 -47 -26 2 139 76 17 -4 84 -91 86 129 -73 48 -8 80 -2 -81 -91 1 12 2 -141 71 -18 -25 -111 -28
5194b8OL5j70J98j21K79j16j19n7J18q0R2j25P7J0n0k5l2N9J03o1m6j41M0jJ67
$$ -28 -22 13 -157 41 -80 199 83 -36 -93 25 -55 37 -88 -11 -1 -51 -76 -108 -49 54 -7 -53 -194 -154 -155 12
5220A2N7j63j01M00j13m3o0K2j35K90r1Oq2rJ01k14K6N3Q0p8M2j47J05%OO6j82
$$ 12 69 -94 -195 205 92 49 -11 11 -124 166 75 81 -1 -10 91 -123 -97 -44 36 -42 0 -147 -42 -42 -36 30 -152
5247a52J49J16r2m5J44j71n9R8l5m2j24K19L7L7k65K89j69k5P7Jn7J14j05J90
$$ -152 -3 113 21 -24 120 -51 -110 -12 -47 -89 -213 6 43 80 -185 104 -65 -90 -13 -12 -69 45 -60 130
5271A30m3j14M5L8j14J18k21K84j31j17J13q5J23q4mN9J30j72j7K4P0m0J19j16
$$ 130 87 -27 18 56 -58 60 -161 123 -8 -125 -12 -97 26 -58 -62 -3 127 -45 -62 -38 32 -8 111 -5
5295eo0j4j05J79J14j3k53R0R6p4P8o7O5L9q4j11O1L0nm6O1J00K3l6l9n1P5O7
$$ -5 -65 -79 -184 -5 109 96 -157 -67 29 -45 33 -34 31 70 -14 -125 -64 -34 -39 -85 -24 76 99 63 24 -27 48 115
5323A15j6M9j42q5M0o5O9K08j44J17k37K12Q4j06m5K18m42P0J2JRL93m30nJ47
$$ 115 99 148 6 -79 -39 -104 -35 173 29 146 -91 121 205 99 54 272 -170 -100 -88 -87 -78 315 -115 -120 27
5348B7J10j78J29L9k43Q1J06K3k54Q4P4NJ1L2j47L7J27N6j88l6J44Q7k86K44k10
$$ 27 137 -41 88 127 -116 -35 71 94 -160 -76 -2 3 14 46 -101 -64 63 119 -69 -105 39 126 -160 84 -126
5373a26M9J32L9q7n8j6L6J5j22J97r8Oj2K6j4k0J72r2n0m1K00r7N8k27J01j7J3
$$ -126 -77 55 94 7 -51 -67 -31 -16 -138 59 -39 -33 -45 -19 -33 -53 119 27 -23 -64 136 39 97 -130 -29 -46 -33
5400c3l8O5k5Qp0jM8J30j97N8P7j0j03N3pN5K04k29J71m21J37K33l8p1O7J9q3
$$ -33 -71 -6 -31 -23 -93 -94 -46 84 -113 -55 22 12 -91 -38 -45 10 214 -15 156 -265 -128 105 67 -4 63 82 -1
5427ao4k0J48k0j43N8m6O3p7N2J45q1K8J15j98n8O0K1N9o5M2M3n9O6nN3k46J15
$$ -1 -65 -85 63 43 -100 -42 -88 -25 -102 -50 95 14 42 157 -41 -99 -39 -18 41 -24 18 61 2 68 63 116 -130 -15
5455a5r9P6j0L2p7J98q6L9q1J46q9J4o8n8Q4n4O3L9M0j44K5o9n6J89L3m8j83M2
$$ -15 -114 -38 -48 -16 -93 105 19 58 -23 123 34 48 -20 -78 6 -48 15 54 94 -50 -25 -94 -150 39 72 24 -159 -117
5483a17J10n6O6L48l99o5j1R5l7j04L16jj98J36j00j8K1k3M1J47k86K6K01r4j69
$$ -117 -7 -63 3 351 -48 -113 -124 -29 -66 -170 146 145 -53 83 -17 -35 -14 -37 4 151 -135 -109 92 -2 -171
5508a71R0R2p0Q2k4j24L22l3j4j65j0J1K34k30q4J95k19K12Pq2M5J20k99j6P1
$$ -171 -81 11 -59 23 -1 -125 197 164 150 -15 -25 -14 220 -10 -94 101 -118 94 101 19 64 184 -115 -131 -60
5533f0J12p1k1k4J44O9j17N6pk24J56m6j4J08j36K36j42L5j69J15k57K26N9j36
$$ -60 52 -19 -40 -64 80 149 32 88 81 -143 13 -33 -47 61 -75 161 19 54 -115 0 -257 -31 28 -108
5557a08J39qJN9j4j03K9J56j09mK4p5l9Q2J83j29j10M1n9k7Q6O3l0ql6o4J04j75
$$ -108 31 23 24 83 69 -34 -5 151 42 38 62 -13 -52 30 213 84 -26 15 -44 -71 15 78 48 40 4 -60 44 -131
5585a31K10j58nJ14O7k05K23k34J50l0j03J23o1N8k6r6K97p9r1L5j76N2K4N5l7
$$ -131 79 -79 -84 30 97 -108 115 -119 31 1 -102 21 -40 18 -8 -104 193 114 23 58 -118 -66 -42 13 -24
5610b4J25j38P1O4j34K5j58K04r9K33o8J7k18J05j55N2M8l5J84j45J35j33L2j8
$$ -24 101 -37 34 98 -36 -11 -169 35 -64 169 101 118 -100 5 -150 -98 -50 -85 99 -46 89 -44 -12 -30
5634c0n7R8r3j79J90J16q3M7n7N8m6l9M1J30j74J10l2q3J31R5n4r4L2K2J15n5
$$ -30 -87 11 -82 -261 -71 45 -38 9 -48 10 -36 -75 -34 96 -78 32 0 -83 48 143 89 -5 27 49 164 109
5660A09j03L3j01n4n5K16j08M8J33j35j39K28O1j25J9j41P4m5L01k85N4j2p7k4
$$ 109 6 39 -62 -116 -171 45 -63 -15 118 -17 -156 72 133 8 27 -114 -40 -85 216 -69 -15 -27 -104 -128
5684a28K94m6J0j08L2QM%r2L2L4M9j6k32L66j38j20NM0k7Q4P1r1j03K09k08O2
$$ -128 166 120 130 22 54 62 66 66 -26 6 40 89 73 -159 207 69 -51 -46 -6 -33 51 122 31 -72 137 -71 -9
5711iL3n3J38l00L43r7j17J12n2k4N3O8j05N9q2p0k4R1p2J95k42M15l25R7J79
$$ -9 24 -29 109 -191 152 55 -62 50 -2 -26 27 95 -10 49 -33 -103 -127 -36 -108 87 -155 260 -65 32 211
5736B11j95J6r7K70j89m5J39j53J1j63J86P3N5k33J35J3j30J08m1K5j66K2K25
$$ 211 16 32 -65 205 16 -29 110 -43 -32 -195 -9 64 119 -114 21 34 -96 12 -29 -4 -170 -148 77
5759G7o5n0n2J01O3j62R0m5L6K06k13Q5j99K18r4J77j67j08J03L8R8k54R0M3L1
$$ 77 12 -38 -90 11 74 -88 2 -43 -7 199 -14 71 -128 90 -4 173 6 -102 1 39 137 -117 -27 16 47
5784D7Mo3J58j98J02j15J18J42o8k46J79Q1l20J60K75k39j5j58J48Q9k02J44O1
$$ 47 51 -12 146 -52 50 -65 53 195 127 -119 60 141 -179 -19 256 17 2 -156 -8 81 -121 23 84
5807H4p0k3m5Npj43P1K67j32Q8o5r4k1O8k2K22j85O1j83J00J10j69J89p5p6m7
$$ 84 14 -9 -54 -49 -56 -199 -128 139 7 95 30 -64 -85 -17 -39 183 -2 59 -124 -24 86 -83 106 31 -45 -92
5833i2J01J0NQ1j69P0Q2j91K41j71q9r3K97j71J67k3k4L3Q1k41J16O0j88O2N5
$$ -92 9 19 24 105 -64 6 88 -103 138 -33 -122 -215 82 -89 78 55 31 64 145 -96 20 80 -108 -46 9
5858IP1j42L58l18q0L02j06q4J01j92R9m5J3K02j90M7J8p7N0k32K32Lp5J15j50
$$ 9 80 -62 296 -22 -102 200 94 10 111 -81 18 -27 -14 188 -2 45 63 -14 36 -196 36 39 -36 79 -71
5883g1J51j16Om3j2m0J15j51K86j13q1M3j28K20o2R2j47Q0n6J71M0p1p0k9N2n4
$$ -71 80 -36 -30 -73 -85 -125 -10 -161 125 12 -69 -26 -154 66 4 96 -51 29 -27 144 184 113 43 14 66 12
5909A2j35J07J00K09k06rj25n3J66J9l69K63r5J08q2M9j8J57j44m4qJ22l3M5O4
$$ 12 -123 -16 84 293 87 78 -47 -100 66 85 -284 -21 -116 -8 -90 -41 -59 98 -46 -90 -98 24 -9 36 100
5934A00k31L52j01M1l16J32j9J05j63J11k1M2j5oj45%N2Q9P2j21ko6K26l46L09
$$ 100 -131 221 120 161 -155 -23 -42 63 -100 11 -10 32 17 11 -134 -134 -82 7 79 -42 -44 -110 116 -230 79
5959G9%k2n5j2nM4O9nj18j42K78N9k49k3l5K29j53o5K45l6j84J97j94J42j14Q9
$$ 79 79 57 2 -10 -15 29 98 93 -25 -167 111 170 -79 -102 -137 92 -61 -126 119 83 -101 96 -98 44 -70 19
5985A9N7m0j4j54J13l7J21K4j27R1N3o6k07J70j47K01n1Jj10j9K96j94O7o1J05
$$ 19 76 36 22 -132 -19 -56 65 89 -38 53 106 40 -167 3 -144 57 6 7 -103 -122 174 -20 47 -14 91
6010I1Mo5q7R5q9J6J04N8j45l0Qn9K65r2rl14R2J68Q0J69k31J89k41J95j63k7
$$ 91 95 30 -57 38 -51 -35 69 127 -18 -48 -40 -99 166 74 65 -249 -157 11 91 260 29 218 -23 172 9 -18
6036a8M5n9OJ39j57J4Q9p7L0j14J07L4qk39J11Q3J75k3k46K41M6j99k9R1n1K8
$$ -18 27 -32 -26 113 -44 -30 59 -18 12 -102 5 39 31 -208 -97 -14 161 138 -108 133 179 -20 -49 42 -9 19
6062A9KQ6K1j34j21J01Q2j79N4K89q7j21n1L6%P4m2q5J32r3p0M6K7L4N2j04m7
$$ 19 21 107 128 -6 -127 -26 56 -123 -69 220 133 12 -39 -3 -3 71 29 -56 76 -17 -87 -41 -14 20 72 -32 -79
6089g9Q5%K7q8O8j52J83p2j03K59j1r8j7J21k10J40j51K32j26N5j37J09N0J5l1
$$ -79 6 6 33 -55 13 -139 44 -28 -131 128 117 19 2 123 -87 53 -98 134 8 63 -74 35 85 100 69
6114F9k3l7o5J29j95J53j36J57o2M6p8J41k77P5K84j72P1k08RK53k0m2p7n1J5
$$ 69 46 9 -56 73 -122 31 -105 52 -10 36 -42 99 -178 -103 181 9 80 -128 -119 134 114 72 -5 -56 -41
6139d1j25K51O8k34J87l4j03J37j56M7j5J9j86K63Lj36j80K01L4m0J72j09j04
$$ -41 -166 85 153 -81 106 72 -31 106 -50 -3 -18 1 -185 78 81 -55 -235 -34 0 -40 132 23 -81
6162h1N6L0p7J66j8q6pJ5L5J5j16l5J78l32L17rj14J31k51J04J10O2m0L1j33n
$$ -81 -25 5 -72 94 76 -10 -17 -2 33 48 -68 -103 75 -257 60 51 -63 68 -183 -79 31 93 53 84 -49 -54
6188e4J26k6l1M1j62N5J35r5r9J36m8N5J13j80Q9q2P4j24j10J80lj00M5J41j54
$$ -54 72 46 15 56 -106 -51 84 -11 -110 26 -22 33 146 -34 55 -27 47 -77 -187 -7 -10 -110 -65 76 -78
6213g8n7N7R5K09k08J36r6m7l2M2j55N5O6j59J55o4K41k03RM0nJ1L3p9N7O0l9
$$ -78 -135 -78 17 226 18 154 58 11 -21 21 -134 -79 -13 -172 -17 -81 160 -43 -34 6 1 12 45 -34 23 83 44
6240D4j02Q9l1R2k12k9J54l7M7P6K6l31M07q0k33J58Rj10K5Q8Q5l5k46K40r5J8
$$ 44 -58 31 0 92 -120 -149 5 -32 15 91 117 -214 193 113 -120 38 47 -63 -38 50 135 100 -146 94 -1 17
6266A7p0J1l3J81j68M9j5J16p7r5Q4PK3p9J87j99J31l7J73k98kj8J43J07n5k39
$$ 17 -53 -42 -75 106 -62 -13 -28 88 11 -84 0 7 30 -49 138 -61 70 33 206 -92 -94 -112 31 138 83 -156
6292a56K37q9k5J8R0j76K9M0ML19n55K77n5NJ33j03L5M7k9P9j64J26k2j06N2o1
$$ -156 81 -8 -33 -15 75 -101 -72 -32 -28 291 -264 13 -42 -37 96 -7 28 75 46 125 -39 87 65 -41 11 -50
6318e0J64j37J14j85L7J72rn3q4j33R4Q6o5M2R3l5K4j21J80j6j71J3P8m3j97j7
$$ -50 114 -23 91 -94 -57 115 106 53 -31 -164 -70 16 -49 -7 86 51 75 -46 134 118 -53 -40 38 -5 -202 -219
6344b19K22J24k30K21k10P2j5R4J78k98K8J05L7q4O2j41J20j37q6J61J00j95J44
$$ -219 3 127 -103 118 -92 -20 -35 59 237 -61 -33 72 109 25 87 -54 66 -71 -157 4 104 -91 53
6367E3j22Q1q7O4J43j38j7k7OO8nj06M5m6N8m1K8R1p3j22K53j53J6l0K58k27J7
$$ 53 -69 12 -75 -11 132 -6 -23 -50 -44 24 19 -87 -42 -88 -30 -71 -43 48 -25 -147 106 -47 -31 -61 197 -30 -13
6394a3N6j10J09N2K2j95k2N3J95j1k04O4j83J63Q3J00j02q7k2Q9j6K2r4P0M5Q7
$$ -13 43 -67 42 94 116 -79 -101 -48 147 136 -68 -4 -187 -24 59 159 57 -30 -52 37 21 43 -51 19 64 151
6420A51j19Qj4j25J03o6oJ85j94n5R6r4J47J60k30QP3j15R8p1P9q5K03k5j22L7
$$ 151 32 40 26 -99 4 -62 -68 117 -77 -132 -36 -130 17 177 -53 -45 28 -87 11 -60 19 -66 137 112 -10 27
6446B7R7j35m3L0O1k0ll6J4P2K3n7j6j15J88j93r8J54j19J65N4L3J9p6m4M9l9
$$ 27 124 -11 -54 -24 37 17 14 -22 -8 64 87 30 14 -101 87 -106 -204 -50 -169 -4 50 83 102 26 -18 31 -8
6473hr6OJ02J23j00p3p9K12K3j64O4J05k74L42l59R6J88j77O2m0K8p4J1J07j18
$$ -8 -104 -98 4 127 27 -46 -125 87 110 -54 10 115 -159 183 -176 -80 108 -69 -7 -47 -19 -93 -82 25 -93
6498i3J60j4J1K5j52J44k60K91k88K22O9j26J23j92K18j26Jq0J23k5j66N0J47
$$ -93 67 53 64 89 -63 81 -179 112 -176 46 115 -11 112 -80 138 12 13 -67 56 31 -135 -85 62
6521F2ok6j69J76J12j88J99j87l8o2J00j23N3Q0N1o0J09k52J64K8L4o5J33k15
$$ 62 56 30 -139 37 149 -39 160 -27 -65 -127 -27 -150 -97 -17 34 -26 83 -169 -5 23 57 -8 125 -90
6545i0O9K7J16j63J34l0r6P3l7j37j90L33k5q6J79j43j3J09j80J56M6o6j9P1k6
$$ -90 -21 6 122 -41 93 63 -33 40 3 -134 -324 9 -16 -102 77 -66 -79 30 -150 6 52 -14 -33 38 12
6570A2p7J13q2K7J21k24J9J50j56J38n5j00K21k57J07j02K4J52J7J6m0j17PK7
$$ 12 -65 48 -34 -7 114 -110 -91 59 -97 41 -14 -114 107 -150 -43 -145 -121 31 48 64 24 -93 -86 -59
6594e9J5R1n1j17J72K7q9J4q1J25k2N6q3Mj9RK1j9O9ok4nm6J18j77M4Q8o6m2Q
$$ -59 -44 47 -4 -121 51 78 -11 3 -78 47 25 81 -2 2 -17 -8 13 -6 63 57 33 28 -18 100 -77 -33 55 -11 -53 -45
6624d5J13n1L9P6j16j69O2J84j51l9O7J98k66K71k22j29K01qm4J68j91n1oJ39
$$ -45 68 17 56 132 16 -153 -91 93 -58 -97 -30 168 -98 173 -49 -178 23 15 -29 139 -52 -103 -109 30
6648C0l8k0P5J02j11n5m3K43o3k45P4K2Q6jm4j07J47K2O1n7j04M9N9q9M1k01J15
$$ 30 -8 -28 47 149 38 -17 -60 183 120 -125 -51 -29 57 56 12 -95 52 74 135 78 -26 23 82 -7 34 -167 -52
6675e2K4J6n9J98j3r0Q2n5K7j57J47p6N9n8J16j63pQ1K12j44j39Q5j11J26q8o0
$$ -52 -28 -12 -71 127 114 24 106 51 78 -79 68 -8 51 -7 109 -54 -61 20 232 88 -51 34 -77 49 -39 -99
6701i9K16j24KL3L3k40K68j28l2J52j76Q0L9o2K03j47N9j09L2n0l5K12k48J82
$$ -99 117 -7 -5 28 61 -179 89 -39 -71 81 -95 -15 24 -38 165 18 77 -32 0 -50 -85 127 -121 61
6725F1J00j09q9R2k33J44J14j94J55r1J43j40J05Q8k6m1q3l7Jj17J55J3j24J25
$$ 61 161 52 -37 55 -178 -34 80 -114 41 -50 93 -47 58 146 120 79 -4 -41 -40 -157 -2 11 -113 12
6749A2k62J75j27J69N0k4r0L37n36k7L56j98K16q4LR9j53Q3j77K09O3j83J32q
$$ 12 -250 -75 -202 -33 17 -7 -97 240 -296 -323 33 -165 51 -33 -30 69 -84 -1 -178 31 94 -89 43 35
6773C5N9j08j07J0K89k19O6r1O0j01n0J55m7o4J60j35o4K53n8q8j3J69j45L1L0
$$ 35 94 -14 -121 -111 178 -41 25 -66 -6 -107 -157 -2 -49 -113 47 -88 -152 101 43 -45 -58 111 -34 -3 27
6798B7j03Q3M8n4L9J11k46J27O6p7j05J39j50J58J20j35k31J75%q8n2O3L2q1L12
$$ 27 -76 7 55 1 40 151 -95 32 98 21 -84 55 -95 63 183 48 -183 -8 -8 -96 -148 -85 -53 -134 178
6823A78j37j40P9J25j14O0j09J32r5m4J00qj21J32l1k7KJ93j48j04J76q6kK8J09
$$ 178 41 -99 -20 105 -9 51 -58 74 -21 -65 35 27 -94 38 7 -20 -18 175 27 -77 99 13 11 39 148
6848A48j71j53K97k43J98j49K10j78j8KR8p9K1l8O8j5P4k9L0j44J77j89k4J30
$$ 148 -23 -176 121 -122 76 -73 137 -41 -59 -57 41 -38 -17 -55 13 -2 72 43 73 -71 106 -83 -107 23
6872B3j73J06n6J35m1K7j36J45J62r3%j93N1K46l07K4J64Rj65oL5J12j57J56j7
$$ 23 -150 -44 -100 35 -6 21 -115 30 192 99 99 -94 -43 203 -104 -80 84 93 -72 -78 -43 69 -88 68 51
6897E1j9N9P5k22J2K0J24k72J90J24j14k02L3J81qr8K12l15K58j77r9J59Q1j3
$$ 51 32 91 166 -56 -44 -24 100 -172 18 142 28 -174 -141 40 32 -66 146 -169 89 -88 -187 -28 53 40
6921D0k67K22j44O6j2k8J84L7j66O7M1j17M8P0o6J11qj12p0J33j39J62n3j9N1
$$ 40 -227 -5 -149 -83 -95 -123 61 98 -68 -1 40 -77 -29 41 -25 86 78 -34 -104 29 -110 52 -1 -20 31
6946C1J6l0j21J52j02K85l07n7J8K14k59J33N5p0K46l07J49N8j44o3J17j8p2L9
$$ 31 47 17 -104 48 -54 231 -76 -133 -115 99 -160 -27 28 -42 204 -103 46 104 -40 -103 14 -4 -76 -37
6970c7K7j4R1j87J29M2q3l2k2j01J40K0r9L35m55K50O6L0J0j28n3J08m8J5K3o
$$ -37 -10 -24 67 -120 9 51 -32 -64 -86 -187 -47 -27 -126 209 -246 4 70 100 110 -18 -71 37 -11 4 27 21
6996B1R3l4o2OO8q1k4p0K14j86j12K44j32R7N4j75M6J09j70M1j52L37N0k10M4
$$ 21 114 80 18 24 92 11 -13 -83 131 -55 -167 77 -55 42 96 -79 -33 76 -94 -53 -205 132 182 -28 16
7021A6rj32P4R8J39j70j21N2K4l1j17J38N3J74k59J34k4J8L4j9N5j33k9J03k1
$$ 16 7 -125 -51 47 186 16 -105 -53 -29 -60 -177 -39 14 188 -71 63 39 57 91 72 127 -6 -35 68 47
7046D7j02Q6k2k5Mq7P7P9m8m9jn5K17L2l5l1j05Q3r2R4j31oK07l00K66o0r7k7
$$ 47 -55 31 9 -16 -12 -99 -22 57 9 -40 -41 -96 121 153 118 87 -18 65 -27 67 -64 -70 137 -163 103 43 -54 -81
7074h1K25j12Qj28Q7J5q0J11k1L4j75J16j39J34o8RP4j54K22k8k8J55k0j73p6
$$ -81 144 32 40 -88 -1 14 -66 45 24 58 -117 -1 -140 -6 -74 -65 9 -145 77 49 21 176 156 -17 -93
7099i3R7m6O9j72L00p8l8j34J11m2o4L6r9J41k4q6L0K18k49J80l9k4O3M9j01k19
$$ -93 4 -42 27 -145 155 77 39 -95 16 -26 -90 -54 -153 -12 -36 -122 -92 126 -123 57 18 -6 57 106 5 -214
7125b14K94J5q0L3j49J19k0j35M9J18m3Pp6K34j72o5P8NJ7M6n1PJ72o8j95L93
$$ -214 80 95 15 48 -101 18 -2 -137 -88 30 -13 -6 -82 152 -20 -85 -7 -2 15 61 10 17 189 121 -74 319
7151C19l37N5O3k8k0k9k18K50Q6j5j7j07J14q4n3J00J2P8m2n2m6j8n4O1Mk6M5
$$ 319 -18 37 100 72 52 23 -195 55 141 126 109 2 116 32 -21 79 91 169 127 75 29 11 -43 18 22 -4 41
7178D1Lj6J87k07j28K17q5j05p2L64j13q4N5P1j77QR2r4J7K4l3Q6P1j59J41q8
$$ 41 44 28 215 8 -120 97 12 -93 -165 199 86 2 57 128 -49 -41 51 -43 -26 -2 -35 51 122 -37 104 16
7204A6M0K4p2jJ62k50P6J53k31J06mm1J7k8q2J72k4j50K21p2rJ03k65K02L1Qp3
$$ 16 56 80 8 7 169 -81 -5 148 -83 23 19 -22 -5 -33 -115 57 33 -117 104 32 23 126 -139 63 94 102 29
7231B9q9p7J01J68r2J50j45L1q8mP0j85P4l2K18q9j27j2J6M5N8j8J46j95J71k16
$$ 29 -60 -137 -36 132 40 190 45 76 -12 -16 54 -131 -57 -89 129 40 -87 -99 -83 -38 20 2 148 -47 124 -92
7257i2Q3J10j60K25j88K34j98Ll05J23K03j26O2PjK7L5r1O8M4j16K1J06l3J8q8
$$ -92 -9 101 -59 166 -22 212 14 17 -288 -165 38 -88 -26 -19 -20 7 42 -49 19 63 -53 -32 74 41 59 -29
7283b9N2K6L7j16J94j50k3J39q4j47N3o0J98j70N8M2N6j66J50q2PKL7j70Ll3J39
$$ -29 23 49 86 -30 164 14 -9 130 46 -101 -48 -108 90 -80 -22 20 76 -90 60 -22 -15 -13 24 -146 -143 -176 -37
7310c7o4K68r3j8j33K22k19L29j79j44Q1j26J84k6oo1M8j52J11L1j39J34R3j37
$$ -37 -101 167 74 56 -77 145 -74 255 76 -68 13 -113 71 45 39 -22 26 -126 -15 16 -123 11 104 -33
7334c3J62r9j41L9K0n3J25p7O9M8Rm1j04J98j01J05p1oj42J46k7P5p6j05O1L8
$$ -33 129 30 -111 -72 -52 -105 20 -57 12 60 69 28 -76 122 21 126 55 49 -93 53 26 101 25 -80 -19 19
7360A9J5m4R4r2J9K9R7j87L9k8k1K0R4K4k04J28J27k54N7K06k16KL5J17M3k94
$$ 19 34 -10 84 -8 11 40 137 -50 -11 -39 -60 -40 54 78 -126 2 129 -125 -68 138 -78 -76 -41 76 119 -175
7386a75O6K04l9R0k39J35k5j35N4K43j83Q5o9j87J44J8M6l7J01P9j48N4j8M1j4
$$ -175 -109 95 56 146 -93 42 17 -118 -64 179 -4 81 12 -175 -31 -13 33 -4 97 176 28 82 64 105 91
7411I1J5M8p6j76K78r2j33J34k10J03p3K30j95k0M8j14J67ON6O7j73J0n1l6K20
$$ 91 106 154 78 -98 180 88 -45 89 -121 -18 -91 139 -56 -76 -28 -142 25 31 87 154 -19 -9 -60 -96 124
7436A24j65J33j94O2J88j22O1r2j50K25K2n5j00K04k33J32N9q5k2j48K97q5j23
$$ 124 -41 92 -102 -40 148 26 87 -5 -155 70 92 37 -63 141 -92 40 99 14 -8 -156 141 56 -67
7459f7R0O0p3j4o0K19o2q4K7J09k70J76J54o7j41J34k77K93k15n5J86M7k39J20
$$ -67 23 83 10 -4 -64 155 93 9 36 145 -125 51 205 138 -3 131 -146 147 -68 -123 63 110 -129 -9
7483iR8K4j5j39K06j26q6K8k0K8J07j55M1J01j33J23j34J33J39j63j36K15j35
$$ -9 89 113 98 -41 165 39 -47 -19 -39 -11 96 -59 -18 83 -50 73 -61 72 211 48 -88 127 -8
7506hO9o3Q1k6n3N3j11o0N3O1M2J73l53K4J51j07o9J00L3J45k9Jj52l3J75j75
$$ -8 61 -2 79 53 0 53 -58 -118 -65 -4 38 211 -142 -118 33 -74 -143 -43 -10 135 106 107 -45 -78 97 -78
7532g8J09J8J40k80R4O7j74n0K03M4j93J87n7R2p6j0L0j49K14p3L8o5j30J26Q
$$ -78 31 49 189 -91 3 70 -104 -154 49 93 -100 87 30 122 46 36 66 -83 131 58 96 31 -99 27 35
7557C5K2j44R4m7N6q6O9J79j34j9J3Q2P9k54J32r4L8M7p6o7R2K9k1N4n0N8M0n9
$$ 35 57 -87 7 -40 16 -70 -1 178 44 25 38 120 199 -55 77 -17 21 68 -8 -75 17 46 25 79 29 87 127 68
7585F8j22M9O4k1j06J10n7J86j50J66j50j8J1o0J18r1j32J60j12j0R0j35J01j3
$$ 68 -54 -5 59 38 -68 42 -15 171 21 187 37 19 30 -30 88 -3 -135 25 -87 -97 -7 -142 -41 -54
7609e4J04k23J95L9k4j9j9Ko9L7N2l2OK6m0K5J66n6k01J04l8n5J45Or8J85j27
$$ -54 50 -173 22 61 37 18 -1 1 -68 -31 21 -11 -5 21 -19 6 172 116 -85 19 -19 -74 71 77 -21 164 37
7636C7r5J89j09LN1o5j06R3k9J22j28Qj97J91M4K02k94P4R0k40J08K00r1K2o6
$$ 37 -58 131 22 25 76 11 -95 -2 -31 91 -37 -29 -226 -35 9 211 -83 -9 81 -159 -51 149 58 80 14
7661A4R0j72J05J14j92j20J39J3Q3m7p5l0Q2J4n6k5q6Q0r5J96L6L2j93J79n2J04
$$ 14 104 -68 37 151 -41 -161 -22 -9 74 27 -48 -78 4 18 -38 -63 -149 -69 -164 32 68 100 -93 86 34 138
7687A38q9J8j49O6J25j81J28j40K09j44O6j43J05r1O4M9j66K12j31J23J61l05
$$ 138 49 67 -82 -16 109 -72 56 -84 125 -19 47 -96 9 -82 -18 31 -135 77 -54 69 230 -75
7709g5K9J02j29k5j3J44r4m5O2l0N1nj02j0J62l8j21J79K9l9L7j30J7J20J7j64
$$ -75 -46 56 -73 -98 -111 33 -61 -106 -44 -74 -23 -28 -130 -140 22 -16 -137 42 71 32 69 -61 -44 76 93 -71
7735g1K36k4j77K2j45M4J52j52J62j44J90K0L0k05J26p7J93k04RR7q9q0P3R9j40
$$ -71 165 141 -36 -14 -159 -115 37 -115 47 -97 93 113 143 -62 64 -13 180 -24 -15 82 -7 -87 -14 85 -55
7760e5Q2m7J5R3k33K22j58K8lr4K88j15P1o1j7k56K38P1K1p8O8o6o5J50j17r2
$$ -55 27 -20 -5 88 -145 77 -81 -53 -56 -150 138 23 94 33 16 -240 -2 69 90 12 80 14 -51 99 -18 -110
7786a10M9P4r3Q7j6J9k3j45Q2J71J2r8o9j0oJ81m0J7n9l2l0r5K19J19p9j71J02
$$ -110 -61 13 -80 7 -9 10 -13 -158 -76 95 107 9 -60 -70 -76 105 65 82 23 -9 -39 -134 85 204 125 -46 56
7813E6n5r8Q0M5j8Q5k9Or3R0j40P1L0n0l4L2l3K7p1O1L0K58k36N7k00K10j31J27
$$ 56 1 -97 -17 28 10 95 66 72 -21 69 -71 0 30 -20 -54 -22 -55 -28 -99 -38 -8 250 14 71 -129 81 -50 77
7841G7j73Q3j18K86j39P5Kk18J0L03j97Q6m5j21J10m4k9k6J14r5%p5K65q9k07
$$ 77 -96 -13 -131 155 16 91 93 -125 -115 188 -9 77 32 -89 21 -23 -52 -78 36 -59 -59 -134 131 42 -165
7866a65K99j68J39j80J4Q7j21q8J36j0O0o9J11r8n3O6J14j7j6r3lO6j02j5J50
$$ -165 134 -34 105 -75 -61 26 -95 -183 -47 -57 3 -66 45 -53 -106 -40 74 57 41 -52 -55 11 -91 -106 44
7891D4J11k21J6P0j4J3p0n6O2M9OR8k94K27J8m1j00P8n7P5n3m3L8M9J05k92K31
$$ 44 155 -66 -50 20 6 19 -51 -107 -45 4 10 108 -186 41 59 18 -82 -4 -61 14 -39 -82 -44 5 110 -182 49
7918D9j7J37j67O8j23M1J21j24J0J79l27J88r1P9q7M8n3K49k43J21mo8q3K0L8
$$ 49 32 169 2 70 -53 -12 109 -15 -5 174 -153 35 -56 23 -64 -16 -69 180 -63 58 54 -14 -97 -77 -39
7943c9R8j64K6J50o6M4p9Q9P1n9j08J82k11pK1J20j9q0K9q5J36j43J60j63P2j2
$$ -39 59 -105 -79 71 5 49 -30 59 130 71 -37 145 -66 -73 -52 68 49 -31 -2 -87 49 -94 66 -97 -25 -37
7969c7o9R8Q2l1r2J64P5k69K2K8l1j08J41o7J55j02M7j54J91J07j52J22j50J15
$$ -37 -106 -8 74 43 -49 115 190 -79 -57 -29 -60 -168 -27 -94 61 -41 6 -148 43 150 -2 120 -30 85
7993H5j55P8j4q5J10k9O8j60K41q0lp9l6K4J57k63P5p8P3K21j69L2K7K0k69J09
$$ 85 -70 8 -6 -91 19 -10 58 -102 139 59 56 -23 -59 -35 122 -141 -66 -144 -71 150 -19 13 40 60 -209 -100
8019a00l6K8K42q7l21J99l8J53k2j34P2J70j60K1J8q1RJ53o8k3MO7J2r5j6o5J10
$$ -100 -136 -108 134 47 -274 -75 -113 40 18 -116 -44 126 -34 -13 5 -76 -67 86 18 -5 -1 66 78 -17 -33 -98 12
8046A2L7j29J2Q5j09K04j33o3L9O2n3j06J31o9K6N9L3r0p5J38M8q5J00L7o6j51
$$ 12 49 -80 -68 17 -92 112 -21 -84 -45 17 -36 -142 -11 -80 -54 5 38 -52 -127 11 59 -26 74 111 45 -106
8072a06J71K5l5j1o3j4k2Q8lK6r2q6R5j9N9P8j11K5N7oq8O8P8j67M4J5L0l0p5
$$ -106 65 90 55 44 -19 -33 -55 33 30 56 -36 -122 -27 -46 13 91 -20 5 62 56 -32 36 114 -53 -9 6 36 6 -69
8101f9J30Pkm9j13O7R6k25Q1P5o0K36k39J93j17J4R0J49j90m1J76j98J1n9M7j13
$$ -69 61 68 66 17 -96 -29 67 -158 -77 -2 -62 174 -65 128 11 25 115 264 74 33 209 11 22 -37 10 -103
8127a03o9N6M9rR9j25O0J06p6J35j70J8P0j13N9j07N5J04l0o2n1K50k11J33k4
$$ -103 -172 -116 -67 -76 23 -102 -42 64 -12 123 -47 -29 41 -72 -13 -120 -65 39 9 -53 -104 146 -65 68 44
8152D4j38M5R1J0O7k20j6J18l4M7M1Oj61J62j43R9m5J0m1O6m5pJ03l5m3j41K5
$$ 44 -94 -49 42 52 119 -101 -117 1 -33 14 55 61 -100 62 -81 18 -27 -17 -58 8 -37 -44 59 24 -19 -160 -135
8179a35J13K5r7J46j19J44j29PPN6oP
$$ -135 -22 3 -94 52 -67 77 -52 -45 -38 18 12 19
8191A9
$$ Imaginary data points
##PAGE= N=2
##DATA TABLE= (X++(I..I)), XYDATA
0@%%%%%%%%%%%qJ6j6J6k4L2m0N0n8P2q8J04j20J44j71J95k26K66l07L49m00M56
$$ 0 0 0 0 0 0 0 0 0 0 0 0 -8 8 -8 8 -16 16 -24 26 -32 40 -48 56 -64 80 -91 104 -122 144 -163 186 -214 242
33B42n16N84o57P39q31R29j036J156j285J427j583J751j937K139k357K598k864
$$ 242 -274 310 -347 392 -439 490 -546 610 -675 752 -831 920 -1017 1122 -1235 1363 -1501
50a501L154l474L828m221M661n155N714o354P092p954Q979j0224J1770j3748J6386
$$ -1501 1653 -1821 2007 -2214 2447 -2708 3006 -3348 3744 -4210 4769 -5455 6315 -7433 8953
65H953k0096K5736l5435N6583j83069J24258K36361l05593J20772J11553k72208
$$ 8953 -11143 14593 -20842 35741 -147328 -23070 213291 -92302 28470 140023 -132185
76a32185m1151K80398m2326o1610P7040j00979j00036J33750k159l0182J01746
$$ -132185 -173336 107062 64736 3126 80166 -20813 -120849 12901 10742 -19440 82306
87H2306o8691j27288J32713M2407j05784N7349N4712j04020J0525Q6537k8440
$$ 82306 13615 -113673 19040 61447 -44337 13012 67724 -36296 -25771 60766 32326
98C2326n2096m785m028L5797J8332j8158K8351l9307j04084R0407J11176q6955
$$ 32326 -19770 -24555 -28583 7214 25546 7388 35739 -3568 -107652 -17245 93931 6976
110F976L936O4904j44969m2787J79006n84r0054P4903l8703j41038R9090J13432
$$ 6976 10912 75816 -69153 -111940 67066 66482 -23572 51331 12628 -128410 -29320 84112
122H4112q6789J0608M8154j24696q109J33050k7406m1762N7129n6030o6408Q6038
$$ 84112 -2677 7931 56085 -68611 -76720 56330 28924 -12838 44291 -11739 -78147 7891
134G891L4603o0184K1464J3237o8059K3005P3671l5414l1701L0771j8182j7252
$$ 7891 42494 -17690 3774 17011 -51048 -28043 45628 10214 -21487 9284 -8898 -26150
146b6150M5866J8468l7596k4472J3581J0731J19K1513M422m3850j9371L0909J9139
$$ -26150 19716 38184 588 -23884 -10303 428 547 22060 26482 -17368 -36739 -5830 13309
159A3309j002Q792j1779m0192L959M0236L858k938M187l5515j6819L3015J3597
$$ 13309 12307 21099 9320 -30872 -26913 13323 17181 14243 18430 -17085 -33904 -889 12708
172A2708k845N692j8376k5020J3639K7207J510o281k1j7149j0493K3679J5411
$$ 12708 9863 15555 -2821 -27841 -14202 13005 14515 8234 8213 -8936 -19429 4250 19661
185A9661j0990r917k262m843m067J8851J4389k6046r629J9750j1809k865L0949
$$ 19661 8671 -1246 -3508 -8351 -12418 6433 20822 -5224 -14853 4897 -6912 -9777 21172
198B1172j1135l0128J7287J1161k0138J3696J8668l2118p814L1652j3221j0007
$$ 21172 10037 -20091 -2804 8357 -11781 1915 20583 -11535 -19349 12303 -918 -10925
210a0925K9593j5788k3736K7413K477j7971J8991J729k6816R963J7423j7954K338
$$ -10925 18668 2880 -20856 6557 9034 -8937 10054 11783 -15033 -5070 12353 -5601 -3263
223c263J8534k2046q553K5852r544j1576K1048p037j5482J3577J975r498O956
$$ -3263 15271 -6775 -15328 10524 980 -10596 10452 3415 -12067 1510 3485 -6013 943
236I43K585n999K550J247n777M500M263p551O874M803j6578M491J2028j2679L612
$$ 943 3528 -2471 79 1326 -4451 49 4312 -3239 3635 8438 -8140 -3649 8379 -4300 -688
251f88J1839j4535n566J1744j844k549P577l548j0661N438N020m508P486m42j5918
$$ -688 11151 -3384 -8950 2794 950 -1599 5978 2430 -8231 -2793 2227 -2281 5205 4763 -11155
266a1155O155Q623p984Q039N894j6619k303J2150Q9j045O499m775j2718N162J0305
$$ -11155 -5000 3623 -4361 3678 9572 -7047 -9350 2800 2889 1844 8343 3568 -9150 -3988 6317
281F317l262K253r68j1743J438P405M48M588k919j0055N49O145L290J530m40o835
$$ 6317 3055 5308 4340 -7403 -5965 1440 1888 6476 3557 -6498 -5949 196 3486 5016 4576 -2259
297b259q187O883R448k576j22l855r933L244R573N066M0p580n725L88M493R104
$$ -2259 -10446 -3563 5885 3309 3187 -668 -10601 -7357 2216 7282 7322 -258 -5983 -5595 -1102 8002
313H002J766p000p167m925N282Q316J049j164p866o971M802P031N483j06q546
$$ 8002 9768 2768 -4399 -9324 -4042 4274 5323 4159 -3707 -10678 -5876 1155 6638 6532 -2014
328b014m175O24L973Q706k54p556n246k285N249P047K056k448q385k579O182N155
$$ -2014 -6189 -5565 -1592 7114 6860 -696 -5942 -8227 -2978 4069 6125 3677 -4708 -7287 -1105 4050
344D050N181j687q824l438M84N486P204l217o782m009k496N734P812P57m651o666
$$ 4050 9231 7544 -1280 -4718 -4234 1252 8456 5239 -1543 -5552 -8048 -2314 5498 6255 1604 -5062
360e062r00L432O142N932n737q039L2j705M948R655m722p280q34j543L641Q071
$$ -5062 -5962 -2530 3612 9544 3807 -4232 -4200 -5905 -957 8698 3976 -3304 -4138 -5681 -2040 6031
376F031K026o552n041J214k99M877P274p401o991K302l262L585R068m455o393
$$ 6031 8057 1505 -3536 -2322 -2621 2256 9530 2129 -4862 -2560 -5822 -2237 6831 2376 -4017
391d017k45j133L130O742J414o120m053O53J06O090N404p190l551n56l903Q139
$$ -4017 -4262 -5395 -2265 4477 5891 -229 -4282 -3629 -3523 2567 7971 781 -2770 -3326 -7229 910
407I10P127o427j076r06o561N472R694l257n585J960m026m189J1274L072j1361
$$ 910 8037 1610 534 -372 -6933 -1461 8233 4976 -609 1351 -2675 -6864 4410 7482 -3879
422c879K720O10q402J0078P786j0259j064K765o186M004J1355l335r054J559j380
$$ -3879 -1159 -549 -8951 1127 8913 -1346 -2410 355 -5831 -1827 9528 6193 -2861 -1302 -2682
437b682l399J1676M893j0939j785n78m733Q829P401l446l734n240k395M421M819
$$ -2682 -6081 5595 10488 -451 -2236 -2814 -7547 1282 8683 5237 1503 -3737 -6132 -1711 3108
452C108K515j906o002m841K644N777j341R44J833r556J405J1029n607j945O947
$$ 3108 5623 3717 -2285 -7126 -4482 1295 -46 898 2731 -6825 -5420 5609 2 -1943 5004
467E004q539k787J2870l63r449L155j82q378Q748J2336j0714o132N750r313O11
$$ 5004 -3535 -6322 6548 6185 -3264 -109 -291 -8669 79 12415 1701 -4431 1319 -7994 -7383
482g383J8388j147j0820K10m721m999J0230J1185n016p928j252m656o8J2738M767
$$ -7383 11005 9858 -962 -752 -5473 -10472 -242 10943 5927 -2001 -3253 -7909 -7977 4761 9528
497I528o109l793l606p09L181N584M315o801n246M155k502j110P814j645p103
$$ 9528 3419 -374 -3980 -4689 -1508 4076 8391 1590 -3656 499 -2003 -3113 4701 3056 -4047
512d047M067M137o120j182O716o193l607J3340j776j1625O653j067r601J0962
$$ -4047 20 4157 -1963 -3145 3571 -2622 -6229 7111 5335 -6290 363 -704 -10305 657
526F57R867r478m550M311o638k776J5595L925j2387J971L6j0498P532J1993m892
$$ 657 10524 1046 -3504 807 -5831 -8607 6988 10913 -1474 497 533 -9965 -2433 9560 4668
541D668m238J103n240l724P649O339m787j595J902o842j183P766L40k252J762
$$ 4668 430 1533 -3707 -7431 218 6557 1770 175 2077 -4765 -5948 1818 2158 -94 1668
556A668l94m204k066N431J470l353M800P64q292J117M931k466M37N542j854q253
$$ 1668 1274 -2930 -4996 435 1905 -1448 3352 4116 -4176 -3059 1872 -594 -157 5385 3531 -4722
572d722K779N113o032K690Q237r074m704Q945l436n127Q268J577r372K406P405
$$ -4722 -1943 3170 -2862 -172 8065 -1009 -5713 3232 -204 -5331 2937 4514 -4858 -2452 4953
587D953q164k581J1139m937o659J1440j476j0686O017M706o349L289O761p699
$$ 4953 -3211 -5792 5347 410 -6249 5191 3715 -6971 -954 3752 -2597 692 7453 -246
601b46o905P684J596m139Q046M7j2597J199O278p70L161L070o148q234K135P595
$$ -246 -7151 533 2129 -2010 6036 6083 -6514 -5315 963 193 3354 6424 276 -7958 -5823 1772
617A772J395M02R05q728n538O810P234O30k000k004o272l415J1179O635p422m22
$$ 1772 3167 3569 4474 -4254 -9792 -2982 4252 4882 2882 878 -5394 -8809 2370 9005 1583 1161
633A161q30q670N093J2065l722p332J989j745m553R735O649j2443l201O815n039
$$ 1161 331 -8339 -3246 8819 5097 -2235 -246 -1991 -6544 3191 9840 -2603 -5804 1011 -4028
648d028L040J1060p915j1469M883M644p10O450K361j4444n875J1464L612J051
$$ -4028 -988 10072 2157 -9312 -4429 215 -495 5955 8316 -6128 -12003 -539 3073 4124
662D124O356r221j3694N064J0277L677J948k783j1825o923J0314R922j34n24p419
$$ 4124 10480 1259 -12435 -7371 2906 6583 8531 5748 -6077 -13000 -2686 7236 7102 6578 -841
677h41j1159M002J1633M207j736n961p078k472P943J0057j966p189m302k884M384
$$ -841 -12000 -7998 3635 7842 6106 145 -6933 -9405 -1462 8595 6629 -560 -4862 -7746 -3362
692c362R837K176p033q139M7N137N110O262l735j3429k084P629M788N030Pj1344
$$ -3362 6475 8651 1618 -6521 -6474 -1337 3773 10035 6300 -7129 -9213 -1584 3204 8234 8241 -3103
708c103r400N712J0770K504J012m576j4506l03J4335L957L00r92j2371o727J0519
$$ -3103 -12503 -6791 3979 6483 7495 2919 -11587 -11890 2445 6402 6702 5710 -6661 -13388 -2869
723b869J0219j55k171n888j0469L389J4796J804m335k510r815j693J2924N809
$$ -2869 7350 7195 5024 -864 -11333 -7944 6852 8656 4321 1811 -8004 -9697 3227 9036
737I036l024n053p188k776P233R852o05p126n715l705N020J0842R91n138o235
$$ 9036 6012 959 -6229 -9005 -1772 8080 7475 349 -5366 -9071 -4051 6791 7782 2644 -3591
752c591o372M944J0214K794k573p422p246K911R046N713j557o430p224k023R007
$$ -3591 -9963 -5019 5195 7989 5416 -2006 -9252 -6341 2705 8418 6861 431 -6793 -8816 191
767A91Q319k220l495o408o521P143R487l60l072n465o038K749Q828L906l962m883
$$ 191 8510 6290 2795 -3613 -10134 -2991 6496 6136 3064 -2401 -8439 -5690 3138 7044 3082 -1801
783a801l725j550Q258O399l945l993l771k466O793O345j560m077m905j577M022
$$ -1801 -5526 -7076 1182 7581 3636 -357 -4128 -6594 199 6544 4984 907 -3998 -5575 -1553
798a553O513K175n684n128j191J295O953L322m559m133l546N06O703L527j910
$$ -1553 4960 7135 1451 -3677 -4868 -3573 3380 6702 2143 -1990 -5536 -5030 1673 5200 3290
813C290l948m846O69M609M181Q30m558l680q71K618N806P21l653k702k715J845
$$ 3290 -658 -5504 -4835 -226 3955 4785 227 -3453 -4324 -1706 4100 4821 1168 -1534 -4249 -2404
829b404N747P25j586k970l612J752L707K040l78l771k345J6K486L728j155k525
$$ -2404 3343 4068 2482 -488 -4100 -2348 1359 3399 3021 -750 -3095 -3079 -593 3135 1980 -545
845e45j450j719K712L527j107q01j788k159K777K121M75o63k412q53Q22K146J727
$$ -545 -1995 -3714 -1002 2525 1418 617 -1171 -3330 -553 1568 2043 1380 -1032 -1885 -1063 1083 2810
862B810j800r56j384q04L317P94j580M32k178j251L380J05p80O28j545j539J762
$$ 2810 1010 54 -1330 -2134 1183 1977 397 829 -1349 -2600 780 885 105 733 -812 -2351 -589
879e89J680j049l25P37j902j0L733j999j261L060l019o14L940j703j469K286j068
$$ -589 1091 42 -283 454 -1448 -1458 2275 276 -985 2075 -944 -1558 2382 679 -790 1496 428
896D28j756J639J110j910K57J868k656j65K728k832O9L111k722j14J816k556L48
$$ 428 -1328 311 1421 -489 -232 1636 -1020 -1185 1543 -1289 -1220 1891 -831 -945 871 -1685 -1337
913a337K793j489k27P48j231j003K344J011k013J626m18l547L363J536l392L149
$$ -1337 1456 -33 -260 488 -743 -1746 598 1609 -404 1222 804 -2743 620 2156 -1236 1913
929A913j0n205L537J947m007K315J986m635j73N022k864l026N505k191m605O962
$$ 1913 1903 -3302 235 2182 -1825 490 2476 -2159 -2332 2690 -174 -3200 2305 114 -4491 2471
945B471r6o587M811J066n390M386L427n331m20K971k616q2N247j706m105K282
$$ 2471 2375 -4212 599 1665 -3725 661 4088 -1243 -1663 1308 -1308 -1390 3857 2151 -1954 328
961C28j074j837N213K91l335J014k377j093L993l24j77Q13l357r46L123k66r82
$$ 328 -746 -2583 2630 2921 -414 600 -1777 -2870 1123 799 622 1435 -1922 -2868 255 -11 -993
978i93L035q21m937L901K425o186L752M272p536K194O365p952r31P447m111l193
$$ -993 2042 1221 -3716 185 2610 -3576 176 4448 -3088 -894 5471 -2481 -3412 4035 -76 -3269
994c269P885j903q131N095L601o941M423N506r297j136O465m189q4O134l008m553
$$ -3269 4616 2713 -5418 -323 3278 -3663 760 6266 -3031 -4167 2298 -1891 -1975 4159 1151 -3402
1010c402K304J229j362J650K224k544k265J916O21J29J5Q80j57l449J725L959
$$ -3402 -1098 131 -1231 419 2643 99 -2166 -250 371 500 515 1395 1238 -2211 -486 3473
1026C473n098j61O068n361k622P943l515o027O808K026p655M015M914r628M82
$$ 3473 -1625 -1786 4282 -1079 -3701 4242 727 -5300 1508 3534 -4121 -106 4808 -4820 -4338
1041d338R946o214k866R439o524p251J0065J254o055N369J162r020J108P674k571
$$ -4338 5608 -606 -3472 5967 -557 -7808 2257 3511 -2544 2825 3987 -5033 -3925 3749 1178
1056A178j600M951m418n573M783K661j225P99n49j826j956P68M408j664k391L602
$$ 1178 -422 4529 111 -5462 -679 1982 757 1556 1007 -819 -2775 -2007 2401 737 -1654 1948
1072A948j913l961M712J824o233K332O018n747k053Q100n751o836J1701R90r062
$$ 1948 35 -3926 786 2610 -3623 -1291 4727 -1020 -3073 5027 -724 -7560 4141 5131 -3931
1087c931P100Q89j1903M652R900o182j356O199p824o212J0799J947o011N950j656
$$ -3931 3169 4058 -7845 -3193 6707 525 -831 5368 -2456 -8668 2131 4078 -1933 4017 2361
1102B361j0476N025O641l553J344K380n791l183M840K838j639J84N95l178q94
$$ 2361 -8115 -3090 3551 -2 1342 3722 -2069 -5252 -412 2426 787 971 1566 -1612 -2506
1117b506L299J999k291j958K743q5l950M789R61p698L361N506n709N69N411p135
$$ -2506 793 2792 501 -1457 1286 1201 -2749 2040 3001 -4697 -1336 4170 -1539 -970 4441 -2694
1133b694l719R329L18o091N525J67j1245N554R234p130O18N644r455l057R852
$$ -2694 -6413 2916 3234 -2857 2668 2835 -8410 -2856 6378 -752 -134 5510 -3945 -7002 2850
1148B850M84l803M024j731p822L619O449l423P8K795n751k055N112P12j125M44
$$ 2850 3334 -469 3555 1824 -5998 -2379 4070 647 725 3520 -2231 -4286 826 1538 413 857
1164H57q31j491n73K658J327l476K25K379j745n01L152r83m249K511L787l496
$$ 857 26 -1465 -2038 620 1947 -1529 -1304 1075 -670 -1171 1981 998 -3251 -740 3047 -449
1180d49L45L768n937j638P050j357l008M574k818n181L866L766l405P55K567n472
$$ -449 -104 3664 -2273 -3911 3139 1782 -1226 3348 530 -4651 -785 2981 -424 331 2898 -2574
1196b574j905O620r77k428L542k549l432L392J720j491Q26L17k132m04K223K03
$$ -2574 -4479 2141 1164 -1264 2278 -271 -3703 -311 1409 -82 744 1061 -1071 -1475 748 951
1212I51r80P59m63r55R56K40L18m44j321J834m81j694K383n17k542K153J045k448
$$ 951 -29 730 267 -688 268 508 826 382 -939 895 414 -1280 1103 586 -1956 197 1242 -1206
1230a206O67J580j952q22K952n56k714L121m23l158L284J002l396J868J272k627
$$ -1206 -539 1041 -911 -1733 1219 663 -2051 1070 647 -2511 773 1775 -1621 247 1519 -1108
1246a108R41J706j519r69K022k95j888J835K46k725K007Q29j859J121o4j681R76
$$ -1108 -167 1539 20 -949 1073 778 -1110 725 971 -1754 253 1082 -777 344 280 -1401 -425
1263d25O56j88K80o54o49%Q56R12m77N3j073p06J862J55O3P20k041p07K082l02
$$ -425 231 43 323 -331 -980 -980 -124 788 311 364 -709 -1415 447 602 665 1385 -656 -1363 719 417
1283D17L86L88j452r75P26J108K17l63Qk052j13K490l15l45O94k445j59K091K48
$$ 417 803 1191 -261 -1236 -510 598 815 452 460 -1592 -1705 785 470 125 819 -1626 -1785 306 554
1302E54L95n21j360m62P90J925J35r74n43j309N21K225M6l08r17j950O85J553
$$ 554 949 428 -932 -1394 -604 1321 1456 482 -61 -1370 -849 1376 1422 1114 197 -1753 -1068 485
1320D85P98M14j767j648L60O73J567N76j402r87r53Q56J963p2J63j755j148J677
$$ 485 1283 1697 -70 -1718 -1358 -685 882 1458 56 -931 -1884 -1028 935 863 1026 -729 -1877 -200
1338b00P29N42L56j947r68J070Q29J374j68j729j245K61J371J238p2q46k066n81
$$ -200 529 1071 1427 -520 -1488 -418 411 1785 1617 -112 -1357 -1096 275 1513 1441 595 -1471 -2052
1356b052J981N59R30l31k773j91J020P72J587l88j886p54K43J630J097k32j088
$$ -2052 -71 488 1418 1087 -1686 -1877 -857 -85 1502 1114 -772 -1526 -1283 347 1444 1212 124
1373A24j784P20J494M03P36j075k410J029J039K90J443j309k242O7J012R56Q21
$$ 124 -1660 -940 554 957 1693 618 -1792 -763 276 566 2009 700 -1542 -1475 -463 493 1314
1390A314J2j898j850J550J049O8J638j693k442J367P81J88J616q67j718k26J088
$$ 1314 1326 -572 -2422 -872 177 245 1883 190 -2252 -885 -104 84 1700 833 -885 -1111 -23
1407b3O28J13M15j108j301J199P73m81P37r73q90R27l8O49K8j385L9K68r2J088
$$ -23 605 718 1133 25 -1276 -77 696 215 952 -21 -911 16 -22 627 655 -730 -691 -423 -515 573
1427E73M5j099m65L20O53L9Q77k19k161J118J062j313J520O89k647L43J305o51
$$ 573 618 -481 -946 -626 27 66 943 724 -1437 -319 743 -570 950 1639 -1008 -665 640 -11
1445a1L99P75p53j644R89R80j211R79P11k270OJ431r47M52P59m90p35k1O65j57
$$ -11 388 1163 410 -1234 -245 735 -476 503 1214 -1056 -1050 381 -566 -114 645 155 -580 -601 64 -93
1465i3l82J131j89j252J032J40q02L39Q96j68j188J098K96k114J448J590k610
$$ -93 -475 656 467 -785 247 387 -415 -76 820 652 -536 562 858 -1256 192 1782 -828
1482h28O24J645k409n07K411o06j335J676K15k866J036K263k283L28K618k572
$$ -828 -204 1441 -968 -1475 936 330 -1005 671 886 -1980 -944 1319 -964 -636 1982 -590
1498e90r79K583j036q74J665M88j834l9J530j186n12K360m95j916R04M2q39O01
$$ -590 -1569 1014 -22 -896 769 1257 -577 -616 914 -272 -784 1576 1081 -835 69 111 -728 -127
1516a27J224k7k109L18J147k074J011K659k019j556J965p96j432K708R49k762
$$ -127 1097 1070 -1039 -721 426 -1648 -637 2022 3 -1553 412 -384 -1816 892 1841 -921
1532i21J21K426k707p77M626k051k533L548q26l634L206J748l226N33K805k853
$$ -921 -800 1626 -1081 -1858 2768 717 -1816 1732 906 -2728 478 2226 -1000 -467 2338 -515
1548e15j906L413k54k728L020N70l592J252J489j954N24K100n81k034P11J396
$$ -515 -2421 992 738 -1990 1030 1600 -1992 -740 749 -1205 -681 1419 838 -1196 -485 911
1564I11k167R01K560j744j423J726m34j356R79K194j802j459K435j189k674L443
$$ 911 -1256 -355 2205 461 -962 764 330 -1026 -47 2147 345 -1114 1321 132 -2542 901
1580I01Q06l038J524J394l506j93L660r00k147L165m82m693K665K908l183J087
$$ 901 1707 -1331 193 1587 -1919 -2112 1548 648 -1499 1666 1184 -3509 -844 2064 -1119 -32
1596c2K971m110j602L725P6j830K335N92m300M63L754j977o30K913k142k555K547
$$ -32 2939 -1171 -2773 952 1028 -802 1533 2125 -2175 -1712 2042 65 -565 2348 206 -2349 198
1613A98Q75j597L96J084j627j082K795o4k673J497J034k236J032K171j576j868
$$ 198 1073 -524 -128 956 -671 -1753 1042 978 -1695 -198 836 -1400 -368 1803 227 -1641
1629a641J483J018j563J559J692l898p83L069n08k32K338j541l684J112K809o22
$$ -1641 -158 860 -703 856 2548 -1350 -2133 936 428 196 2534 993 -2691 -1579 1230 608
1645F08k53K200l549k702L701J431j675J876o02m139Q07L653j42j125J281j949
$$ 608 355 2555 -994 -3696 5 1436 -239 1637 1035 -3104 -2297 1356 1214 89 1370 -579
1661e79k741L477K451k276J73J35k659Q58L202N3k216m06l0j166K056K602k524
$$ -579 -3320 157 2608 332 505 640 -2019 -1161 2041 2094 -122 -528 -558 -1724 332 2934 410
1678D10j990O40j93O52K407r7k938j189J259J317N60J458j638l536P48K494P02
$$ 410 -1580 -940 -1133 -481 1926 1829 -1109 -2298 -1039 278 838 2296 658 -2878 -2130 364 1066
1695A066J066n47k741j896K363K912n79M8j067l790O49M282J74q56k62k582j407
$$ 1066 2132 1585 -1156 -3052 -689 2223 1644 1692 625 -3165 -2516 1766 1940 1084 822 -1760 -3167
1712c167L027K896j481j536m05k143Q24M218n8k290m81j362j10L156J777j631
$$ -3167 -140 2756 1275 -261 -666 -2809 -1985 2233 2175 -115 -596 -1958 -2068 1088 2865 1234
1728A234k230q39N82J333K827n56l074j166J70J411K579K22k039k567n38K388
$$ 1234 -996 -1835 -1253 80 2907 2351 -723 -1889 -1719 -308 2271 2493 454 -2113 -2651 -263
1744b63J810N13p64k719j756J853K437R67n81k307j796K69L106J847j387j049
$$ -263 1547 2060 1296 -1423 -3179 -1326 1111 2078 1497 -810 -2606 -2337 769 2616 1229 180
1760A80j880j134L006K274n93j446j515j186J433K755O57k190j643m27R3K546
$$ 180 -1700 -2834 172 2446 1853 407 -1108 -2294 -861 1894 2551 361 -1282 -1709 -1616 930
1776I30J684j881j494j188oK287J674n33j853j734L01J699J644N97j982j772l01
$$ 930 2614 733 -761 -1949 -1955 332 2006 1473 -380 -2114 -1813 -114 1530 2127 145 -1627 -1928
1793a928J324K207O82j583j488j382J225K303M73o02j652j748R06J762J131j81
$$ -1928 -604 1603 2285 702 -786 -2168 -943 1360 1833 1231 -421 -2169 -1263 499 1630 1449
1809A449j769j350J9J260J909j26j693q68p63J347J978P7p39j712p93J189J378
$$ 1449 -320 -1670 -1651 -391 1518 1392 -301 -1169 -1932 -585 1393 1470 731 -981 -1774 -585 793
1826G93J063n14j888o99N14J081J195l81j153j255j07J415J043Qn34j765l67J481
$$ 793 1856 1342 -546 -1245 -731 350 1545 1164 11 -1244 -1351 64 1107 1115 581 -1184 -1551 -70
1844g0L72N77k96j493m02Q16Q33O28m04q33o67K1J448K44o5l70j227L54J018P0
$$ -70 302 879 583 -910 -1312 -496 337 965 561 -272 -939 -918 530 774 709 339 -888 -534 484 554
1864E54L64n76r90K31M74M95R9o07l43m21L01P58k77Nj76q00O51N59l82M85m45
$$ 554 918 342 -648 -417 57 552 651 44 -299 -720 -419 339 62 67 -109 -909 -258 301 -81 404 -41
1885d1n17M44L54p5J54l12j62MM41j2m15N47k13m68Q61m52o22P65m45j11M50k5
$$ -41 -558 -114 240 165 319 7 -155 -151 290 278 -137 410 197 -271 590 138 -484 281 -164 -275 175 150
1907A50o37K18J87k04M0O66o40n21R83o2m17Q22n29q98Q98M43k26L06n49l48j5
$$ 150 -487 -269 -82 -286 -246 420 -220 -741 242 180 -237 585 56 -842 56 499 273 579 30 -318 -333
1928c33M06O35l65j30n06n69R80L72j71j19q13k59M85M66R39q21j021K43J52L43
$$ -333 73 708 343 213 -293 -862 118 490 319 200 -613 -872 -387 79 1018 197 -824 -581 -429 -86
1948h6J012j41j173o09N87M87M08Q47r00j710Q04O86k25J285k78k118K20R11K80
$$ -86 926 785 -388 -997 -410 77 485 1332 432 -1278 -474 212 -13 1272 994 -1124 -904 7 287
1967B87N54N6j158j408R53J144j54M54n00j601N55J028L59J09o88p48j14N63J335
$$ 287 841 897 -261 -1669 -716 428 274 728 228 -1373 -818 210 569 678 -10 -758 -872 -309 1026
1986A026j04r07m85k83J94J585O64j219j309j11O25L58J871l55k658m19J130l07
$$ 1026 922 15 -470 -753 -559 1026 1690 471 -838 -949 -324 34 1905 1550 -1108 -1527 -397 -704
2004g04J701J100k314j519P96N50L43J721j96l145K19J528m09J386J100k654j260
$$ -704 997 2097 -217 -1736 -940 -390 -47 1674 1478 -1667 -1448 80 -329 1057 2157 -497 -1757
2021a757J534K10M78R99n97k109J82J560N9p9L67j524p89J454P17J96p36q85k15
$$ -1757 -223 -13 465 1464 867 -1242 -1060 500 559 480 847 -677 -1466 -12 705 901 165 -720 -935
2040i35k33J789J169j688j048M84p52J251J996o84k346l5P74m69J579J961k688
$$ -935 -1168 621 1790 102 -946 -462 -1214 37 2033 1349 -997 -1032 -258 -727 852 2813 125
2057A25k108J797l35L6L002j059l177O95P81n60J324J894k583j892J665J80m72
$$ 125 -1983 -186 -521 -485 2517 1458 -1719 -1024 -243 -803 521 2415 -168 -2060 -395 -215 -687
2074f87K521r68k482Q95J029m62Q23M95j283j241J060J274n90K04k15j327J14
$$ -687 1834 866 -1616 -721 308 -154 669 1164 -119 -1360 -300 974 384 588 373 -954 -840
2091h40J633N57q48q92J10p46J00K621n58k190O54k53q23K178J356k116j216J284
$$ -840 793 1350 502 -390 -280 -1026 -926 1695 1137 -1053 -399 -652 -1475 703 2059 -57 -1273 11
2109A1q59p6K675r0l251J056P17j584K217J481k481j102J490o37J4K017j74k712
$$ 11 -848 -924 1751 1661 -1590 -534 183 -1401 816 2297 -184 -1286 204 -433 -419 1598 1424 -1288
2127a288K45J533r77O90J396j859j015Q48M33n0M65M5j028p41J702L30r12N33
$$ -1288 -1043 490 -487 203 1599 -260 -1275 -427 6 -44 421 466 -562 -1303 399 729 -183 350
2145C50j13j351P94J479l36j155K82Q0j175J582J469k019n21R69j271L86K060
$$ 350 237 -1114 -320 1159 823 -332 -50 30 -1145 437 1906 -113 -634 335 -936 -550 1510
2162A510n90j722M90K32j000J174J746j965r73J423r73k65K152m95j453M21L45
$$ 1510 920 -802 -312 -80 -1080 94 1840 -125 -1098 325 -648 -913 1239 744 -709 -288 57
2179E7n97M26J136o15j234J178j31p28R70K86j112L6P42l75l92N03J41j053N54
$$ 57 -540 -114 1022 407 -827 351 220 -508 462 748 -364 -328 414 39 -353 150 291 -762 -208
2198b08R98q38m38Q56o92j21O66M29p49j89M97p50J79J309n33q07Q60m30o25Q91
$$ -208 790 -48 -486 370 -322 -443 223 652 -97 -286 211 -539 -360 949 416 -391 469 39 -586 305
2218C05L25m62j56O6Ln95Q38J13r22O15P6q68L12O27m18J20K9O0m79j19Q37l37
$$ 305 630 168 12 78 81 -514 324 437 -485 130 206 -662 -350 277 -141 -21 8 68 -411 -530 307 -30
2240c0k46P97p41l88Q10j93J22L48j41n33m27J203k85m94O93n82n97Q45K28n73
$$ -30 -276 521 -220 -608 202 9 131 479 338 -195 -622 581 296 -198 495 -87 -684 161 389 -184
2260a84M36l51k33R1M88Q5n45J01k03n27R41N82m95l8o91K50N72L65n6k48p99
$$ -184 252 -99 -332 -241 247 332 -213 -112 -315 -842 99 681 186 148 -543 -293 279 644 588 340 -459
2281d59j00N56L45O12n37o56m13L50O87K00j79m57j056N34R24oJ82l20j101J72
$$ -459 -559 -3 342 954 417 -239 -652 -302 385 585 406 -51 -1107 -573 351 345 527 207 -894 -722
2301g22Q91L15O5k58p80m88P47J097ml73l34j233N47J267R5j44o10r78J77Q67
$$ -722 169 484 549 291 -489 -977 -230 867 863 490 156 -1077 -530 737 832 688 78 -900 -723 144
2321A44P47q5o37q40l04P96R77r1m58p05r36J057J093j19Qj039r39P53Q50Q18
$$ 144 891 806 169 -671 -975 -179 798 707 249 -456 -1392 -335 758 639 647 -392 -1331 -578 272 1090
2341A090l50q62q29r0J233R80k24n54r93o49J169R68J04m21j211q05R83R66N62
$$ 1090 740 -122 -951 -1041 192 1172 948 394 -599 -1248 -79 889 993 572 -639 -1444 -461 505 1067
2360A067l72j173p63K67J291Q97n08o04j286p3J689O56m9n13j520k50J012J173
$$ 1067 695 -478 -1241 -974 317 1214 706 102 -1184 -1257 432 1088 1039 526 -994 -1244 -232 941
2378I41N15j045j107n36M40J604M42o52p81j031J98J494M98k03o92j385K54R54
$$ 941 1456 411 -696 -1232 -792 812 1254 602 -179 -1210 -1012 482 980 777 85 -1300 -1046 -92
2396i2R38L83j029j477K34P69J010M99p89j047p12Q27J133L51O3j281j130O38
$$ -92 846 1229 200 -1277 -1043 -274 736 1235 446 -601 -1313 -486 647 998 1061 -220 -1350 -712
2414g12J166N52K3j099j113J91Q64J071j29o16j151m57J067J105J32m56r70q18
$$ -712 454 1006 1029 -70 -1183 -992 -128 943 814 198 -953 -1410 -343 762 894 438 -532 -1350
2432a350Q03R90O67k44j354n05J77O57J433l28q10r18J1N73J016J26m71j302K1
$$ -1350 -547 443 1110 866 -488 -993 -816 -159 1274 946 136 -782 -771 -198 818 944 473 -829 -808
2451h08N24N24Q80n07j500l5N41O31N77j63r69q30L74J070L78n8l75j363L08J078
$$ -808 -284 240 1120 613 -887 -922 -381 250 827 664 -305 -1135 -761 309 687 629 254 -1109 -801 277
2471B77K49K83k28j036m42Q33P07L1k32m84p60J84J189K7l00m18m89p8N83N71
$$ 277 526 809 581 -455 -897 -64 643 674 442 -42 -802 -618 571 598 298 -120 -609 -687 -104 467
2491D67no69k69p9J24P85K46o96j45L2n0O35K27l53o12N0N01k48L27O02j053n60
$$ 467 462 -207 -476 -555 -431 354 600 -96 -241 -209 -259 376 603 250 -362 -312 189 -59 268 870 -183 -743
2513g43P56J15O6K85l31p10k6O87J27l07O23q94n92J089Rl06L81k5q74K55P47
$$ -743 13 128 194 479 148 -562 -588 99 226 -81 542 -352 -944 145 154 -152 229 204 -670 -415 332
2534C32J0n50L44O2p05N62M53p50K54M82n31k78N20J56o36J29N45q43K33O98p23
$$ 332 342 -208 136 198 -507 55 508 -242 12 494 -37 -315 205 361 -275 -146 399 -444 -211 487 -236
2555b36j03O93j47n86M85J90m65j14N43j42n90R25l46n71N75K06l87R8K53j37
$$ -236 -339 354 207 -379 106 296 -169 -283 260 118 -472 453 107 -464 111 317 -70 28 281 144
2575A44l20M77J21r44O18M45q32q6Q44o96k81P94R7n30j88N89o00k40J372m52
$$ 144 -176 301 422 -522 96 541 -291 -377 467 -229 -510 284 381 -149 -337 252 -348 -588 784 332
2595C32r43P52k48n49J033M97r01k00L16m28J17J037q2j320L98J31l97Q32N11
$$ 332 -611 141 -107 -656 377 874 -27 -227 89 -339 -222 815 733 -587 -189 -58 -455 377 888
2614H88r34m12K97L9m5N79K81j296pP79l16P2N46n55m28L99M80j88p5M41p15m06
$$ 888 -46 -458 -161 -122 -167 412 693 -603 -610 169 -147 -75 471 -84 -512 -113 367 179 104 545 -170 -576
2636e76J120J63p23J51j08p77M39J052k31p28P4j10m33R68O64r30l09K33p10K92
$$ -576 544 707 -16 135 27 -750 -311 741 510 -218 -144 -254 -687 281 945 15 -294 -61 -771 -479
2656d79J317k26j009L4L01l10O48Q06r28o62M54k25nJ097j93r50j52O20l7K9N80
$$ -479 838 612 -397 -363 -62 -372 276 1082 154 -508 -54 -279 -284 813 620 -330 -482 138 101 130 710
2677G10o38p71M70M57m67P49m06o65r4Q66Jj96J64l61n47L01R53q0l55M4p55N
$$ 710 72 -699 -229 228 -239 510 104 -561 -655 211 212 16 180 -181 -728 -427 526 446 91 135 -620 -615
2699f15Q13M78p4p90j1l27J40J030K7q10rl68o7P34N02l25q54N2L43l7Q08L5j266
$$ -615 198 676 602 -188 -199 -526 -386 644 671 -139 -148 -516 -583 151 653 328 -526 -474 -131 -168 640 675 -591
2722e91j96N25R8N62L74o41o98L19K95P4J42M65j178j96P96J22j7L69n62o48J85
$$ -591 -787 -262 -164 398 772 131 -567 -248 47 121 263 728 -450 -646 150 272 255 624 62 -586 -401
2743d01O31J03j50j16m21m41Q69L30j66q5n30j76L29N30J84k70n31k8M3M42O80
$$ -401 230 333 183 67 -354 -795 74 404 238 153 -377 -553 -224 306 490 220 -311 -339 -296 146 826
2764H26m16n53j68M0M09K02J69m14n01J55K83J96L57n37m30KJ94K10L66j58j67
$$ 826 410 -143 -311 -271 138 340 509 95 -406 -251 32 228 585 48 -382 -380 -186 24 390 232 65
2785F5n51K37K79Q0K15l85m70K08N74J3J43k56l67j0O0M79K09l11j60n11K10N77
$$ 65 -486 -249 30 110 325 -60 -530 -322 252 265 408 152 -215 -225 -165 314 523 212 52 -459 -249 328
2807C28k94J75k99k49K02K38J57K9n39m0J96N2K34J16k25k32j38K29K30R5J08
$$ 328 34 209 -90 -339 -137 101 258 287 -252 -292 -96 -44 190 306 81 -151 -289 -60 170 265 373
2828C73n22o3L09r7L92q3n11m4K30j72M28j00j77j56j77L24R4K01r7l46k1J60
$$ 373 -149 -212 97 0 392 309 -202 -246 -16 -188 240 140 -37 -193 -370 -46 48 249 152 -194 -215 -55
2850e5J1J98j04j92O3j09J07L09l4j80Q5k59L01k9j90K67k83M3K4Q3K44l10j60
$$ -55 -44 154 50 -142 -79 -188 -81 228 194 14 99 -160 141 112 -78 189 -94 -51 -27 56 300 -10 -170
2873a70J74j30J08J80l79K16o8p7L8O7j4K4j68J31M2j16L41l32N6L40k9k25P3
$$ -170 4 -126 -18 162 -217 -1 -69 -146 -108 -41 -55 -31 -199 -68 -26 -142 199 -133 -77 263 234 9 82
2896H2k23K78R0k33J75m43L42N8q6N9l03J15J84k31j5J59j05J70l2j69O5J01p3
$$ 82 -141 137 227 -6 169 -274 68 126 40 99 -204 -89 95 -136 -151 8 -97 73 41 -128 -63 38 -35
2919c5P2l45L16NK76j44j87m9J48p1J86o0l30J79o4r8M08j82k5pj27n8K27O4P7
$$ -35 37 -308 8 13 289 145 -42 -91 57 -14 172 112 -218 -39 -103 -201 207 25 0 -7 -134 -192 35 99 176
2944A76m68K09K19l45M23k25l31J14Q6J65J79ok65j70J4L54p5J27j06l08J8L65
$$ 176 -292 -83 136 -209 214 -11 -342 -228 -142 23 202 196 -69 -239 -225 129 54 181 75 -233 -215 150
2966A50K2K5j46m0k35p3M81L1k40m4m6j75M19k2N4j47n7m4k21M99K62l80k2k9
$$ 150 172 197 51 11 -224 -297 184 215 -25 -69 -115 -290 129 107 161 14 -43 -87 -308 191 453 73 51 22
2990B2k57M84K06n60J94j56k9K90l0J32m47j31J95%K63J45l97l14R8J32N8L08
$$ 22 -235 249 455 -105 89 -67 -96 194 164 296 -151 -282 -87 -87 176 321 -76 -390 -292 -160 -102 206
3012B06j85j37l51M61J45m9L08m21n15K29L45K38j69Lj27l82L63N42m58n8K86
$$ 206 21 -116 -467 -6 139 90 398 -23 -538 -309 36 274 105 108 -19 -401 -38 504 46 -12 274
3033B74p98L98M22kk87P1k97k29M04L02l21j73K52l00R9M46j38m26K84O5j61K46
$$ 274 -524 -126 296 294 7 78 -219 -448 -44 258 -63 -236 16 -284 -185 261 123 -303 -19 46 -115 131
3055A31J50k16l49L58r4j01M40K43r45K66J26l9K35Q1j78p16K67N22k76J06M89
$$ 131 281 65 -284 74 -20 -121 319 562 -383 -117 9 -30 205 286 108 -608 -341 181 -95 11 500
3076E00p91j54O70k19l7L28j94m40J4Q22m15j66L76l57m17O64k4j4p2N1k52p9
$$ 500 -291 -445 225 6 -31 297 103 -337 -323 499 84 -82 294 -63 -480 184 160 146 74 125 -127 -206
3098b06M82q0m99J51K60m45M17L63o47l8J26J80k12L11K29o42j58N42k60R4P07
$$ -206 276 196 -303 -152 108 -337 80 443 -204 -242 -116 64 -148 163 392 -250 -408 134 -126 -32 675
3119F75m07n96K77K83l38K01L68o41l19P44j64n35Q71k73p76N05K21j61n0K80
$$ 675 268 -328 -51 232 -106 95 463 -178 -497 247 83 -452 419 146 -630 -125 96 -65 -115 165
3139A65l34k14M54J28l60M26j7o35J35M66j32k80K72j40j95L79J26j07l33M31
$$ 165 -169 -383 71 199 -161 265 248 -387 -252 214 82 -198 74 -66 -261 118 244 137 -196 235
3159B35m10k22O13M9k24j49J11n3q5L39J01n81K26J85m15K83L40l50k65J61J08
$$ 235 -175 -397 216 265 41 -108 3 -50 -135 204 305 -276 -50 135 -280 3 343 -7 -272 -111 -3
3180cj12K54Q1n59R3N59m65J68K57l88Q0J28l9p7K90k31j85k5L32K4k79L00k31
$$ -3 -115 139 220 -339 -246 313 -152 16 273 -115 -35 93 54 -23 267 36 -149 -174 158 182 -97 203 -28
3203b8k31K62K01k60J08j08J06k84K03J71k59R9J42m5r5J58j99J35k21J80j10
$$ -28 -259 3 204 -56 52 -56 50 -234 -31 140 -119 -20 122 77 -18 140 -59 76 -145 35 -75
$$ [...]
8191A32
##END NTUPLES=NMR FID
##END=
