##TITLE=1H_E3e1207RHCl
 CDCl3
 8 sc, 
 13.7.2023
##JCAMPDX= 6.0         $$ Bruker NMR JCAMP-DX V2.0
##DATA TYPE= NMR FID
##DATA CLASS= NTUPLES
##ORIGIN= UXNMR, Bruker Analytische Messtechnik GmbH
##OWNER= root
$$ XWIN-NMR		Version 3.5
$$ Thu Jul 13 14:44:20 2023 Russian Standard Time (UT+4h)  she@DPX200
##.OBSERVE FREQUENCY= 200.13135
##.OBSERVE NUCLEUS= ^1H
##.DELAY= (6, 6)
##.ACQUISITION MODE= SIMULTANEOUS
##.ACQUISITION SCHEME= undefined
##.AVERAGES= 8
##.DIGITISER RES= 18
##SPECTROMETER/DATA SYSTEM= spect
##.PULSE SEQUENCE= zg30
##.SOLVENT NAME= CDCl3
##.SHIFT REFERENCE= (INTERNAL, CDCl3, 0, 15.7039)
##AUDIT TRAIL= $$ (NUMBER, WHEN, WHO, WHERE, WHAT)
$$ ##TITLE= Audit trail, XWIN-NMR		Version 3.5
$$ ##JCAMPDX= 5.01
$$ ##ORIGIN= Bruker BioSpin GmbH
$$ ##OWNER= she
$$ F:/spectra/data/she/nmr/H-F/1/audita.txt
$$ ##AUDIT TRAIL=  $$ (NUMBER, WHEN, WHO, WHERE, WHAT)
(   1,<2023-07-13 14:43:10.90 +0400>,<she>,<DPX200>,
      <created by zg, POWCHK disabled, PULCHK disabled
       configuration hash MD5:
       00 E9 B6 7A A2 85 ED C7 34 08 36 98 17 FE 4E 26
       data hash MD5: 16K
       67 A3 5D A8 FC 83 F3 85 13 C8 F8 BD A9 B4 1A 8B>)
$$ ##END=
$$ 
$$ hash MD5
$$ 60 86 2D 56 F8 35 9A FE 45 5F 0B 99 7B 49 CC 88
##$RELAX= 
##$RELAX= 
##$RELAX= 
##$RELAX= 
##$RELAX= 
##$RELAX= 
$$ Bruker specific parameters
$$ --------------------------
##$DU= <F:/spectra>
##$EXPNO= 1
##$NAME= <H-F>
##$PROCNO= 1
##$TYPE= <nmr>
##$USER= <she>
##$AMP= (0..31)
100 100 100 100 100 100 100 100 100 100 100 100 100 100 100 100 100 100 
100 100 100 100 100 100 100 100 100 100 100 100 100 100 
##$AQSEQ= 0
##$AQ_mod= 1
##$AUNM= <au_zg>
##$AUTOPOS= <>
##$BF1= 200.13
##$BF2= 200.13
##$BF3= 200.13
##$BF4= 200.13
##$BF5= 200.13
##$BF6= 200.13
##$BF7= 200.13
##$BF8= 200.13
##$BYTORDA= 1
##$CFDGTYP= 0
##$CFRGTYP= 5
##$CHEMSTR= <none>
##$CNST= (0..31)
1 1 145 1 1 1 1 1 1 1 1 1 1 1 1 1 1 1 1 1 1 1 1 1 1 1 1 1 1 1 1 1 
##$CPDPRG= <>
##$CPDPRG1= <>
##$CPDPRG2= <>
##$CPDPRG3= <>
##$CPDPRG4= <mlev>
##$CPDPRG5= <mlev>
##$CPDPRG6= <mlev>
##$CPDPRG7= <mlev>
##$CPDPRG8= <mlev>
##$CPDPRGB= <>
##$CPDPRGT= <>
##$D= (0..31)
0 1.2 0 0 0 0 0 0 0 0.06 0 0.03 0 0 0 0 0.0002 0 0 0 0 0 0 0 0 0 0 0 0 
0 0 0 
##$DATE= 1689244990
##$DBL= (0..7)
120 120 120 120 120 120 120 120 
##$DBP= (0..7)
150 150 150 150 150 150 150 150 
##$DBP07= 0
##$DBPNAM0= <>
##$DBPNAM1= <>
##$DBPNAM2= <>
##$DBPNAM3= <>
##$DBPNAM4= <>
##$DBPNAM5= <>
##$DBPNAM6= <>
##$DBPNAM7= <>
##$DBPOAL= (0..7)
0.5 0.5 0.5 0.5 0.5 0.5 0.5 0.5 
##$DBPOFFS= (0..7)
0 0 0 0 0 0 0 0 
##$DE= 6
##$DECBNUC= <off>
##$DECIM= 32
##$DECNUC= <off>
##$DECSTAT= 4
##$DIGMOD= 1
##$DIGTYP= 9
##$DL= (0..7)
0 120 120 120 120 120 120 120 
##$DP= (0..7)
150 150 150 150 150 150 150 150 
##$DP07= 0
##$DPNAME0= <>
##$DPNAME1= <>
##$DPNAME2= <>
##$DPNAME3= <>
##$DPNAME4= <>
##$DPNAME5= <>
##$DPNAME6= <>
##$DPNAME7= <>
##$DPOAL= (0..7)
0.5 0.5 0.5 0.5 0.5 0.5 0.5 0.5 
##$DPOFFS= (0..7)
0 0 0 0 0 0 0 0 
##$DQDMODE= 0
##$DR= 18
##$DS= 0
##$DSLIST= <SSSSSSSSSSSSSSS>
$$ [...]
##$SUBNAM2= <"">
##$SUBNAM3= <"">
##$SUBNAM4= <"">
##$SUBNAM5= <"">
##$SUBNAM6= <"">
##$SUBNAM7= <"">
##$SUBNAM8= <"">
##$SUBNAM9= <"">
##$SW= 18.05172834244
##$SWIBOX= (0..15)
0 0 2 0 0 0 0 0 0 0 0 0 0 0 0 0 
##$SW_h= 3612.71676300578
##$TD= 16384
##$TD0= 1
##$TE= 0
##$TE2= 300
##$TE3= 300
##$TEG= 300
##$TL= (0..7)
0 120 120 120 120 120 120 120 
##$TP= (0..7)
150 150 150 150 150 150 150 150 
##$TP07= 0
##$TPNAME0= <>
##$TPNAME1= <>
##$TPNAME2= <>
##$TPNAME3= <>
##$TPNAME4= <>
##$TPNAME5= <>
##$TPNAME6= <>
##$TPNAME7= <>
##$TPOAL= (0..7)
0.5 0.5 0.5 0.5 0.5 0.5 0.5 0.5 
##$TPOFFS= (0..7)
0 0 0 0 0 0 0 0 
##$TUNHIN= 0
##$TUNHOUT= 0
##$TUNXOUT= 0
##$USERA1= <user>
##$USERA2= <user>
##$USERA3= <user>
##$USERA4= <user>
##$USERA5= <user>
##$V9= 5
##$VALIST= <valist>
##$VCLIST= <CCCCCCCCCCCCCCC>
##$VD= 0
##$VDLIST= <DDDDDDDDDDDDDDD>
##$VPLIST= <PPPPPPPPPPPPPPP>
##$VTLIST= <TTTTTTTTTTTTTTT>
##$WBST= 1024
##$WBSW= 4
##$XGAIN= (0..3)
0 0 0 0 
##$XL= 0
##$YL= 0
##$YMAX_a= 244782
##$YMIN_a= -324925
##$ZGOPTNS= <>
##$ZL1= 120
##$ZL2= 120
##$ZL3= 120
##$ZL4= 120
##$ABSF1= 10
##$ABSF2= 0
##$ABSG= 5
##$ABSL= 3
##$ALPHA= 0
##$AQORDER= 0
##$ASSFAC= 0
##$ASSFACI= 0
##$ASSFACX= 0
##$ASSWID= 0
##$AUNMP= <proc_1d>
##$AZFE= 0.1
##$AZFW= 0.1
##$BCFW= 1
##$BC_mod= 2
##$BYTORDP= 1
##$COROFFS= 0
##$CY= 11.3945322036743
##$DATMOD= 1
##$DC= 2
##$DFILT= <>
##$DTYPP= 0
##$F1P= 15.7292609196834
##$F2P= 12.9074282941183
##$FCOR= 0.5
##$FTSIZE= 0
##$FT_mod= 4
##$GAMMA= 1
##$GB= 0.15
##$INTBC= 1
##$INTSCL= 1
##$ISEN= 128
##$LB= 0.24
##$LEV0= 0
##$LPBIN= 0
##$MAXI= 10000
##$MC2= 0
##$MEAN= 0
##$ME_mod= 0
##$MI= 1.114404
##$NCOEF= 0
##$NC_proc= 0
##$NLEV= 6
##$NOISF1= 3.799351
##$NOISF2= 2.8
##$NSP= 1
##$NTH_PI= 0
##$NZP= 0
##$OFFSET= 15.70392
##$PC= 1
##$PHC0= -20992.28
##$PHC1= 11.65272
##$PH_mod= 1
##$PKNL= yes
##$PPARMOD= 0
##$PSCAL= 0
##$PSIGN= 0
##$REVERSE= no
##$SF= 200.130013532006
##$SI= 16384
##$SIGF1= 3
##$SIGF2= 2
##$SINO= 400
##$SIOLD= 16384
##$SREGLST= <1H.CDCl3>
##$SSB= 0
##$STSI= 0
##$STSR= 0
##$SW_p= 3612.71676300578
##$SYMM= 0
##$S_DEV= 0
##$TDeff= 0
##$TDoff= 0
##$TI= <>
##$TILT= no
##$TM1= 0
##$TM2= 0
##$TOPLEV= 0
##$USERP1= <user>
##$USERP2= <user>
##$USERP3= <user>
##$USERP4= <user>
##$USERP5= <user>
##$WDW= 1
##$XDIM= 8192
##$YMAX_p= 0
##$YMIN_p= 0
$$ End of Bruker specific parameters
$$ ---------------------------------
##NTUPLES= NMR FID
##VAR_NAME=  TIME,          FID/REAL,        FID/IMAG
##SYMBOL=    X,             R,               I
##VAR_TYPE=  INDEPENDENT,   DEPENDENT,       DEPENDENT
##VAR_FORM=  AFFN,          ASDF,            ASDF
##VAR_DIM=   8192,          8192,            8192
##UNITS=     SECONDS,       ARBITRARY UNITS, ARBITRARY UNITS
##FACTOR=    0.0002768,     1,               1
##FIRST=     0,             0,               0
##LAST=      2.2672688,     0,               0
##MIN=       0,             -324925,         0
##MAX=       2.2672688,     244782,          0
$$ Real data points
##PAGE= N=1
##DATA TABLE= (X++(R..R)), XYDATA
0 0 0 0 0 0 0 0 0 0 0 0 0 0 0 0 0 -8 8 -8 8 -8 12 -16 16 -20 24 -24 32 -36 40 -45 52 -60 68 -76 84 -92 105
37 105 -116 129 -144 160 -176 194 -213 236 -262 288 -315 348 -383 423 -467 513 -567 628 -700 783
57 783 -878 992 -1133 1304 -1524 1815 -2214 2796 -3709 5312 -8634 18092 -94706 -324925
71 -324925 67088 56179 -148061 166832 175679 -215311 -88119 110401 -60126 40297 197579
82 197579 -73786 -142977 46370 -52419 -59280 150827 30144 -116268 40796 45406 -59629
93 -59629 37241 48626 -64958 -23983 35163 -1899 -3844 -26481 -49401 32822 57912 17624
105 17624 43751 -31863 -133472 -3732 87866 15241 42222 12168 -140981 -55968 109324
116 109324 48628 32200 60628 -111276 -139871 79612 77829 -20640 64168 -8182 -152072
127 -152072 10840 117276 -14142 -1258 35618 -91081 -55419 86651 18236 -41663 34033
138 34033 -10915 -56700 59786 53683 -63446 -16597 29088 -33696 6597 65107 -20774 -64193
150 -64193 12065 31190 1665 30853 22068 -56318 -47949 23339 25042 10663 21344 -15651 -54773
163 -54773 -10114 38967 20294 9528 9850 -39948 -45611 23300 30772 2259 17378 -4115 -42943
176 -42943 -4867 35198 11588 -221 6811 -20292 -25133 17033 20477 -3965 -795 -4369 -12092
189 -12092 4110 11886 2385 -10418 -13911 3351 8438 338 6281 -5037 -22994 2494 25108
202 25108 2606 -5435 4855 -19582 -18718 31664 20202 -18469 5854 -789 -31592 16332 35564
215 35564 -16665 -9565 12790 -23388 -10656 35434 430 -25527 14554 -715 -26789 20224
227 20224 17074 -27438 3753 16785 -21142 -364 21286 -13663 -8872 20658 -3432 -14173
239 -14173 14066 1335 -13694 14768 8323 -16317 3357 5571 -9620 8232 9301 -11153 -4133
252 -4133 2778 -3531 3564 6884 -7415 -8640 2570 -15 2269 8982 -6219 -10540 5099 1396
266 1396 1126 9498 -6061 -12515 4221 6313 3550 8571 -687 -13483 -2253 10411 3084 2785
280 2785 2046 -15353 -9997 10511 7082 3458 4669 -10210 -12604 3874 8523 2358 -510 -6441
294 -6441 -13440 -2508 12713 7236 1270 -419 -9970 -4244 10591 7843 551 -4490 -9853 -4096
308 -4096 7868 12816 4641 -5872 -7887 -5800 3866 12769 3301 -8716 -11439 -8737 4706 14452
322 14452 8103 -3911 -13208 -9989 2834 10617 9525 -3448 -15228 -9376 3216 13524 14509 1166
336 1166 -11335 -11213 -148 12247 10593 -154 -10634 -13824 90 14333 12634 3612 -9777
349 -9777 -15508 -4061 8247 10653 1238 -11492 -13820 -4852 9961 16751 5863 -6649 -12915 -8650
363 -8650 6942 12588 4535 -4999 -13873 -8126 9351 15455 10866 -400 -12925 -11113 2522 11861
377 11861 7185 -3449 -10224 -13203 -387 16839 10323 -1866 -6349 -14529 -7078 11957 9728 -3605
391 -3605 -7926 -8826 -5155 10875 18753 1465 -10602 -5814 -5754 3624 17200 2966 -13631 -8258
405 -8258 -1146 6192 16687 10529 -10616 -16834 -3877 4403 8969 10710 -6544 -20240 -7418 7039
419 7039 12492 12135 115 -14601 -15350 406 12871 8105 678 -6124 -13697 -2775 14590 12750
433 12750 1531 -4533 -7325 -7142 4407 13709 -743 -10900 -1306 -1546 680 14395 4097 -14858
447 -14858 -6896 3429 731 5946 7711 -12838 -17823 6172 10668 3156 10646 -3353 -23266 -3140
461 -3140 15347 6180 5519 3850 -16813 -15709 12407 15185 1710 5147 -5279 -21098 235 16795
475 16795 3286 638 465 -12965 -9052 9628 9062 -2507 -1821 -3154 -8976 1479 9563 -875
489 -875 -4249 -541 -756 1887 3921 1933 -4183 -6967 3920 8868 382 -325 -1390 -9881 -1541 14821
505 14821 7418 -6232 -2564 -6320 -12705 10166 19206 -6501 -7129 918 -15705 -2884 23765 3664
519 3664 -12552 3118 -6460 -16366 14557 18314 -12337 -1756 8444 -17122 -2900 22727 -3290
532 -3290 -9163 13108 -4537 -14644 11463 6568 -11610 6435 9649 -12922 -3194 8837 -9336
545 -9336 -2346 14345 -2348 -7908 2878 -5657 -6180 7899 6813 -723 -2513 -5065 -4976 1672 5934
560 5934 6325 3442 -6309 -7343 2370 -37 2260 12780 -1940 -12032 3838 -1104 -8134 12322
574 12322 8764 -12397 -707 4976 -13872 -1435 17605 -3488 -8469 10590 -7598 -16345 13674
587 13674 8593 -9314 8116 3526 -18564 -238 14319 -2603 931 11240 -9901 -12970 10498
600 10498 4323 -4408 10218 1054 -14075 653 5744 -3788 2474 5513 -5281 -5516 2588 -914
614 -914 -3713 4504 2710 -3013 979 -436 -5341 -740 3723 3800 2195 -431 -2805 -5132 -893 7726
630 7726 5912 236 -1678 -6093 -6097 2938 9094 4312 -3029 -4037 -6396 -4376 7522 8091 -2403 -3986
646 -3986 -4436 -5873 2054 8309 2829 -4604 -2865 -503 -2355 4164 6694 -4350 -4650 3809 430
661 430 -493 5002 -215 -6996 1744 7616 -1871 -1885 2927 -7805 -4701 11252 2989 -6155 1597 -3913
677 -3913 -8828 6942 9832 -4654 -3946 418 -8187 -562 13856 1079 -6981 2145 -4298 -4840 11080
692 11080 5798 -6441 -477 -397 -4791 5064 7892 -3987 -4110 1827 -2943 1107 7139 -3787 -6164
707 -6164 1531 -1596 1014 6303 -3197 -6363 714 200 1351 6062 -986 -8169 -882 2694 318
722 318 6913 3414 -9642 -2144 4719 -1194 5397 6083 -8467 -5609 4413 63 1393 6340 -3724
737 -3724 -9197 2991 3714 -2932 4471 644 -10508 514 6572 -2781 1558 2859 -7439 -2550
751 -2550 6747 931 -1454 2762 -3126 -4935 5967 4478 -2991 1684 -557 -5762 3696 5422 -2681
766 -2681 -343 -185 -4557 740 5059 -931 -2975 -321 -2361 -1323 5198 839 -4788 -92 -1512
781 -1512 -1595 5580 2166 -4076 -1111 -479 -670 4311 4032 -2173 -3492 361 -47 1695 5062 -1173 -4504
798 -4504 450 -471 323 4029 -1016 -4022 -884 -11 77 1984 531 -3080 -2122 1349 450 480 1789
815 1789 -2302 -1903 2163 790 726 1697 -1621 -1257 1394 1545 1212 279 -896 -1354 -81 2303 613
832 613 -744 -560 -2239 -181 1774 85 -318 -1632 -2163 159 885 1088 359 -2311 -1372 267 1102
849 1102 2169 792 -1483 -1413 -42 1936 1731 881 143 -2414 -367 2079 251 1209 547 -2818 -841
866 -841 1048 -658 51 134 -1572 -1296 701 679 -1368 442 -1 -2176 1542 1493 -1829 744 494 -1968
884 -1968 1679 2145 -942 468 926 -1323 -62 2532 68 -1551 1384 -758 -2300 2732 372 -2520
900 -2520 1781 -604 -3214 1822 1084 -2387 552 841 -2552 -431 2609 -1424 -1141 3186 -1106 -1929
916 -1929 3606 -128 -2175 3308 554 -2081 1890 642 -1931 783 1614 -1173 -579 1437 -1481 -1298
932 -1298 1709 -1051 -1027 1613 -1310 -1437 901 -1273 -414 1331 -213 19 84 -879 -347 1361 1081 406
950 406 787 -641 -2180 1773 1966 -448 1985 46 -3943 379 1896 -368 1049 775 -2692 -2178
966 -2178 1150 927 -862 1125 -122 -3255 -166 1360 -633 776 609 -841 -270 372 893 41 -332
983 -332 1495 -16 -273 1746 -276 -2034 1131 1629 -348 594 846 -2963 -2730 3265 1095 -1702 2717
1000 2717 -1448 -5736 1841 2973 -1487 1678 745 -5001 -1454 4159 825 -155 3055 -2477 -4190
1015 -4190 3728 2462 -1294 3113 -345 -4421 1683 2193 -842 1276 300 -2884 -500 1441 -817
1030 -817 55 803 -2606 -718 2530 -2085 -888 1895 -2887 -255 4098 -1811 -1474 2063 -2374 -432
1046 -432 5452 529 -3313 1465 -1067 -4116 5467 5211 -5053 -44 1448 -6674 1856 8222 -2914
1061 -2914 -2806 1950 -5460 -3159 7484 1953 -4454 1894 -1187 -6691 4437 5957 -4489 395
1075 395 2540 -5858 -89 6035 -1373 -1348 3204 -1295 -2191 3192 385 -2880 1880 1199 -2222 1895
1091 1895 257 -4091 563 1233 -487 2468 -626 -3749 -557 -320 134 4094 1012 -4449 -1475 954
1107 954 -1916 3251 6319 -3635 -4524 2778 -2014 -252 7602 279 -5701 720 124 -2482 4340 3633
1123 3633 -4949 -2038 2347 -3111 209 5732 -3046 -4516 3491 -991 -2778 3903 508 -4659 1026
1138 1026 3110 -1821 -56 2478 -2299 -1262 4013 602 -1504 1236 -1639 -1628 2974 2229 -297 -856
1154 -856 -1555 -1327 488 2676 1314 -1984 -2281 -2002 -188 2141 1746 696 -2192 -3150 588 1365 1228
1171 1228 2646 -881 -3250 41 1168 688 2162 1101 -2263 -1330 2160 533 -750 2365 -337
1186 -337 -2905 2086 1525 -2470 -226 752 -1761 43 2182 -579 -2846 -143 165 -990 2637 1305
1202 1305 -3004 -713 644 -633 1888 2450 -953 -2289 -179 806 329 1708 1352 -2007 -1143 895
1218 895 -2 902 1052 -1098 -1246 -663 109 571 -358 86 -822 -1138 678 377 -614 -25 -207 -233 181 803
1238 803 601 -1153 107 1123 -450 745 1180 -1144 -403 846 310 321 491 -185 -1188 -36 1343
1255 1343 -737 -625 634 -1395 -701 881 -687 -603 156 -481 -411 177 555 -609 -408 1225 87 -245
1273 -245 1220 -493 -526 1154 391 368 277 -504 -198 -83 762 484 -623 -269 -714 -726 975 317 -638 -382
1293 -382 -1159 -206 599 205 217 -787 -897 419 684 974 519 -749 -315 228 873 1523 38 -588 -664
1312 -664 -659 1251 1184 114 -575 -1433 -963 649 1093 686 -1146 -1549 -595 -193 1295 1226 -1297 -1211 -618 55
1332 55 1492 869 -705 -988 -688 1019 1465 798 84 -1688 -544 1703 1084 1143 -67 -2186 -897 589
1350 589 1540 1339 -557 -1868 -1844 -369 1698 1141 -173 -971 -2274 -379 1848 1111 664 -829 -1826
1367 -1826 -359 1309 1621 640 -895 -1027 -377 1411 2351 287 -1071 -1166 -1114 1568 1904 421 -1035
1384 -1035 -2498 -1529 1314 1820 1052 -696 -2556 -1645 233 2104 1417 -768 -1315 -1937 -217 2547 1596
1401 1596 -176 -454 -1782 -455 2090 1366 51 -574 -716 -424 1099 1955 -535 -2006 -381 -544 203
1418 203 2026 -204 -2307 -943 -85 650 1302 589 -1676 -2370 186 1536 1223 1311 -820 -2411 -269
1435 -269 1535 1986 1254 -685 -1699 -1642 910 2767 611 -608 -1041 -2310 -92 2825 1121 -1047
1451 -1047 -1092 -1495 -1164 1363 2708 -907 -1924 150 -1420 -408 3406 515 -2113 -78 3 -700 1662
1468 1662 1919 -1153 -1115 1187 -64 -242 2000 -645 -1988 1081 563 -450 605 -408 -1717 -400
1484 -400 1093 838 -513 -735 -1057 -1212 782 1721 436 -1132 -1399 -276 88 1269 2769 -542 -2468
1501 -2468 408 111 -275 2974 1320 -2827 -1067 1233 -937 499 3336 -1585 -3260 1945 -166
1516 -166 -2576 2998 957 -4178 792 1855 -2584 404 2835 -2034 -1809 2960 -436 -2417 2675
1531 2675 728 -2727 2456 1825 -2740 426 1485 -1676 103 2462 -544 -1808 164 -197 -939 1607
1547 1607 977 -1425 -1019 -746 -581 822 668 374 -780 -2327 6 1155 -385 1202 1249 -2272 -1192
1564 -1192 1882 -27 -539 2755 411 -3169 1369 1640 -2893 1489 3201 -3287 -623 2731 -2848
1579 -2848 -1851 3709 -213 -2933 2113 335 -4400 1541 3346 -2829 107 2779 -3352 -1648 3692
1594 3692 -164 -1338 2524 42 -3102 1026 2117 -1195 667 2066 -2019 -1588 1737 -317 -738
1609 -738 1294 228 -1577 -903 402 -181 -697 1125 398 -1476 -571 526 -911 -79 1841 448 -1649
1626 -1649 -115 782 -1477 909 3037 -1021 -1464 1271 -1331 -993 2995 1337 -2274 -287 544 -1985
1642 -1985 457 3389 -1319 -2209 1263 -1139 -1790 2305 880 -2305 82 861 -1455 -247 2227 -806
1658 -806 -1527 1852 365 -1647 1265 864 -1799 802 1968 -366 -796 611 -623 -1397 1875 1805 -1850
1675 -1850 -718 172 -1822 291 2677 -203 -1795 -714 -589 -705 1921 2061 -1491 -1359 365 -709
1691 -709 729 2649 -10 -1706 -505 209 169 1197 1020 -1238 -1695 693 687 98 898 -489 -1746 -191
1709 -191 961 473 -372 -488 -770 -1111 1033 1728 -809 -1025 -173 -803 437 2184 438 -1602 -929 403
1727 403 102 1544 2116 -1515 -2167 472 180 727 2409 -684 -2751 -489 505 332 1255 701 -2268
1744 -2268 -1867 992 545 639 1241 -1627 -2205 493 1200 711 910 -606 -1669 -275 1628 1347 361 -149
1762 -149 -1461 -746 1506 1381 525 -447 -1687 -636 974 1078 688 -822 -1885 -490 475 1082 693
1779 693 -648 -1670 -1273 986 1376 500 182 -1325 -1786 1048 1753 415 438 -849 -1670 258 1927
1796 1927 1252 -19 -608 -1298 -954 1890 1454 -745 -481 -1370 -1405 1232 1452 -206 -781 -1320 -740 864
1814 864 1597 641 -1152 -889 -575 438 2055 874 -873 -754 -748 488 1762 664 -572 -811 -881 378
1832 378 1293 930 -352 -1366 -735 -45 780 1275 -459 -1203 -553 -537 800 1225 -307 -828 -761 -520 808
1851 808 1048 352 -835 -652 -111 323 1124 913 -818 -670 -45 59 982 768 -786 -666 -663 185 835 357
1871 357 -479 -1087 -635 310 399 437 -168 -1106 -247 307 493 860 -55 -518 -199 71 863 786 -361 -125 -288
1892 -288 1 727 443 -63 -463 -534 146 -39 385 199 -953 -236 310 -264 257 297 -776 -579 69 -79
1912 -79 26 496 -41 -641 -7 448 -144 226 723 -646 -50 635 -152 255 339 13 -102 73 43 -341 -161
1933 -161 250 -210 -260 94 -490 -393 -2 247 187 -495 -122 26 -386 408 585 -505 -275 56 -17 353 815
1954 815 307 -425 -75 697 -313 147 729 -1030 -639 1044 -42 -482 177 -500 -1024 486 887 -763
1972 -763 -378 250 -1099 -315 1778 -22 -1092 30 -562 -632 1458 1428 -471 -928 -136 -242 344 1865
1990 1865 260 -1427 -236 -85 -294 1241 1005 -746 -1175 -390 464 9 803 131 -1585 -664 654
2007 654 -33 401 183 -861 -705 830 1323 -135 -440 -17 -592 229 2114 433 -1444 -203 -171 -249
2025 -249 1341 1511 -1372 -1992 12 216 280 1986 86 -2870 -854 566 276 1283 1106 -1765 -2242
2042 -2242 375 1063 354 1360 63 -2542 -286 1784 331 698 738 -1513 -1523 1297 1464 -399 0
2059 0 -112 -1579 66 2136 -204 -1061 33 -669 -370 1694 848 -1495 -1376 211 205 954 1793 -817
2077 -817 -2344 -27 870 810 1705 201 -1966 -1635 743 1548 741 881 -791 -2717 -188 1969 875
2094 875 539 17 -1933 -1701 963 1501 -13 -396 -364 -1758 -172 2132 -119 -1255 236 -477 -557 1318
2112 1318 1302 -1366 -906 920 156 265 1667 -640 -2170 436 1241 202 1016 145 -2369 -1392 1380
2129 1380 1048 53 819 -1401 -2847 616 1822 106 565 -240 -2227 -737 1573 1419 -236 -1 -515
2146 -515 -1443 914 1870 -119 -197 -78 -1029 181 1241 391 -761 -689 269 -206 327 929 -927 -1252 89
2165 89 346 38 402 -182 -1025 -684 949 1033 -226 88 -316 -1454 466 1775 265 -298 -30 -922 -314
2184 -314 1606 1228 -693 -570 27 -1323 385 1938 -653 -1085 98 -703 -521 1285 604 -1230 -610
2201 -610 321 -896 260 1403 -486 -897 829 -190 -228 1088 20 -769 448 580 -229 200 647
2218 647 -605 -501 787 183 -214 85 -431 -521 102 196 111 -281 -510 -374 -227 403 421 -173 -450 -151 -142
2239 -142 138 361 376 -261 -420 351 -142 -88 724 -89 -698 387 193 -331 260 347 -310 -455 516 -266 -429
2260 -429 644 -201 -778 507 -82 -689 223 89 -362 -32 166 -213 -130 408 245 -278 408 6 -508 371
2280 371 390 -83 213 33 -378 136 30 30 -209 -296 -22 -337 108 283 -511 -217 -11 25 399 -86 -179 -253
2302 -253 -325 251 273 47 233 -154 -257 340 237 184 119 -293 -332 -111 160 479 -184 -270 -292 -430 324 438
2324 438 97 -85 -479 -203 124 61 363 -325 -556 -89 204 354 331 -179 -297 -163 174 650 198 60 -242
2345 -242 -613 366 565 213 174 -543 -622 95 384 325 -294 -435 -551 -509 379 730 -125 -272 -500 -424 688
2366 688 474 -27 62 -504 -222 373 630 497 -325 -367 -104 66 528 536 -332 -321 -403 -39 560 252 -404 -484
2388 -484 -607 75 533 282 -159 -707 -577 -29 442 598 -92 -625 -498 -109 589 868 -94 -352 -284 -108
2408 -108 606 737 -31 -398 -429 -296 220 598 472 -692 -612 -77 -374 479 599 -835 -724 -21 -54 425
2428 425 385 -145 -636 -334 219 278 327 279 -707 -459 422 379 640 135 -433 -391 -44 922 629 -279 -285 -691 -428
2451 -428 360 635 37 -396 -459 -303 93 671 429 -834 -347 229 -76 738 651 -668 -501 188 281 389
2471 389 564 125 -712 45 724 131 306 385 -929 -611 658 383 99 98 -520 -932 -79 611 245 -301
2491 -301 -88 -760 -725 550 630 24 64 -293 -300 -71 831 517 -285 73 -15 -437 571 672 -260 -304 107 123
2513 123 -231 401 5 -839 29 524 -265 36 483 -853 -633 623 153 -89 157 -194 -734 151 1061
2532 1061 -21 -193 471 -638 -413 958 533 -320 282 -50 -616 181 667 -29 -303 40 -283 -756 407
2551 407 657 -453 -117 -13 -604 -224 539 174 -472 -25 334 -520 219 773 -327 -269 604 -98 -272 438
2571 438 493 -317 80 734 -546 -518 727 -422 -712 712 23 -870 172 196 -793 -93 715 -278 -468
2590 -468 411 -319 -808 799 540 -673 281 151 -673 185 720 229 -225 226 99 -722 471 715 -211
2609 -211 -154 44 -747 -375 396 490 -326 -117 231 -642 -306 560 -27 -533 500 7 -543 419 354 -347 -65
2630 -65 751 -350 -314 870 147 -590 553 459 -700 307 532 -551 -30 702 -68 -440 339 15 -802
2649 -802 455 642 -658 258 130 -732 -284 589 241 -364 30 -127 -416 308 684 -198 30 281 -509
2668 -509 -333 503 189 -30 -168 -123 -273 -136 652 101 -541 -43 -37 -314 246 275 -279 -447 74 -32 -290
2689 -290 490 162 -641 260 485 -202 403 544 -287 -367 539 253 -237 112 50 -536 85 791 -226 -218 260
2710 260 -701 -424 724 283 -137 -220 -207 -672 -12 810 -24 -457 -143 -350 -252 578 280 -316 -14 -137 -147
2731 -147 283 677 -114 -579 6 109 -131 682 60 -586 -246 -22 213 387 10 -418 -746 -9 560 80
2751 80 98 -192 -656 -95 434 507 172 -149 -294 -148 199 777 342 -371 -303 -302 72 577 454 -138 -747 -408
2773 -408 127 266 507 -206 -817 -449 -22 125 490 145 -632 -591 -117 402 408 217 -410 -658 74 800 390
2794 390 134 -196 -673 10 421 272 285 -359 -681 -321 313 811 123 -453 -472 -502 259 675 68 -310 -667
2815 -667 -552 218 582 498 -65 -512 -228 252 538 661 -104 -444 -226 -89 660 505 16 -322 -737 -274
2835 -274 531 602 79 -389 -489 -189 388 481 83 -404 -376 -256 101 574 118 -519 -318 -283 256 506 379
2856 379 -180 -682 13 346 506 433 -181 -446 -153 182 363 648 -117 -676 -426 63 324 280 -14 -568 -560
2877 -560 133 534 222 -11 -427 -543 198 394 245 160 -265 -435 218 424 543 164 -42 -235 -233 419 264
2898 264 -58 -10 -349 -180 113 120 67 -203 -382 -232 -33 267 395 0 -320 -177 18 421 93 73 -42 -296
2920 -296 117 335 91 73 -47 -250 77 263 -34 69 -107 -132 -65 52 147 -358 27 -22 -257 94 223 -218
2942 -218 -69 -40 -218 -130 65 172 109 -70 192 -30 65 341 117 -91 90 -51 -18 148 189 35 -126 263
2964 263 -12 -147 202 87 -244 -84 -227 -183 67 19 -32 -225 -101 149 -246 199 292 -276 -4 200 -223
2985 -223 139 237 -5 -301 85 270 109 99 137 -600 -163 357 92 32 152 -417 -513 35 331 69 -215 -153
3007 -153 -546 -284 479 315 -70 -110 -155 -157 204 453 269 -366 -499 -9 -17 345 280 -265 -246 34 -107 217 356
3030 356 -45 -636 -169 314 -36 250 176 -624 -370 539 78 -65 107 -499 -604 136 501 -46 -138 243 -416
3051 -416 -68 868 388 -30 54 -207 -197 409 648 28 -351 -256 5 -41 637 320 -518 -448 -66 -256 393 309
3073 309 -409 -558 -192 342 69 250 -10 -477 -312 396 215 115 88 -361 -380 188 786 -10 -148 -84 -478
3094 -478 -178 740 209 -284 -255 -363 -239 416 550 75 -561 -163 -49 194 773 252 -610 -135 173 239 432
3115 432 426 -290 -532 -95 389 463 305 156 -737 -476 281 266 17 50 -419 -392 190 511 66 -66 -79 -399
3137 -399 -185 629 201 -388 -227 -277 -60 555 467 -172 -456 -19 77 8 672 69 -498 -13 146 -90 660
3158 660 211 -394 -419 -5 288 186 185 -155 -671 -131 232 -24 323 -66 -373 -258 97 340 178 -173 -7
3179 -7 -215 12 588 143 -123 -65 -10 -170 251 440 -156 -319 -129 88 -18 407 84 -570 -151 155 100 166
3201 166 114 -342 -542 -12 448 68 200 -157 -411 185 373 66 233 87 -355 -193 395 372 159 73 -142
3222 -142 -364 -20 515 -127 -139 -57 -324 -55 171 131 21 -265 -216 -17 155 275 -39 -212 -40 -86 -41 264
3244 264 72 -140 -57 -186 245 6 115 -5 -268 93 280 102 128 -18 -393 -228 -8 131 -68 -338 -12
3265 -12 -76 -148 198 -44 -55 -26 -59 303 70 104 -161 -144 55 193 120 227 -29 -186 119 82 218 85 79 -104
3289 -104 -156 52 123 -226 14 51 -244 160 8 -151 33 -39 -61 207 131 131 -146 69 -112 35 155 111 -75
3312 -75 46 105 -23 110 45 16 -148 19 93 79 -47 96 -67 -37 -32 -36 -80 123 -128 224 39 -186 -52 -26
3336 -26 -56 127 -18 165 -31 -16 145 -17 56 131 31 6 -39 -187 141 -152 -121 12 -91 33 47 18 -3 -125
3360 -125 -187 131 -91 98 -37 -165 59 -182 -10 123 -77 -158 2 345 114 123 203 32 -75 137 113 -34
3382 -34 189 -52 -92 161 -116 -147 156 -315 -220 -53 246 100 -159 -124 -268 -108 271 105 -269 108 -153 -69
3404 -69 280 -45 117 -53 -105 65 96 181 226 -186 -118 -27 106 211 -109 -84 -61 -39 137 124 -68 -210 -186 -158
3428 -158 252 110 37 112 -294 65 279 144 -2 -127 -15 147 -87 339 63 -104 -231 27 130 211 -55
3449 -55 -31 -168 -242 45 -47 133 90 -327 -212 76 86 197 47 -180 -261 -154 282 75 -243 -22 -135 61
3471 61 237 -4 -18 -36 -53 43 146 171 176 -122 8 93 118 341 -118 -203 -151 42 40 -3 -187 -292 -318 14 224
3496 224 75 -20 -113 -185 78 252 188 95 -15 -139 30 44 162 42 -187 -117 -93 56 -22 98 -19 -336 -41
3519 -41 123 57 -108 -100 -269 -212 184 -43 -33 -98 -380 -40 281 320 20 -138 -141 -103 246 329 74 -67 108 -209
3543 -209 30 198 94 -116 -244 -224 -134 -6 304 -51 -213 -225 -105 80 262 -148 -122 -173 -22 111 51 7
3565 7 8 -28 112 182 -68 215 2 -85 89 159 140 -99 102 -88 -130 22 209 -170 0 55 -37 53 165 -104
3589 -104 -183 -242 -105 101 146 277 -105 -172 -1 -165 69 243 -45 -142 -42 62 161 89 82 63 -247 -73 -26 -23
3613 -23 -3 -88 -188 -139 42 -40 -126 58 -21 -99 152 96 -249 -100 268 -62 156 113 54 0 -157 7 -134 53
3637 53 10 -97 -177 106 -206 -111 138 -110 100 -58 -107 -191 -174 276 -157 -10 -19 -81 -116 98 203 78 -87 -216
3661 -216 115 -68 204 110 -203 -39 12 -43 106 206 -161 -241 -210 54 33 -10 -168 -170 -200 -43 -9 51 -51 -242
3685 -242 -50 -10 118 116 34 -120 34 -77 254 148 -129 26 -76 -83 100 171 -93 -86 -236 -9 109 177 21
3708 21 -327 -158 -93 -43 297 115 -373 -190 -216 67 185 149 -45 -378 -194 19 122 391 -17 -71 -366 56
3730 56 360 280 -141 -270 -64 -92 540 73 -92 -43 -162 -206 404 13 -20 -183 -244 -88 139 294 88 -264
3752 -264 -344 -94 119 473 129 -225 -335 -44 24 329 186 -17 -224 -212 192 259 99 -77 -495 -226 125
3773 125 163 240 -196 -268 -89 48 356 57 -129 -274 -443 -68 369 137 -39 -150 -104 176 201 308 138 -299
3795 -299 -140 68 188 445 -10 -313 -173 83 153 113 13 -269 -357 -153 247 326 196 -300 -307 -167 80 239
3817 239 147 -221 -335 -315 73 322 252 -129 -278 -383 171 264 229 -186 -358 -350 52 72 229 25 -309 -43 -65
3840 -65 125 375 3 -356 -274 -175 118 100 48 -161 -227 -33 323 201 130 -183 -272 -67 129 413 160 -231 -108
3863 -108 -215 106 302 88 -43 -179 -274 58 243 264 -272 -255 -122 102 206 204 -60 -376 -115 182 225 165
3885 165 -136 -266 -156 44 392 240 5 -118 -258 -151 201 202 69 -79 -253 -48 58 172 102 -164 -204
3906 -204 -158 -90 60 205 -128 -117 -227 134 216 -51 -47 -257 -147 118 182 143 25 -132 24 70 39 180 -7
3929 -7 -81 48 -18 56 -52 -23 -9 -311 -73 233 185 -69 -99 -233 -39 22 11 70 -90 -26 47 76 116 -63 -170
3954 -170 -160 -90 189 41 -106 -70 -263 -93 113 -230 163 48 -223 33 26 -60 -37 -49 -74 126 -40 91 -106
3977 -106 33 -138 -108 63 167 -136 24 67 -45 66 52 41 72 200 104 -38 -29 -19 -10 128 209 17 -156 13
4001 13 -144 -79 -64 -26 -177 -137 6 -77 36 138 -22 -177 57 49 159 51 149 -125 -111 76 50 43 -101 63
4025 63 -289 183 324 154 17 -8 -133 5 50 57 76 -102 -38 -290 118 425 -185 -29 -112 -159 5 327 102
4048 102 -220 -218 -138 13 262 238 -284 -310 66 91 275 200 -48 -234 -162 67 241 -52 -1 -290 -420 113 248
4071 248 111 -17 -444 -200 -24 281 194 -23 -190 -6 -107 210 361 -72 -219 -51 35 186 303 78 -306
4092 -306 -216 -80 230 118 138 -253 -428 -86 131 372 101 -302 -342 -74 88 187 -84 -141 -267 -210 146 161
4114 161 6 161 -233 -198 171 482 379 -20 -215 -166 -59 246 267 -253 -456 -88 -114 66 179 -38 -189
4135 -189 -373 35 123 261 -30 -288 -423 215 154 330 148 -228 -344 -190 416 159 22 -276 -328 -148 407
4156 407 312 -30 -183 -287 -110 29 192 57 -130 -295 -184 154 391 215 -218 -403 -78 71 120 140 45
4177 45 -269 -120 95 139 122 106 -167 -186 122 277 192 -12 -249 -316 34 249 183 -110 -139 -267 -326 21 126
4200 126 -172 -39 -194 -102 205 234 -115 -240 -67 37 21 372 147 -151 -142 53 55 376 85 -154 -160 -63 101
4223 101 149 222 -222 -317 -109 161 -13 67 -73 -276 -188 -57 91 135 -19 -79 -65 -18 255 260 -51 -20 -73 0 106
4248 106 222 131 -193 -202 -134 150 -60 31 -227 98 121 -44 120 75 -153 -125 19 216 150 15 164 -196 -120
4271 -120 111 54 87 -220 -28 -14 44 93 -72 95 60 -185 -122 -41 14 -81 -83 49 -66 141 103 -93 -141 12 -46
4296 -46 41 122 -70 -36 51 -62 134 101 54 -55 -101 -89 -2 -39 -1 -29 -135 6 102 39 -26 82 21 -28 70 -87
4322 -87 -19 -15 169 42 -117 133 32 -75 132 19 120 -73 -194 20 32 70 -48 -101 -2 -70 66 193 -50
4345 -50 -180 -118 -13 105 170 77 11 -108 -17 116 -21 -15 -97 -76 -62 57 80 -56 -101 45 -9 -120 139 -16 35
4370 35 -137 -53 74 56 31 45 -145 46 357 213 5 126 -264 60 -51 145 -5 58 -174 -95 -57 136 143
4393 143 23 -2 -184 -84 47 67 135 -189 -210 41 203 106 58 54 -42 44 72 79 8 -42 -41 -177 96 53 52 -31 -291
4420 -291 9 -62 177 -18 -56 -269 -97 -43 94 293 -54 -53 -21 -72 84 215 19 -8 -355 8 186 102 97 -141
4444 -141 -258 -147 263 300 56 78 -238 -180 78 345 47 -136 -35 -60 -94 193 -57 25 -114 -26 100 128 52
4467 52 14 -290 -60 -37 20 233 -77 -179 -33 131 284 57 -219 -179 -372 208 79 20 252 -43 -96 55
4489 55 201 206 131 13 -43 88 178 98 98 -26 -57 -207 107 252 205 88 27 -10 203 123 197 -108 -36 24 -21 22
4515 22 290 -100 -389 9 -108 48 84 28 -174 -201 158 270 177 156 -160 -54 110 161 219 150 -43 30 -70
4538 -70 161 113 -74 -75 44 25 248 120 -97 -28 -97 -67 -129 45 -60 43 -22 -27 -132 238 185 -44 74 -31
4562 -31 83 53 16 113 -38 -119 6 152 -131 84 -64 -90 -49 -35 -24 113 -130 -56 -3 -126 129 -113 9 -82
4586 -82 8 113 158 -10 -58 -50 -79 27 35 -52 -44 17 58 -103 28 173 -69 -122 81 -55 -172 39 -23 -131 -134 -11
4612 -11 125 -175 145 -79 -116 128 122 -66 124 -142 -48 75 128 94 -148 -89 -10 -23 125 64 -247 59 162 28
4636 28 104 102 139 46 106 -3 -150 -12 -28 -135 202 225 -198 -33 -3 64 -122 -76 95 19 -94 46 -38 -129 2
4661 2 101 -3 -52 108 -136 -18 235 -160 -74 233 -103 19 161 -24 -22 57 73 -41 -50 -155 38 8 43 60 -164
4686 -164 49 96 3 179 -8 27 -44 -11 -98 7 111 45 -159 -10 160 -22 -42 81 -164 52 115 -21 101
4709 101 -71 110 -78 -233 20 47 56 -39 -58 -37 -110 26 -40 -24 -80 -94 92 132 223 -207 13 15 -53 -140 35 -114
4735 -114 -110 26 4 51 -15 111 -168 -86 57 -23 -7 241 -116 14 -42 -72 -17 -59 5 -102 74 43 -42 0 83 -330
4761 -330 -134 70 132 -91 -37 -79 -48 -6 211 27 52 -293 -50 -129 -12 30 -44 -119 -105 -153 -96 124 2 -100
4785 -100 86 187 10 -58 143 23 45 -12 130 229 71 -30 -1 137 159 238 39 37 -45 -246 -34 164 -82
4808 -82 -40 -10 16 -59 104 77 70 22 -55 -1 158 21 -49 -74 -90 17 -99 -41 -95 -104 103 190 50 218 66 -9 -20
4835 -20 -233 96 160 59 -27 -181 -116 53 116 27 -229 -117 -92 45 -115 7 -10 -45 39 49 109 -18 -86 -100 -124
4860 -124 -46 -56 91 73 -100 104 99 -60 48 122 -138 -119 -97 58 -102 58 21 -125 -61 93 74 -121 -75 72
4884 72 -53 54 56 -49 71 -183 -36 54 -88 104 -159 -99 64 -14 -86 157 -170 52 -120 32 -30 -33 -110 -57
4908 -57 -96 32 75 -39 121 -32 -62 -8 -129 102 153 61 65 -30 105 50 -58 -198 -19 83 -173 7 13 94 1
4933 1 75 23 -63 -75 -165 37 53 40 12 -17 -66 89 37 -59 57 -65 -107 11 91 26 36 -24 29 -208 -65 -31 -20
4960 -20 15 -76 -43 -26 10 -47 72 -49 -59 -89 -49 38 -53 187 54 -87 18 -9 -16 84 42 -66 -52 -61 113 35 -45
4987 -45 -3 5 -78 -42 133 31 -107 -115 71 -19 87 136 74 -130 -153 -163 -57 11 -83 -174 -106 -93 7 117 34 -82
5013 -82 -56 141 -80 6 -53 -54 102 129 -68 0 57 20 -25 -42 110 55 -103 102 163 93 35 -91 56 -143 75
5038 75 -107 -197 -32 59 26 47 15 6 96 -122 49 179 199 5 82 40 204 103 -30 -12 -31 143 40 -23 112
5063 112 -11 -61 73 5 -175 -138 -143 -115 -5 -224 -17 46 -64 -101 29 -44 81 -8 14 -6 39 55 34 37 109 -163
5089 -163 86 -137 161 33 -66 51 -178 -17 91 51 -80 130 -161 40 23 5 -8 -37 38 62 5 37 -65
5112 -65 10 -10 69 31 143 -17 -74 50 125 37 3 -143 -61 -45 222 -35 -109 194 202 -41 -28 44 -56 52 15 -157
5138 -157 -111 -38 106 0 -71 124 -157 -121 23 -64 11 -73 -26 48 123 -2 68 -115 89 5 -115 71 34 -94
5162 -94 120 -84 -6 76 -32 21 -35 -142 -173 -96 103 163 -233 -68 22 90 -77 50 74 -41 30 -110 7 35
5186 35 94 -80 -53 66 -64 -79 -23 -22 2 119 -91 10 33 78 -135 -93 144 -29 121 -148 -131 -72 68 157 63
5211 63 76 -186 101 -46 -32 -10 -113 75 -157 -94 119 -28 -24 5 -112 26 -26 35 65 -24 -37 -186 -97 -80 -48
5236 -48 -56 17 -117 12 -50 92 -96 -147 -81 163 -34 176 84 -162 49 3 105 58 -77 29 52 -122 171 -91
5260 -91 -266 14 -114 -67 -42 -83 -93 -191 4 138 -96 126 -85 -212 -13 -82 -102 65 -93 192 -186 118 135
5283 135 -2 48 106 104 -107 79 70 -79 -8 -35 -7 103 111 -138 -165 30 -139 -89 104 -19 -87 1 123 1 69
5308 69 -111 45 39 116 -62 43 -90 -31 -51 104 -72 -103 126 -9 -170 -76 -45 -82 -6 -136 36 -53 149 76
5332 76 54 -169 -21 -38 -13 -101 20 171 68 17 -34 67 202 -145 -47 -52 -93 44 176 -27 -164 -48 -16 -39
5356 -39 -83 25 -114 -201 23 -15 -102 91 49 -23 1 -61 104 -25 -22 -44 -83 43 -165 -110 31 -52 1 8 7 -110 24
5383 24 53 38 120 22 142 -206 -30 85 -33 -145 -42 91 -10 -42 71 28 -48 4 16 20 24 -36 50 168 17
5408 17 18 -52 39 138 -4 18 -109 139 49 -36 -58 -44 37 -113 76 29 111 -32 -58 12 65 -108 33 -68 -102 151
5434 151 -265 -60 -171 -35 -24 36 84 85 11 -16 -191 157 162 -106 -15 -48 -52 74 71 -15 -9 -88 -75 112 -121 107 -71
5461 -71 -177 -184 -134 -111 137 47 111 118 -1 101 -27 238 244 -188 33 95 23 -15 22 -113 -46 -35 71 -45 -119 -82
5487 -82 -144 -36 164 -92 27 64 -29 -12 79 126 -188 -41 202 117 78 110 2 37 -171 10 53 -5 -40 -87 -75
5512 -75 14 -10 103 -49 5 68 36 -50 31 -38 -1 32 -74 -36 47 163 -82 -16 -69 -26 103 -72 66 21 -107 123
5538 123 100 -118 21 -53 -137 108 -78 52 -79 -43 -163 -6 130 106 -71 -51 -50 -11 99 68 -24 -45 -136 46
5562 46 -1 -157 30 -207 -128 -66 126 -206 -67 -51 60 -115 -56 48 3 -119 -13 26 -300 75 11 23 -44 -118
5586 -118 -2 21 184 -50 -169 -234 -7 -98 -60 -176 -47 58 23 205 70 -155 28 -56 89 42 78 -121 -223
5609 -223 79 -95 134 50 -192 -224 204 -207 24 -26 67 40 -87 -167 47 -46 -65 -42 -180 -55 -57 71 -49 121
5633 121 -129 228 97 -87 -4 53 -106 -53 139 114 -80 50 -24 -19 -33 -52 14 172 9 -33 16 -18 -40 10 -193
5658 -193 -131 -8 14 -29 -29 158 3 -103 117 45 -46 -14 3 129 33 47 -72 -24 -40 24 21 -13 -37 29 -78 -17 69
5685 69 78 -112 -36 35 -23 -32 56 -88 95 -76 71 63 -119 -57 -140 119 -31 -40 -181 76 12 -75 76 81 -116 -20 -46
5712 -46 -161 29 123 -33 75 149 109 -5 103 19 -102 -67 -156 113 190 82 -45 -152 68 99 -91 -93 -19 -132
5736 -132 106 -153 179 -57 -114 -64 -134 -122 69 174 -178 -72 -171 77 217 92 -95 -43 -89 63 31 54 -41
5759 -41 100 -19 -105 -11 189 -43 -13 144 190 203 -64 19 -186 -233 38 91 -60 62 -289 -56 -29 199 4
5782 4 -87 -192 -63 -76 67 21 -27 -36 -157 -132 192 132 -45 -22 1 142 -21 110 9 93 -43 130 -4 -40 23
5807 23 -130 -34 -48 46 67 120 14 -146 -317 4 74 -70 70 14 43 -5 -31 116 116 -109 169 -18 14 26 -22
5832 -22 16 -177 -153 36 195 -30 -18 1 79 21 35 -115 -132 -157 -77 104 -124 239 -224 -106 -7 69 48 13 14 -137
5858 -137 5 35 185 -104 113 -168 35 171 90 52 -26 -135 -13 87 -111 287 -30 -93 -194 -136 66 -49
5880 -49 -123 -153 57 56 51 20 36 -81 36 120 -36 212 62 -4 -25 -106 15 -57 148 4 11 -116 -87 191 117 -47
5906 -47 -160 -57 59 146 -47 73 49 114 -147 -68 59 -95 163 64 -50 211 61 -25 -15 -46 19 25 2 25 23
5931 23 -50 -48 30 107 -45 -273 -41 -132 -11 40 -89 -101 -175 10 -61 13 142 -28 -109 101 14 173 38 28 97
5956 97 -97 -52 52 -16 -112 105 -68 7 35 -106 33 -15 -162 10 -63 83 22 -50 23 -92 -52 -89 97 -40
5980 -40 -34 -112 31 34 -55 -77 47 -105 -55 8 10 88 -84 -90 112 -51 -106 -152 24 74 47 -49 0 -91 29 -156 -107 5
6008 5 -83 -9 -7 -256 -226 144 58 44 -40 32 139 -18 61 -8 297 146 14 68 3 -103 1 84 -69 -138 -13 -85
6034 -85 -160 127 -96 -122 -22 -150 -43 -76 -16 25 -124 1 60 20 45 9 99 23 5 82 36 -90 179 81 15 -1
6060 -1 57 -3 -192 -73 119 -79 104 62 33 -196 1 7 32 58 157 -129 53 54 83 33 23 54 -31 -50 149 72 -112
6087 -112 55 7 43 -132 76 4 52 67 56 29 20 113 -40 14 49 66 -44 -52 -88 43 29 117 49 -63 24 -178 121
6114 121 0 168 -14 101 -9 51 4 -93 61 -32 -67 92 40 131 119 -112 45 74 -106 -13 -129 -15 -84 -47
6138 -47 -52 -2 149 -154 -249 -21 74 69 98 -104 38 6 -67 37 32 143 -60 -60 14 100 3 49 1 -116 45 128 99
6165 99 7 -63 126 70 -131 151 1 -9 -98 -138 -21 124 22 51 -25 -63 120 76 102 -181 -7 107 32 78 79
6190 79 -19 -45 -31 59 1 -106 4 -3 69 -55 -73 33 19 -180 -64 10 195 -87 -104 -214 1 178 -28 116
6214 116 -54 -107 46 54 -73 140 13 -6 -105 -7 -101 17 236 35 -206 -89 25 -5 48 105 21 -79 112 54
6238 54 27 15 51 233 159 93 -66 -57 24 -111 121 63 90 43 15 -69 40 92 -60 94 -62 124 -89 16 -51
6263 -51 -51 21 -106 23 -25 75 -27 -49 -46 110 102 -230 76 -41 -96 137 -4 57 64 -184 59 25 -150 -132 187
6288 187 -91 -191 -66 -33 -80 11 -19 -240 59 25 115 -73 91 -140 102 -106 17 -6 30 -111 -67 -127 110
6311 110 62 -20 -47 -7 -43 128 -37 -86 70 -87 27 -77 5 110 -137 12 -4 86 -40 6 3 11 -27 53 -68
6336 -68 -102 -3 125 58 -128 109 37 18 54 50 -43 14 -91 -8 -6 -30 95 71 -75 20 -7 -9 185 -61 -22 52 -11 265
6364 265 -75 -39 28 72 -10 87 22 62 5 -117 79 41 4 -69 69 107 -122 -93 121 33 26 38 8 34 56 19 -69
6391 -69 -35 -42 117 -51 100 -23 -96 115 11 -121 58 32 23 77 -155 21 -77 175 -119 16 108 151 -78 87
6415 87 108 -213 -69 -100 183 -87 -94 -78 106 -132 -7 39 3 93 62 -18 -74 146 -35 -39 -100 113 35 -81 115
6440 115 41 64 -162 147 -9 -149 -128 97 100 113 59 112 132 -2 100 52 -84 -70 -95 -32 -15 171 281 -48 14
6465 14 -29 265 0 95 76 -109 -20 19 105 163 -19 -12 -119 21 183 182 81 46 -10 12 29 -56 76 -29 -4 92
6491 92 9 -24 7 -43 -53 -21 80 305 -208 96 -103 71 211 3 25 27 -194 33 49 -92 101 49 63 -64
6515 -64 -118 58 117 -26 -21 -154 27 -52 -4 49 25 -331 -30 93 30 58 -119 11 80 -63 4 95 -72 -121 -89
6540 -89 125 219 176 -42 -68 2 50 -2 49 8 -68 -111 37 -15 -66 65 -36 18 -17 -37 17 -52 -130 51 -1 43 15
6567 15 28 21 -6 11 150 -73 -93 -237 4 -128 -120 -7 -77 -271 -50 8 -152 66 -30 50 29 -180 84 60 -9
6592 -9 244 -46 -271 94 7 -27 -23 19 -41 -22 100 -65 -57 145 34 112 -116 -16 45 189 0 -32 73 -45 165
6617 165 -211 -34 -57 23 -119 -100 -123 184 -53 36 150 11 91 -56 -145 -60 -110 147 107 -86 -36 -7 64 101 -74
6642 -74 -15 -28 -147 47 270 79 165 -34 37 30 -54 -3 4 42 -210 -65 109 -146 -23 -22 -147 61 -6 43 -71
6667 -71 -15 -64 105 -133 162 5 20 62 83 2 18 -45 -42 28 -107 52 -80 13 79 20 -78 -81 69 -15 -39 22 -10
6694 -10 -125 -72 -59 202 136 8 -219 103 -111 4 1 -13 57 -109 -71 -86 -51 -70 -169 142 -66 -34 -90 -202 157
6719 157 157 40 -74 48 -71 17 109 -51 -43 57 97 10 146 -145 82 187 19 51 63 -133 -282 -25 -40 77
6743 77 -110 84 57 89 227 42 97 -53 -102 -141 23 -18 -100 21 -38 40 -85 -7 -106 -110 125 -28 12 63 -77
6768 -77 -234 110 -16 -32 224 -119 116 -169 61 193 -1 -12 40 -15 -42 -34 69 -64 -65 46 165 109 108 20 -158
6793 -158 33 16 270 272 54 216 -102 -90 46 -23 -65 -190 -157 -96 -71 -42 68 -233 -151 -122 -147 97 27 143 31
6818 31 -12 -20 105 -42 -39 50 -178 -33 139 -11 57 -38 -10 -24 -98 135 -92 49 -38 7 217 1 5 -67 9 -65
6844 -65 30 34 -124 7 -50 -82 71 -25 244 -15 -207 -179 -186 112 -18 -130 49 -91 25 123 98 -61 -107 92
6868 92 73 -19 170 63 -247 -74 -18 30 191 -3 -71 -123 314 -45 62 29 -66 -10 -122 199 46 286 -31
6891 -31 -82 42 183 110 -61 -70 -38 -9 87 80 148 -45 -42 -70 -75 -16 -61 -84 -28 -136 -52 -113 -128 124 28 -62 -8 126 117
6920 117 -227 -93 63 81 41 25 57 6 -274 -9 154 -103 -111 -68 -23 209 47 -182 78 -165 20 -46 179
6943 179 164 -89 10 -37 114 118 -67 -29 27 46 -175 -72 145 88 125 -116 156 -127 -219 -20 -135 -60 -7 29 144
6968 144 3 -172 155 -215 29 -39 -104 -6 -2 69 90 28 -104 -25 27 130 34 -30 10 121 -124 81 62 -42 60
6993 60 -44 70 15 67 59 151 62 174 -64 -63 50 25 252 13 -28 68 52 116 137 -78 -77 -48 13 -87 -33 68 123
7020 123 -47 126 113 -24 30 5 97 -317 182 57 89 -124 -38 -60 -46 40 -37 188 -89 193 139 102 -143 -5
7044 -5 -43 45 3 75 38 -22 -8 51 -52 -68 126 57 31 68 39 -95 13 -195 291 45 -101 42 35 -13 38 -103
7070 -103 -74 -83 9 -70 58 -69 -57 -141 33 172 -162 18 -117 83 -11 16 213 -5 -115 -80 52 62 -24 44
7094 44 -24 -22 -21 63 -138 85 -61 47 6 -115 -88 272 -69 -94 94 52 84 68 -17 14 -70 30 86 178 -5 -90
7120 -90 126 -99 -5 183 95 42 93 -9 -4 -48 40 -95 129 9 -167 -91 -7 -4 -42 -23 -223 15 108 -10 -18 -114
7146 -114 -11 -25 57 -34 -116 -59 63 4 106 102 -81 69 17 -117 51 239 -51 112 -107 70 100 71 13 -72
7170 -72 -4 -66 57 13 38 6 -112 2 -11 8 193 -3 -102 82 8 3 80 117 -1 -50 12 115 196 -18 -22 -117 64
7197 64 23 -89 37 -250 150 108 196 133 -94 -137 22 85 59 -29 58 -54 29 -43 26 -102 142 -148 -254 36
7221 36 78 38 51 -84 -101 13 151 -111 1 18 -179 -173 -20 -6 -84 46 19 -297 178 -94 48 -34 -42 126 130
7246 130 58 128 179 -88 26 -61 -13 1 -34 34 -33 50 48 -73 -44 -12 -91 136 -50 -114 -18 -98 74 86 70 -62 147
7273 147 16 15 -288 55 104 182 -31 -94 103 5 26 106 -11 -30 -94 80 -27 202 -149 -29 60 52 -62 -13 -7
7298 -7 -13 80 84 49 62 -53 -10 -104 -25 -29 114 47 -67 -97 20 -4 -86 104 35 61 85 -53 24 99 -135 -109 -56 120
7326 120 89 64 68 -69 95 -35 -80 6 -80 -107 -198 173 29 -45 -66 82 -33 -222 67 -55 131 14 -139 -18
7350 -18 19 49 -25 -195 103 6 -66 -118 49 -130 -31 72 -7 71 -158 127 -45 -118 9 102 60 -61 134 -133
7374 -133 102 68 17 -41 -73 -134 169 73 -73 47 -68 -45 104 -54 83 2 -132 210 54 28 123 -242 -78
7397 -78 1 46 39 -89 16 -78 6 29 22 27 -128 83 -142 188 -105 -53 -13 -191 -98 -140 -34 169 -80 -90 20 -35
7423 -35 -15 -144 1 -33 -40 -78 158 -44 244 -129 0 16 -16 -91 -24 152 42 -82 52 13 51 -152 51 90
7447 90 -67 -106 75 36 136 61 -18 -113 157 208 149 -106 -28 -64 -46 -63 -138 75 -47 21 38 -32 -253 -80 101
7472 101 -149 17 -18 76 -36 -18 14 98 29 24 -73 -44 -84 114 109 80 -70 -125 47 92 -2 50 -130 -50 58 -47
7498 -47 -72 -65 -126 11 -10 -106 -76 238 -101 -23 32 10 99 50 190 -63 108 32 80 101 127 -155 -17 18 71 53 114
7525 114 -330 73 -179 -131 -27 2 91 -20 91 -27 -12 24 -29 -18 -75 45 114 -13 -72 25 -118 19 -105 14
7549 14 155 -106 -122 -82 -69 -6 -6 -119 125 -94 -1 -97 -15 -77 -23 32 -47 10 21 -170 -2 -56 -28 56 -55 -18 -132
7576 -132 -9 132 -92 -94 13 -67 76 -74 2 55 -37 -74 21 65 -66 153 -77 -70 32 -96 -65 -73 -173 -23 -120
7601 -120 -45 -13 192 7 -152 11 62 33 -36 -32 6 12 40 -128 -33 -79 -148 170 -43 7 -19 -111 8 -17 79 -161
7627 -161 179 47 -36 -139 -34 -65 -55 -134 -38 128 -14 -90 -33 77 60 -17 56 -145 146 129 -97 21 -121 67
7651 67 -71 115 51 -58 -17 -153 -21 -136 68 -114 -34 -2 24 -66 60 -17 206 136 -100 -81 -31 27 79 80 7
7676 7 -17 29 -21 12 96 128 -86 -34 -78 1 100 64 -28 -63 -11 99 -102 53 91 38 -34 193 -43 -84 34 78 96
7703 96 -90 -48 58 49 -43 -23 -23 61 -37 6 30 39 66 -77 42 -15 13 145 47 125 -28 -26 21 181 31 31 -143 -16
7731 -16 184 52 214 85 -54 9 152 220 -31 5 118 118 -26 3 72 60 29 -14 99 -54 -189 -66 40 24
7755 24 -183 95 -12 4 118 -48 -32 44 -3 118 198 134 -103 -63 241 101 -86 -123 21 50 6 1 -16 111 211
7780 211 6 10 -14 32 20 -220 -5 -146 -36 -21 -26 -65 -79 97 95 32 -116 -123 125 4 59 93 -24 88 41 13
7806 13 46 170 104 -82 -5 24 120 -121 72 24 -64 62 161 164 -49 -51 -7 -76 -42 89 -22 131 107 -78 -16 -24 97
7833 97 -63 -26 -85 62 206 23 -91 -89 133 -59 199 -131 44 -123 162 -99 33 110 -148 -66 -26 13 -23
7856 -23 56 -250 44 -110 155 64 -12 -46 31 -82 87 -181 210 94 -108 -161 -55 39 -9 70 117 -177 -4 -41
7880 -41 -3 -152 76 -193 -12 164 71 -204 -201 78 20 117 -71 133 34 -23 56 -49 149 47 206 94 -114
7903 -114 183 -116 -19 -164 72 -114 68 4 -52 68 -96 -150 40 -27 -140 33 -62 71 28 -47 14 113 70 -72
7927 -72 -94 -31 149 65 20 63 -34 100 34 -21 -16 -215 10 194 111 161 -183 -1 7 -57 -96 -71 -104 69 2 -51 -56 -46
7955 -46 30 -84 -94 -49 14 100 137 28 -51 136 -183 -111 -3 -57 -4 -104 36 59 -7 50 -92 -40 99 -67 18
7980 18 -35 -23 0 -115 92 -158 -80 63 -129 -24 -38 181 -81 129 -17 -27 125 74 25 184 74 140 97 -160
8004 -160 -12 -181 106 21 145 -42 -58 175 -106 -63 83 -64 207 104 57 -28 -131 15 67 41 80 55 -26
8027 -26 -38 -70 -149 -59 28 -9 56 -34 73 -39 -13 3 40 5 -122 11 10 -26 44 -135 38 -136 -168 -148 -3 -104
8053 -104 -29 34 117 -53 -85 -124 -99 -85 -47 -155 33 93 -7 19 -134 54 -285 -241 -23 -36 40 -65 53 -96
8077 -96 -46 -1 74 192 33 130 49 -46 -60 -62 59 -87 -75 -15 173 30 74 181 -191 0 27 -47 -142 -151 -106 -91 -87
8104 -87 -147 -67 -136 54 17 -21 -50 -22 22 12 -179 53 61 28 44 -30 -47 13 11 112 92 91 63 -45 -60 -93 -33 -162 -136
8133 -136 -22 2 142 13 -95 -46 -43 31 73 103 6 -99 51 -9 -22 160 221 -52 -15 167 95 147 -6 78 5
8158 5 36 23 85 53 6 94 117 18 19 7 -188 30 110 -37 -109 -40 46 206 114 -122 -35 22 -31 -4 23 67 73 -80 39
8187 39 -72 66 3 -42
8191d2
$$ Imaginary data points
##PAGE= N=2
##DATA TABLE= (X++(I..I)), XYDATA
0 0 0 0 0 0 0 0 0 0 0 0 8 -8 8 -8 16 -16 24 -24 32 -40 48 -56 69 -80 96 -112 128 -150 171 -198 225 -257
32 -257 293 -331 374 -421 474 -531 592 -662 736 -817 909 -1005 1113 -1229 1357 -1495 1647
49 1647 -1815 1999 -2204 2429 -2679 2960 -3276 3636 -4049 4526 -5088 5765 -6590 7625 -8970
64 -8970 10794 -13419 17541 -24979 42622 -174279 -15755 244782 -86033 110101 147983
75 147983 -240738 -167060 206502 49621 -11152 114520 -101681 -208196 88404 76369 -43384
86 -43384 95467 33009 -139850 39648 106772 -61244 -31496 36830 -53039 -11089 65731
97 65731 -7774 -49995 -20518 -7673 62550 72228 -29582 -43304 -39671 -84277 35787 127232
109 127232 -5542 -45289 -1659 -80827 -16640 141044 46450 -53019 8632 -65170 -102564
120 -102564 95962 108525 -53881 5546 20577 -117309 -3018 132693 -13278 -49890 35194
131 35194 -58565 -67555 84756 45538 -51486 19217 8943 -65550 29270 65423 -54195 -33524
143 -33524 39693 -22271 -11922 65056 -2520 -65261 9847 43057 -191 12778 16774 -53463
155 -53463 -50540 36576 46974 8076 3831 -23949 -54601 -1428 58952 29339 -14501 -18871 -42049
168 -42049 -34408 43413 53315 -9251 -16237 -14026 -32946 9596 50684 8103 -26781 -9076 -8345
181 -8345 -7973 26394 22592 -17582 -12516 5406 1006 7244 6834 -8777 -11807 -2711 12892 11871
195 11871 -8643 -8006 -2193 -9478 7810 22817 -7223 -21721 1952 -2006 -10120 24437 16689
208 16689 -28332 -4238 14952 -19050 6103 33697 -16409 -19304 19674 -8290 -16165 29818
220 29818 9471 -27486 9757 10746 -27296 9537 27046 -22165 -6969 19510 -19447 -10221 25938
233 25938 -4659 -16808 13906 -1482 -18259 13125 10899 -16376 3905 10026 -14996 1881
245 1881 14402 -8556 -267 10464 -7883 -3037 8708 -1856 -1659 6039 -3043 -6079 5129 1974
259 1974 -2699 5193 -2440 -10480 3981 3073 -4691 5114 -2600 -12216 3918 8141 -192 3387 -631
274 -631 -12394 -2785 11899 4593 -1636 1246 -9861 -7685 15083 12108 -698 20 -9487 -11944
288 -11944 7146 12768 722 -5781 -7908 -9366 2213 16566 7067 -7446 -6922 -8812 -2484 12588
302 12588 6648 -6867 -8725 -6670 2351 12750 10921 -1929 -11640 -7077 1945 8516 10854 -1297
316 -1297 -13227 -7485 2223 11170 13624 550 -11789 -12372 -3627 8710 9949 1399 -9095 -13957
330 -13957 -2682 10695 12241 5433 -7628 -14778 -6691 5553 12180 5669 -6505 -10263 -6023 7009
344 7009 16713 7715 -4916 -11813 -11138 2349 12791 8367 -2743 -11915 -8326 3928 13448 12925
358 12925 -2131 -14377 -12783 -3617 9704 11967 -1532 -10410 -11166 -1941 14256 14755 1810 -9155
372 -9155 -14984 -6985 8775 14061 4166 -8134 -10058 -4573 7331 19206 7617 -11092 -11041 -8260
386 -8260 -420 15361 9221 -9146 -10681 -3344 2589 11823 12866 -6582 -18692 -5815 2239 4986
400 4986 12135 -1038 -17445 -5311 8591 9883 10942 1691 -15787 -15232 4170 12645 7956 3500
414 3500 -8218 -16648 947 16491 11669 3197 -8176 -16530 -9795 6863 15009 4477 -7233
427 -7233 -8575 -8542 1936 15804 8722 -7047 -10481 -6524 -2165 6311 12027 -1521 -12624 120
441 120 6268 2404 9957 2511 -15894 -6016 9742 4857 1989 3250 -10694 -14212 10502 16538
455 16538 -981 -688 -5567 -20625 -792 21133 5501 -5654 -3233 -13849 -11009 16738 18573
468 18573 -4713 -6245 -4816 -14552 4153 22621 3043 -8010 -1896 -7755 -3973 13449 10657
481 10657 -6074 -6410 -1246 -4236 2419 10012 -1833 -7854 -123 1045 660 1641 -1233 -4812 -4553
496 -4553 4233 8383 -2361 -5716 -1197 -4510 1228 14421 5406 -11331 -6052 551 -4029 10090
510 10090 18584 -8470 -15103 3397 -4692 -1266 22406 3750 -20613 -2158 1774 -10857 11480
523 11480 19049 -14627 -12229 9470 -9156 -6125 22331 242 -17351 8471 1686 -14625 9622
536 9622 12369 -11296 749 11645 -10315 -6408 12372 -2776 -5204 13657 -234 -12538 2522
549 2522 265 -4810 8030 6551 -5422 -6086 -3960 -2177 3866 6479 2334 -2210 -7750 -6843 4674
564 4674 5381 642 7330 -2030 -13995 2897 6798 -4894 8427 9762 -13179 -5468 9265 -6541
578 -6541 -2797 17448 -598 -14721 6492 -432 -15139 11715 13855 -12842 -1196 5321 -15536
591 -15536 -2087 18097 -697 -7026 6548 -6730 -13235 11757 10584 -7009 3485 2852 -13292
604 -13292 305 11338 -1476 -664 5373 -4528 -5986 4064 2510 -3085 3083 3365 -4932 -1964
618 -1964 463 -4280 -239 4966 2163 -1170 -3360 -3662 -2583 1400 7846 4276 -4511 -4531 -3562 -1621
634 -1621 6284 9501 1653 -6333 -4831 -1673 492 8205 7400 -5403 -7016 -1824 -1483 3748 7873
649 7873 270 -7480 -4162 1363 -111 2005 4482 -4995 -6679 4006 2404 -2094 2549 236 -5920
664 -5920 1430 8272 -1392 -4951 2709 -2463 -3381 11110 4808 -9453 -854 1072 -5315 6298 10059
679 10059 -6492 -8516 1799 -2423 -542 11821 753 -12167 -355 963 -4169 8567 5520
692 5520 -9883 -3605 3280 -1738 3773 7517 -4363 -6301 3509 1201 39 5951 -2212 -7131 3366
707 3366 2717 -237 4676 -2508 -7483 1856 3313 324 2749 -2152 -8473 -483 5772 522 2005
722 2005 1514 -9591 -3437 8128 1021 568 4366 -7586 -6085 7605 3969 -847 3693 -2602 -8316
737 -8316 3714 7512 -2676 387 1950 -8555 -309 9386 -2183 -3024 2544 -5737 -3429 7558
751 7558 1395 -4962 342 -1245 -4157 4987 5367 -4952 -1314 1458 -4023 2757 6751 -3171 -2640
766 -2640 1691 -1941 1482 5879 -715 -4445 353 525 -544 4177 723 -5996 -1057 1669 -1025
781 -1025 3601 1554 -5989 -2128 1618 139 2725 2117 -3861 -4121 1416 2469 1307 3349 -1270 -5097
797 -5097 1313 2853 616 3191 -308 -4463 216 2089 574 1164 -8 -2742 -1887 1965 1166 -956
813 -956 279 -1978 -2791 2184 1185 -1020 528 -1507 -1705 1782 1579 152 -537 -971 -386 828 2357
830 2357 951 -1233 -237 -462 499 2589 263 -1108 -909 -1392 974 1639 224 -683 -2314 -1432 1143
847 1143 1054 637 -582 -2596 -1560 191 1820 1033 -543 -511 -1701 -138 3146 808 80 959 -1962
864 -1962 -365 2552 528 -173 604 -876 -798 1135 1255 -1196 -662 480 -1764 159 1551 -2273 -934
881 -934 939 -1979 513 2156 -1816 -961 1017 -542 -50 2160 336 -1934 1032 870 -1707 2626
897 2626 1879 -2813 1136 1369 -2688 1406 2214 -2418 -257 1206 -1971 -1028 2307 -778 -2431 1885
913 1885 -393 -3109 2334 832 -3431 2113 1505 -2868 1105 1660 -1715 528 2300 -571 -634 1760
929 1760 -30 -1144 2192 453 -1562 1578 -295 -1696 1317 -342 -915 1164 -718 -1378 -211 -1139
945 -1139 -671 1140 836 -857 -692 -747 -1661 1355 2757 -1041 -75 385 -2909 868 3825 231 31
962 31 968 -2009 -1445 2253 2034 -656 -53 161 -2604 -314 2368 -510 -472 398 -1467 -763 314 269
980 269 -318 -908 690 400 -1167 965 159 -1892 1418 2424 -510 -285 766 -1670 -1643 3636 2641
997 2641 -2517 878 -1 -4734 1981 4778 -1914 -1044 526 -4195 -1600 4807 997 -2545 446 -1755
1013 -1755 -4166 3430 3882 -2719 607 469 -4099 1519 4073 -1002 42 824 -2061 -104 2654 89
1029 89 -536 1093 -1261 -1017 2721 -755 -2178 2217 -1323 -1751 3568 -1400 -3618 1782 -782 -1423
1045 -1423 4279 454 -4853 100 1322 -2614 3854 5555 -5300 -2819 3914 -3286 901 8565 -2562
1060 -2562 -6058 2506 -1291 -2415 7480 2812 -6522 -575 1363 -4850 3057 6895 -5152 -3645 3054
1075 3054 -4164 -1584 6520 -843 -3850 2478 -159 -2774 2566 1683 -3053 1139 2675 -2010 658
1090 658 1709 -2856 938 3225 -703 736 -378 -3895 4 2023 370 2166 14 -5262 -2090
1105 -2090 2787 -39 990 4210 -4172 -6521 3340 1529 -1654 5364 421 -7316 501 3476 -1047
1120 -1047 3030 3657 -4857 -2913 4207 -162 -763 5151 -1632 -5809 3504 1661 -3672 2572 1366
1135 1366 -4971 67 3624 -1753 -1742 1967 -1285 -2264 3399 752 -3241 323 26 -1113 2822 2245
1151 2245 -1502 -1446 -495 86 1510 2508 923 -2352 -2199 -161 1373 2583 1027 -1231 -2573 -2690 968
1168 968 2666 236 191 -1700 -3702 378 2445 498 720 131 -2508 -1519 2245 1489 -1415 1065 623
1185 623 -2546 1617 2804 -2202 -677 1873 -617 -73 2007 -639 -2681 120 1621 -626 1037
1200 1037 931 -3504 -1735 1660 -30 707 1396 -2095 -2575 262 1576 785 912 748 -2155 -1201 2053
1217 2053 1089 556 1153 -973 -1023 313 922 943 -316 -302 -217 -803 571 545 -1029 -285 -325 -542 70 71 -66
1238 -66 -1115 -622 1253 -225 -312 824 -1024 -646 1370 487 -84 360 63 -400 107 1503 80 -646
1256 -646 787 -587 -678 1595 -141 -1115 302 -175 -582 197 91 -719 -862 494 43 -927 384 -322
1274 -322 -870 1117 750 -291 130 -363 -28 564 821 539 -505 -137 248 88 1103 547 -915 -429
1292 -429 -416 -18 842 -119 -483 -1003 -974 589 497 191 -122 -1137 -593 324 735 800 -606 -1121 -263 263
1312 263 1491 1492 -469 -1003 -752 167 1495 1170 -80 -983 -1443 362 931 820 757 -1664 -1495 83 390
1331 390 1066 260 -1419 -1249 -306 1021 1086 -415 -781 -1360 -388 1877 1331 183 -464 -1674 -229 2030
1349 2030 1633 626 -837 -1607 -719 1040 2050 811 -1100 -1287 -1522 122 2134 438 -880 -1449
1365 -1449 -1798 286 1559 772 -395 -1589 -937 416 1477 1783 -532 -1770 -811 115 1931 2264 -393
1382 -393 -1461 -1343 -34 2558 1928 -275 -1556 -2389 -735 1482 2184 437 -1973 -1753 -861 178 2463
1399 2463 967 -1824 -1194 -995 -148 2119 1267 -960 -947 -369 407 1122 1502 -401 -2039 264 1120 569
1417 569 1640 -251 -2503 -321 1159 898 795 -423 -1830 -1832 653 2011 310 -440 -1461 -2323 168
1434 168 2204 1350 -140 -1493 -1728 -433 1367 2788 162 -1672 -574 -651 759 3171 912 -1936
1450 -1936 -1443 -308 199 1637 2236 -1230 -2883 185 302 -430 2327 153 -3384 -678 901 -730
1466 -730 1042 1293 -1530 -1740 1116 873 -671 1483 49 -2028 1078 1722 -492 135 134 -1175 295
1483 295 1568 727 -866 -1074 -413 -402 904 1523 -597 -1913 -1639 301 839 728 1254 -842 -3340 371
1501 371 1460 -134 1877 1006 -3112 -1019 2334 398 -40 2411 -777 -3486 1740 1968 -2146 1786
1517 1786 1899 -3979 -205 2943 -1963 -871 2687 -1572 -2520 2366 386 -3102 1476 1569 -3208 883
1533 883 2610 -2781 -629 2320 -963 -271 2436 -332 -1982 656 1040 -246 1252 1217 -1781 -1137
1549 -1137 253 138 1055 623 -351 -869 -1744 69 1895 -280 -143 683 -2208 -1631 2222 608 -1358
1566 -1358 1568 530 -3015 598 2848 -2246 183 3499 -2518 -1909 3231 -870 -2285 3712 954
1581 954 -3638 1052 1592 -3572 527 4061 -2521 -1935 2711 -2343 -2555 3586 658 -2584 1307 441
1597 441 -2891 418 2799 -999 -571 1864 -1400 -2001 2198 954 -1015 1273 434 -1326 -516 1116
1613 1116 530 -588 651 560 -1551 -785 821 -302 -471 1136 53 -2132 -870 1074 -689 221
1629 221 2508 -1242 -2520 1315 282 -872 2618 1475 -2684 -720 1625 -539 357 3060 -812
1644 -812 -3223 1400 530 -1674 2033 1202 -2643 -627 1375 -988 -626 1620 -358 -2197 1192 797
1660 797 -2089 405 1288 -1739 59 2127 -612 -1420 702 392 -738 1538 1830 -1730 -1187 1102
1676 1102 -356 396 2393 -467 -2435 -437 466 26 1172 1403 -2117 -2325 671 462 271 1731 -818
1693 -818 -2608 -266 968 716 807 443 -1241 -1478 1146 1654 -154 219 -55 -1266 374 1592 469
1710 469 -731 -642 -290 -309 742 1534 -1217 -1806 94 -111 291 1633 -272 -2434 -756 964 525 753
1728 753 900 -1701 -2263 1190 1403 388 1572 -738 -2763 182 1912 956 682 144 -2167 -1609 1957
1745 1957 1618 -327 379 -1516 -2330 1252 1882 -18 -404 -1232 -1620 71 1764 823 -586 -744 -864
1762 -864 -154 1822 1150 -394 -684 -1112 -47 1924 1031 56 -916 -1451 177 1234 1181 -145 -1072 -1389
1780 -1389 -495 1188 1511 -431 -1002 -1053 -1348 1159 2097 -270 -960 -885 -1246 749 2097 496 -1081 -883
1798 -883 -636 194 1995 1598 -1121 -1244 -329 -149 1640 1647 -962 -1270 -711 -278 1105 1201 -459 -1876 -1143
1817 -1143 35 701 1369 250 -1870 -967 154 604 1532 320 -1416 -833 -281 982 1356 468 -633
1834 -633 -1069 -214 930 1076 971 -820 -1519 -99 394 888 1089 -821 -1445 -357 -77 805 797 -403 -1136
1853 -1136 -544 317 750 566 95 -979 -855 660 740 973 408 -976 -652 568 632 984 74 -768 -799
1872 -799 -135 794 667 -65 -400 -979 -237 683 272 155 -463 -1224 -80 307 474 418 -591 -509 216 70
1892 70 797 487 -198 -327 24 441 560 388 456 -721 -292 912 37 116 449 -757 -601 374 69 -59
1912 -59 -106 -174 -820 -267 502 -338 -269 501 -631 -356 743 -75 -145 277 -100 4 109 289 -145 -7 555
1933 555 81 -151 261 -143 -100 356 38 72 -295 -498 29 -48 38 446 -759 -770 287 -111 -171 396 67
1954 67 -629 -16 818 -19 -368 798 -446 -603 1395 283 -706 502 -14 -576 708 1026 -506 -807
1972 -807 448 -208 -344 1449 -54 -1834 -127 -39 -525 1056 923 -954 -1326 127 344 284 1296 230
1990 230 -1828 -273 852 306 1032 653 -1168 -1191 190 862 435 355 62 -1272 -585 1184 203 -461
2008 -461 -61 -881 -675 674 1153 -485 -1343 25 -53 -20 1465 241 -1758 -554 601 149 1081 947
2026 947 -1398 -1745 684 1557 348 1145 -137 -2730 -557 1854 604 393 422 -1803 -2028 1003 1780
2043 1780 -80 132 -222 -2452 -363 2379 451 -520 233 -1332 -1128 1557 1614 -536 -690 445 -785
2060 -785 302 2259 91 -1730 390 240 33 1504 563 -1797 -1437 594 756 163 764 -1207 -2548
2077 -2548 241 1638 563 405 -322 -2173 -1063 1505 2087 144 -420 -1130 -1911 340 2767 1022
2093 1022 -500 -429 -1273 -671 1605 1889 -588 -1151 -203 -783 -43 1983 9 -1763 -164 110 -621 723
2111 723 674 -1507 -1279 1307 785 -352 933 -460 -2220 847 1995 151 172 -48 -1794 -812 2284
2128 2284 1529 -686 -278 -800 -2007 1018 2772 -356 -924 -535 -1796 -492 2152 1164 -1087 -1003 -425
2145 -425 -895 786 1922 -324 -1165 -129 -319 175 1378 361 -957 -585 547 300 135 619 -422
2162 -422 -1169 422 918 -14 62 -196 -829 -465 730 1171 -751 -753 -299 -943 441 1603 -223 -1152 -270
2181 -270 -454 -2 1497 1080 -1014 -941 506 -466 500 2051 -410 -1504 471 -9 -236 1420 446 -1439
2199 -1439 -756 635 -62 37 921 -684 -1428 729 60 -481 575 -84 -929 142 642 -332 -81 382
2217 382 -223 -458 821 483 -527 88 -37 -220 369 622 125 -186 -471 232 60 136 301 -356 -587 -39
2237 -39 60 -114 76 91 -427 -810 236 170 -372 449 63 -848 295 369 -350 188 557 -305 -116 579 172
2258 172 -441 433 287 -591 369 189 -781 32 291 -225 54 162 -373 -441 96 195 -364 -14 157 -462 117
2279 117 459 -232 100 182 -157 271 109 292 -21 -71 333 83 -53 312 -182 -291 103 -20 98 -129 -293
2300 -293 -117 -265 175 385 -324 -45 -70 -500 232 441 96 -218 -285 -63 -14 226 583 -206 -342 115 -119
2321 -119 381 498 -9 -376 -337 -74 465 123 -125 -415 -596 4 307 -14 35 -415 -634 3 228 490 -107
2342 -107 -216 -276 -255 379 776 -142 -55 -223 -421 498 688 163 -269 -321 -214 94 328 489 -375 -425 -172 -202
2364 -202 483 480 -595 -573 -367 -223 477 511 -85 -646 -437 127 249 543 374 -541 -223 55 311 586 157
2385 157 -457 -359 -10 239 611 116 -477 -535 -350 402 556 290 -403 -866 -189 192 557 624 -538 -726 -157
2406 -157 27 662 727 -373 -700 -467 258 448 601 277 -779 -719 435 307 489 530 -796 -685 178 351
2426 351 258 93 -442 -887 -221 485 312 -18 -341 -773 -540 734 473 199 -154 -568 -171 485 785 461
2446 461 -386 -351 -135 23 651 758 -312 -564 -280 -22 428 405 154 -940 -670 325 -66 124 343 -624
2466 -624 -505 251 386 188 16 -253 -882 -101 1028 216 -230 255 -548 -283 1142 531 -93 111 -368
2485 -368 -561 336 810 171 -689 -203 -372 -496 780 441 -486 -471 -241 -354 199 563 303 -554 -211 304
2505 304 -119 251 745 -493 -362 592 325 -121 378 30 -604 5 1018 -184 -382 561 -390 -584 757
2524 757 263 -837 -21 -6 -529 196 709 -288 -781 206 -177 -561 734 634 -680 -115 198 -412 181
2543 181 844 102 -502 -5 174 -454 526 785 -524 -375 260 -298 -230 499 48 -495 -326 218 -498 -221
2563 -221 626 -285 -583 469 -74 -486 444 343 -632 57 610 13 -543 803 -9 -640 844 470 -666
2582 -666 212 424 -488 22 710 -139 -776 229 -33 -793 495 485 -888 -106 283 -579 -31 741 19
2601 19 -405 -28 266 -380 227 951 -355 -476 330 -252 -79 650 310 -270 -107 64 -268 -356 688 -70
2621 -70 -803 175 189 -657 147 504 -478 -355 463 -13 -588 390 207 -658 493 673 -803 60 812 -342
2641 -342 -200 876 -36 -583 316 314 -676 299 872 -611 -332 348 -413 -253 618 -4 -517 -375 -68 -296
2661 -296 46 675 -234 -540 282 -302 -90 767 225 -239 -98 56 -61 132 541 395 -554 -156 167 -315
2681 -315 265 238 -191 -550 111 -120 -392 121 236 -640 -143 538 -394 -185 417 -302 -394 324 382 -339 -133
2702 -133 219 -235 65 1037 96 -393 304 -220 -144 707 534 -567 -291 -124 -84 82 637 -255 -880 -196
2722 -196 -187 -174 610 222 -571 -450 52 137 198 325 -40 -503 68 244 34 269 223 -372 22 386 350 134
2744 134 -104 -424 -356 -112 550 301 -351 -257 -610 -98 585 408 -330 -553 -320 -16 173 395 101 -667 -382
2765 -382 -73 371 621 243 -311 -353 71 543 548 274 -7 -790 -242 558 186 267 -202 -844 -477 346 454
2786 454 365 -216 -553 -578 23 808 20 -171 -457 -560 152 897 373 -147 -273 -411 136 659 612 103 -539
2807 -539 -362 -58 199 672 -74 -559 -414 -245 509 525 37 -431 -607 -163 218 391 214 -496 -689 -90
2827 -90 161 581 385 -436 -448 -85 225 697 419 -284 -534 -351 215 628 392 -59 -697 -267 159 204 600
2848 600 -45 -799 -266 66 228 478 -69 -589 -431 -104 352 252 169 -189 -602 201 553 230 383 -212
2868 -212 -493 54 303 505 267 -209 -395 -432 283 445 152 -141 -347 -488 216 362 -146 -49 -397 -449 -39
2889 -39 270 186 -214 -330 -232 25 310 412 -66 -94 -145 -72 445 321 -28 -161 -334 -46 408 92 -132 -226
2911 -226 -247 -49 97 212 -55 -267 -267 -229 106 365 -191 -319 -23 -269 30 300 -83 -48 -6 -61 -55 190 299
2934 299 -96 -262 36 -135 4 270 -109 -258 -10 32 -57 114 69 -15 -277 -90 -61 -7 256 12 -287 -42
2956 -42 97 39 150 8 -36 -99 45 46 -75 287 263 -322 -147 58 -154 -79 261 -26 -195 -223 81 -262 -153
2979 -153 382 -387 -20 192 -236 14 178 -332 -232 17 257 -32 -14 167 -293 -177 337 151 -32 159
2999 159 -168 -142 187 455 32 -278 -201 66 -196 447 65 -497 -328 -239 -194 308 284 -22 -385 -395 126 117 360
3022 360 246 -284 -324 227 172 235 213 -104 -275 15 229 215 -280 118 -355 -412 431 345 -310 34 -187 -265 332
3045 332 489 -122 -519 -35 -295 -98 640 194 -602 -391 -177 -114 595 494 -355 -458 -115 323 262 550 248
3066 248 -762 -281 320 173 339 84 -346 -502 -127 388 210 -159 -20 -517 -194 650 255 -65 -13 -264
3086 -264 -417 243 686 -141 -373 3 -11 2 717 418 -683 -167 90 39 492 480 -397 -573 -259 395 143
3107 143 362 167 -701 -387 190 290 379 290 -532 -625 107 421 118 -65 65 -547 -171 749 189 100 28 -259
3129 -259 -515 348 573 -55 -250 -75 -280 -19 527 46 -760 -144 -7 -69 391 390 -349 -543 252 330 208
3150 208 364 -136 -763 -35 499 248 531 180 -593 -396 130 453 120 -34 -75 -491 -17 650 2 -45 -177
3171 -177 -564 -200 267 123 135 -184 -178 -103 188 519 36 -247 -284 -1 88 542 150 -109 -507 -11 359 23
3193 23 352 109 -494 -30 365 100 117 -68 -459 -400 170 320 88 -20 -203 -561 87 476 -97 -264 23
3214 23 -284 -53 385 79 59 -151 -29 -200 -48 484 -240 -233 86 -161 61 413 170 -79 -312 -73 191
3235 191 59 12 -116 -414 3 182 -13 215 -87 -268 -71 167 251 -17 -144 -103 -50 32 470 117 36 63
3257 63 -12 -31 253 187 -98 -168 18 42 40 215 -340 -244 2 -68 -8 95 -33 -75 -255 15 77 59 140 23 -107
3282 -107 64 160 31 181 -97 23 37 6 418 115 -144 49 -208 121 181 -250 59 -43 -92 52 -107 -83
3304 -83 -79 -150 -44 -25 36 45 -157 -325 38 -194 -11 129 47 133 104 125 8 -76 95 -94 -70 110 6 -169 40
3329 40 -99 -67 119 -141 -7 -108 -139 -30 89 -44 -6 -151 -127 104 39 -2 -152 -71 155 -191 189 209 -53
3352 -53 95 115 68 153 -74 -20 -92 -90 182 -2 -76 -114 -375 65 -69 -41 109 -161 -91 118 -142 -54 -161 -140 34
3377 34 46 39 235 -27 179 174 -76 83 124 -46 22 -74 0 189 19 36 -141 -163 -184 -14 102 130 -383 -303 -119
3402 -119 -69 170 -90 -72 -88 -201 166 170 -130 -103 -11 -15 200 29 40 -74 -60 -14 130 225 85 -266 50 159
3426 159 -54 367 208 -244 -221 -179 38 172 -12 -212 -339 -111 106 162 181 22 -329 -78 35 179 158 140
3448 140 -59 -195 192 273 78 -97 -163 -166 -4 248 158 -88 -107 -317 -89 0 288 -7 -371 -157 -51 110
3470 110 281 127 -70 -138 -253 245 114 62 -50 -265 82 293 27 190 33 -372 -53 197 118 35 -104
3491 -104 -266 -286 21 188 48 -213 -270 -375 6 212 68 -146 -121 -112 54 98 187 -57 -380 -142 97 52 323
3514 323 -58 -135 -132 26 102 84 -15 129 -167 -98 394 59 50 -70 -306 -262 306 105 -87 -162 -135 -108 146 388
3538 388 -26 -312 83 17 86 255 110 15 -49 31 226 95 79 -115 -208 -36 -120 -50 60 105 -304 74 46 135
3562 135 -123 96 -322 -246 80 149 123 94 32 -313 235 106 95 -108 -27 174 -6 149 243 -165 -213 53 -150
3585 -150 -6 258 -15 -220 -9 84 103 -29 38 24 -222 -42 -6 52 138 -21 -191 106 138 131 33 -60 63 -142
3609 -142 -172 -3 28 25 225 60 8 -83 2 -64 -50 131 -19 -49 129 -10 -139 4 -130 17 117 -161 38
3632 38 111 56 137 7 198 75 -124 62 -62 -267 204 16 -29 10 3 -58 -36 216 98 -148 76 190 -99
3655 -99 176 80 -384 -58 15 -28 101 54 -84 6 -6 73 -49 136 149 -32 -183 -4 94 123 101 -116 -255 -26
3679 -26 80 25 46 91 -264 -210 -10 225 -45 -136 -311 -116 43 122 165 -327 -179 -71 12 125 309 -179 -231
3702 -231 54 48 -20 172 105 -458 -65 167 272 177 -162 -222 -245 15 236 212 48 -78 -212 -149 448 65 -95
3725 -95 -246 -425 -133 157 97 22 -48 -161 -19 15 412 204 -231 -95 -110 158 216 169 -48 -213 -221 270 391
3748 391 236 83 -408 -194 13 79 256 11 -279 -306 11 181 248 43 -153 -348 -12 385 227 -49 -174
3769 -174 -217 -88 358 165 158 -148 -308 32 335 235 90 -295 -127 -51 60 339 155 -120 -364 -40 23 193
3791 193 84 -137 -247 -132 297 390 270 -170 -382 -220 240 204 246 -97 -220 -169 45 405 255 24 -226
3812 -226 -258 50 285 63 -52 -277 -411 92 328 164 45 -400 -402 25 99 423 179 -139 -246 -255 182 376
3834 376 401 -266 -307 -196 244 329 175 -202 -335 -173 130 335 31 -291 -390 -54 -124 272 235 -104 -305 -298 26
3857 26 319 305 82 -139 -310 189 282 183 -6 -329 -185 -28 238 432 7 -51 -332 -119 240 241 83 -416
3879 -416 -421 -269 160 205 20 5 -372 20 158 312 47 -167 -203 -111 73 147 234 -195 -254 -133 125 321 55
3902 55 -176 -57 -63 -92 230 130 -92 -112 -154 37 241 171 -103 -111 5 -254 66 101 50 -49 -173 -89 189 195 100
3927 100 -12 -111 -42 101 224 -112 -74 -18 -39 131 321 -43 -105 -96 -270 252 26 14 -135 -88 -45 34 49 20 219
3952 219 -95 -96 -85 56 64 -8 -88 22 72 45 10 -22 -80 -147 115 92 -80 99 -17 -48 -9 15 -78 -37 -44 182 -29
3979 -29 4 28 -18 -98 84 102 70 174 27 -73 46 -99 -225 -5 138 154 12 256 21 -7 -71 8 108 27
4003 27 223 -24 -88 -24 79 172 87 -104 -199 60 72 -7 1 -108 -88 -73 -22 -60 -46 -16 22 -95 60 213 50 -36
4029 -36 -36 -33 90 248 86 -171 -45 45 24 153 76 7 -173 117 -35 94 276 -102 -199 -173 211 72 143 60
4053 60 -66 -177 37 217 179 -58 -231 -209 27 388 232 -17 -206 -260 -183 143 152 164 -186 -179 -225 -83 249 173
4077 173 -121 -419 -76 82 315 101 -329 -313 -32 -73 279 204 -333 -148 2 229 337 -19 51 -251 -346 233
4099 233 373 18 -53 -309 -398 -22 424 199 -159 -302 -150 -243 105 390 -202 -201 -311 -212 219 316 123 -163
4121 -163 -256 48 36 249 235 -265 -474 -50 172 236 123 -159 -286 -26 239 336 61 -26 -404 -218 143 372
4143 372 177 -117 -302 -191 75 413 356 -245 -252 -220 -60 314 211 -153 -61 -35 -20 227 146 -207 -272 -287 -17
4166 -17 53 312 29 -221 -189 173 -63 128 165 -345 -436 -217 219 81 64 -134 -326 -207 253 363 235 7
4188 7 -152 -128 143 243 188 -171 24 -70 179 350 168 -191 -219 91 -182 400 25 -62 -286 -82 261 121
4210 121 255 45 -361 -139 88 238 229 -35 -54 -155 137 169 129 6 -31 -174 -89 378 261 75 -86 -197
4232 -197 -125 104 143 -2 -199 -211 -78 17 400 -82 -141 -35 29 44 83 83 -59 -259 -24 184 40 70 139 -228
4256 -228 -106 268 32 186 139 -80 -52 -5 78 127 -96 -134 -10 -79 126 82 -297 99 -8 -77 5 70 87 -132
4280 -132 26 69 -113 144 175 20 61 159 44 89 79 -27 -236 -15 272 3 -105 6 -214 -16 -5 -180
4302 -180 -41 -37 55 -119 16 202 62 101 13 -135 200 -11 60 -84 3 125 -37 -105 -66 -20 -15 121 27 -121
4326 -121 118 -80 -53 76 -100 -54 11 -236 -100 14 -81 -51 -104 -37 -5 87 42 22 -102 -24 -202 -63 157 -91
4350 -91 -37 -105 -88 222 98 -94 -191 -56 125 103 4 -22 -143 -109 -5 11 102 43 -168 -92 83 66 -17 -161 -179
4375 -179 67 -159 95 100 17 111 -175 45 124 99 172 -45 -94 -7 103 183 108 22 -121 -139 -95 121 43 -223 -93
4400 -93 -79 -1 157 144 51 -218 -103 -110 92 124 61 -11 -98 -96 123 156 106 -48 -277 -131 125 189 -24 45 -222 -75
4426 -75 207 134 -28 -212 -160 -54 199 140 78 -335 -213 -99 -41 174 -23 -109 70 -198 -70 158 55 -60
4448 -60 -4 -243 71 19 219 157 -125 -321 -27 -72 156 -69 -251 -191 22 59 90 25 -126 -227 43 25 210
4471 210 26 -74 -268 23 94 175 -23 -263 10 -131 201 110 36 -98 -12 -280 21 27 137 -158 -220 14 -18
4494 -18 -129 157 -198 -27 -40 -64 190 298 1 -264 18 79 72 37 83 -147 -186 1 77 260 257 -127 -138 130
4518 130 211 134 157 -164 -19 -274 111 206 -78 -193 -114 -227 -24 171 21 58 -157 -168 93 61 49 -27 -125 106
4542 106 -31 204 207 -209 -104 -101 34 189 87 124 -184 -157 179 -13 -58 -98 -129 -131 148 -59 31 34 -149 -22 15
4567 15 132 112 -20 -33 -50 -108 83 282 29 29 -177 -114 -110 109 175 -102 -94 -6 74 -24 156 -94 -234 -56 121
4592 121 -74 -61 -84 -262 -264 60 -118 -51 60 -124 -60 65 -7 157 141 69 -62 -24 97 25 8 29 96 -139 53
4617 53 94 -67 60 34 -35 21 8 -146 -62 -26 79 -32 146 76 -176 -1 -108 60 12 -36 -36 -128 42 113 -56
4642 -56 17 202 -42 61 105 62 -31 -65 95 -83 -43 -64 33 -227 113 38 -110 70 89 -256 -191 149 -31 -9
4666 -9 -93 165 85 137 -57 -32 81 -162 39 185 417 47 -98 11 8 -81 -222 27 -260 -73 19 -17 113 24
4690 24 -71 -183 -130 73 44 129 -99 -11 -128 -23 -31 -59 71 22 -9 -85 -4 -59 93 19 114 -269 172 103 -20 -3
4716 -3 20 -109 93 -52 -117 -138 -134 29 51 -79 91 -189 -42 127 -33 -3 -52 -65 109 120 153 191 -152 228 -101
4741 -101 -168 186 113 -46 141 84 -215 78 106 70 -117 -126 93 -85 -2 124 36 -97 -121 -54 85 17 -21 -157
4765 -157 -6 66 20 106 -39 -189 -151 33 -186 138 124 -87 -133 -21 95 7 -10 -134 -165 -68 102 50 102 173
4789 173 2 -201 154 -114 100 93 -66 1 9 225 90 -212 -110 -17 -21 200 134 -28 -111 24 214 20 221
4812 221 96 -55 -12 -78 -120 139 55 -15 -133 40 94 132 -40 3 6 -98 118 111 83 75 144 -44 -124 56 140 57
4838 57 -157 254 -37 17 114 -208 23 60 -6 266 124 30 140 -20 -18 13 -13 -85 -151 -55 46 12 -17 -24 111 -3
4864 -3 -12 -95 -7 21 49 27 113 105 -103 88 15 11 -39 90 -143 36 -103 -46 47 -134 134 136 -181 34 -170 56 -8
4891 -8 -10 3 81 142 118 -79 113 -19 -26 72 -42 -56 44 30 78 186 -142 -52 134 2 1 14 -191 -79 7 61 68
4918 68 -72 34 -4 58 155 -85 -21 -173 -129 -168 13 -73 53 164 24 36 19 106 12 169 50 -53 71 0
4942 0 97 43 -27 137 -40 -255 54 -135 -44 -239 -44 -112 52 20 50 37 -69 49 113 -57 23 111 27 214 33
4967 33 92 -3 -64 66 -33 -1 -59 -32 -99 5 35 -24 71 -30 15 -129 -50 -12 -23 119 -55 -149 127 48 -110 -45
4993 -45 61 -42 55 86 156 27 -180 188 -267 -62 43 164 135 -50 2 39 -35 -59 67 -113 -32 -75 60 93
5017 93 66 -73 -30 11 118 53 -70 112 -34 -7 -67 27 183 -74 -51 146 105 13 -133 -132 -19 -136 -124 57 19
5042 19 7 17 -4 4 9 32 13 74 11 3 137 80 33 -10 147 -139 26 114 -55 -12 -36 74 43 147 37 68 -24 156
5070 156 -5 -73 -32 -11 -27 -53 43 -84 0 87 -183 -82 -129 86 -128 -35 -76 39 163 -18 112 -4 29 -80
5094 -80 37 12 -131 243 4 25 68 -163 -82 -97 -48 92 103 10 46 75 37 -113 4 138 18 20 -16 -34 -33 -98
5120 -98 -35 45 14 59 68 94 226 44 111 -41 -263 42 -31 36 -48 82 66 -66 41 -69 -28 113 -95 8 -136
5145 -136 115 -20 -109 -157 -197 -29 16 71 12 126 214 38 155 67 67 -74 88 -94 173 17 131 19 -65 14
5169 14 49 73 -11 -133 -26 -129 39 -4 110 31 -25 46 -45 244 -73 -10 171 -95 103 46 -113 -59 56 -57
5193 -57 -51 156 19 7 10 121 14 -52 147 -22 4 111 15 -92 -28 -2 -27 -263 142 91 98 -45 -119 79 114 -12
5219 -12 -2 -46 -90 93 32 129 -76 19 67 -4 -74 38 -157 167 -17 -5 -46 -50 -36 0 59 -86 46 18 -70 107
5245 107 -106 -8 -8 -33 -5 -10 246 135 -82 170 210 45 187 -70 -54 139 -40 -1 8 74 -30 -34 88 123 -10
5270 -10 -54 -14 103 -146 72 75 45 75 35 -90 159 -25 -38 55 54 24 73 154 4 104 28 -98 -70 -41 -23 21 -96
5297 -96 -22 141 -2 22 24 4 0 137 92 149 -185 53 -34 98 -96 -111 38 140 68 -122 190 36 107 -48 -61
5322 -61 -25 -9 115 217 -51 -109 -129 132 -169 -100 -92 -91 -236 48 114 24 109 -42 23 -28 141 54 -82 41 51 129
5348 129 74 -44 21 -64 113 -81 35 -62 3 68 -40 -4 63 -140 182 23 -194 2 17 -12 50 -17 -78 -37 39
5373 39 80 65 11 114 -80 -157 -35 39 10 101 38 2 61 117 -23 14 142 4 -82 29 123 95 -249 -21 -12 -85
5399 -85 76 48 6 10 -42 -95 -96 -276 -98 71 118 101 62 -94 68 22 -23 -56 89 165 -25 64 -15 26 38 -13 159
5426 159 -68 53 59 78 147 46 30 108 42 -150 -248 -81 103 -30 -200 -78 181 115 30 -150 -59 -78 130 41
5450 41 -73 -33 136 -27 16 29 14 -134 -59 -70 -40 -87 -101 -76 59 94 -154 30 -89 69 -103 -146 148 -184
5474 -184 68 -24 -9 92 -19 5 -36 -47 66 51 -184 -20 56 136 -70 -96 -257 208 -84 158 57 35 -44 -124
5498 -124 -24 69 -25 -233 -109 -253 -37 51 71 -221 -65 83 21 -122 -5 -50 -13 35 87 6 238 211 -129 134
5522 134 -134 -32 26 -56 -49 -185 -16 -177 -22 -43 -98 96 5 -71 18 -10 -101 -91 -31 -210 54 -43 -37 82 -193
5547 -193 -22 -85 -108 120 -34 63 156 52 60 26 -11 32 0 145 151 -109 -90 -95 11 -67 7 19 173 -13 -173 142
5573 142 -54 143 12 69 24 40 33 103 -52 -12 24 -101 0 -110 33 79 -101 -90 80 -75 -64 -211 -90 14
5597 14 -82 -162 38 -33 -14 -50 8 13 -35 237 53 -78 141 -19 64 -51 25 168 -123 237 146 -251 -112 -115 -54
5622 -54 -129 65 -34 -132 168 5 -66 34 19 -81 -194 111 41 22 36 205 -53 12 36 108 -47 -158 25 -163
5646 -163 158 -46 117 102 55 -61 -22 105 39 22 77 192 32 63 8 55 -76 -7 -3 30 -37 -159 -16 153 29
5671 29 182 44 108 9 -49 134 -76 -114 -58 -96 41 136 -6 51 -181 -32 -140 -9 -49 30 126 -93 -37 -24 25
5696 25 -55 41 -81 15 202 -175 97 -95 94 97 169 -111 109 201 7 89 129 -107 -6 11 -32 57 23 91 -28
5721 -28 -122 -45 -259 -67 -29 -93 36 19 24 -124 113 38 97 -40 155 24 -17 -40 -81 204 37 49 122 19 -102
5746 -102 68 71 102 103 -5 -61 52 6 -12 -119 -19 -53 -137 73 59 96 88 -141 -55 -6 72 235 28 -47 79 -11
5772 -11 68 119 -50 -249 -87 -143 190 -66 59 48 -116 -71 9 64 -89 -145 19 -98 -37 -50 -60 -169 2 30
5796 30 101 34 1 94 -219 -38 141 36 156 154 -141 15 124 88 70 -31 -68 -44 -149 -37 110 63 -30 -5 41
5821 41 46 166 -92 65 -142 55 67 -11 102 -107 -5 -167 -90 118 134 22 -119 133 44 76 -113 -192 -71
5844 -71 -167 32 80 141 31 -125 83 59 130 167 16 -68 -79 -5 34 129 -57 -89 -12 -36 52 36 34 27 13 64 101 146
5872 146 89 -140 -162 -2 231 120 60 -106 85 -93 22 -23 192 -14 -171 -51 -4 113 -9 -22 36 -46 -40
5895 -40 180 -35 50 60 0 13 46 -40 5 76 -17 14 -43 79 -18 -22 -76 23 54 -72 98 -138 25 13 36 -22 111
5922 111 -123 -88 -200 100 136 -82 21 -26 -27 334 22 -106 121 38 28 68 35 -87 -94 -3 145 -56 -134 144
5946 144 -71 2 -57 11 -51 -25 38 8 -53 -3 -77 34 53 -80 48 137 11 -30 -195 -108 -58 43 -45 2 -99 -39
5972 -39 -175 171 60 79 47 -276 11 -6 -109 22 -30 20 -9 24 131 -75 -21 -52 102 86 204 245 -111 22
5996 22 91 -6 -68 -88 -140 44 -105 -1 51 25 -75 -72 -73 7 56 -100 -58 53 56 68 -30 188 -11 33 -99 28 64
6023 64 -116 -63 -7 -3 105 127 -119 -137 7 -43 32 87 157 49 -120 -11 28 29 -38 -45 11 -49 48 25 17 -134 -52 -139
6051 -139 218 30 -32 -141 106 142 52 65 57 58 -58 34 46 -48 111 66 16 -15 -109 77 -126 80 -164 -47 -112
6076 -112 -43 -74 99 -138 -133 -103 -30 33 -12 -114 9 108 -68 -58 -6 15 -66 157 8 -99 -114 -33 -39 12 59 56 -34
6103 -34 9 125 -54 76 -60 92 -15 32 -43 15 227 49 77 -9 54 168 30 -129 -9 -6 -285 -185 67
6126 67 -25 8 101 29 -125 59 42 -185 -87 -43 -164 -35 9 -24 -120 29 100 51 -63 81 -44 -105 47 8 80
6151 80 54 -58 -174 -9 -58 224 -92 -7 -18 63 210 -38 127 -49 -10 54 94 -29 53 -135 -90 -155 25 37
6175 37 44 2 -108 -13 -141 100 69 111 -33 -24 -85 53 77 -86 42 -16 56 214 61 -18 -25 -52 111 11 -4 55
6201 55 -102 -48 144 61 88 -23 39 -115 -98 -106 46 59 -4 58 -157 -18 63 -10 53 -11 129 67 12 61 -13 -87 -27
6228 -27 2 -42 -11 -1 -6 31 26 81 27 -68 -4 -97 -12 -23 3 -18 -96 -95 74 -77 143 -65 2 112 -17 35 -2 51 19
6257 19 -90 -131 -104 -116 -49 -84 -166 100 -130 102 17 -100 3 -163 -93 -56 -149 -24 -18 -69 13 128 -26 13 -7 -4
6283 -4 -66 -109 164 117 52 -10 -157 131 4 -76 82 61 -23 51 15 -222 -4 -84 216 -114 0 20 84 -76 61
6308 61 -91 -121 32 -45 -66 -95 47 165 88 96 133 95 49 71 16 -15 4 115 -153 160 96 -2 -80 -145 88 -73
6334 -73 -56 -61 -43 14 62 -60 55 -48 82 -84 219 37 -33 6 96 213 -36 20 2 -69 125 73 42 53 36 28
6360 28 38 -187 -63 -103 -169 55 87 -186 124 2 -154 33 -69 120 -28 23 31 -16 -103 55 131 -53 -38 -3
6384 -3 19 2 35 90 -138 -38 98 -119 120 -99 22 144 35 114 -24 -62 4 -62 -56 -62 36 -51 23 -13 22 -6 95
6411 95 63 -105 170 79 67 102 108 -125 -52 122 46 -21 24 90 -112 -32 -10 -162 -106 -50 -46 6 -167 59 -174 35
6437 35 51 27 -48 -113 25 -185 132 -178 -64 25 120 -71 -74 -81 -155 7 -28 -27 -51 28 46 -109 -60 -4 -128 -23 35
6464 35 37 32 124 -33 61 -20 149 -75 -5 -3 -50 22 42 44 -38 123 -192 70 -35 159 -16 134 -11 -15 -92 71 140
6491 140 134 130 70 -55 81 0 187 -36 -24 -95 12 135 -51 136 29 -134 -116 173 139 109 -206 -64 112 -116
6515 -116 -55 164 98 39 15 -210 8 32 -23 -102 -100 -114 -61 -63 31 19 -188 -34 -168 27 -108 -74 96 138 9 146
6541 146 -5 -33 -67 -7 76 99 90 -140 -34 59 92 -55 139 -4 33 -83 168 -168 70 -133 -106 86 37 30 -22
6566 -22 14 -25 -9 -7 81 -64 -93 53 -116 32 -106 -7 142 -5 79 26 66 166 -109 -59 30 52 -13 59 96 -2
6592 -2 -133 -38 -52 23 31 -112 -26 -105 -132 -85 -23 47 -56 136 34 -42 -88 -194 -26 -78 54 122 66 33 -55 50 51
6619 51 12 23 -103 231 69 -8 -175 -50 20 -23 -167 -20 -85 -50 113 62 4 -155 -65 -70 88 57 92 -160 165
6644 165 -43 -30 256 19 -201 -15 84 22 -137 97 -34 -79 16 8 96 46 -57 -148 33 54 -159 -164 -97 86 -30
6669 -30 47 -22 83 -56 -23 -41 -7 -26 -18 -19 -82 -27 20 -18 67 -81 17 -36 -119 -2 37 -23 -140 -15 54 -84 75
6696 75 117 -143 129 -134 -51 -101 64 -121 107 -49 43 84 145 0 80 -167 20 91 62 44 -172 -116 -63 11 -32
6721 -32 -50 -132 -79 53 75 8 124 -40 -95 -103 -18 28 82 36 -53 36 -82 27 108 -1 -89 86 -74 108 179 -64
6747 -64 167 -78 -20 64 79 122 -58 -135 -164 58 286 84 -36 69 -94 -8 22 22 57 -3 16 5 141 123 123 -65
6773 -65 46 -76 52 15 -7 -108 -12 -63 66 131 46 -30 -62 16 -6 120 -46 175 60 34 94 51 35 -65 -31
6798 -31 64 21 160 -31 -145 44 -27 150 -23 137 59 59 -25 126 -56 4 52 3 -221 163 59 65 -150 -171 -71
6823 -71 6 -49 117 50 -52 -1 -153 151 -119 82 8 -86 4 -129 3 29 -82 -21 -75 -43 132 116 69 -134 -66
6848 -66 37 45 -14 91 -97 -154 -80 -170 105 -12 -22 -41 135 -108 181 -28 -127 -77 -131 -73 167 -50 129 -74
6872 -74 -191 39 60 81 -37 -200 8 82 40 74 -36 21 2 -150 -23 48 -186 -111 -145 -50 79 72 27 -86 -75
6897 -75 -116 -33 54 28 -169 20 -31 -43 30 49 -54 -18 133 -129 133 -57 -19 -249 43 142 165 110 -65 -260 -131
6922 -131 89 -55 178 -182 -77 102 33 72 10 -1 10 -68 -108 129 15 -93 -129 40 -60 -84 85 66 42 -39
6946 -39 120 -99 33 39 -154 125 119 95 222 -33 31 -3 -94 -101 121 150 -24 -56 -172 -37 142 86 20 -92 189
6971 189 48 52 103 56 -48 80 -10 43 38 12 -154 -24 -125 43 64 -67 -56 -131 12 -202 131 -123 33 -59
6995 -59 198 18 -36 90 -96 88 37 -81 -34 -22 56 -51 16 -189 131 97 80 161 -135 -161 -272 142 -75 20
7019 20 -122 63 -92 -51 -20 -154 8 20 71 -18 83 42 35 80 -126 221 -32 80 -46 21 101 -64 9 163
7043 163 -139 -11 42 -56 -3 -41 -107 63 13 12 -92 3 -103 -252 17 153 54 87 19 112 119 8 101 90 -43 -1
7069 -1 26 49 75 13 95 -75 14 85 31 56 144 123 -113 -139 -15 24 38 36 17 40 -49 6 46 101 -65 78 -79 93
7097 93 57 70 -121 -56 -65 32 189 69 -18 -140 32 160 76 149 62 60 -164 150 128 -99 -150 17 19 -4 223 0
7123 0 114 -18 29 -36 84 8 -86 -42 182 -130 145 98 -141 46 -98 56 106 152 146 -200 -46 -240 59 -111
7147 -111 56 -65 -78 -52 -6 -23 37 -262 -26 -171 -44 -80 -76 59 -173 -47 20 -144 83 32 7 -32 59 77 90
7172 90 -56 -95 27 -69 175 -103 20 -25 -122 -137 47 29 7 -31 -121 -137 -127 91 60 -61 18 -196 205 6 11
7197 11 38 -19 -81 41 -157 9 89 -72 113 -51 44 120 -69 -57 12 209 132 73 -71 -114 -11 -72 56 71 -9
7222 -9 35 50 26 -38 3 13 -182 -37 43 133 51 63 -62 48 -10 -44 84 72 -116 -120 -168 -133 2 35 -142 -54 26
7249 26 -33 157 183 -113 -143 -74 70 60 70 -49 -34 27 -23 177 -76 32 -115 123 0 -72 74 56 -198 -96
7273 -96 -23 -36 48 8 110 48 -33 -1 17 -81 210 103 -53 -79 9 96 -15 166 -93 12 204 -30 -41 -128 22
7298 22 -136 -37 3 -100 -18 -22 -92 -35 108 -76 59 -118 122 60 -3 -84 -33 3 40 -54 128 -52 -125 -51 3 -59
7324 -59 34 -75 76 -31 -136 -100 -80 -103 -21 -97 -29 -81 -85 120 -134 -7 -144 -34 65 53 131 142 -9 99 -55
7349 -55 -16 26 68 -193 33 90 -73 38 146 46 76 -97 -124 90 -22 38 25 -69 44 44 -86 -67 -44 152 -19
7374 -19 -66 45 -7 180 3 -123 -43 54 99 -14 42 251 118 -42 -7 104 124 139 17 -42 33 -16 28 -91 -45
7399 -45 -38 0 -119 -149 -182 -25 -143 -30 -61 -123 148 17 79 124 -76 37 64 37 123 71 -145 27 34 0 -33 -80
7425 -80 106 -274 -67 -32 171 22 -18 -6 -66 71 -47 -152 -46 -48 -97 53 -9 -96 132 96 -69 174 -44 -27
7449 -27 36 54 -91 -140 -26 -144 115 96 -47 58 -84 -39 211 -162 2 -9 -40 91 33 181 11 -23 56 -51
7473 -51 1 51 -9 -64 55 126 60 172 134 -6 -70 -84 -20 -139 -67 32 -99 -47 -24 -146 17 -40 62 81 115 -17
7499 -17 69 -75 -87 -9 16 36 -40 -17 102 78 22 -88 78 56 -16 69 -179 44 -40 -12 97 187 -1 -21 -238 103
7525 103 -60 -166 -8 15 -99 -119 4 -108 90 -173 -38 -162 -113 49 51 -129 79 161 -79 -28 -30 69 127 98
7549 98 39 -97 88 107 120 62 53 -152 162 52 55 -12 -72 -12 -35 -154 -17 123 -104 -49 -84 -66 31 -41 74 19
7575 19 -32 52 -62 10 -75 -117 -144 81 134 2 57 19 21 222 35 -42 132 -159 -84 20 147 15 -3 -5 -42 -5
7601 -5 26 22 43 77 -62 125 139 81 -32 132 -137 -9 196 79 81 90 104 -1 78 -22 -4 13 100 17 84 1 -49
7628 -49 143 46 149 48 32 36 -25 33 -188 21 96 88 88 35 -105 95 36 43 -26 -49 -54 15 86 -4 -60 -43 -95 3 42
7657 42 -192 -14 -152 65 -59 -12 30 53 12 -43 40 -10 -233 -8 33 -106 92 -41 -82 -7 28 -32 44 43 106 -122
7683 -122 28 83 15 108 9 -34 45 -33 -22 -250 -27 99 -168 -85 -121 45 -16 -12 -114 0 -102 18 -99 -27 -73
7708 -73 79 -20 -2 -1 58 36 -26 183 42 44 3 -10 -39 51 49 73 -30 47 70 14 69 94 -22 -107 16 -203 -32 50
7736 50 -62 -9 -2 -31 133 52 -47 73 -174 126 15 8 -44 67 8 -17 -1 -29 -105 -139 93 -94 -53 -111 -23 86
7762 86 -47 40 24 23 45 0 90 2 137 -128 104 -89 27 -81 -12 67 -10 -38 86 -78 119 42 227 67 -6
7787 -6 -108 68 14 58 121 64 60 -90 43 89 -26 27 160 46 53 -49 137 84 -93 51 194 274 21 -21 82
7812 82 243 46 -105 -169 -99 -57 -133 -86 -99 29 54 -78 0 153 -56 -44 -44 -8 144 60 88 7 92 -5 128 78
7838 78 38 57 20 50 -65 -54 236 -22 44 -29 41 34 90 57 70 -27 200 40 18 -208 129 -148 44 -59 0 -79
7864 -79 -55 40 -52 22 -19 -50 -141 18 -39 193 88 -3 -167 19 -84 181 114 -150 149 95 -92 112 -83 -160
7888 -160 102 144 -70 -66 90 -133 48 18 35 33 57 44 -75 24 4 16 77 108 141 -144 21 70 -56 -14 -20 -22 167
7915 167 -87 -15 -52 -69 99 -69 81 99 -164 4 -43 106 -25 69 -69 -125 -144 -148 57 -1 101 -33 38 -73
7939 -73 -60 37 67 162 -48 -62 107 103 61 44 53 -8 -50 -78 135 -36 -54 -133 98 42 105 92 -52 -24 15 -75 139 35
7967 35 -95 97 -210 207 -89 -62 67 -54 -4 7 69 -122 33 -27 46 -39 16 89 1 -48 -76 38 80 0 91
7992 91 -113 57 -41 -20 69 -118 62 86 65 160 -291 -84 -78 208 -41 68 16 -44 -14 129 -15 29 58 -51 24
8017 24 26 -89 49 -25 71 -186 25 75 -107 13 85 54 -54 67 130 82 29 31 -102 59 -84 67 34 -11 67
8042 67 -22 -127 -99 -69 107 -18 -131 -16 84 10 91 75 -55 -1 -108 44 -123 -8 171 13 95 -74 69
8065 69 255 52 -22 57 -25 88 -60 77 63 -89 -73 -26 -109 -31 48 104 -25 -111 -179 -91 -41 74 100 4 -194 52
8091 52 143 43 139 -42 -23 120 -33 15 -54 -54 81 -14 0 104 -210 -100 40 40 59 -28 -86 -215 -78 -77 -20 -122
8117 -122 -86 -72 -116 105 12 -27 5 -125 97 11 -61 -45 116 -19 -115 -104 -31 33 37 -68 -41 184 210 51 -167 6
8143 6 -66 166 -72 -231 32 -10 30 43 -58 -191 -54 -132 -143 -67 134 226 -162 -21 -44 2 -103 -121 -10 -78 121
8168 121 49 102 79 29 -142 -18 -120 -4 83 -63 -45 -22 36 -175 104 -141 -50 -51 19 101 152 193 11
8191A1
##END NTUPLES=NMR FID
##END=
