##TITLE=1H_E3e0806
 CDCl3
 8 sc, 
 8.6.2023
##JCAMPDX= 6.0         $$ Bruker NMR JCAMP-DX V2.0
##DATA TYPE= NMR FID
##DATA CLASS= NTUPLES
##ORIGIN= UXNMR, Bruker Analytische Messtechnik GmbH
##OWNER= root
$$ XWIN-NMR		Version 3.5
$$ Fri Jun  9 13:41:49 2023 Russian Standard Time (UT+4h)  she@DPX200
##.OBSERVE FREQUENCY= 200.13135
##.OBSERVE NUCLEUS= ^1H
##.DELAY= (6, 6)
##.ACQUISITION MODE= SIMULTANEOUS
##.ACQUISITION SCHEME= undefined
##.AVERAGES= 8
##.DIGITISER RES= 18
##SPECTROMETER/DATA SYSTEM= spect
##.PULSE SEQUENCE= zg30
##.SOLVENT NAME= CDCl3
##.SHIFT REFERENCE= (INTERNAL, CDCl3, 0, 15.7039)
##AUDIT TRAIL= $$ (NUMBER, WHEN, WHO, WHERE, WHAT)
$$ ##TITLE= Audit trail, XWIN-NMR		Version 3.5
$$ ##JCAMPDX= 5.01
$$ ##ORIGIN= Bruker BioSpin GmbH
$$ ##OWNER= she
$$ F:/spectra/data/she/nmr/H-F/1/audita.txt
$$ ##AUDIT TRAIL=  $$ (NUMBER, WHEN, WHO, WHERE, WHAT)
(   1,<2023-06-09 13:40:35.96 +0400>,<she>,<DPX200>,
      <created by zg, POWCHK disabled, PULCHK disabled
       configuration hash MD5:
       00 E9 B6 7A A2 85 ED C7 34 08 36 98 17 FE 4E 26
       data hash MD5: 16K
       C0 98 16 3F 01 97 A3 CE 7E 5C 98 5C 72 19 3F 36>)
$$ ##END=
$$ 
$$ hash MD5
$$ D6 58 39 0F A6 77 0B E0 6E 8A 69 CE B6 F0 31 13
##$RELAX= 
##$RELAX= 
##$RELAX= 
##$RELAX= 
##$RELAX= 
##$RELAX= 
$$ Bruker specific parameters
$$ --------------------------
##$DU= <F:/spectra>
##$EXPNO= 1
##$NAME= <H-F>
##$PROCNO= 1
##$TYPE= <nmr>
##$USER= <she>
##$AMP= (0..31)
100 100 100 100 100 100 100 100 100 100 100 100 100 100 100 100 100 100 
100 100 100 100 100 100 100 100 100 100 100 100 100 100 
##$AQSEQ= 0
##$AQ_mod= 1
##$AUNM= <au_zg>
##$AUTOPOS= <>
##$BF1= 200.13
##$BF2= 200.13
##$BF3= 200.13
##$BF4= 200.13
##$BF5= 200.13
##$BF6= 200.13
##$BF7= 200.13
##$BF8= 200.13
##$BYTORDA= 1
##$CFDGTYP= 0
##$CFRGTYP= 5
##$CHEMSTR= <none>
##$CNST= (0..31)
1 1 145 1 1 1 1 1 1 1 1 1 1 1 1 1 1 1 1 1 1 1 1 1 1 1 1 1 1 1 1 1 
##$CPDPRG= <>
##$CPDPRG1= <>
##$CPDPRG2= <>
##$CPDPRG3= <>
##$CPDPRG4= <mlev>
##$CPDPRG5= <mlev>
##$CPDPRG6= <mlev>
##$CPDPRG7= <mlev>
##$CPDPRG8= <mlev>
##$CPDPRGB= <>
##$CPDPRGT= <>
##$D= (0..31)
0 1.2 0 0 0 0 0 0 0 0.06 0 0.03 0 0 0 0 0.0002 0 0 0 0 0 0 0 0 0 0 0 0 
0 0 0 
##$DATE= 1686303635
##$DBL= (0..7)
120 120 120 120 120 120 120 120 
##$DBP= (0..7)
150 150 150 150 150 150 150 150 
##$DBP07= 0
##$DBPNAM0= <>
##$DBPNAM1= <>
##$DBPNAM2= <>
##$DBPNAM3= <>
##$DBPNAM4= <>
##$DBPNAM5= <>
##$DBPNAM6= <>
##$DBPNAM7= <>
##$DBPOAL= (0..7)
0.5 0.5 0.5 0.5 0.5 0.5 0.5 0.5 
##$DBPOFFS= (0..7)
0 0 0 0 0 0 0 0 
##$DE= 6
##$DECBNUC= <off>
##$DECIM= 32
##$DECNUC= <off>
##$DECSTAT= 4
##$DIGMOD= 1
##$DIGTYP= 9
##$DL= (0..7)
0 120 120 120 120 120 120 120 
##$DP= (0..7)
150 150 150 150 150 150 150 150 
##$DP07= 0
##$DPNAME0= <>
##$DPNAME1= <>
##$DPNAME2= <>
##$DPNAME3= <>
##$DPNAME4= <>
##$DPNAME5= <>
##$DPNAME6= <>
##$DPNAME7= <>
##$DPOAL= (0..7)
0.5 0.5 0.5 0.5 0.5 0.5 0.5 0.5 
##$DPOFFS= (0..7)
0 0 0 0 0 0 0 0 
##$DQDMODE= 0
##$DR= 18
##$DS= 0
##$DSLIST= <SSSSSSSSSSSSSSS>
$$ [...]
##$SUBNAM2= <"">
##$SUBNAM3= <"">
##$SUBNAM4= <"">
##$SUBNAM5= <"">
##$SUBNAM6= <"">
##$SUBNAM7= <"">
##$SUBNAM8= <"">
##$SUBNAM9= <"">
##$SW= 18.05172834244
##$SWIBOX= (0..15)
0 0 2 0 0 0 0 0 0 0 0 0 0 0 0 0 
##$SW_h= 3612.71676300578
##$TD= 16384
##$TD0= 1
##$TE= 0
##$TE2= 300
##$TE3= 300
##$TEG= 300
##$TL= (0..7)
0 120 120 120 120 120 120 120 
##$TP= (0..7)
150 150 150 150 150 150 150 150 
##$TP07= 0
##$TPNAME0= <>
##$TPNAME1= <>
##$TPNAME2= <>
##$TPNAME3= <>
##$TPNAME4= <>
##$TPNAME5= <>
##$TPNAME6= <>
##$TPNAME7= <>
##$TPOAL= (0..7)
0.5 0.5 0.5 0.5 0.5 0.5 0.5 0.5 
##$TPOFFS= (0..7)
0 0 0 0 0 0 0 0 
##$TUNHIN= 0
##$TUNHOUT= 0
##$TUNXOUT= 0
##$USERA1= <user>
##$USERA2= <user>
##$USERA3= <user>
##$USERA4= <user>
##$USERA5= <user>
##$V9= 5
##$VALIST= <valist>
##$VCLIST= <CCCCCCCCCCCCCCC>
##$VD= 0
##$VDLIST= <DDDDDDDDDDDDDDD>
##$VPLIST= <PPPPPPPPPPPPPPP>
##$VTLIST= <TTTTTTTTTTTTTTT>
##$WBST= 1024
##$WBSW= 4
##$XGAIN= (0..3)
0 0 0 0 
##$XL= 0
##$YL= 0
##$YMAX_a= 641805
##$YMIN_a= -868306
##$ZGOPTNS= <>
##$ZL1= 120
##$ZL2= 120
##$ZL3= 120
##$ZL4= 120
##$ABSF1= 10
##$ABSF2= 0
##$ABSG= 5
##$ABSL= 3
##$ALPHA= 0
##$AQORDER= 0
##$ASSFAC= 0
##$ASSFACI= 0
##$ASSFACX= 0
##$ASSWID= 0
##$AUNMP= <proc_1d>
##$AZFE= 0.1
##$AZFW= 0.1
##$BCFW= 1
##$BC_mod= 2
##$BYTORDP= 1
##$COROFFS= 0
##$CY= 11.3945322036743
##$DATMOD= 1
##$DC= 2
##$DFILT= <>
##$DTYPP= 0
##$F1P= 15.7292609196834
##$F2P= 12.9074282941183
##$FCOR= 0.5
##$FTSIZE= 0
##$FT_mod= 4
##$GAMMA= 1
##$GB= 0.15
##$INTBC= 1
##$INTSCL= 1
##$ISEN= 128
##$LB= 0.24
##$LEV0= 0
##$LPBIN= 0
##$MAXI= 10000
##$MC2= 0
##$MEAN= 0
##$ME_mod= 0
##$MI= 1.114404
##$NCOEF= 0
##$NC_proc= 0
##$NLEV= 6
##$NOISF1= 3.799351
##$NOISF2= 2.8
##$NSP= 1
##$NTH_PI= 0
##$NZP= 0
##$OFFSET= 15.70392
##$PC= 1
##$PHC0= -20623.97
##$PHC1= 11.45272
##$PH_mod= 1
##$PKNL= yes
##$PPARMOD= 0
##$PSCAL= 0
##$PSIGN= 0
##$REVERSE= no
##$SF= 200.130013532006
##$SI= 16384
##$SIGF1= 3
##$SIGF2= 2
##$SINO= 400
##$SIOLD= 16384
##$SREGLST= <1H.CDCl3>
##$SSB= 0
##$STSI= 0
##$STSR= 0
##$SW_p= 3612.71676300578
##$SYMM= 0
##$S_DEV= 0
##$TDeff= 0
##$TDoff= 0
##$TI= <>
##$TILT= no
##$TM1= 0
##$TM2= 0
##$TOPLEV= 0
##$USERP1= <user>
##$USERP2= <user>
##$USERP3= <user>
##$USERP4= <user>
##$USERP5= <user>
##$WDW= 1
##$XDIM= 8192
##$YMAX_p= 0
##$YMIN_p= 0
$$ End of Bruker specific parameters
$$ ---------------------------------
##NTUPLES= NMR FID
##VAR_NAME=  TIME,          FID/REAL,        FID/IMAG
##SYMBOL=    X,             R,               I
##VAR_TYPE=  INDEPENDENT,   DEPENDENT,       DEPENDENT
##VAR_FORM=  AFFN,          ASDF,            ASDF
##VAR_DIM=   8192,          8192,            8192
##UNITS=     SECONDS,       ARBITRARY UNITS, ARBITRARY UNITS
##FACTOR=    0.0002768,     1,               1
##FIRST=     0,             0,               0
##LAST=      2.2672688,     0,               0
##MIN=       0,             -868306,         0
##MAX=       2.2672688,     641805,          0
$$ Real data points
##PAGE= N=1
##DATA TABLE= (X++(R..R)), XYDATA
0@%%%%%%%%%%%pJ5qPj5J6j6J6j7K4l1L4m1M8n2N9o8P7q6R7j08J19j34J49j66J86
$$ 0 0 0 0 0 0 0 0 0 0 0 0 -7 8 0 7 -8 8 -8 8 -9 15 -16 18 -23 25 -27 32 -36 41 -45 52 -56 63 -71 78 -88 98
37I8k05K25k48K75l03L32l64L98m37M79n25N77o34O99p73Q52r44J053j178J328
$$ 98 -107 118 -130 145 -158 174 -190 208 -229 250 -275 302 -332 367 -406 446 -498 555 -623 705
57G05j509J727k001K354k816L447m351N711p912J1876k0233M3795k14687o84412
$$ 705 -804 923 -1078 1276 -1540 1907 -2444 3267 -4645 7231 -13002 30793 -183894 -868306
71h68306Q45759K24722m23757O58591k6495r62912K57972N22801k80849K74718
$$ -868306 -22547 202175 -221582 437009 410514 -552398 -294426 228375 -52474 222244
81B22244J93932p54674o4125N59490j63138k6817L25338l36347k21288L96509
$$ 222244 416176 -338498 -402623 156867 -6271 -33088 292250 -44097 -265385 131124
91A31124k536j98899J25560j18162j59887K75152J50510j61136j30907p1952J23509
$$ 131124 128588 -70311 55249 -62913 -222800 52352 202862 41726 -89181 -161133 -37624
102c7624K13416n3375o5449n1812l03380L8422M76077M2510k04383r394k50953
$$ -37624 175792 122417 56968 5156 -298224 -259802 216275 258785 54402 45008 -205945
113b05945j02263M75246J12525k92083O7273j23805l35042L86191M01420l15283
$$ -205945 -308208 167038 279563 -12520 54753 -69052 -404094 -17903 383517 68234
123F8234j15599Q1693k80053J08761M28756j97353k36468J87004j27593j19307
$$ 68234 -47365 34328 -245725 -136964 291792 94439 -142029 44975 -82618 -201925
133b01925L87229M3146l57424L9771J12203r8062J40319Q8091k51975k8031J72303
$$ -201925 185304 228450 -128974 -89203 23000 -75062 65257 153348 -98627 -126658 45645
144D5645n3343K7295J51682j71889k11716J61260J62974n6852k3775k4848j21805
$$ 45645 -7698 19597 171279 -610 -212326 -51066 111908 55056 31281 6433 -115372
155a15372J1288J69769N6364p2819n9276p8356m3404J41000J44714q6405j30406
$$ -115372 -104084 65685 122049 49230 -10046 -88402 -131806 9194 153908 67503 -62903
166f2903j13R488L3717J13189M768j21235m8954Q400K9960J11571L1182j37842
$$ -62903 -63016 -53528 -19811 93378 98146 -23089 -72043 -63643 -33683 77888 109070 -28772
178b8772n8007P7129K1394j514M3091k6903q2590m084O3360M5548p608n0786l5938
$$ -28772 -86779 -9650 11744 10230 53321 26418 -56172 -60256 3104 48652 41044 -9742 -45680
191d5680J8456M6342J8614l1391k5557Q853j3609L446P2637J663r5828o078N7783
$$ -45680 -27224 19118 37732 6341 -19216 -10363 -23972 -20526 52111 53774 -42054 -48132 9651
204I651l822J8683J9213p4298j6701O6845j9693o317P0946n4330r0858P1887M9757
$$ 9651 5829 24512 43725 -30573 -47274 19571 -122 -6439 64507 10177 -80681 -8794 40963
217D0963m6647K2746J395o5844L5474M2563n1437K6020M4582q3338j6347Q6113
$$ 40963 -5684 17062 18457 -47387 -11913 30650 -20787 5233 49815 -33523 -49870 36243
229C6243j9032m0854L9907j1398k5902L6021j4369k4430N1356p300n5434L7101
$$ 36243 17211 -23643 16264 4866 -21036 14985 616 -23814 27542 20242 -35192 1909
241A909K6730m7770P327L4515j9044o316J535j9750K3380K6226l4188r471K4489
$$ 1909 28639 -19131 -11804 22711 3667 -2649 -1114 -20864 2516 28742 -5446 -14917 9572
254I572j6946q686K9944P2j7353m063j0579J3870L2684j7544l0695J2990P445
$$ 9572 -7374 -16060 13884 13956 -3397 -7460 -18039 -4169 28515 10971 -19724 -6734 711
267G11n084J8181K920k2232p297q95J0966L4017n560m8516o107K9254Q044O456
$$ 711 -4373 13808 16728 -5504 -12801 -13696 -2730 31287 25727 -22789 -28896 358 8402 14858
281A4858M658k4340k1214O508J8901K8503N064m5932k9881K9765K8661J805O9
$$ 14858 19516 -4824 -26038 -19530 -629 27874 32938 -12994 -42875 -13110 15551 17356 17425
294A7425j5244k8343P91K8467K4010J677l1882l3787J5309L9847R263j4750j6808
$$ 17425 2181 -26162 -25371 3096 27106 28783 -3099 -36886 -21577 18270 27533 12783 -4025
307d025j8463m50K9330K4148q143l0700k5377Q469L9080K2505j9428l3153j4955
$$ -4025 -22488 -22938 6392 30540 22397 -8303 -33680 -25211 13869 36374 16946 -16207 -31162
320c1162J1604K8071K1814p275l1369k6603O988L7919K9633j4478m1376j9239
$$ -31162 -19558 8513 30327 23052 -8317 -34920 -27932 9987 39620 25142 -16234 -35473
332c5473J8330K9170J6362n084k6445k8325K964L6683K9822j1362m0318k3489
$$ -35473 -17143 12027 28389 23305 -3140 -31465 -28501 8182 38004 26642 -13676 -37165
344c7165J8274L3598J3224r881k2543k5352m35L5917L1239j2055l8451k2305J4639
$$ -37165 -18891 14707 27931 18050 -4493 -29845 -30280 5637 36876 24821 -13630 -35935 -21296
357b1296L3881J7774j1458k6368k0842L490L0372K7582p124l4695k3922J1874
$$ -21296 12585 30359 18901 -7467 -28309 -24819 5553 33135 26011 -8684 -32606 -20732
369b0732L3667J8208j2260k7033j9922N979L0769K0914r886k5745k1386J269L3219
$$ -20732 12935 31143 18883 -8150 -28072 -22093 8676 29590 19704 -6041 -27427 -26158 7061
382G061K7641j6836l1904j1587N889K2712K5583p223k9631j4634K023J9621L1730
$$ 7061 34702 17866 -14038 -25625 -19736 2976 28559 21336 -8295 -22929 -20906 -1285 30445
395C0445l056m0812j5261J8743J5328J2803N153k5016k4657J0000K1661J4865
$$ 30445 27389 -13423 -28684 -9941 5387 18190 23343 -1673 -26330 -16330 5331 20196
407B0196J892k6323k6879J5086L0105M885p730j1476k0803l284K8183K2123r987
$$ 20196 22088 -4235 -31114 -16028 14077 18962 11232 -244 -21047 -24331 3852 25975 15988
420A5988k2242j4849J565K2022K2460p142k4971r664M042Q390J9908R062k5073
$$ 15988 -6254 -21103 -19538 2484 24944 17802 -7169 -16833 -12791 -4401 15507 24569 -504
433e04k1227J1253J4342O601O746j5116k3657J1256J9687m029K064J034k5249
$$ -504 -21731 -10478 3864 10465 17211 2095 -21562 -10306 9381 5352 7416 8450 -16799
446a6799m134L1966P129j7265l410r429p083K5849J5738j9261q174m12j3796J3601
$$ -16799 -20933 11033 18162 897 -2513 -11942 -19025 6824 22562 3301 -4873 -5285 -19081 -5480
460e480L2582r874k8330r24L276L198K0503N020k1190r895K618K18J3631J4162
$$ -5480 27102 17228 -11102 -12026 -8750 -5552 14951 19971 -1219 -11114 -8496 -8278 5353 19515
474A9515j4167j9155M272J0230J493K515P94q650n901O558O223j421j710k865
$$ 19515 5348 -13807 -9535 695 2188 4703 5497 -3153 -9054 -2496 3727 2306 596 -2269
488b269m672P511J1529r273j3559P586N870m991R010O436j8672q537J2711L992
$$ -2269 -6941 570 12099 2826 -10733 -3147 2723 -2268 6742 13178 -5494 -14031 -1320 2672
502B672M529Q497j7453j7587J5573Q708p244J3084L001k7576l615K0835n65L88
$$ 2672 7201 15698 -1755 -19342 -3769 4939 -2305 10779 13780 -13796 -17411 3424 2859 3247
516C247R078j6512j1454J7377K76p896J6613k47k3090O696J3977j1150J404J0312
$$ 3247 12325 -4187 -15641 1736 2012 -5884 10729 10482 -12608 -5912 8065 -3085 -1681 8631
530H631r953j292R586j0869l982J5062l956q617J1889j371j5232M378P788j621
$$ 8631 -1322 -2614 6972 -3897 -7879 7183 3227 -5390 6499 5128 -10104 -5726 2062 441
544D41N586j086j2596J255O240k581N450O593q279p558l27L800R389R03q511K225
$$ 441 6027 4941 -7655 -6400 -160 -2741 2709 9302 1023 -6535 -6862 -3062 6327 7230 -1281 944
560I44N22j0037N472J2486n655l674K570r097K099J1341q714j650J5381j1847
$$ 944 1466 -8571 -3099 9387 3732 58 2628 -6469 -4370 6971 -1743 -3393 11988 141
574A41j5086J7588L246j4119J2375M253j7971O923P558j4517J0113J4939k1086
$$ 141 -14945 2643 5889 -8230 4145 8398 -9573 -2650 4908 -9609 504 15443 -5643
587e643m245J8929j1165o645J9463n521j3184J2323k914j0980J6519K055j8196
$$ -5643 -9888 9041 -2124 -8769 10694 5173 -8011 4312 1398 -9582 6937 8992 -9204
600i204R333Q638j5893L009J1856r775p16P870r172l08J0536r212l839J4667m032
$$ -9204 129 8767 -7126 -4117 7739 -2036 -2752 5118 -4054 -4362 6174 -3038 -6877 7790 3758
615C758j2098P449L559n088M299J659n156J599j170l160Q236M139q550l645L286
$$ 3758 -8340 -891 2668 -2420 1879 3538 -1618 -19 -1189 -4349 3887 8026 -524 -4169 -883
630h83P42K026Q50j203j06m885l198Q867M662p013j630L00l908N072N222o016
$$ -883 -141 1885 2735 1532 1426 -3459 -6657 2210 6872 -141 -1771 -1471 -5379 -307 4915 -1101
646a101P81L289r013Q26J3195m949q742P569O32p142P524K113r996M718O988r742
$$ -1101 -320 2969 -6044 -5218 7977 3028 -5714 1855 2487 -4655 2869 4982 -5014 -296 6692 -3050
662c050R46R952j0016p130J4097K472j0533L444P22q664O672Q921q579n95N197
$$ -3050 -2104 7848 -2168 -9298 4799 7271 -3262 182 904 -7760 -1088 7833 -746 -1341 3856
677C856j1681j808J8970j278j3899N154K163r605P975R724q988k196L653q328
$$ 3856 -7825 -9633 9337 8059 -5840 -686 1477 -8128 -153 9571 583 -1613 2040 -6288
691f288L092J3587p397r340Q915n77p783P644L893q601Q89L541l463K606J916
$$ -6288 -3196 10391 2994 -6346 2569 1992 -5791 1853 5746 -2855 -1966 1575 -1888 718 2634
706B634o706O66O404j702j876N73k344m96K901J873J998k284o665J271N848L68
$$ 2634 -4072 -3406 2998 1296 -580 -7 -2351 -2847 54 1927 3925 1641 -5024 -3753 2095 2463
722B463J526r54p536R34N738k254K090N063r638n993J0444J352m853N233k959
$$ 2463 3989 3035 -4501 -3567 2171 -83 2007 7070 -2568 -8561 1883 3235 -1618 3615 656
737F56q300P544L717p141N384K624j2015L520J1476p623m008P425m707k719R199
$$ 656 -7644 -100 3617 -3524 1860 4484 -7531 -4011 7465 -158 -4166 3259 -1448 -4167 5032
752E032k297o238N529j599n378Q925K495j0046J044M360l899K710M184o046j811
$$ 5032 2735 -3503 2026 427 -4951 3974 6469 -3577 -2533 1827 -2072 638 4822 -1224 -3035
767c035L582k788J292N568m556m521L580J078o68K517k156k389K750l14q21L393
$$ -3035 547 -2241 -949 4619 63 -4458 -878 200 -468 2049 -107 -2496 254 -60 -881 2512
783B512r77m755K202L146j184M17p09k986K142K251j881J039O09m766K45M788
$$ 2512 1535 -3220 -1018 2128 944 1361 652 -2334 -192 2059 178 1217 1826 -2940 -2695 2093
799B093l24j619J59k524n00L586K33j551J104j658k286L343K344j939n32l67r51
$$ 2093 1769 150 309 -2215 -2715 871 1104 -447 657 -1001 -3287 56 2400 461 -71 -438 -1389
816a389J669J887j680o79Q60j300K70K193o08j472k25j1P88J229j228j707R92
$$ -1389 280 2167 487 -192 668 -632 -362 1831 1223 -249 -474 -485 303 1532 304 -1403 -411
833d11M85p83P28O17j135j182M81J717M92j448o86M20Q20L19L8j82R2p80j42J995
$$ -411 74 -709 19 636 -499 -1681 -1200 517 1009 -439 -1125 -705 115 434 472 290 382 -398 -540 1455
853A455L41j889n95P32J34M71M84j025r57O72l64N92J118j019j464N57J96K38
$$ 1455 1796 -93 -688 44 178 649 1133 108 -849 -177 -541 51 1169 150 -1314 -757 -561 -323
871c23J071p32j428J309L88j084J162Q34j718l8Q90K94L96n90j058J076J068j750
$$ -323 748 16 -1412 -103 285 -799 363 1197 -521 -559 331 625 1021 431 -627 449 1517 -233
889b33L16J347j504q38J277k2j91K92j618K26J881j510j087K595p98j969J743
$$ -233 83 1430 -74 -912 365 343 152 444 -1174 -948 933 -577 -1664 931 133 -1836 -93
906i3O06j445J151K14j429J666L84k239J227J815k245K00J905j698n84J900j155
$$ -93 513 -932 219 433 -996 670 1054 -1185 42 1857 -388 -188 1717 19 -565 1335 180
923A80n16K021j511j948K240M04j867Q78O21j475rO96n08J129L97j552k17J549
$$ 180 -336 1685 174 -1774 466 870 -997 -119 502 -973 -982 -286 -794 335 732 -820 -1037 512
941E12o64n96J096Q00p99r95K00J181j15k89K65L08p64q95L17J191Q27j335j496
$$ 512 -152 -748 348 1148 349 -646 -446 735 620 331 596 904 140 -755 -438 753 1580 245 -1251
960a251J199L13j650J180J783j567j608Q86k88N20J511j082j048J819r67j472
$$ -1251 -52 261 -1389 -209 1574 7 -1601 -715 -1003 -483 1028 -54 -1102 717 -250 -1722
976a722K069J419j892n6R76j041J53Q52n18L35R83j673j441J755O32j319N74J401
$$ -1722 347 1766 -126 -182 794 -247 -94 758 240 575 1558 -115 -1556 199 831 -488 86 1487
994A487j776j685Q41J068N79N11j176j482P22R48r01J230K252k472k848K220J866
$$ 1487 -289 -1974 -1133 -65 514 1025 -151 -1633 -911 37 -864 366 2618 146 -2702 -482 1384
1011A384j419P96J199k327l55J163o69O91J953k492k139L300q1k849J744J989
$$ 1384 -35 761 1960 -367 -722 441 -228 463 2416 -76 -2215 1085 1004 -1845 -101 1888
1027A888k720l19J614j349p9J665j427j02K282j268k726K417J962j982q3J368
$$ 1888 -832 -1151 463 -886 -965 700 -727 -829 1453 185 -2541 -124 1838 -144 -227 1141
1043A141r57j523J283J210jr2r97j558J401J781j194j106J725q29k934K145K696
$$ 1141 184 -1339 -56 1154 1153 1061 64 -1494 -93 1688 494 -612 1113 284 -2650 -505 2191
1060B191k325j207J400r57n34K517q09j755K394n94l037K952K725l823p80L276
$$ 2191 -134 -1341 59 -898 -1432 1085 276 -1479 915 321 -2716 236 2961 -862 -1642 1634
1076A634j194j663K759q87j370J877o10j918K344O43l388R47K982j985k098J918
$$ 1634 440 -1223 1536 649 -721 1156 546 -1372 972 1615 -1773 -826 2156 171 -1927 -9
1092iK87j084Q69P16j380j10J6p45J166K253j156k694J212J447j480M04K528j270
$$ -9 278 -806 63 779 -601 -711 -695 -1440 -274 1979 823 -1871 -659 788 -692 -288 2240 970
1110I70k727J382P35m42J920k55l250J115J883k811N64M036k780l184K955M10
$$ 970 -1757 -375 360 -82 1838 1583 -1667 -552 1331 -1480 -916 3120 340 -2844 111 521
1126E21k059J768M61k068J498N66l110J949K634l142l27L702j683k944K236J088
$$ 521 -1538 230 691 -1377 121 687 -2423 -474 2160 -982 -1309 2393 710 -2234 2 1090
1142A090j335J338K11k354M39J217j046Q81J872j839k746J186J579l27J32J43
$$ 1090 -245 1093 1304 -1050 -611 606 -440 441 2313 474 -2272 -1086 493 166 298 441
1158D41q19j010K15Q19O86O18q63j650M43K090j137o17K078k61k261R09J526j243
$$ 441 -378 -1388 -1173 -354 332 950 87 -1563 -1120 970 -167 -784 1294 1033 -1228 -319 1207 -36
1176c6L5J011j044L25R08j892n39K674o24k196J686O78k426K13J980o21k04L88
$$ -36 -1 1010 -34 291 1199 -693 -1232 1442 818 -1378 308 986 -1440 -1227 753 132 -72 316
1194C16j598N8K111p91r69J833l77k516J612J606n87m03L49q07k32J106m61j40
$$ 316 -1282 -1224 887 96 -873 960 583 -1933 -321 1285 698 295 644 -163 -395 711 250 110
1212A10R34q25j091J139O91j320j65N20j34n3j67OJ78O7k79k8O34q3p33O1P78
$$ 110 1044 219 -872 267 958 -362 -527 -7 -141 -194 -361 -355 -177 -110 -389 -417 217 134 -599 -538 240
1233B40L86o31m60N69N33p94L15N71k95l77j10J01P95k93j016K51P35n90p08J125
$$ 240 626 -5 -465 104 637 -157 158 729 434 57 -53 48 843 550 -466 -215 520 -70 -778 347
1253C47L6r67K18L30k17L56j73o47O49M69j043K72R36o05l01Q11k89n0K40l19
$$ 347 383 -584 -366 -36 -253 103 -70 -717 -68 401 -642 -370 566 -39 -340 471 182 132 372 53
1273E3K5P14k08r24O89M71r87J04N50p33J64R5k84K74K20j041O1J077k45m98K31
$$ 53 78 792 584 -340 349 820 -167 -63 487 -246 -82 13 -271 3 223 -818 -757 320 75 -423 -192
1294a92Qk50M86j76P5J92k03l53P30L92o16k7L43k03J32j54J34J6j80n06M36M14
$$ -192 -184 -434 52 -124 -49 143 -60 -413 317 709 93 66 409 206 338 184 318 334 154 -352 84 498
1316D98l24o11J70j79L47J66j73l54pK0K22O34j89k74l94P8O25K55j31l01m7K9
$$ 498 174 -437 -267 -446 -99 67 -106 -460 -467 -447 -225 409 220 -54 -448 -370 255 510 379 78 31 60
1338F0j04K51O90m69p23K07K49K56j73m38p8R8j5o2L06j30m64k16O21N59m48l73
$$ 60 -44 207 897 428 -295 -88 161 417 244 -194 -272 -174 -189 -251 55 -75 -539 -755 -134 425 -23 -396
1360c96n7L5O30K20k16P1q9o83L17J230k60p83k82l9L53N44n7q26N03k62n77R28
$$ -396 -453 -418 212 432 216 287 198 -485 -168 1062 802 19 -263 -302 51 595 538 -288 215 -47 -624 304
1382C04M91j185n96N79L20Q3m2n59J38L58n5K64O43o42r01K27J423M0n25m80j93
$$ 304 795 -390 -986 -407 -87 -4 -46 -605 -467 -109 -164 100 743 101 -800 -573 850 890 365 -115 -308
1403c08R5M51L41L25n53p09m92M60J293J28j459j28L33l29n0J222l88q72r8k2
$$ -308 -213 238 579 904 351 -358 -850 -390 903 1031 -428 -556 -223 -552 -602 620 232 -640 -738 -760
1423g60M20J060n50j216Q67J072j122p5J153m90q49P85M60m62L52q84n52J858
$$ -760 -340 720 170 -1046 -179 893 -229 -304 849 359 -490 295 755 293 645 -239 -791 1067
1441A067K05j730O9P02j060p2J630K64j663n37K06O83O35J68r98m17P47l40q2
$$ 1067 1272 -458 -389 313 -747 -819 811 1075 -588 -1125 -919 -236 399 567 -431 -848 -101 -441 -523
1460e23J823O6k523M4K017l50n19J046j198o60J150j27o48J387l05k513J487K083
$$ -523 1300 1366 -1157 -1113 904 554 35 1081 -117 -777 373 246 -402 985 680 -1833 -346 1737
1478A737j901o59J085q26m45J633o35o51J062q52j085K392P55k611j36J729k24
$$ 1737 -164 -823 262 -564 -1009 624 -11 -662 400 -452 -1537 855 1610 -1001 -1137 592 368
1495C68m77O78k06k53m60K99O82O94q40j394K61J541nj317K55R74j578o33J943
$$ 368 -109 569 363 110 -350 -51 631 1325 485 -909 -648 893 888 -429 -174 800 -778 -1411 532
1514E32M94j549j91L06m13J243K57j580P74J078k343K51L235j330j946J526J80
$$ 532 1026 -523 -714 -408 -821 422 679 -901 -127 951 -1392 -1141 2094 764 -1182 344 524
1531E24r78J270l84j374J766K00k400J225J805k311n99K210j90j337J57o4J60
$$ 524 -454 816 432 -942 824 1024 -1376 -151 1654 -657 -1256 954 764 -573 -416 -480 -320
1548c20J050r93p31J285j35j652Q07J998p90j124j32O70O49k98l57Q57k05j190
$$ -320 730 -263 -994 291 156 -1496 -689 1309 519 -605 -737 -67 582 284 -73 784 579 -611
1566f11k29J284Q60n11j121P2Q54o78r91J394R81j740o83Q36kO8K74n56P46L56
$$ -611 -840 444 1304 793 -328 -256 598 -80 -1071 323 1304 -436 -1119 -283 -285 -217 57 -499 247 603
1586F03j634k41K300r4j596O10P63j056J8M85J19R36n90j707R16J355j344m41
$$ 603 -1031 -1272 1028 934 -662 -52 711 -345 -327 158 277 1213 623 -1084 -168 1187 -157 -598
1604e98J560k49j351r1N37N28L22j171m46J462m13j605J288J358q32j053M24K33
$$ -598 962 713 -638 -729 -192 336 658 -513 -959 503 90 -1515 -227 1131 299 -754 -330 -97
1622i7J23j66n4Q38O17j806m81J601L26q99Q4L34q9o43n36R56J004j029j288Q63
$$ -97 26 -140 -194 644 1261 -545 -1026 575 901 2 86 420 331 -312 -848 108 1112 83 -1205 -342
1642c42M90j96l07M7M65J23j046k63J577J55j523K46J298m45o27L83J15N60j86
$$ -342 148 -48 -355 -308 157 280 -766 -1029 548 703 -820 -574 724 279 -348 35 150 710 524
1661E24q98M82R47j285p25J613N12j543j37N51o1R1l39j21O39r6j349O56J420
$$ 524 -374 108 1055 -230 -955 658 1170 -373 -510 41 -20 71 -268 -389 250 154 -1195 -539 881
1680H81p12j097N28O65k90k94j54J021p5q83l8J168J86q86m48P70M65o47o21Q70
$$ 881 169 -928 -400 265 -25 -319 -473 548 473 -410 -448 720 906 20 -428 342 807 160 -461 409
1700D09M81j106p34J305L57q45k97R1K72L42o74k54J124j92j393O15J378n34j219
$$ 409 890 -216 -950 355 712 -133 -430 -339 -67 275 -399 -653 471 279 -1114 -499 879 345 -874
1719h74P38K09J28K0k52J09N58q96n08J552L82j142q94P92O49o30j6J19J9l29
$$ -874 -136 73 201 221 -31 78 636 -260 -768 784 1166 24 -870 -78 571 -59 -75 44 63 -266
1739b66n05O13P54k71j435L81Q68L87q09m0O76l40p99Q64Q52l67o14o59O41J060
$$ -266 -771 -158 596 325 -1110 -729 139 526 -283 -323 353 13 -786 78 930 563 -51 -710 -69 991
1759I91l88r26N00K95q75J10J154k24j209l21M74Q98L11j137o09N40L92l92N69
$$ 991 603 -323 177 472 -403 -293 861 637 -572 -893 -419 479 790 -347 -956 -416 -24 -416 153
1778A53N77p25j291M42J502M98j077o88M41K70J52R2L43j97q77n20J364J191j200
$$ 153 730 5 -1286 -844 658 1156 79 -609 -168 102 254 346 689 492 -385 -905 459 1650 450
1797D50j257K60O77q8J40J21l69l77m66M72J336j13j761k25J206N42l79m6r8m63
$$ 450 -807 -547 130 42 182 303 -66 -443 -909 -437 899 786 -975 -1200 6 548 169 123 25 -438
1817d38q6N22Q79K38j274j013R89J039j11o30k51j84J24K30O05L78j146j422M75
$$ -438 -524 -2 877 1115 -159 -1172 -183 856 745 115 -136 -320 -196 34 639 1017 -129 -1551 -1076
1836a076J577L61r98o65j2M38M07J33O10n90j209J27J430Q32j025q88nP37L46
$$ -1076 501 862 -136 -801 -813 -375 32 165 775 185 -1024 -897 533 1365 340 -548 -553 184 530
1855E30l04M65o8j109l86J197R81q92j126j46P74N28k0n73J27l79p23R96J177
$$ 530 226 691 623 -486 -872 325 1306 414 -712 -858 -84 444 424 -149 -22 -401 -1124 -128 1049
1874A049n85j188k45P07Q60J1q31o8L37k36MO80M89j038r09Q13J181k02p28m44
$$ 1049 464 -724 -969 -262 598 609 -222 -290 47 -189 -185 495 984 -54 -963 -150 1031 829 101 -343
1894c43L52L9k22L90L56o83q06r6J344O27j277n87P07L60o04M54J60K8m63k43
$$ -343 9 48 -174 216 572 -111 -917 -1013 331 958 -319 -906 -199 161 -443 11 171 199 -264 -507
1914e07M92J029m14j316N52Q64n56m18N44K51p17J8K40K47K15r26k32R29L42j070
$$ -507 -15 1014 600 -716 -164 700 144 -274 270 521 -196 -178 62 309 524 -402 -634 295 637 -433
1934d33k35Q66j49n11oM15L08n47l34O72P06o83r25O79J117o92q33O22M87m03
$$ -433 -668 198 49 -462 -468 -53 255 -292 -626 46 752 69 -856 -177 940 248 -585 37 524 121
1954A21m75P39J31m73o13K43J003O2j150l41R43J82n85o9K45k31m20L63Q02q8
$$ 121 -354 385 516 43 -570 -327 676 738 -412 -753 190 372 -213 -282 -37 -268 -688 -325 477 389
1974C89o01p58L05J342P1r25J32J85p30K34J406j55p44q66mR60J236r00j396P61
$$ 389 -212 -970 -665 677 748 -177 -45 140 -590 -356 1050 895 151 -715 -719 241 1477 577 -819 -58
1994e8J24r76J048J206j296j294L91Q35N02K41j313o95J545N6j191J305O52k110
$$ -58 66 -910 138 1344 48 -1246 -855 -20 482 723 -590 -1285 260 316 -875 430 1082 -1028
2012a028o6K322Q4j314n01k78M29J758j16j536jJ05j429J582K523j365k813K74
$$ -1028 -1094 1228 1312 -2 -503 -781 -352 1406 1290 -246 -247 -142 -1571 11 2534 1169 -1644 -1370
2030a370P31M21J437N3j765p76O06k71J390J752j691k858J486J897q41L03N74
$$ -1370 -639 -218 1219 1272 -493 -1269 -663 -934 456 2208 517 -2341 -855 1042 201 504 1078
2047A078j571m17J436j95j88R86j481j433L006J001l274n45K379j299N8K332j046
$$ 1078 -493 -910 526 331 143 1129 -352 -1785 1221 2222 -1052 -1597 782 -517 -459 1873 827
2064H27k651O34Q48J1K641n09m633M02L211n80J7K434k154l663J774K436q7P00
$$ 827 -1824 -1190 -342 -331 2310 1801 -2832 -2430 781 201 218 2652 498 -3165 -1391 1045 958 1658
2082A658m57l392O03K849o24n97J628j472k789K113K344j567r39N95r60N51J907
$$ 1658 1201 -2191 -1588 1261 637 40 1668 196 -2593 -480 1864 297 -642 -47 -1007 -456 1451
2099A451j345j924J980L56j852J989J543l492j264L283O90j195J031j436k230
$$ 1451 106 -1818 162 518 -1334 655 2198 -1294 -2558 725 1415 220 1251 -185 -2415
2114b415K289J703j471J053L46l851k42M595j34k354Q98n21k014J894J906j853
$$ -2415 -126 1577 106 1159 1505 -2346 -2588 2007 1873 -481 417 -104 -2118 -224 1682 -171
2130a71n1N36k112Q69L122j204k875J545J145j766J222J390j806j285J649J1J57
$$ -171 -222 314 -1798 -929 2193 989 -1886 -341 804 -962 260 1650 -156 -1441 208 219 376
2147C76J229j475k505K234J848j533k29J211j793j287K677P20j450k7n61j261
$$ 376 1605 130 -2375 -141 1707 174 -55 1156 -637 -1924 753 1473 23 -4 -565 -1826
2163a826K049J586k319m67J604j243p64K465L99k391J47R22m33J189L00j798l45
$$ -1826 223 1809 -510 -977 627 -616 -1380 1085 1484 -907 -760 162 -271 918 1218 -580 -925
2180i25J588o38l99J803m85k715Q91J931l94n75J34p37n58J331L7l71M53k15j645
$$ -925 663 25 -374 1429 944 -1771 -880 1051 657 82 216 -521 -1079 252 289 -82 371 156 -1489
2199a489J106J513q26j183R91J34o39P09J57r18N06L44p40O55R21j646o94J762
$$ -1489 -383 1130 304 -879 112 246 -393 316 473 -445 61 405 -335 320 1241 -405 -1099 663
2217F63J80j109K40L57q31K8N71o5L25j97j300L44J480k71q69K81L93o32oO60
$$ 663 843 -266 -26 331 -500 -472 99 34 359 162 -1138 -794 686 415 -454 -173 220 -412 -418 242
2237B42J21j58n64j00O80M12m51m41L32M18o93k73Q18K88r65J15N87j32m13l7
$$ 242 363 205 -359 -459 221 633 182 -259 73 491 -202 -475 343 631 -334 -219 368 236 -177 -214
2257b14q9K75N12q37l13J001j75p84P52M89p06l65K14L11L61l43n39N67N71q62
$$ -214 -303 -28 484 -353 -666 335 160 -624 128 617 -89 -454 -240 71 432 89 -450 117 688 -174
2277a74k81Q89P6j021L56M40j15j61n63J92Q39k98r64O84K11m27jM84m0m9m82
$$ -174 -455 434 510 -511 -155 285 170 9 -554 -362 477 179 -785 -101 110 -317 -318 166 126 77 -405
2298d05l94J044K93p64n6N27k52k81M72J70k31j56m25L77R77p06r17R27K6m31
$$ -405 -799 245 538 -226 -282 245 -7 -288 184 354 123 -33 -458 -81 896 190 -727 200 226 -205
2318b05K19O6j75J39n89p3J323k51j104M9O62R1l64K33Q0k47r7l21Q01J049j419
$$ -205 14 80 -95 44 -545 -618 705 454 -650 -601 61 152 -212 21 101 -146 -243 -564 237 1286 -133
2339a33o73J088M9m03L53p9j92j87j74L33Q01n99j070M08R59m07j19R2k06k2M0
$$ -133 -806 282 331 -72 281 202 10 -177 -351 -18 783 184 -886 -478 481 74 -45 47 -159 -181 -141
2360a41o0O48j11j052J49R22J35k29n70pL44J0j30N68K18r19m34P40N81l11l64
$$ -141 -201 447 336 -716 -567 355 490 261 -309 -316 28 38 -92 476 694 -225 -659 81 662 351 -13
2381a3l08K40L11n54L48P18p90j192Q86O28K37o10l47J74K25p9l1O95N0j318l2
$$ -13 -321 -81 230 -324 24 742 -48 -1240 -354 274 511 -99 -446 -272 -47 -126 -157 538 588 -730 -762
2402g62J440L4o22l03J97K18l0l20L96L08p04m15O06N67k45q34k6P07r2n17M08
$$ -762 678 712 90 -213 -16 202 172 -148 248 556 -148 -563 43 610 365 -469 -495 212 120 -397 11
2423A1R6m64Q3L15J59M26n98q67N73J256p55o54R75l35j021Q56O98k96l45l40
$$ 11 107 -357 -274 41 200 626 28 -839 -266 990 235 -419 556 221 -800 56 754 458 113 -227
2443b27p39J144P75j177j58R37q51r59J688N59j040m59J94j06P72j37m72K68L98
$$ -227 -966 178 953 -224 -382 555 -296 -1255 433 992 -48 -507 -313 -419 353 216 -256 12 410
2462D10p92k41J179J26j281J31J217j57p13L08k68k73N63J51m40L57R4j539L17
$$ 410 -382 -623 556 682 -599 -468 749 592 -121 187 -81 -354 209 360 -80 277 371 -1168 -851
2481h51K171n55j581N25K99j123J041J029q19m08K03j151P02K126j018j703J467
$$ -851 1320 765 -816 -291 8 -1115 -74 955 136 -272 -69 -1220 -518 1608 590 -1113 354
2498C54J60j640J063J338j065n75O30o14L58Q74j194m29J529j53j696Q11J070
$$ 354 514 -1126 -63 1275 210 -365 265 -349 9 883 -311 -740 789 636 -1060 -249 821
2515H21j402m96J872p5j134J25j41k90J258N77j594M0Q36j067k22K681n28k299
$$ 821 -581 -1077 795 720 -414 -289 -430 -720 538 1115 -479 -439 397 -670 -892 1789 1261 -1038
2533a038L14R46q32R03J067j383m66R78j239J0K392p95k450J022J267j379K96
$$ -1038 -724 222 -610 293 1360 -23 -489 489 -750 -740 1652 857 -1593 -571 696 -683 -387
2550c87J181j137k47Q92o74j0J314j108j002J735O26j583l48J126l23l36P57K36
$$ -387 794 -343 -590 302 -372 -382 932 -176 -1178 557 1183 -400 -748 378 55 -281 476 712
2568G12o29n14j2J59J062K14j354m49J066l33o63J214P66j905m60J217L8k01O70
$$ 712 83 -431 -443 -284 778 992 -362 -811 255 -78 -741 473 1239 -666 -1126 91 129 -72 598
2587E98q69p51J444k72q68J174M10j887L94J542q42m60Q09n36j92J106o48q07
$$ 598 -271 -1022 422 150 -718 456 866 -1021 -627 915 73 -387 422 -114 -306 800 152 -655
2605f55J224l27j492J419R75j297l46O19m84J09N87l67r7N06q10m99J313J27p76
$$ -655 569 242 -1250 169 1144 -153 -499 120 -364 -255 332 -35 -132 374 -436 -935 378 505 -271
2624b71J04M59l34k30Q8N47J64k16o40K42O18m66o01P98K28n50k40L44J69j94
$$ -271 -167 292 -42 -272 -184 363 527 311 -329 -87 531 65 -536 262 490 -60 -300 44 213 19
2644A9k98K10K61j05n06k10N13N25k09j93J44k95o88N09J058R0n60o50j88K87
$$ 19 -279 -69 192 87 -419 -629 -116 409 200 7 151 -144 -832 -323 735 825 265 -385 -573 -286
2664b86O74n2J39K34j047r35J353Q64o34m07J55n95J00P44j84N6K86j014l52J511
$$ -286 388 336 475 709 -338 -1273 80 944 310 -97 58 -537 -437 307 123 179 465 -549 -901 610
2684F10K2j210K59O81n96L25L10n71k28O42k64M03N34r01j236R17J261m35m61
$$ 610 632 -578 -319 362 -234 91 401 -170 -398 244 -20 383 917 16 -1220 -303 958 523 62
2703F2L82j046m05J089N24j27n3j215n73J305J066o91m81L24r41k71J538O37p87
$$ 62 444 -602 -1007 82 606 479 426 -789 -1362 -57 1009 318 -163 161 -780 -1051 487 1124 337
2722C37o05l31K8J063N51j306r8K38J4j16J271k87j341l83J142O23k79l94r75
$$ 337 -268 -599 -571 492 1043 -263 -361 -123 -109 -225 1046 759 -582 -965 177 800 521 127 -848
2741h48r7J043M84k70j8n13j099P41J620J3j065n22r3K20J056J70m72p00j77j92
$$ -848 -945 98 582 312 294 -219 -1318 -577 1043 1056 -9 -531 -624 -404 652 822 350 -350 -527 -719
2761g19J147J222r94j783K29Q68K74L94L4j160m79O18O61N01Mj534r11J408J009
$$ -719 428 1650 656 -1127 -898 -30 244 638 672 -488 -967 -349 312 813 817 -717 -1628 -220 789
2780G89l04j25l66j168M17J402N48o00r86r00O23J518M06j051p41Ok10R16J021
$$ 789 485 360 -6 -1174 -757 645 1193 593 -393 -1293 -670 848 1254 203 -538 -532 -742 174 1195
2799A195j90j472q74R05Q60O43o52j118k15N31M57N45J60q83j204N05J063Q64
$$ 1195 1005 -467 -1341 -436 424 1067 415 -703 -918 -387 70 615 775 -108 -1312 -807 256 1120
2817A120n83j252k49O91P38M52k09q99o40P5J069J124o63j345m73P86O89K93J7
$$ 1120 537 -715 -964 -273 465 917 708 -191 -831 -756 313 1437 774 -571 -1044 -258 431 724 741
2836G41j063o23K19P10J050k7j640q06J028J028J25l52m54p15k5Q65Q84O3j039
$$ 741 -322 -945 -726 -16 1034 1007 -633 -1439 -411 617 742 390 -64 -779 -804 61 945 1008 -31
2855c1j089M85J275K15n01l72m09l57P24R75j0q65j148K26J158P71o26o97l87
$$ -31 -1120 -635 640 855 354 -18 -427 -784 -60 915 905 40 -1108 -882 276 1047 421 -276 -663
2874f63O6L98O05L72p71j034J59J013P30l02o88o18L56N43L75O0k73q91l17R67
$$ -663 -597 -199 406 778 7 -1027 -868 145 875 573 -115 -733 -377 166 541 601 328 -563 -880 87
2894H7J033m04r76m25K14P72J97o9l47o10j90L70J046J41j082o63N05M80J95K4
$$ 87 1120 716 -260 -685 -471 301 498 429 82 -528 -718 -348 698 839 -243 -906 -401 79 274 298
2914B98r5n27j73L43P07L20o45j009L07Q98J08k84k33m2p67M76O02L32l13p16
$$ 298 203 -324 -497 -154 553 873 228 -781 -474 424 532 248 15 -27 -794 -318 284 616 303 -413
2934d13l47M08Q70k21o69M16p7l60L77M28l06m51J0L16L04O1n68j49N06k1l90
$$ -413 -760 -352 518 297 -372 44 -33 -393 -16 412 106 -345 -335 -19 285 346 -222 -371 135 114 -276
2955b76N63J89p27p4L51K28p8k72k05M02R6l35p1N96k46n54K89L58n8k36m15M26
$$ -276 287 476 -251 -325 26 254 176 -96 -301 101 197 -138 -209 387 141 -413 -124 234 176 -60 -475 -49
2977d9J65l08k5M27L24l50o65K50M51J31j83Q1j16l44k57O49M77k91o28k13K42
$$ -49 116 -192 -217 210 534 184 -481 -231 220 351 168 249 133 -211 -468 181 658 367 -261 -474 -232
2998b32K48M5J01K55n38m72K97O62K8l88m02r1P32N3n71L43L36q38J21R23j84
$$ -232 16 61 162 417 -121 -593 -296 366 394 6 -396 -487 245 298 -273 70 406 -432 -311 612 428
3019D28o96k4J28L59N40o70l82L08q9k92P88N01j095q90M77P84L58J11o70q18
$$ 428 -268 -292 -164 195 735 65 -317 -9 -98 -390 398 899 -196 -1086 -609 175 533 644 -26 -844
3039h44L13M85K23M16k79j084m60J266R91q33l78M1l69L60R92k91n90j07m85K1
$$ -844 -531 -46 177 593 314 -770 -1230 36 1027 194 -184 -143 -512 -152 840 549 -41 -148 -633 -612
3059f12J669J25k071lJ086n26P01R66j581j184R34K02L17J449j025k318R98J771
$$ -612 1057 1182 -889 -892 194 -332 369 1335 -246 -1430 -496 -294 23 1472 447 -1871 -873 898
3077H98p17J5Q01j572r12J786O71o15n6p00q77J670R55j375p36Q55n79r3J645
$$ 898 181 196 997 -575 -1487 299 970 355 299 -401 -1278 392 1347 -28 -764 91 -488 -581 1064
3096A064oj747l82O12N15Q95K35j539j435J597N74l31J002Mk862J57K591R7p68
$$ 1064 1058 -689 -1071 -459 56 951 1186 -353 -1788 -191 383 52 1054 1058 -1804 -1647 944 1041 273
3115B73N89j443j235K316Q12j418M20J93k248R57K641j263j699J360j08q29J524
$$ 273 862 -581 -1816 500 1312 -106 314 507 -1741 -784 1857 594 -1105 255 147 -682 842
3132H42R6j995L72J116q73Q49J347k345j696K326J089j120R23m90k092Q77J516
$$ 842 938 -1057 -685 431 -442 407 1754 -591 -2287 39 1128 8 931 441 -1651 -774 742
3149G42N0k0K36k382n57K703Q17j481j39R1j248L98K025l31j362K59n10j19J759
$$ 742 792 772 1008 -1374 -1931 772 1589 108 -31 60 -1188 -790 1235 904 -458 -199 -709 -828 931
3168I31J09k033M46R56o67M6J287r39j590J199J108m98L0j48j446O35J990o41
$$ 931 1040 -993 -547 409 -258 -212 1075 136 -1454 -255 853 355 385 237 -1209 -574 1416 775
3186G75r47N88q37j137J791J393j370q08J36m85N60J558p37j192O51j70p04J609
$$ 775 -172 416 -421 -1558 233 1626 256 -552 -416 -901 -341 1217 480 -712 -61 -231 -935 674
3204F74P43j859p00J380m3k13Q26r00r45J097O62p05N70j57j588L58J939n06j035
$$ 674 1417 -442 -1142 238 195 -18 808 -92 -1037 60 722 17 587 430 -1158 -800 1139 633 -402
3223d02O28o05o01J232L53n75p7k53n80R97R65r38q46N15J84j69N42J82o80l60
$$ -402 226 -379 -980 252 605 30 -47 -300 -880 117 1082 144 -702 -187 -3 -172 370 552 -128 -488
3243d88J02N39N65l11m88n63O23M69j89j47L9m14l18O28N42m88n29j32L71N14
$$ -488 -386 153 718 407 -81 -644 -21 448 259 112 151 -263 -581 47 589 101 -428 -560 -189 325
3263C25O3m08m18O35n30j33R14J58r60o4M12K7K59r2k40r2J62k43J93P66m65q97
$$ 325 388 -20 -438 197 -333 -466 448 606 -354 -418 -6 21 280 188 -52 -144 18 -225 -32 734 269 -628
3285f28L46O82k90k26J5k45K23J77k61M08L5n92j46P82O9m78M7J2M7J62k71J50
$$ -628 -282 400 110 -116 -101 -346 -123 54 -207 201 236 -356 -502 280 349 -129 -82 -70 -23 139 -132 18
3307A8L52k69m51K50M41j49k70m2J15K31k06k2J61L2o05j3N49J13m64K06N5j4
$$ 18 370 101 -350 -100 341 192 -78 -120 -5 226 20 -2 159 191 -414 -427 122 235 -229 -23 32 18
3329A8J52l79K85J74l44l85M68K96j50m09J74J72J64m50J82K78j37m38J3O36J30
$$ 18 170 -209 76 250 -94 -479 -11 285 135 -274 -100 72 236 -214 -32 246 109 -329 -316 320 450
3350D50o49J1J50k9k3PJ90p6m48nN91K92l64o23N01k6J23j41L27j56l34k09M14
$$ 450 -199 -188 -38 -67 -90 -83 107 31 -417 -422 169 461 97 -526 -25 -51 72 -69 258 102 -232 -441 -27
3373b7M97j09q25J25M67NQ8j62l3r3j24L3M60o5n85k51N43L54k51q2K6k57j5J59
$$ -27 470 361 -464 -339 128 133 221 59 26 -67 -191 -158 302 237 -348 -599 -56 298 47 -35 -9 -266 -281 -122
3397a22L88K52o75m09J39P04K89n62n3p5K03m9L73q7l65k68k1P14J56l14n83J22
$$ -122 266 518 -157 -566 -427 277 566 4 -49 -124 79 30 403 316 -49 -317 -338 376 532 218 -365 -243
3419b43K23j1J95Q2k98o15J37Q27K66k16q69O8K91L91Q7j5r0n99k34P25O83m31
$$ -243 -20 -31 164 246 -52 -667 -530 297 563 347 -522 -454 -163 228 315 300 210 -389 -623 102 785 354
3441C54o81k57N71K78K9j14l82K58m66K19O58k1r38k05P50L50j03j39o44m9M54
$$ 354 -327 -584 -13 265 294 180 -202 56 -410 -191 467 446 -492 -697 53 403 300 161 -483 -532 -78
3462g8K42J54J94n51r98P44R29O5p32o9j16j85N74M27l79l54l47j1R53M30r01
$$ -78 164 318 512 -39 -1037 -293 636 701 -31 -100 -216 -401 173 600 221 -133 -480 -491 462 892 -9
3483io53N15K37q9J60K17p22m03N72N98J02j8j025l38J063L77l05j56j4p29J55
$$ -9 -662 -147 90 1 161 378 -344 -747 -175 423 525 507 -518 -856 207 584 279 123 109 -620 -465
3504d65Q81M61p71l19l93L48P25J57p00K5p6l85L84R34l65j246J27O52J15K25
$$ -465 416 877 106 -213 -606 -258 467 624 -76 -51 -127 -512 -128 806 441 -805 -678 -26 89 314
3524C14m3p83J16M66j84J94L37m56j064R34J177p82j94Jm94J20O20L31n50k7n31
$$ 314 271 -512 -396 70 -114 80 417 -39 -1103 -169 1008 226 32 33 -461 -341 279 610 60 33 -498
3545d98l22J287N01j102l01M30l13j8P67j49o11J34K28j29M58J94j029j42Q45
$$ -498 -820 467 968 -134 -435 -5 -318 -336 431 282 -329 -195 33 -96 362 556 -473 -615 230
3564B30K6n95N72n1p05M08P48k4n79j45n85M26J089n10p04L34K00p71O14Q73n33
$$ 230 256 -339 233 182 -523 -115 633 609 30 -115 -700 -274 815 305 -399 -65 135 -636 -22 851 318
3585C18o87j03K89L30M20l03o87K81K40m19K97O53p49k83N84K06l81p4J91j47
$$ 318 -369 -472 -183 147 567 264 -423 -142 98 -321 -24 629 -120 -403 181 387 6 -68 123 -24
3605b4J23J81l01k01M04l63k40R46J21j055j45N11j74K8M79j45m00K20l19J26
$$ -24 99 280 -21 -222 182 -181 -421 525 646 -409 -554 -43 -217 -189 290 145 -255 -35 -354 -228
3625b28P29j19o34n0M62k56m5M15R3l99j63J3P2L97k25k00K65J69o53o8O30J2
$$ -228 501 382 -252 -302 160 -96 -141 274 367 -32 -195 -182 -110 287 62 -138 127 296 -357 -425 205 217
3647B17j88J46o1n7k23J22K6K32j45l88J64J96j45l1J83R2j51j35M0Q2j3m5K08
$$ 217 29 175 114 57 -166 -44 -18 214 69 -319 -155 41 -104 -135 48 140 -11 -146 -106 -24 -37 -82 126
3670A26j1l5l80K4K66L27j91l03pr5J84K18K60n2n09k41L45L61o4l78J96N1l61
$$ 126 115 80 -300 -276 -10 317 126 -177 -184 -279 -95 123 383 331 -178 -419 -74 287 223 -155 41 92 -269
3693b69K84J87N9k17l44R5M93J43n63k16L77l9j6J53J7l31j96K84K89K31l54n53
$$ -269 15 202 261 44 -300 -205 288 431 -132 -348 29 -10 -26 127 144 -187 -383 -99 190 421 67 -486
3715d86P7N18K8J23j85m53L5l9O95J28k12m76j90J31O79J45l74j55l67r5O10M37
$$ -486 -409 109 137 260 75 -378 -343 -382 313 441 229 -247 -437 -306 373 518 144 -11 -378 -473 137 574
3737E74l25n98n7L47L03J25k69o19K66K16K2M21J17j013k71N97N28P6k67m11m41
$$ 574 249 -349 -406 -59 244 369 100 -519 -253 -37 -15 406 523 -490 -761 -164 364 440 173 -238 -679
3758f79N70K94K83k58l91m61M20P78P8m18m73k17J84N19M21n21l27k24M8O70K57
$$ -679 -109 185 468 210 -181 -642 -222 556 634 216 -257 -474 -290 229 650 129 -198 -422 -374 296 553
3779E53j54r87j3N60L05P2j86m20k61K67N84L96m36n91n46O73Q79j42m44k45m10
$$ 553 399 -588 -601 -41 264 336 150 -270 -531 -264 320 716 280 -311 -857 -184 695 553 109 -136 -546
3800e46M6Q99K78m69m31l81J81O93L87n22p28K03PM75L85J20j114l1L29P72L4
$$ -546 -500 399 677 208 -223 -604 -423 270 657 135 -593 -390 -383 92 477 597 -517 -548 -219 553 587
3821E87l70o35j86M41M66M1pm85o53M97O64L36l77n47m14L78N63L43m57o14r1
$$ 587 217 -418 -604 -163 303 344 337 -148 -801 -304 360 696 319 -228 -642 -264 299 642 185 -429 -520
3842e20J97M24O95n32o57j21K49O24K65m56m39l69L38M88L74n7p67l50N53N20
$$ -520 -323 101 796 264 -393 -514 -265 359 624 168 -271 -640 -302 186 560 503 -264 -614 -61 459
3862D59J06m06l48j32j1O17L33k81o04l00K53Q38K59o18n77j16L66M37K67j84
$$ 459 565 159 -189 -321 -332 285 618 337 -267 -567 -314 524 783 165 -412 -528 -162 275 542 358
3882C58o68k83L01O27J73k83o35qL93L80l0k2m09l91K63N10K87l27m89j52L78
$$ 358 -310 -593 -292 335 508 225 -410 -418 -25 355 325 303 -106 -497 -234 276 563 236 -253 -405 -27
3903b7M71j50k53j36j74j44N98N08n24m70K1J55L88K22o09K9j3K8J27N42l53o33
$$ -27 444 294 41 -95 -269 -413 185 693 169 -301 -280 -125 263 485 -124 -95 -108 -80 47 589 236 -397
3925c97j01N11L61K5l37k44j8J48k9L41j67k39j76J30M47o2j22l12J25r8K16K01
$$ -397 -498 13 374 399 62 -182 -200 -52 -81 260 93 -146 -322 -192 255 193 71 -241 -116 -214 2 203
3947B03l9k47j03m2K34L20k45k59o9L25k47P8M32m39j19L24p5O3R0k29j3K38k5
$$ 203 164 -83 -186 -228 6 326 81 -178 -247 78 -169 -91 341 -98 -217 107 32 95 185 -44 -57 181 156
3970A56k11J18M8n2o8J9K7k8j85N5lJ47j12r9K73k59k7P8L89O2k29l73L12Qj80
$$ 156 -55 63 111 59 -9 10 37 9 -176 -121 -124 23 -89 -188 85 -174 -201 -123 266 328 99 -274 38 46 -134
3995a34j35J67K76j99p5l33L51R3J35o1m2pl72K40K33j0j84j34M0L29r2q8P7o6
$$ -134 -269 -102 174 -25 -100 -433 -82 11 146 85 43 36 -336 -96 137 127 -57 -191 -151 178 86 -2 75 9
4019Ik39K37K19n3o9l34Q5L94l5l00q8N7O4J76m9Rk31j30J44K92K32k81l35N5
$$ 9 -230 7 226 173 104 -230 -145 249 214 -86 -174 -117 -53 123 74 83 -148 -278 -134 158 390 109 -226 -171
4043a71m9K38J78J38m12k17r2L70J56K39m64j16R0K50L6JNm12L4K33J55j42k46
$$ -171 -220 18 196 334 -78 -295 -387 -17 139 378 -86 -202 -112 138 174 175 180 -232 -198 35 190 48 -198
4066a98j0J0L75J01k60m82J13J73J08N75p5p66k80N82L19o2J23n16l85L47M26
$$ -198 -208 -198 177 278 18 -464 -351 -178 -70 505 430 -336 -616 -34 285 223 346 -170 -555 -208 218
4087B18j3L13k83j113O52O33j14k09l3k64l35P86Q6k64L5l49l53O54M95l84o36
$$ 218 205 518 235 -878 -226 407 293 84 51 -213 -548 238 324 60 95 -254 -607 47 542 158 -478
4108d78K50K39K3K27J23p55k02N10K51L49R1p44n22N46L21K9L0J7q45o0Q19J60
$$ -478 -228 11 34 261 384 -371 -573 -63 188 537 628 -116 -638 -92 229 258 288 305 -540 -600 219 379
4130C79j72P0o75j57N10M73m35j13K38o44J70R21k33p47Q8L20q3L21J92p43j63
$$ 379 207 277 -398 -555 -45 428 -7 -120 118 -526 -356 565 332 -415 -327 -7 -90 231 423 -320 -483
4151d83O00r3K03K70m58q86O32Q86l22j00p5n52k63J003J36l19k3l95o03P66P68
$$ -483 117 24 227 497 39 -847 -215 671 349 249 174 -378 -641 362 498 179 156 -239 -842 -76 692
4172F92n54l99K14k45j3P34Q9q52J0K71k74O00J29o32l52O32nj01N21l56m87n5
$$ 692 138 -261 -47 -292 -305 429 518 -334 -324 -53 -327 273 402 -230 -582 50 45 -56 465 109 -378 -433
4194d33P44m8j07Q3p14j2P01J35l37j01om64L24Q15j48p36J51j87J69N05K39o76
$$ -433 311 263 156 239 -475 -487 214 349 12 -89 -95 -559 -235 580 432 -304 -153 -340 -171 334 573 -103
4216a03j32L54k20K09M07m02o26O01J85l03K65o9p43M67N17k67q7L6k77l35M63
$$ -103 -235 119 -101 108 515 113 -513 88 273 -30 235 166 -577 -110 407 140 53 89 -188 -523 -60
4237f0O58m28k58J08l86L36L48j45k63J1j89J4O92q0m17j68O2J82J11J59q1m24
$$ -60 598 170 -88 20 -366 -30 318 173 -90 -79 -268 -254 438 358 -59 -227 -165 17 128 287 206 -218
4259b18J86m3J74J4K4m15J99J04J14p3l8k8k52J70K44J43l64k54J66JL23L0q3
$$ -218 -32 -75 99 113 137 -278 -79 25 139 66 28 0 -252 -82 162 305 -59 -313 -147 -146 177 207 124
4282A24j92m3k0J82K42k98p2O0J28K4O7r4k78J32K58m59J57k4k8k1J98P9k53j9
$$ 124 -68 -111 -131 51 293 -5 -77 -17 111 135 202 108 -170 -38 220 -239 -82 -106 -134 -155 43 122 -131 -150
4306a50K5O3R8M1j53P5J35k85J50J21J1k28L3J79m2k13J85j50J20m8NM7l0M1j85
$$ -150 -125 -62 36 77 -76 -1 134 -151 -1 120 131 -97 -64 115 73 -140 45 -105 15 -33 -28 19 -11 30 -155
4331a55J05N7Q6j61J12P1o5Q8l39J63Nj3O3N9q6o2LK39qj56l00J34J53Q0qj20
$$ -155 -50 7 93 -68 44 115 50 138 -201 -38 -33 -46 17 76 -10 -72 -69 170 162 6 -294 -160 -7 73 65 -55
4357e5J42j77j73M12N7k5l29L7n5L74ml96K84k48j24L46M7J09j11k11L1J48P9
$$ -55 87 -90 -263 149 206 181 -148 -111 -166 208 204 -192 92 -156 -280 66 113 222 111 -100 -69 79 158
4380A58j14m1k59J88J00K27j18k12k04j2L21J57M1l20k42J01J45K10q9Q3n08L71
$$ 158 44 3 -256 -68 32 259 141 -71 -275 -287 34 191 232 -88 -330 -229 -84 126 37 120 -388 -17
4402a7R4N2j83j61N4P4J6K46P0j37l01j71M42J93q2l96k02L81NJ55M6j64k54m2
$$ -17 77 129 -54 -215 -161 -87 -71 175 245 108 -193 -364 78 271 189 -207 -409 -28 -23 132 178 14 -240 -282
4426b82J37M03K14n80j89M0L36J25k4k17l03J51J97N18l21r5m53QM08M10l17l00
$$ -282 -145 258 472 -108 -297 -257 79 204 180 -37 -340 -189 8 526 205 110 -343 -335 73 483 166 -134
4448a34Rp3K17K67J16m21k44n2L15J79lj65m77L51J12J40O8O8n42K5M00K62l11
$$ -134 -125 -198 19 286 402 -19 -263 -315 0 179 176 11 -466 -115 -3 137 205 273 -269 -244 156 418 107
4471A07j06k95j6K85K43mm08O6r1L91M53l64m15l9o7L47J15P6n88k4R5J65L15
$$ 107 1 -294 -310 -25 218 214 -194 -128 -219 172 625 261 -154 -193 -260 87 202 278 -310 -334 -239 -74 241
4494B41K98m73n82L08M00j57J20j73l67J86K68J98m4p5k89j80O43K75n89k00K15
$$ 241 539 66 -516 -208 192 35 155 -18 -385 -199 69 267 223 148 -141 -321 322 597 8 -192 23
4515B3k96J29M19n8l85o1J47J5M25M7n88k12M99k22J39L98l43n80J32M76q5J35
$$ 23 -273 -144 275 217 -168 -229 -82 -67 358 405 -183 -395 104 -118 21 419 76 -504 -372 104 19 154
4537A54K00l78l48M37P8j35L21m55l08L48N08l30k94L45m78K81K50q2l74R4J68
$$ 154 354 -24 -372 65 143 8 329 -126 -434 -86 422 92 -202 143 -335 -54 196 114 -260 -166 2
4558Bj4J02P6l32k86L91K32l32L98j53m43L15J15K1P8M6m27k19M38R2k16J99n9
$$ 2 -12 90 166 -166 -452 -61 171 -161 237 84 -359 -44 71 92 170 216 -211 -430 8 100 -116 83 24
4581B4m49K05M40k09J33k19l8J10K02k11j37K52n1j24Q8K98l59k37K51K13j73
$$ 24 -425 -220 220 11 144 -75 -113 -3 199 -12 -149 103 52 -72 16 314 -45 -282 -31 182 9
4602Ij9J3l47K53K42j09J51O8l92k08K86K09J28j81j75p1j8L97j30j47L17l06
$$ 9 -10 3 -344 -91 151 42 193 261 -131 -339 -53 156 284 103 -72 -143 -161 236 106 -41 276 -30
4624c0k53K31J49k76l1M09j41j73L04j55r8L2J77j79K15n6l42J79L44j29k71J49
$$ -30 -283 -52 97 -179 -210 199 58 -115 189 34 -64 -32 145 -34 181 125 -217 -38 306 177 -94 55
4646E5l6q1J16O9o7j07J8l5m8O7K1n8J42L4k72Q1N9L8L2M9j71j19K22j01J49J77
$$ 55 19 -62 54 123 56 -51 -33 -68 -116 -49 -28 -86 56 90 -182 -101 -42 -4 28 77 -94 -213 9 -92 57 234
4672B34J12m48J05R4k17l8K69Pk85J77J22N2n4j98j2J76K28k95q5j13K21R5k55
$$ 234 346 -102 3 97 -120 -158 111 118 -167 10 132 184 130 -68 -80 96 324 29 -56 -169 52 147 -108
4695a08K2K49k20PJ20J78j22j33l0j13J01N2K1J76k8k60k03M48Q8j63k27N5O9
$$ -108 -86 163 -57 -50 70 248 126 -7 -37 -150 -49 3 24 200 172 -88 -291 157 245 82 -145 -90 -21
4718b1kK10j27R9j22j40kJ68k3k3QO1j9k04J57l1Qj65K72O0l4l23j66L97O5Lj20
$$ -21 -23 187 60 159 37 -103 -105 63 40 17 25 86 67 -137 20 -11 -3 -168 104 164 130 -193 -359 38 103 106 -14
4745a4k6l3n6P3J77N8k70KjJ64PP7q9m04M88k66J39J37r7l08K83n8J13J9o0j45
$$ -14 -40 -73 -129 -56 121 179 -91 -89 -90 74 81 158 69 -335 153 -113 26 163 66 -242 41 -17 96 115 55 -90
4771i0O7M9O6p3r8j26j38L76K64j88m27L40R6n6M6r2o7n6q7J4L57n6k80rJ38N5
$$ -90 -23 26 92 19 -79 -205 -343 33 297 109 -318 22 118 62 108 16 -51 -107 -194 -180 177 121 -159 -168 -30 25
4797B5j13K00l7k74l9K58Q8J60m03J5J7K80n2j30j50O7P0k43K55J40k11M8j10
$$ 25 -88 112 75 -199 -238 20 108 268 -135 -120 -103 177 125 -5 -155 -88 -18 -261 -6 134 -77 -29 -139
4820a39O5J53j05j68J34M9K4L6J9n5p6l4K81N6j73k52R1J19J11j81J73k04j64
$$ -139 -74 79 -26 -194 -60 -11 13 49 68 13 -63 -97 184 240 67 -185 -94 25 136 -45 128 -76 -240
4843b40P6J32J62J1l29J91R9j69K01k3j3l17K5J71Q8o6j50J60j31R6k3J96j04
$$ -240 -164 -32 130 141 -188 3 102 -67 134 111 98 -219 -194 -23 65 -1 -151 9 -122 -26 -49 147 43
4866D3l1l8j44J72K5Nj70J35K3j29J89L7j59p6P1J46j65J38j28m6Q3J92k46k0
$$ 43 12 -26 -170 2 27 32 -138 -3 20 -109 80 117 -42 -118 -47 99 -66 72 -56 -102 -19 173 -73 -93
4890i3J01M9p1R4o7P7k31J65J34N1j21j90K03k2q3j23K22j13k9p5J24K3M7k71
$$ -93 8 57 -14 80 13 90 -141 24 158 209 88 -102 101 79 -4 -127 95 -18 -47 -122 2 25 72 -199
4914a99K17M4Rk3j24K26j61j30J86o3O4k36N3K43j63j7j9O8L5J28Op2Mp2p2M3
$$ -199 18 62 71 48 -76 150 -11 -141 45 -18 46 -190 -137 106 -57 -74 -93 -25 10 138 144 72 76 4 -68 -25
4940b5J73k04K11j23n0O4l8l6j08r4O4NJ98l9k30J91M2M1o6J1J91l0l05J77m1
$$ -25 148 -56 155 32 -18 46 8 -28 -136 -230 -166 -161 37 -2 -232 -41 1 42 -24 -13 178 148 -157 20 -21
4965b1O1n1n2J4J09p9n2O5Lp6j39K43o3P5l4n7K8J2O6p7Q7J5M4j50K9j35p9J89
$$ -21 40 -11 -63 -49 60 -19 -71 -6 -3 -79 -218 25 -38 37 3 -54 -26 -14 52 -25 62 77 121 -29 0 -135 -214 -25
4993b5O8J09l37R3P2j9J54m7k67L29q9p5l2K3rj48L06m1j61M1j02J24J41r1Q5
$$ -25 43 152 -185 -92 -20 -39 115 68 -199 130 41 -34 -66 -43 -52 -200 106 65 -96 -55 -157 -33 108 17 102
5018A02J8L5k82J23q7K88j84o8J60n6Qj64N7O5M6j18L8q5K16l71L43P4k17J43
$$ 102 120 155 -127 -4 -91 197 13 -55 105 49 57 -107 -50 15 61 -57 -19 -104 112 -259 84 158 -59 84
5042H4J2P9j19j10J03j71k1J32j3LK7j38K08J00j93P2j95j0J44k7J05k4J40m5
$$ 84 96 175 56 -54 49 -122 -143 -11 -24 -21 6 -132 76 176 -17 55 -140 -150 -6 -33 72 48 188 143
5066A43m5j59OJ87j73j15L27k08q1K6L67k95r1J92r8j6rJ72k32K1M7J21J20j37
$$ 143 98 -61 -55 132 -41 -156 171 -37 -118 -92 275 -20 -111 81 -17 -33 -42 130 -102 -81 -34 87 207 70
5090G0K8j40J32o8j32m4L59l00j23K23J4M9L2j72j9J26O1k20J11J57l8j12k3K57
$$ 70 98 -42 90 22 -110 -154 205 -95 -218 5 19 68 100 -72 -91 35 96 -124 -13 144 106 -6 -29 228
5114B28j78K1m8q7m1J16Nj06R5m8K4J89l4k79J50K38j71j15RL2L7K3q4nM5o6j32
$$ 228 50 71 23 -64 -105 11 16 -90 5 -43 -19 170 136 -143 7 245 74 -41 -32 0 37 60 -24 -29 16 -50 -182
5141a82J24M31k92j30J88j50LJ28J6j59J23k33L4J65j1k22k1L75k30k07L06K43
$$ -182 -58 373 81 -49 139 -11 -8 120 136 -23 100 -133 -99 66 55 -167 -188 187 -43 -250 56 299
5163B99l03j00J22K03k41K61l98J39J03J58k43p0K96k61n6K46L2j78j77M2K0K03
$$ 299 -4 -104 18 221 -20 241 -157 -18 85 243 0 -70 226 -35 -91 155 187 9 -168 -126 -106 97
5185I7j02J99j03Q4k77r9K20Q9k19N7R2j26K16m9R3j71N8n2p4K47k10l0J67J61
$$ 97 -5 194 91 175 -102 -201 19 108 -111 -54 38 -88 128 79 172 1 59 7 -67 180 -30 -60 107 268
5209B68j54j42LQM2Q8Kk08K15j07r2J59Q7j14l12K12J15j54J55P3l32n8M33r6
$$ 268 114 -28 -25 -17 25 113 115 -93 122 15 -77 82 169 55 -257 -45 70 -84 71 144 -188 -246 187 91
5233I1p7K5k4j60K04l2j04J81O7j19k34K03K5j24NM6J20M9j72n3L8N7q9k0K36
$$ 91 14 39 15 -145 59 27 -77 104 171 52 -182 21 46 -78 -73 -27 93 142 -30 -83 -45 12 -77 -97 139
5258A39Nk00l2J1K35o4o5j18M8ML5J23j33R1k04K04R6j50j26P2J57n3j21J09q3
$$ 139 144 -56 -88 -77 158 94 29 -89 -41 -37 -2 121 -12 79 -125 79 175 25 -101 -29 128 75 -46 63 -20
5283b0M8N7l59K48K26j90j37P9K20j73o9O3n6R2k1r7K97l52J35P4L9o8p2N1q6
$$ -20 28 85 -274 -26 200 10 -127 -48 172 -1 -70 -7 -63 29 8 -89 208 -144 -9 65 104 36 -36 15 -71
5308g1Qj8P3K01k36n5K7Q6L6lm9J82j13j90K25j57J96j92j44K91j78M6N5j22K14
$$ -71 -63 -81 -8 193 -43 -98 -71 15 51 48 -1 181 68 -122 103 -54 142 -50 -194 97 -81 -35 20 -102 112
5333A12J8k22M0L05l94P1K3J9J11p7O6j09N8j56K57j23J90j54k41K71j33j4JJ16
$$ 112 130 -92 -52 253 -141 -70 -47 -28 83 6 72 -37 21 -135 122 -1 189 35 -206 65 -68 -82 -81 35
5357C5m4K7rJ8j03J16qJ00%k05K27k50J06qLM1P1p6j43m5N2J8L7r0O0k2J2O5J08
$$ 35 -9 18 9 27 -76 40 32 132 132 -73 154 -96 10 2 5 46 117 41 -102 -147 -95 -77 -40 -130 -70 -92 -80 -15 93
5386I3j27P5Ll3p9J40j8j33J61P7k85k4J99Q0j45n1p3J85m3QJ50j63j62J99p3
$$ 93 -34 41 44 11 -68 72 54 -79 82 159 -126 -150 49 129 -16 -67 -140 45 2 10 160 -3 -165 34 -39
5411c9pJ47Rj91L8Q2q6O1j9j5p7J42J43j90r9J31nN8j75kO8k06M2L38k09r7j04
$$ -39 -46 101 110 -81 -43 39 -47 14 -5 -20 -97 45 188 -2 -101 30 25 83 -92 -94 -26 -232 -190 148 -61 -158 -262
5438b62K85m0j25J89ro9n5R0Q1j1k37K70q6j20J81k7l64K72l8J80r2J64j88rj06
$$ -262 23 -17 -142 47 38 -31 -86 4 85 74 -163 107 21 -99 82 55 -309 -37 -75 105 13 177 -11 -20 -126
5463a26J38J19pl10P0J81J01J73m47L7N8k5o0K80q1k36K7J59O3q0q8J08j55l7
$$ -126 12 131 124 -186 -116 65 166 339 -108 -71 -13 -38 -98 182 101 -135 -108 51 114 34 -54 54 -101 -138
5487a38K76q4m1k57J97R3J33p9k3j89n9N0J75N4q9K6k48K02J23n0j33M1p3j33
$$ -138 138 54 13 -244 -47 46 179 100 77 -112 -171 -121 54 108 19 45 -203 -1 122 72 -61 -20 -93 -226
5511b26L92l1l3j21N8k14K56J17n0o4k44J72j03J17L2o8J9J18j10Q7R5m04K2L34
$$ -226 166 135 102 -19 39 -175 81 198 148 84 -160 12 -91 26 58 -10 9 127 17 104 199 -205 -183 151
5535A51j8j36Lo3o3k1R4J40l3k74J47rJ32J01j14J8j03L5R7R7j59o4j95L29q0
$$ 151 133 -3 0 -63 -126 -147 -53 87 54 -220 -73 -82 50 151 37 55 -48 -13 84 181 22 -42 -237 92 12
5560A2j20J92k15q3K99Q9j27Q1j29l01J95K62j6%j31l05K35J96Q4k17N6Rl45J83
$$ 12 -108 84 -131 -214 85 174 47 128 -1 -302 -107 155 139 139 8 -297 -62 134 218 1 57 66 -279 -96
5584i6L78l10q3j7MRJ75R3k04q6J10q6J41R9j65L0J15J61k36R8p5j99N2L84k39
$$ -96 282 -28 -111 -128 -124 -115 60 153 -51 -137 -27 -113 28 127 -38 -8 107 268 32 130 55 -144 -92 292 53
5609E3l6l4Q6J6K2K2j28j23J11p8P8K12j25j63n6J37NJ54j61j16N0J54j35o5K11
$$ 53 17 -17 69 85 107 129 1 -122 -11 -89 -11 201 76 -87 -143 -6 -1 153 -8 -124 -74 80 -55 -120 91
5634I1M5l80J79J69J2j76J8k6JJ6R8m2K2j05j41L29J38j72j78K14q2M3j07K41
$$ 91 136 -244 -65 104 116 -60 -42 -68 -67 -51 47 5 27 -78 -219 110 248 76 -102 112 30 73 -34 207
5658B07l65j30L14p9J31J09j77j49M05l10M3J71l6j14j89M58j32l8m7m1p9N4M0
$$ 207 -158 -288 26 -53 78 187 10 -139 266 -44 -1 170 134 20 -169 289 157 119 72 31 -48 6 46
5681D6J7j89J87Q6k46K49r7k17J33J01j20J17Pk49J62J85j16j70J21K8j18M8J89
$$ 46 63 -126 61 147 -99 150 53 -164 -31 70 -50 67 74 -175 -13 172 56 -114 7 35 -83 -35 154
5704A54j97j26M5J73q7P0M4j54M2O0j59j04L38j48r0J05J08j17m5J0K1M1J70j70
$$ 154 -43 -169 -124 49 -38 32 76 -78 -36 24 -135 -239 99 -49 -139 -34 74 -43 -88 -78 -57 -16 154 -16
5728a6JLJ1j4J53j32j49M9J92j1j84M8qm2J4R2n3l2O5k23N9M66k07j80m7K05r8
$$ -16 -15 -12 -1 -15 138 6 -143 -94 98 87 -97 -49 -57 -99 -85 7 -46 -78 -13 -236 -177 289 82 -98 -145 60 -38
5755c8j16J17l6l3o4J36J81n7q5j23rJ67q7q2L27k39m2M3M6j7J41k74J22q6K50
$$ -38 -154 -37 -73 -106 -170 -34 147 90 5 -118 -127 40 -47 -129 198 -41 -83 -40 6 -11 130 -144 -22 -108 142
5780A42k08L0j9J44j7r2P3m0j54P3M0J36q7j78Q6K4K6o2M7K07j58k74K05J91Q4
$$ 142 -66 -36 -55 89 72 -20 53 13 -141 -68 -28 108 21 -157 -71 -47 -21 -83 -36 171 13 -261 -56 135 219
5805B19k74j79K73O2qP9kk84j3J20KL13l04o3p5O9O6rl1pj88M4K31Rk11K7j33
$$ 219 -55 -234 39 101 93 172 170 -114 -127 -7 -5 308 4 -59 -134 -65 1 -8 -39 -46 -234 -190 41 50 -161 -134 -267
5832b67L03j9K60j61l24J90j7J66%l6l10K1J11K05J35l88Q7Qk3Q7J99l47KJ6J5
$$ -267 36 17 277 116 -208 -18 -35 131 131 95 -215 -194 -83 122 257 -131 -44 -36 -59 28 227 -120 -118 -102 -87
5857h7L12k9k36j94J65K43k23R5K21k38j98J43K80j18k25j22K22o2J4M4Nj54k6
$$ -87 225 196 -40 -234 -69 174 -49 46 267 29 -169 -26 254 136 -89 -211 11 -51 -37 7 12 -142 -168
5880a68j5J19P8N3j74k8M5q4K56j00k62Q2J48K94k28r6O9JJ41K4j50r0K7j94L13
$$ -168 -183 -64 14 67 -107 -135 -90 -174 82 -18 -280 -198 -50 244 16 -80 -11 -10 131 155 5 -85 -58 -252 61
5905F1J8J41j57o8k31K18K28j57jk57J58O3J15l6R0l66j02K53P9m7q1O2o6k3O2
$$ 61 79 220 63 -5 -236 -18 210 53 52 -205 -47 16 131 95 185 -181 -283 -30 49 2 -79 -17 -83 -106 -44
5930d4J07j47N6j86L05O2j68o5j05J17J74M3j9j78o8P0J27J98k22p6r3R8l3K58
$$ -44 63 -84 -28 -214 91 153 -15 -80 -185 -68 106 149 130 -48 -116 -46 81 279 57 -19 -112 -14 -47 211
5954B11q1j61k5r9R2K7J19j24j71K69O8O8k99J20jJ5o4j1J47o5j13QJ04K9k7k63
$$ 211 130 -31 -56 -155 -63 -36 83 -41 -212 57 125 193 -106 14 13 28 -36 -47 100 35 -78 -70 34 63 36 -227
5980b27K28M3n0PM2P8j91m1N7j17K25k37Q1J52K4j61O2J24k01L7J38L2j34J14
$$ -227 1 44 -6 1 43 121 -70 -111 -54 -171 54 -183 -102 50 74 -87 -25 99 -102 -65 73 105 -29 85
6004H5q0j05J80k18J61j7K6j09rK92o8n0j1k44K08R6p1k75K52K1j7q3J41j15j09
$$ 85 5 -100 80 -138 23 6 32 -77 -86 206 138 88 77 -167 41 137 66 -209 43 64 47 -36 105 -10 -119
6029a19N9K68k02j52K75j81K08k80J57j24M5R0n5K11j09j34n5J00K4P8K8j74j19
$$ -119 -60 208 6 -146 129 -52 156 -124 33 -91 -46 44 -11 200 91 -43 -98 2 26 104 132 -42 -161
6052a61J24j8k4O0J79k33l7K67j47Q2j1m9j18K30j09J31p1j42Q8j04P1N9j92k
$$ -161 -37 -55 -79 -19 160 -73 -110 157 10 92 81 32 -86 144 35 166 95 -47 41 -63 8 67 -125 -127
6076a27J29j9L4r0J58k21J2J34N0r4k3J3l5J17Oj72M0M7j35M1L23j94p1n8P5o
$$ -127 2 -17 17 -73 85 -136 -124 10 60 -34 -57 -44 -79 38 44 -128 -88 -41 -176 -135 188 -6 -77 -135 -60 -66
6102f6J69o7Q5l4j09N9k9M5k9k28J80M1j3J8j50J95q0q2o2L01l09R7J33R7N6k55
$$ -66 103 36 121 87 -22 37 8 53 24 -204 -24 17 4 22 -128 67 -13 -95 -157 144 -165 -68 65 162 218 -37
6128c7j28L03j41j24L5J48J1k5q1Q4R2k13J3QJ51j61p7K05p3r7J11J07j54o5P2
$$ -37 -165 138 -3 -127 -92 56 67 42 -39 45 137 -76 -63 -55 96 -65 -142 63 -10 -107 4 111 -43 -108 -36
6153c6L46n34L55j87Q8Q9j34j39J48J09j65m6N1J56r5J0P5J0n7j85R7kJJ61j46
$$ -36 310 -224 131 -56 32 121 -13 -152 -4 105 -60 -106 -55 101 6 16 91 101 44 -141 -44 -46 -45 116 -30
6178c0K20j09l43K41J1m8N7O1K2j39K29p5k53K48p7l7n4J3J84j72Q3J66k42J67
$$ -30 190 81 -262 -21 -10 -58 -1 60 82 -57 172 97 -156 92 15 -22 -76 -63 121 -51 32 198 -44 123
6202A23k30J28QR6k16J62Q1r5nJ32p1k62P5J71M6j40j23K00j55J01p2k9L53l4
$$ 123 -107 21 29 125 -91 71 152 57 52 184 113 -149 -74 97 143 3 -120 80 -75 26 -46 -75 278 244
6226B44k72n2J38j15J5r3J05p1K68m2k17p7L30k07L6M0o9j4K06nk60N0MQ6q8j60
$$ 244 -28 -80 58 -57 -42 -135 -30 -101 167 125 -92 -169 161 -46 -10 30 -39 -53 153 148 -112 -62 -58 28 -60 -220
6252b20p5K88L4j28m2K12n0L6j01J46k41j15J33J17o7K13k36Q5K6K1K0j74J91
$$ -220 -295 -7 27 -101 -143 69 19 55 -46 100 -141 -256 -123 -6 -73 140 -96 -11 15 36 56 -118 73
6275G3q6L7LM3j01k4Q7k8O1n5j04J97j14k67K93K6n1k0j49K51O5j28J1j51J57
$$ 73 -13 24 27 70 -31 -55 32 4 65 10 -94 103 -11 -278 15 41 -10 -30 -179 72 137 9 20 -131 26
6300B6O9o3L1J4j25Kj0J08P1k38J06O3j84oK17j9o7M4n7j20L76k76j37P0j6K5
$$ 26 95 32 63 77 -48 -46 -56 52 123 -115 -9 54 -130 -136 81 62 -5 39 -18 -138 238 -38 -175 -105 -121 -96
6326i6k5R5K9RJ0Q4j29jJ3L4q4L0l2L1J14P2m49K23K24k38J60o1j13L4K57k49
$$ -96 -121 -26 3 12 22 106 -23 -24 -11 23 -61 -31 -63 -32 82 154 -295 -72 152 -86 74 13 -100 -66 191 -58
6352e8J67r3K8j62O5n9N9j00J07j1P0J52j86O6J7q4q4R2J25l26L50j16K4J69l16
$$ -58 109 16 44 -118 -53 -112 -53 -153 -46 -57 13 165 -21 45 62 -22 -106 -14 111 -215 135 19 43 212 -104
6377a04Q2p6P9L7q3J36N4k52J05N8P2L3k6j58m5J74N0k0j6k07J28J3j06nk6l1
$$ -104 -22 -98 -19 18 -65 71 125 -127 -22 36 108 141 115 -43 -88 86 136 116 100 -107 21 34 -72 -77 -103 -134
6403a34R6l9J84j43M8k18J97p5R7OM3l18L20Lq7K6J43j63j5j25L40j78N1M7j86
$$ -134 -38 -77 107 -36 12 -206 -9 -84 13 19 62 -256 64 67 -20 6 149 -14 -29 -154 186 8 59 106 -80
6428h0J14r0J82n9JN0k81J20J19j09J0l7J33j62J25R5j73q1J58k3J08k2k56J71
$$ -80 34 -56 126 67 68 118 -163 -43 76 -33 -23 -60 73 -89 36 131 -42 -123 35 12 120 98 -158 13
6452A3Kj21O6J91j83P3K3lP7n1L0l77L00p9RJ6P8k05r7K51J91j50r9p7P6j4L3
$$ 13 15 -106 -40 151 -32 41 64 61 138 87 117 -260 40 -39 -30 -14 64 -141 -238 13 204 54 -45 -122 -46 -60 -27
6479b7M6M5j12o0O0rJ26P2l16J80Q6k58J94l1L2j20n4K99Qj33onln3R1j68j40
$$ -27 19 64 -48 -108 -48 -57 69 141 -175 5 91 -167 27 -4 28 -92 -146 153 161 28 22 17 14 -39 52 -116 -256
6506b56J53j2N5K60j59j0k73K88o4J04k83n1K37M2k20K30O5k58n9P6J34P9J3l32
$$ -256 -103 -115 -60 200 41 31 -242 46 -18 86 -197 -248 -11 31 -189 41 106 -152 -211 -135 -1 78 91 -241
6530b41K20j26J56K4R0j15j11J25L03j91k53K06j83KK09p6K9j20p4j57L33O6R6
$$ -241 -21 -147 9 33 123 8 -103 22 325 134 -119 87 -96 -94 115 39 68 -52 -126 -283 50 116 212
6553B12k45l2Q4N0M2n6j40p7R5J63j09K47k09j28J88k6P0j25Mk21K42J91q1j37
$$ 212 -33 -65 19 69 111 55 -85 -162 -67 96 -13 234 25 -103 85 59 129 4 8 -213 29 220 139 2
6577BO9k83J65M6P7k94J35K30j89J25M2j33rj35K03j14J98M1j21k21J10J85k09
$$ 2 71 -212 -47 -1 76 -218 -83 147 -42 83 125 -8 -17 -152 51 -63 135 176 55 -166 -56 129 -80
6600h0N6N3p1J1R0RJ2j54j6J24K16j33J5k55q4R3J02J12j0k95J1O0J81M1n6j42
$$ -80 -24 29 -42 -31 59 68 80 -74 -90 34 250 117 132 -123 -207 -114 -12 100 90 -205 -194 -134 47 88 32 -110
6626a10M6LK1j1J66j01k35J06L02j84r0L22m34K33N0q3P1J35k22J04j22L31j78
$$ -110 -64 -61 -40 -51 115 14 -221 -115 187 3 -87 235 -199 34 84 1 72 207 -15 89 -33 298 120
6649A20k87K42l7J02P0j78j61K37m1k42L18r0j35k14M02j41q8K13o4j06np5K16
$$ 120 -167 75 38 140 210 32 -129 108 67 -175 143 53 -82 -296 106 -35 -123 90 26 -80 -85 -160 56
6672E6Q8j08j59J75Q0j55P0K7o4k44K68m2L5l24K19n1J30m9O4r3J1O9j43J98O9
$$ 56 144 36 -123 52 132 -23 47 74 10 -234 34 -8 27 -297 -78 -129 1 -48 16 -77 -66 3 -140 58 127
6697A27j19n0KO1j5M5j7r4M7k4O7q0M2J0o2J29o0P3p3k5r1J34J06n4k39J72o9
$$ 127 8 -42 -40 21 6 51 34 -60 -13 -37 30 -50 -8 2 -60 69 9 82 9 -16 -107 27 133 79 -160 12 -57
6724e7J0n7J28j50J19l4J19j54K00K1j08J03j26o4o0M9m4K57j20k9JJ64k06K17
$$ -57 -47 -104 24 -126 -7 -41 78 -76 124 145 37 140 14 -50 -110 -61 -105 152 32 3 4 168 -38 179
6748A79k81J13r5J1K13m6j45K0L3J08k1n5j12r8p2L04j30J14pj09l3J52Qk8L7
$$ 179 -102 11 -84 -73 140 94 -51 -31 2 110 89 34 -78 -176 -248 56 -74 40 33 -76 -109 43 51 23 60
6773F0O4j36J22j85J0qJ0J74m4P0N3k70O3K48j07r5l3P2j58J46o0O6N7k70Q2J06
$$ 60 124 -12 110 -75 -65 -73 -63 111 67 137 190 -80 -17 231 124 29 -4 68 -90 56 -4 62 119 -151 -69 37
6799C7M1p3P8j25o6pK47j71J7j14K2r7J84K44k22n4M8k3N7oo2J05k17l8L0K38
$$ 37 78 5 83 -42 -108 -115 132 -39 -22 -136 -114 -211 -27 217 -5 -59 -11 -34 23 17 -45 60 -157 -195 -165 73
6825G3r2p7L8L7J13r8LP2j79K7J53m9K3k7j06j05K61Mj95O7J0p3j4K10K5j94L
$$ 73 -19 -96 -58 -21 92 -6 -3 69 -110 -83 70 21 44 17 -89 -194 67 71 -124 -57 -47 -120 -134 76 101 -93 -90
6852i0j8L5K22r5j34K0q4j3K67Q2k04k1K5M0J64m30K20m1P0Q1O7k47Q2P4m1P3
$$ -90 -108 -73 149 54 -80 -60 -144 -157 110 192 -12 -33 -8 32 196 -234 -14 -55 15 96 163 -84 -2 72 31 104
6878A04l0j2j75qJ67j65K8O2n5K4JJ08m1M6j19J56n3J21o5m8J3p8r1J50J29N4
$$ 104 74 62 -113 -121 46 -119 -91 -29 -84 -60 -59 49 8 54 -65 91 38 159 94 46 59 -19 -110 40 169 223
6904B23k54n3J79r2N5lQq6p0j3L12k23r5J2L15j91l7J59k51l1O9q2J77O1k39J33
$$ 223 -31 -84 95 3 58 55 63 -23 -93 -106 206 -17 -112 -100 215 24 -13 146 -105 -136 -67 -149 28 89 -150 -17
6930a7lj79K55rJ1j95l0L44j44m7K4j0j57J29NJ19p4J05j09l7j1j7m0J47k24J24
$$ -17 -20 -199 56 47 58 -137 -167 177 33 -14 10 0 -157 -28 -23 96 22 127 18 -19 -30 -47 -87 60 -164 -40
6956d0J9J19n6Lk3j4RJ12j86qL1K0Ll8N0j76J59K02k45J41PJ4j76N9J73k87K0
$$ -40 -21 98 42 45 22 8 17 129 -57 -65 -34 -14 -11 -49 1 -175 -16 186 -59 82 89 103 -73 -14 159 -128 -108
6983a08P6R5j35K89j09q0j33J79N4p3j09p2q0J13k1N7l7j02J92k9M2j99K03r9
$$ -108 -32 63 -72 217 108 28 -105 74 128 55 -54 -126 -206 -93 -114 -57 -94 -196 -4 -33 9 -190 13 -86
7007h6Q4l4K2L09l10J28m9l9o4J39p6j1q3k1j37L01J53l03J38j35N8J40q8o1j4
$$ -86 -2 -36 -14 295 -15 113 64 25 -39 100 24 13 -70 -91 -228 73 226 -77 61 -74 -16 124 36 -25 -39
7032c9j18L37k49J54K00k39j78N9N3n2M6k10J14J00m7L3j06L22k07n5N4k8K0P7
$$ -39 -157 180 -69 85 285 46 -132 -73 -20 -72 -26 -236 -122 -22 -69 -36 -142 180 -27 -82 -28 -56 -36 41
7056D1J19o8J31k04j7J16j67M1j0n8J7L7q4J45j40O1m2j0R7M4L6j5j47J91j12
$$ 41 160 92 223 19 2 118 -49 -8 -18 -76 -59 -22 -106 39 -101 -40 -82 -92 5 49 85 70 -77 114 2
7081BJ03j94K13P7j73n6j12J16J31J4l65J06J25O2q4K28k37K1J39p2pl3m9n8K8
$$ 2 105 -89 124 201 28 -28 -140 -24 107 121 -244 -138 -13 49 -35 193 -44 -23 116 44 37 4 -45 -103 -75
7106g5J16p6J38j08j36M8J11r4M9j00K16j92K77kk82J33j1l0j32L38j83J23j47
$$ -75 41 -35 103 -5 -141 -93 18 -76 -27 -127 89 -103 174 172 -110 23 12 -18 -150 188 5 128 -19
7129a9pk1P0m3K21j59q1j26J28j27J68J01j01J0j03J76M5j08m0Q2q5P7j00J06
$$ -19 -26 -47 23 -20 201 42 -39 -165 -37 -164 4 105 4 14 -89 87 132 24 -16 66 -19 58 -42 64
7153F4k76LK87j57O9%L5l3qq1R1R9k00k9KK78n0j44J87p1l8O4j7r1Q8k00qP6k6
$$ 64 -212 -209 78 -79 -10 -10 25 -8 -16 -97 -6 93 -107 -136 -134 144 94 -50 137 66 28 92 75 -16 72 -128 -136 -60 -86
7182h6J13nq9J45r9M7Q1j52m8K24j04j26J66j75P1P1Q5j35m4J8Q9r2P7m8J9o3
$$ -86 27 22 -67 78 -21 26 107 -45 -93 131 27 -99 67 -108 -37 34 119 -16 -60 -42 47 -45 32 -16 3 -60
7208f0o7o1J97Q0l9r1k5n2J03O4J70j74L0Ok1m7Q8j2l05J93J96j33j19J89j81
$$ -60 -127 -188 9 89 50 -41 -66 -118 -15 49 219 45 75 81 60 13 101 89 -216 -23 173 40 -79 110 -71
7233g1N1P8Mn2K47k25j35K32O8j44j03Q2m7j45K89p3p0p3J89r6l6K07j93O3Q1
$$ -71 -20 58 62 10 257 32 -103 129 197 53 -50 32 -15 -160 129 56 -14 -87 102 6 -30 177 -16 47 128
7258A28j32m7N7or5R8K4R6q6L2k90J22J84j32L6jJ5qk1j25O0J32L1o2o7J68k65
$$ 128 -4 -51 6 0 -95 3 27 123 37 69 -221 -99 85 -47 -11 -12 3 -5 -26 -151 -91 41 72 10 -57 111 -154
7285a54pJ13R9p2q5J52N0o1j24M9J53Qj90J14jj13J05r6J30j33J67j7m6j0r8M
$$ -154 -161 -48 51 -21 -106 46 96 35 -89 -40 113 121 -69 45 44 -69 36 -60 70 -63 104 87 41 31 -67 -63
7311f3N3k7N9J17l55J91O8j69L15k03m5j84K23Qj22K44O8j22L0k4NP8k09P3L4
$$ -63 -10 -37 22 139 -216 -25 43 -126 189 -14 -59 -243 -20 -12 -134 110 178 56 86 62 67 145 -64 9 43
7336D3J9j65J87q1O0M1kq6l0r7J88p6mnj26M7J88N4j75k19K84o7J7j16jJ40j17
$$ 43 62 -103 84 3 63 104 102 16 -14 -111 77 1 -3 -8 -134 -87 101 155 -20 -239 45 -22 -5 -121 -122 18 -99
7363i9O7K0N7j25M0N7Q7j20oJ03k6r6N1K04r7j51J16O3j60M9J05j72J29j00n7
$$ -99 -32 -12 45 -80 -40 17 104 -16 -22 81 55 -41 10 214 117 -34 82 145 -15 34 139 -33 96 -4 -61
7388f1j3J63j86R9O1j04j00L27q2m8J20k11P1j00LM0P0o7O9j22O0m8P0n4K4L7
$$ -61 -74 89 -97 2 63 -41 -141 186 104 56 176 -35 36 -64 -61 -21 49 -18 51 -71 -11 -59 11 -43 -19 18
7414A8k8J70k13R5LmK4j19m5j33J76M1j80J62O4O8J1k23J11O2O4j88R4mm8m9K06
$$ 18 -10 160 -53 42 45 41 65 -54 -99 -232 -56 -15 -195 -33 31 99 110 -113 -2 60 124 -64 30 26 -22 -71 135
7441A35j12P1r8p5J11K9l7P5J3Nj50J37j74JJ00j12K02k26J63j47J52j00K68k16
$$ 135 23 94 -4 -79 32 61 24 99 112 117 -33 104 -70 -69 31 -81 121 -105 58 -89 63 -37 231 15
7465A5j79J92j27J35P5o5LJ6m1l4p2L36j11k75K21j94P4Q1j00Q3q0jj12J16K4
$$ 15 -164 28 -99 36 111 46 49 65 24 -10 -82 254 143 -132 89 -105 -31 50 -50 33 -47 -48 -160 -44 -20
7490b0l0KQ6j63L17j14n4QR5j23j35J23%n8J39J0m1L2k9n7n5J23j67R0N1k9M2
$$ -20 -50 -48 38 -125 192 78 24 32 127 4 -131 -8 -8 -66 73 83 42 74 45 -12 -67 56 -111 -21 30 1 43
7517D3k9K7j13K7j03J21j91R4L1L5M0J70n9pr2R1l6r8L6k0n8J6O2J50K1l74M83
$$ 43 14 41 -72 -45 -148 -27 -218 -124 -93 -58 -18 152 93 86 -6 85 49 -49 -13 -33 -91 -75 -13 137 158 -216 267
7544B67k05r6O4%P6j32r2J53q5K2J04n0j15K65j95O7j6k91K12J42o6R1j76J2j37
$$ 267 62 -34 30 30 106 -26 -118 35 -50 -28 76 26 -89 176 -19 48 32 -259 -47 95 29 120 -56 -44 -181
7569a81R1m1J85oL0R4k53L2J52j33p6M7J16j77p7L29q2R4q5o7j02N0L83j33k23
$$ -181 -90 -131 54 48 78 172 -81 -49 103 -30 -106 -59 57 -120 -197 132 50 144 59 -8 -110 -60 323 190 -33
7594c3nm4K63n1j13l9L4J7k33J74J48j42J59q0q5Q2j0j7j12Q9J59k42j13K09q6
$$ -33 -38 -82 181 130 17 -22 12 29 -204 -30 118 -24 135 55 -30 52 42 25 -87 2 161 -81 -194 15 -71
7619g1J66%j57R9R7n8k5O2m6j80q9K34k22J3L23j49j9J36Q2j41o9N7Q8k30j0K46
$$ -71 95 95 -62 37 134 76 51 113 67 -113 -202 32 -190 -177 146 -3 -22 114 196 55 -14 43 131 -99 -109 137
7645A37l34K47k22K10j33J39mk57K60P9j93Q3k2j21J25q5P1O9m7P4k26J95m7R4
$$ 137 -197 50 -172 38 -95 44 40 -217 43 122 -71 12 -10 -131 -6 -91 -20 49 2 76 -150 45 -2 92
7669I2r9p7k1J15J43j56K7n8J90k57K05j73P7j83J75J09p0r3j5J83m02J96J37
$$ 92 -7 -84 -105 10 153 -3 24 -34 156 -101 104 -69 8 -175 0 109 39 -54 -69 114 -288 -92 45
7692D5k7Q6k08K25m5o2k9Q3j94K0R9m5P4r4O5p9Q9L4L7r5Jj3lm7J49pj31K24k16
$$ 45 18 104 -104 121 76 14 -15 68 -126 -106 -7 -52 22 -72 -7 -86 3 37 74 -21 -20 -33 -36 -83 66 59 -72 152 -64
7721f4P1J63k49J30l5R9p3N8r4m4o5J45p6n9J29p8o3J02P2l7j07K7j61J67j4k3
$$ -64 7 170 -79 51 16 115 42 100 6 -38 -103 42 -34 -93 36 -42 -105 -3 69 32 -75 -48 -209 -42 -56 -79
7747g9J40m8O3L8j09O5J5j30J83j78m4L9J55N0k97L8J03o5J96k2k52J14R7K9j33
$$ -79 61 13 76 114 5 70 85 -45 138 -40 -84 -45 110 160 -137 -99 4 -61 135 113 -139 -25 72 101 -32
7772c2POJ17k31J17l7q4M5O2k3p7M6J2N7M0Op4j3n1J27J16k18J98J24k35P1p1
$$ -32 -25 -19 98 -133 -16 -53 -137 -92 -30 -53 -130 -84 -72 -15 25 31 -43 -56 -107 20 136 -82 116 240 5 76 5
7799Ep8n2J00l5jK21k19K25k97K16j14O5o2Q8j27qK19l7j26R0Pn4j0M0J2r7J6
$$ 5 -73 -125 -25 -60 -61 160 -59 166 -131 85 -29 36 -26 62 -65 -73 146 109 -17 73 80 26 16 56 68 -29 -13
7826a3p1O7J45o6J9j71J26o5M1J28K0j60Oj44P4J45q0p1K64j50J8K6l6j09J82
$$ -13 -84 -17 128 62 81 -90 36 -29 12 140 160 0 6 -138 -64 81 1 -70 194 44 62 88 52 -57 125
7851A25k61K53P9j83K3n6O7j46K29k99K55j28M6J10J06j68r9m7J22R7j57P8l3
$$ 125 -136 117 196 13 36 -20 47 -99 130 -169 86 -42 4 114 220 52 -47 -94 28 125 -32 46 13
7874A3j10R5j63K38j04R5o1N2N1M3j43Rj14p3K55j87J91L6k00m7J87k4k8m8Q1
$$ 13 -97 -2 -165 73 -31 64 3 55 106 149 6 15 -99 -172 83 -104 87 123 -77 -124 63 39 11 -37 44
7899D4n5N3N5r5n1p0P6J05j57j13O8J64K9q5o8J2Lm2M7J4M9j60M5O6J09O1n8j1
$$ 44 -11 42 97 2 -49 -119 -43 62 -95 -208 -140 24 53 -32 -100 -88 -85 -127 -80 -66 -17 -177 -132 -66 43 104 46 35
7927C5Q3j86J59l6M4j08r0Q1k7L7l3Q0K1j26Q5L4l4j17J51q0J02j23R1j3R7j78
$$ 35 118 -68 91 55 99 -9 -99 -18 -45 -8 -41 39 60 -66 19 53 19 -98 53 -27 75 -48 43 30 127 -51
7953e1M6O5J7J9j34P0L5Q6N4k14l9R6k2j00K29k83J10O3n7O6j37J67m9k5l8J03
$$ -51 -5 60 77 96 -38 32 67 153 207 -7 -46 50 28 -72 157 -126 -16 47 -10 56 -81 86 37 12 -26 77
7979G7j8q1n8J8q2L13k21j8J34j1O0j3%j91L09k33m9K83k95N9J05o0O3O0r5p2
$$ 77 59 -22 -80 -62 -144 169 -52 -70 64 53 113 100 100 -91 218 -15 -64 219 -76 -17 88 28 91 151 56 -16
8005a6o8J02l9mJ2k76K75q7R7m4J11j18J04p9O9j68L8J75q6m0J8O2K2j3L4q8R7
$$ -16 -84 18 -21 -25 -13 -289 -14 -101 -4 -48 63 -55 49 -30 39 -129 -91 84 -2 -42 -24 38 60 47 81 -7 90
8032I0j70J33J2m9p6J83O2j44j67oJ30o0K9p3J06o5M4r0O6RJ3k02K10J5o1R1j01
$$ 90 -80 53 65 16 -60 123 185 41 -126 -132 -2 -62 -33 -106 0 -65 -21 -111 -45 -36 -23 -225 -15 0 -61 30 -71
8059g1J6J65k07l0K13k15N2O9M9lQ4j51m2Q2lm6J61j35l6J9J45j62J72r5r5J6
$$ -71 -55 110 -97 -127 86 -129 -77 -8 41 38 122 -29 -71 11 8 -38 123 -12 -48 -29 116 -46 126 31 -64 -48
8085d8n6L3J75j04Km0J9m9K13j66j06K23q4N4j00N5j20J74j13R7r9M0J43o0J8
$$ -48 -104 -71 104 0 2 -38 -19 -68 145 -21 -127 96 12 66 -34 21 -99 75 -38 59 -40 0 143 83 101
8110A01j85Q1N2n8M7o6k3q4RN2P5P1j19J36q2lQ1j23L6o8j4q6J32K5j7J2j7L8
$$ 101 -84 -3 49 -9 38 -28 -51 -135 -126 -74 1 72 -47 89 7 4 85 -38 -2 -70 -84 -170 -38 -13 -30 -18 -35 3
8138Cq6M7M5Nq0O9j83K59K9j47K0r7R5M7R0k40R1R3Jk54L59j00r8K01k82J84j39
$$ 3 -83 -36 9 14 -66 3 -180 79 108 -39 -19 -116 -21 26 116 -124 -33 60 61 -193 166 66 -32 169 -113 71 -68
8165f8N7J7L5k7O9k9k34J46j30K33r6Oo5J55k23J8K18j57O4J97k15L1m0J50j36
$$ -68 -11 6 41 14 83 54 -180 -34 -164 69 -27 -21 -86 69 -154 -136 82 -75 -11 186 -29 2 -38 112 -24
8190b4l9
$$ -24 -63
8191f3
$$ Imaginary data points
##PAGE= N=2
##DATA TABLE= (X++(I..I)), XYDATA
0@%%%%%%JrJ6j6J6k4M0n6O4p8J02j21J51j88K22k64L13l70M39n11N94o90P94r14
$$ 0 0 0 0 0 0 0 1 -8 8 -8 8 -16 24 -32 32 -46 56 -65 86 -102 120 -144 169 -201 238 -273 321 -369 425 -489
30d89J049j199J363j548J752j971K215k486K782l109L467l853M277m741N245n797
$$ -489 560 -639 724 -824 928 -1043 1172 -1314 1468 -1641 1826 -2027 2250 -2491 2754 -3043
46c043O400p058P780q574R445j0404J1468j2646J3961j5442J7116j9033K1250
$$ -3043 3357 -3701 4079 -4495 4950 -5454 6014 -6632 7329 -8113 9003 -10030 11220
59A1220k3841K6923l0660L5307m1269M9224o0433P7523j07025J71763n56078K91401
$$ 11220 -12621 14302 -16358 18949 -22320 26904 -33529 43994 -63031 108732 -447346 -155945
71a55945P97750p60767L39473J19333q63827J17963Q46350l30561j01435K24383
$$ -155945 641805 -118962 220511 339844 -523983 -406020 440330 109769 8334 232717
81B32717n60659j47901P58121n5642k87931K50086j88247l20187M11717J00657
$$ 232717 -327942 -475843 282278 226636 -61295 188791 544 -319643 92074 192731
91A92731l12915P7277M7074j56437K33687J51149k45236j43840N0036J27468J73043
$$ 192731 -120184 -42907 4167 -152270 81417 232566 -12670 -156510 -106474 20994 194037
102A94037j00996j78430p208j11501O1713M42609N335l88307m5110k7656m7521
$$ 194037 93041 -85389 -92597 -204098 -142385 300224 305559 -82748 -127858 -155514 -203035
113b03035M12529J29473m30807m5401Q9842k06688K94287M10488l87694k96224
$$ -203035 209494 338967 -91840 -137241 -47399 -254087 40200 450688 62994 -233230
123b33230K02840r3961K5470L99443j66597l69703K02361N8036j56812K86621
$$ -233230 -30390 -124351 -98881 300562 133965 -235738 -33377 24659 -132153 154468
133A54468Q1634m09428r94K49532p5271K4854J02043k19475o1687K35246r674
$$ 154468 236102 -173326 -174320 75212 -59 24795 126838 -92637 -154324 80922 71248
144G1248p6624J02623j16067j91541J85417K01923j13271j01168O484n5279L0337
$$ 71248 -5376 97247 -18820 -210361 -24944 176979 63708 -37460 -30976 -86255 -55918
155e5918J63746K2707j36907p2513o308J6615J25788J02716j24852j54468M0684
$$ -55918 107828 130535 -6372 -78885 -85193 -68578 57210 159926 35074 -119394 -78710
166g8710P8464K7279O0241k0839j35116l1923P4516M8614N9196N99j38091n1884
$$ -78710 -246 27033 87274 66435 -68681 -100604 -26088 22526 81722 82321 -55770 -107654
178a07654J14541M6970l6240J0464k1170o9374J6691P9929K7265l6948n4108j8019
$$ -107654 6887 53857 17617 28081 6911 -62463 -45772 34157 61422 24474 -29634 -47653
190d7653L7703M4656J335m1506k7979J9521J1541k23M3762j918r1524n128Q4033
$$ -47653 -9950 34706 36041 -5465 -33444 -13923 -2382 -2605 41157 39239 -52285 -57413 26620
203B6620L391k1038J2055n1949k1511P9691K631m0182M6342k7473q7925O9685
$$ 26620 30011 8973 21028 -30921 -52432 27259 29890 -10292 36050 8577 -79348 -9663
215i663P7100o3174j3814K4113n1496J8976O2346m6600j0637N0513n9945l2922
$$ -9663 67437 4263 -9551 14562 -36934 -17958 44388 -2212 -12849 37664 -22281 -55203
227e5203R1977j961o7410L3137J3034l7395K8864P486l4278L5613R874n8271K3979
$$ -55203 36774 34813 -32597 540 13574 -23821 5043 12529 -21749 13864 23738 -34533 -10554
240a0554M4242m5046p853M4051j6939k1781J2881p979J1407K6279l1439k0450
$$ -10554 33688 -11358 -19211 24840 7901 -13880 -999 -8978 2429 28708 -2731 -23181
252b3181L1166m363j6296K5833K624k7168j127M159R224K3670j7019l5013J6259
$$ -23181 7985 3622 -12674 13159 15783 -11385 -12512 -8353 871 24541 7522 -27491 -11232
265a1232K0751q747O756L344k3653m518J3795J0179J8209r200m5355j57M2737
$$ -11232 9519 772 7528 10872 -12781 -17299 -3504 6675 24884 15684 -29671 -29828 12909
278A2909R075j1396l047j9412j4135J9432K2907J0775r171m1275j9530M1692L3102
$$ 12909 21984 10588 7541 -11871 -26006 -6574 16333 27108 17937 -23338 -42868 -1176 31926
291C1926j3823j6532j2203j6568J0628L3076J2194j5968l0691j9326K6089M1335
$$ 31926 18103 1571 -10632 -27200 -16572 16504 28698 12730 -17961 -37287 -11198 30137
303C0137j974l0240j5952k911J0677K8273J3101k1876l0799r154K2316L6171P662
$$ 30137 28163 -2077 -18029 -20940 -10263 18010 31111 9235 -21564 -30718 -8402 27769 35431
316C5431l3016l1921J869K5478K5506N742k1655l1057j0710K2724L6604J2610
$$ 35431 2415 -29506 -27637 -2159 23347 29089 7434 -23623 -34333 -11609 24995 37605
328C7605k9964l9990l269L3194K8961K88k0363k5826j2755J8228L7364J4774k7158
$$ 37605 7641 -32349 -35618 -2424 26537 26825 6462 -19364 -32119 -13891 23473 38247 11089
341A1089l9325p320L2710L3154j898k5014k2116r116J4284L4964J6931k7604l9299
$$ 11089 -28236 -35556 -2846 30308 28410 3396 -18720 -27836 -13552 21412 38343 10739 -28560
354b8560o480K9560L2389K504k5952k6780n363J8065K9941J3455k2194l4920r223
$$ -28560 -35040 -5480 26909 29413 3461 -23319 -28682 -10617 19324 32779 10585 -24335 -33558
367c3558K5986L3207M568k6116k6495m379J9468K9398Q628k3470k7155o529J6026
$$ -33558 -7572 25635 30203 4087 -22408 -26787 -7319 22079 30707 7237 -19918 -26447 -10421
380a0421L0953J4543k8404l4131K023K1589K0439J1619j7753l2367m799J8538
$$ -10421 20532 35075 6671 -27460 -25437 -3848 16591 28210 10457 -21910 -26709 -8171
392h171K0207J6097j3011m0167p378L2921J8598k164o557k2191j6573K0310K6689
$$ -8171 12036 28133 15122 -25045 -32423 498 19096 16932 10375 -11816 -28389 -8079 18610
405A8610K971j1595k3273j5839K3179L2297m898k1579j1066q183O110K8231J3630
$$ 18610 21581 9986 -13287 -29126 -5947 26350 21452 -127 -11193 -19376 -13266 14965 28595
418B8595k1658k5569l376J3702K1318J1818j6578k7035k590J6630J1821R154k67
$$ 28595 6937 -18632 -22008 -8306 13012 24830 8252 -18783 -21373 -4743 7078 16232 15965
431A5965k5052j7031J9717K0544j562m265j2495j6886J4179K4634p144j0354J636
$$ 15965 -9087 -26118 -6401 14143 12581 8316 -4179 -21065 -6886 17748 10604 250 1886
444A886j4747k400L1221N862k7217o476M039j318J9820J2559k5421j4526R816
$$ 1886 -12861 -15261 15960 21822 -5395 -11871 -7832 -9150 10670 23229 -2192 -16718 -6902
457f902j602Q716K5116j3618l3435M226J7506M077J0610J84k3801q990J3092P219
$$ -6902 -8504 212 25328 11710 -21725 -17499 7 4084 14694 14878 -8923 -17913 -4821 2398
471B398O959P036j5526j8538R627J5935o37l569j267p076l444Q024O388l919m612
$$ 2398 9357 16393 867 -17671 -8044 7891 7254 3685 2418 -4658 -8102 -78 6310 2391 -2221
486b221p06j314N230Q202q704j3619Q859J1225o224J519N491j5394p694J8072
$$ -2221 -2927 -4241 989 9191 487 -13132 -4273 6952 728 2247 7738 -7656 -15350 2722
500B722P571m495J648j2039j4936J8524J5510j1283J160M315k2488l263K6700
$$ 2722 10293 5798 7446 -4593 -19529 -1005 14505 3222 4382 8697 -13791 -17054 9646
513I646K063j0742M353j0267j1731J8607P400j3186Q667L308k2237M135K0285
$$ 9646 11709 967 5320 -4947 -16678 1929 9329 -3857 4810 8118 -14119 -9984 10301
526A0301r349o002J1682o600o432J0844n035p280J4712M35j3169Q343L186j4606
$$ 10301 952 -5050 6632 32 -6400 4444 -591 -7871 6841 7276 -5893 2450 5636 -8970
540h970L882J2722l404j116m07j0682J155J0606j499k03M484q659p997M907O241
$$ -8970 -5088 7634 4230 3114 2707 -7975 -6820 3786 2287 2084 6568 -2091 -10088 -5181 1060
555A060N740r21j0088m17M831n915L340J2820o163r208M514l226k71J2163n283
$$ 1060 6800 5879 -4209 -4626 205 -5710 -2370 10450 4287 -4921 -407 -3633 -3904 8259 2976
570B976p705J2624n683j6711J6120J0127j6763M754R448j7151J299J4308j1600
$$ 2976 -4729 7895 2212 -14499 1621 11748 -5015 -261 9187 -7964 -6665 7643 -3957
583c957J385J5704j7195j0580K1692l671j3267J6766N63j8291J0055N662j2630
$$ -3957 -2572 13132 -4063 -14643 7049 3378 -9889 6877 7440 -10851 -796 4866 -7764
596g764J1159P375j9181L969J4650j3803k368J4993p226o869R831n338m654J0901
$$ -7764 3395 10770 -8411 -4442 10208 -3595 -5963 9030 1804 -5065 4766 -572 -5226 5675
610E675m466p984J2670q32j4173O206Q091o559Q26L282n757L36K565k441N134
$$ 5675 1209 -6775 5895 5063 -9110 -2904 5187 -1372 -546 2736 -3021 -2685 -120 -2561 2573
625B573M014r266l947O446K356M8M57k565p12j763j513P846M307q973l663L756
$$ 2573 6587 -2679 -6626 -180 2176 2224 2681 116 -596 -2359 -3872 3974 8281 -692 -4355 -599
641e99j494K677N327o062l198M924n214j283J2047l142j1812O526M857p847L963
$$ -599 -2093 584 5911 -151 -3349 1575 -3639 -4922 7125 3983 -7829 -1303 3554 -4293 -330
656c30N185r214J327R296p560l281J0428n567q664J2955M922j3223M79N607o536
$$ -330 4855 -4359 -3032 6264 -1296 -4577 5851 284 -8380 4575 9497 -3726 -3247 2360 -4176
671d176L848R711q867n771P196n662l531J6420L09j7918L004Q237p839M077J0593
$$ -4176 -328 9383 516 -5255 1941 -3721 -7252 9168 9477 -8441 -5437 2800 -5039 -962 9631
686I631r774o861P016l185J07J2247n609j2244Q428M414q518N109N906q833j283
$$ 9631 -143 -7004 12 -3173 -3066 9181 3572 -8672 -244 4170 -4348 761 6667 -2166 -3449
701c449O350k491o08K789m984o79P060j315n040J111l00n77L536J039j085k377
$$ -3449 2901 410 -198 2591 -2393 -3072 3988 2673 -2367 -1256 -1556 -2133 1403 2442 1357 -1020
717a020m528J860P102m2k338j049n167R71Q009j022k295L794o458o169J1222M171
$$ -1020 -5548 -3688 3414 3372 1034 -15 -5182 -4211 3798 2776 481 4275 -2183 -8352 2870 7041
733G041q235K015P63p550N559O951q017M39N191r595M03J2640o095q385Q032k35
$$ 7041 -1194 821 1584 -5966 -407 6544 -1473 -1034 4157 -5438 -5035 7605 1510 -6875 1157 922
749I22n519P589M24q481M120K902n591N732M162j0468l10P811k687n60M534n235
$$ 922 -4597 2992 3416 -5065 -945 1957 -3634 2098 6260 -4208 -4518 3293 606 46 4580 -655
765f55l357N365l77j223M446l331n752M416K901k375R09q65l187K482J456j903
$$ -655 -4012 1353 976 -247 4199 868 -4884 -468 2433 58 967 102 -3085 -603 853 -1050
781a050J813n2m536K181M342j903j217k1j679J862L072k110p83J221l048K8N296
$$ -1050 763 711 -3825 -1644 2698 795 -422 -443 -2122 -260 2812 702 -81 1140 -1908 -1880 3416
798C416n50l287l4n98m81L683K69l179K37j6j931K768K273k913j251N83n11J542
$$ 3416 2866 -421 -455 -1053 -1534 2149 2418 -761 -524 -540 -2471 297 2570 -343 -1594 -1011 -1522 20
816B0J960k231j364J582l78l11K057m5k242L18Q79P35N45j019j458Q52J175p62
$$ 20 1980 -251 -1615 -33 -411 -722 1335 1290 -952 -634 245 980 1525 506 -952 -100 1075 313
834C13J49N62j281r16R18J416m62j604n61R45P20j47m68J7k69p8J3J667L99k041
$$ 313 462 1024 -257 -1173 -255 1161 699 -905 -1466 -521 199 52 -416 -399 -668 -746 -733 934 1333 -708
854g08n75J578M23j52O13j127n93R73P9J63P96r36j737R54P59m29O95n92j562
$$ -708 -1283 295 718 566 1179 52 -541 432 511 674 1470 534 -1203 -249 510 81 776 184 -1378
873a378R50R53j176M49P56j608l08J268K18k4k07r54R21J293j331j78J402j003
$$ -1378 -428 525 -651 -202 554 -1054 -1362 -94 124 100 -107 -1061 -140 1153 -178 -356 1046 43
891D3q69J627K45o25Q6q15j22K122j170j549J756P5k542J351J473j859K70P10
$$ 43 -826 801 1046 421 507 -308 -430 1692 522 -1027 729 804 -1738 -387 1086 -773 -503 207
909B07j385Q40J057k219N20K369j757j027K439j005j284K207k43j517J813k06
$$ 207 -1178 -338 719 -1500 -980 1389 -368 -1395 1044 39 -1245 962 719 -798 1015 809
925H09k413K081J454k373M03J273j285k83P21l19J03M29j355n14J697m72j031
$$ 809 -1604 477 1931 -442 -39 1234 -51 -334 387 68 171 600 -755 -1269 428 -44 -1075
942a075R67Q16j216p87M63J090K61o71rM56p15k74O69J082N56j303j393J221J017
$$ -1075 -108 708 -508 -1295 -832 258 519 -152 -161 295 -420 -694 -25 1057 1613 310 -1083 138 1155
961A155j330O09J551j758j719J019O12k35J009r28j601J667j94j625J837J468
$$ 1155 -175 434 1985 227 -1492 -473 139 -96 913 -15 -1616 51 -143 -1768 69 1537
977A537k297o57J512m56m22J280j43k69R66j274j117J641J505j552N0J235j569
$$ 1537 -760 -1417 95 -361 -783 497 354 85 1051 -223 -1340 301 1806 254 304 1539 -30
994c0j419J404J290r3m61j102j237P82J458p05J63J326j924k788K528K769k146
$$ -30 -1449 -45 1245 1152 691 -411 -1648 -866 592 -113 50 1376 -548 -3336 -808 1961 -185
1011a85n83J528j438j012K147j23n9J560j930j977L018J089l200J108K567k636
$$ -185 -768 760 -678 -1690 457 334 275 1835 -95 -2072 946 2035 -1165 -57 2510 -126
1027a26j080K124o43j104J838o84j226J679n93k642J997K635k432j046J464o01
$$ -126 -1206 918 275 -829 1009 325 -901 778 185 -2457 -460 2175 -257 -1303 161 -440
1043d40j273J568J247n98n73n07r41J520J898j157j668J729k7k187J434K669j997
$$ -440 -1713 -145 1102 504 -69 -576 -1517 3 1901 744 -924 805 778 -1409 25 2694 697
1060F97k530K009J17j117K080j15k786J633N58k837J851L125l512k119L987k82
$$ 697 -1833 176 293 -824 1256 1141 -1645 -12 546 -2291 -440 2685 -827 -2946 1041 759
1076G59k587K384K50k016J345R27k185J725J289k828J16L168j282k753J890J201
$$ 759 -1828 556 806 -1210 135 1062 -1123 602 1891 -937 -821 2347 1065 -1688 202 1403
1092A403j545L76Q21j412l81N16k83P14J214j160k819J111K450j255n21K218r97
$$ 1403 -142 234 1055 -357 -738 -222 -505 209 1423 263 -2556 -1445 1005 -250 -771 1447 450
1109D50l037J591K011o20O00J59k839P27K753j925m75L402j709l854K936J801
$$ 450 -2587 -996 1015 395 995 1154 -1685 -958 1795 -130 -605 2797 1088 -2766 170 1971
1125A971k565P00J241k254N57J293k441M91L026k413j738L424p79l454K259K175
$$ 1971 -594 106 1347 -907 -350 943 -1498 -1007 2019 -394 -2132 1292 513 -2941 -682 1493
1141A493j695J56P34j962K09J974m10k80J629j610k315J637K136o42o41K5q15
$$ 1493 -202 -46 688 -1274 -1065 909 499 219 1848 238 -2077 -440 1696 1054 413 438 -377
1158c77o68P52Q52L69l87p93j424N53K333r53j442J627K27k459O55K245j078o57
$$ -377 -1045 -293 559 928 541 -252 -1676 -1123 1210 257 -1185 442 669 -1790 -1135 1110 32 -625
1176f25J025m10l83J127q85r28K599j53k329J000J531k328j62K328l53j426L94
$$ -625 400 -10 -393 734 -151 -1079 1520 1367 -962 38 1569 -759 -921 1407 1054 -372 22
1193B2p70k41J953k98j677J183J1k077R41K419j233j214O91j19q2R73l54k80O84
$$ 22 -748 -989 964 666 -1011 172 183 -1894 -953 1466 233 -981 -290 -409 -491 482 128 -152 532
1212E32l68r59J358Q44j146m57O10m7k97N2J3j2M8l32k49M69J9n76L9M55J95n73
$$ 532 164 -795 563 1407 261 -196 414 367 70 122 135 123 171 -161 -410 59 78 -498 -459 -4 191 -382
1234c82n33P00L80n44j0N87o7n98n1P44J73J01q80LJ310m98q72R91M17j458L33
$$ -382 -915 -215 165 -379 -389 198 131 -467 -518 226 399 500 -380 -377 933 435 -437 554 971 -487 -154
1255a54O34l93Q8O3p12M68K11q93J70R60p60n38P76K3m41L97K7m02P18j0r49R52
$$ -154 480 87 175 238 -474 -6 205 -688 -518 442 -318 -856 -80 -57 -498 -101 -74 -476 242 232 -717 235
1277B35O92q90q2N28j40j57J76j78l2M42o56k99R32N4j211L65K89j81j85J69l3
$$ 235 927 37 -45 483 343 186 362 184 152 594 -62 -361 571 625 -586 -221 68 -113 -298 -129 -162
1298a62J85k91m79P89M39p29j19L89K0j54K89K1q2M3l51M56N09m90k46r9K23J21
$$ -162 23 -268 -747 42 481 -248 -367 22 42 -112 177 198 116 159 -192 264 773 283 37 -62 161 282
1320B82J91m06l17L5J16nK54j21n60j32L19M06ql4o04J49K64J48K5M10m01l02
$$ 282 473 67 -250 -215 -99 -104 150 29 -531 -663 -344 62 54 20 -584 -435 -171 -23 2 412 11 -291
1342b91P1O83J92k76k74Q5J15L3j35j21K0m00k8N65K56o60n14K95J54K70L8k15
$$ -291 -220 463 655 379 105 190 305 338 203 82 102 -298 -326 239 495 -165 -679 -384 -230 40 78 -137
1364a37l80M8j1J33J020n08p53J79K75M05L74l06o16K68K61m86O74M34p53r47
$$ -137 -517 -469 -480 -347 673 165 -588 -409 -134 271 645 339 -277 -9 252 -234 440 874 121 -826
1384h26P89N32n5j81n28j10M92k11kK24m69p07N29J148j56p43o56M01N52L12K19
$$ -826 -37 495 440 259 -269 -379 113 -98 -100 124 -345 -1052 -523 625 469 -274 -930 -529 23 335 554
1405E54K3o49o83K54O15R99l7j280o63J144M3k61P68k86j259K19M53K6O30m37
$$ 554 577 -72 -755 -501 114 1113 1076 -204 -867 277 320 59 827 541 -718 -499 -46 -20 610 173
1425A73j595Q14J377r83p07J288k29j119J251M40p35j0m85J57J472J96j865j30
$$ 173 -1422 -608 769 -214 -921 367 138 -981 270 710 -25 -35 -520 -363 1109 1305 -560 -690
1443f90J372n81o25J730J49k012o00J206P79m5j03j253l00Q00L19n29R58J58k309
$$ -690 682 101 -524 1206 1355 -657 -1257 -51 728 683 580 -673 -973 -173 146 -383 575 733 -1576
1462a576NK404j69j294Q39k32r11J342L93r79P74K08k209J205K490k035j329J617
$$ -1576 -1571 833 664 -630 209 -23 -934 408 801 -178 596 804 -1405 -200 2290 255 -1074 543
1480E43j58q83J227k54j334J086k33j163J699P31k572m18K371k00r68N59O9o20
$$ 543 385 -498 729 475 -859 227 -6 -1169 530 1261 -1311 -1729 642 442 -526 33 102 -518
1498e18N0M47L77M36p46j051M55J691j89j250o8J122q06q15J882N04k124k40P31
$$ -518 -468 -21 356 792 46 -1005 -550 1141 952 -298 -366 756 -50 -865 1017 1521 -603 -843 -112
1517a12j54O85N14k066K93J674j968k89K923q56k712J737J135j617R63L91j886
$$ -112 -266 419 933 -1133 -840 834 -1134 -1423 1500 644 -2068 -331 804 -813 150 541 -1345
1534a345J719R34k247N50K304j930j442K496J68k032O04M03l31R61n34j158Q46
$$ -1345 374 1308 -939 -389 1915 -15 -1457 1039 1207 -825 -221 182 -149 812 278 -880 -34
1551c4N54j659P41J815r08j745K78R44L57j76n77N64k5j191N05J296K77p51q36
$$ -34 520 -1139 -398 1417 509 -1236 -958 -14 343 167 -410 154 129 -1062 -557 739 1016 265 -571
1570e71K4J238k59j114J279P85j551q93J304L44l26j12l33J55M12j205n05K185
$$ -571 -547 691 432 -682 597 1382 -169 -1062 242 586 260 148 -185 -30 382 -823 -1328 857
1588H57J95k080L98J089q84j27Q83j52L88o17j241J001J608r99r79J471J00j507
$$ 857 1052 -1028 -630 459 -425 -552 331 179 567 -50 -1291 -290 1318 319 -660 811 911 -596
1606e96K19P87K60J04q49o45J198n1j526P89J549j018j360O08M61O2l47L7L90
$$ -596 -377 410 670 774 -75 -720 478 427 -1099 -310 1239 221 -1139 -531 -70 -8 -355 -318 72
1625G2L42j271m95J905L50j022r4M02L9l77m2P35O75j079j091J064O15n93l42
$$ 72 414 -857 -1352 553 903 -119 -213 189 228 -149 -191 544 1219 140 -951 113 728 135 -207
1644b07K86J24k06n05q0R63J69j535L38J227m02q69M48N99k91l5n98M86R58j006
$$ -207 79 203 -3 -508 -588 375 544 -991 -653 574 172 -697 -249 350 59 24 -574 -88 870 -136
1664a36o87J598O31j813j48J090j21k75N2k47N23qj390O59J463q20j597R35N57
$$ -136 -823 775 1406 -407 -555 535 414 139 191 -56 467 459 -931 -272 1191 371 -1226 -291 266
1683B66k27n31J12N50M5r20J03J000K08j027j46N57N15k73o36P08N20r72n94J319
$$ 266 39 -492 -380 170 215 -705 -602 398 606 -421 -567 -10 505 232 -404 304 824 -148 -742 577
1703E77M92j066n36O62K78j40m13k45O41J00j270L57J314m39j387N11Q43l88n6
$$ 577 1069 3 -533 129 407 267 -146 -391 250 350 -920 -563 751 312 -1075 -564 279 -109 -165
1722a65k92J50O27m16p18J282O03j410o48J324M80o53j61K67L3k30m10N54Q21
$$ -165 -457 -307 320 -96 -814 468 1071 -339 -987 337 817 164 3 270 303 73 -337 217 1038
1741A038p36j071R6J313J58j467N8P52l18n93P53O01p36o77M2Q15N90j72j126
$$ 1038 302 -769 -673 640 798 -669 -611 141 -177 -770 -17 584 -152 -829 -787 28 618 446 -680
1760f80L05P64m08j87J068j16j053l81R29O32j08r90n58Q75J76k26Q6K88n93j252
$$ -680 -375 389 -19 -206 862 746 -307 -688 241 873 765 -225 -783 92 268 42 128 416 -177 -1429
1780a429Q45J408j8j264m62L75O95O0k00J54j56o50j57J429Q48j134j442Q68R75
$$ -1429 -584 824 806 -458 -920 -545 150 210 10 164 8 -642 -799 630 1478 344 -1098 -230 745
1799G45j17j91n8m73j39K38K85P24o32j602k5J672M49q29n24R7l04N75K58K15
$$ 745 628 437 379 -94 -233 5 290 1014 382 -1220 -1245 427 876 47 -477 -380 -684 -109 149 364
1819C64J7j248m29J331J182n21j040k81L56M52L11J09q8o66j029Q72J550p6j320
$$ 364 381 -867 -1296 35 1217 696 -344 -625 -269 183 494 603 515 -151 -1180 -308 1242 1166 -154
1838a54q68N49N55K01q6Ql91j188O13J616R6j194r00M80P48M32l32k61p9l31k85
$$ -154 -1022 -473 82 283 197 205 -186 -1374 -761 855 951 -243 -1143 -663 85 517 185 -76 -155 -486 -771
1859g71J410Q08j249j028K36J003M93k98p46m7M1l76P18P86n53j280p7J287L58
$$ -771 639 1447 198 -830 -594 409 902 604 -142 -189 -148 -524 194 980 427 -853 -930 357 715
1878G15n70n92j78K81K89j02N44J65j028p04R45J267k57j351p5O67L62l98N30
$$ 715 145 -447 -625 -344 -55 -157 387 552 -476 -1180 -235 1032 775 -576 -651 16 378 -20 510
1897E10J93q03n70K40J233L26j299q95J114M08q17J72M73k83n22R8M59N30n64
$$ 510 703 -100 -670 -430 803 1129 -170 -1065 49 457 -360 -188 285 2 -520 -422 37 567 3
1916Cq14K68J195l37p86O21M51n58k02M09K72k18n39k25Q11L15q97k03P54K66
$$ 3 -811 -543 652 315 -471 150 601 43 -159 250 522 304 -235 -460 351 666 -231 -434 320 586
1936E86r93L5O15q3m61l25N42M38n03o82P09P75p86p82O35R07n47m31L66K60k69
$$ 586 -407 -372 243 160 -301 -626 -84 354 -149 -831 -122 653 -133 -915 -280 627 80 -351 15 275 6
1957Fn64N71O41J25j060k97J038K88p01k70N61l05o09N12M71l01n41l07L49J167
$$ 6 -558 13 654 779 -281 -578 460 748 47 -223 338 33 -576 -64 407 106 -435 -742 -393 774
1977G74k34j312l3Q18k84Q3J019k79j092m20N47J011P60j026j506P98J085q65
$$ 774 540 -772 -805 13 -271 -188 831 552 -540 -960 -413 598 1358 332 -1174 -376 709 -156
1995a56M43J078j406j404J070J190q1k99j022p01J461N04j338N10Q48j644l54
$$ -156 287 1365 -41 -1445 -375 815 734 435 -587 -1288 173 677 -661 -151 697 -947 -1301
2012a301K325M1k001j68P49K42J346k45j990K22R77p21Q67K113j623k945P70J935
$$ -1301 1024 1065 -936 -1104 -355 -113 1233 988 -1002 -780 197 -524 343 2456 833 -2112 -1342 593
2030E93M23K74l79k038m46J207M80M69R95j832k536J787K375j027o25P69j252
$$ 593 1016 1290 911 -1127 -1573 -366 114 583 1578 -254 -2790 -1003 1372 345 -280 489 -763
2047g63o20J905K61q71N27m67j344K111J424l236p06K813k73r55J598q61k703
$$ -763 -1383 522 783 -88 439 -28 -1372 739 2163 -1073 -1779 1034 761 -194 1404 543 -2160
2064b160J257J641j96J244p90l890L80M173m25j609J667j522l129K259L198p54
$$ -2160 -903 738 542 1786 996 -2894 -2514 1659 1234 -375 1292 -230 -3359 -1100 2098 1344
2080A344r78m08k246Q55L398l41k088J123m86k281K012K723k033j791J412l53
$$ 1344 366 -42 -2288 -1433 1965 1624 -464 659 173 -2108 -96 2627 594 -1197 215 -138
2096a38k00J577q78k110J851R20j753Q13J464k827j317L555P66k018P2l35j631
$$ -138 -338 1239 361 -1749 102 1022 -731 82 1546 -1281 -2598 957 1723 -295 -223 -558 -2189
2113b189K355J972j749n08R27k703j82M616n7l493L35Q04j584J629K212k171j209
$$ -2189 166 2138 389 -119 808 -1895 -2077 2539 2482 -1011 -676 128 -1456 173 2385 214 -995
2130i95J027q92J26K732q17l202J249J907j498M5J486j651j361K024O60r42R14
$$ -995 32 -860 -734 1998 1181 -2021 -772 1135 -363 -318 1168 -483 -1844 180 840 -102 812
2147H12j011j962K093K363j928j183J453q54r71K230Q79k168k90O22q94J327J494
$$ 812 -199 -2161 -68 2295 367 -816 637 -217 -1188 1042 1921 -247 -537 85 -809 518 2012
2164B012k543q84J745j65j267K087L80k843R3J932j53l20O81j746k91J947j42
$$ 2012 -531 -1415 330 165 -1102 985 1365 -1478 -1385 547 394 74 755 -991 -1282 665 523
2181E23p83J176m20k151R04K485p78j451L84j17l36J001M32j081K38N9j337Q45
$$ 523 -260 916 496 -1655 -751 1734 956 -495 -111 -228 -564 437 869 -212 26 85 -1252 -407
2199d07J794r98j690J167L87n35K34M14q04Q0O13p62N40O83j148p00J628P91j516
$$ -407 1387 389 -1301 -134 253 -282 -48 366 -438 -358 255 -507 33 716 -432 -1132 496 1287 -229
2218b29j32P31o43P6O55K2k54p1p97N8J424j47j222J58N58n72j98R15P8m79n80
$$ -229 -361 370 -273 -197 458 480 226 155 -642 -584 840 693 -529 -371 187 -385 -583 332 410 -69 -649
2239f49K95M07J94j92m85L75L49k56l94P30L06q24j20P23j79m80J79j3L03K19
$$ -649 -354 53 247 55 -430 -55 294 38 -356 374 680 -144 -264 459 280 -200 -21 -34 269 488
2259D88p27l62R79N8r97M34P88j060k03M27K04n6K9n29K10R88q30n33J062J0q90
$$ 488 -239 -601 378 436 -561 -127 661 -399 -602 -175 29 -27 2 -527 -317 671 -159 -692 370 380 -510
2280e10K41O24j4j41l12L4Q14m75p94M34N59o78j7L21J46l14n95K30P33J74r09
$$ -510 -269 355 341 200 -112 -78 736 261 -533 -99 460 -218 -235 86 232 -82 -677 -447 286 460 -449
2301d49l80Q45N2m31N24P8k82r1l07M03R41p91o20N34L43k59j24L82l21k12R4
$$ -449 -829 16 68 -363 161 239 -43 -134 -441 -38 903 112 -508 26 369 110 -14 368 47 -165 -71
2322g1k1Q00k22j344M62Q83k70m82L30j69k34J81j69N78N12j112n35R43O32p78
$$ -71 -92 708 486 -858 -396 487 217 -265 65 -104 -338 -157 -326 252 764 -348 -883 60 692 -86
2342h6J11J64k00rk27M62O87p65r46N82J067n37n93M21m6k48M1R2K47k37n88J27
$$ -86 25 189 -11 -20 -247 215 902 137 -809 -227 840 303 -290 131 85 -163 -122 -30 217 -20 -608 -481
2364d81Q86J45q32k62L06K63K05l31J80K52q50j50R31N70m93m60j55L63L01k15
$$ -481 405 550 -282 -544 -238 25 230 -101 79 331 -519 -669 262 832 339 -121 -276 87 388 173
2384A73j01N45o39q12P85O13n2r35j82L68L01j33k12N08p2r52J56J136N0p63m27
$$ 173 72 617 -22 -834 -49 564 512 -423 -605 -237 64 -69 -281 227 155 -797 -641 495 545 -218 -645
2405f45O30L06p6l13K38rk86k73O14N13l34r00J62R41Q6r72K46K05m66l9O32J7
$$ -645 -15 291 215 -98 140 131 -155 -428 186 699 365 -535 -373 568 654 -318 -72 133 -333 -372 260 277
2427B77j77j60p76N82J343q11j048R25K13j053O68R08o20n51n3l9O20R47j420
$$ 277 100 -60 -836 -254 1089 278 -770 155 368 -685 -17 891 271 -280 -333 -372 248 1195 -225
2446b25o15J319o85o29J253Q01j437n75O95P1K12K06p60j57Q86p00l69J122O5
$$ -225 -840 479 -206 -835 418 1219 -218 -793 -98 -27 185 391 -369 -526 360 -340 -709 413 478
2465D78j244k2J474j88r29L4M34j30M01L45n47j04J12r15L64J886n66j877N29
$$ 478 -766 -788 686 498 -431 -397 37 -93 308 653 106 2 114 -801 -437 1449 883 -994 -465
2484d65Q90p35J81J282r98r56O86m95K62J795r80j987J355O37j482O03J781j327
$$ -465 425 -310 -129 1153 155 -801 -115 -610 -348 1447 467 -1520 -165 472 -1010 -407 1374 47
2502D7j160J088R5k56P98n16j032J443L66j753M75J376j129p24J623K58j815R6
$$ 47 -1113 -25 70 -186 612 96 -936 507 873 -880 -405 971 -158 -882 741 999 -816 -720
2520g20P09k44R28M02j644o08J479p02m64K049Rk746M94J651p66M52P21j216q68
$$ -720 -11 -255 673 1075 -569 -1177 302 -400 -864 1185 1194 -1552 -1058 593 -173 279 1000 -216 -1084
2539a084J220j13m10J729l99k331P74K061j401m75J265p82q21R51ro07J015n44
$$ -1084 136 23 -387 1342 943 -1388 -614 1447 46 -429 836 54 -767 184 175 -432 583 39
2557C9j258J482R86j732o57J434j16n32N52L09r89j78O00J61N17K19j231n79J151
$$ 39 -1219 263 1249 -483 -1140 294 178 -354 198 507 -482 -660 -60 101 618 837 -394 -973 178
2576A78M21q52N79N56j493n03J590R9n75K94k55q28J072Q3j174Q94P98j819k1
$$ 178 599 -253 326 882 -611 -1114 476 575 0 294 39 -789 283 366 -808 86 884 -935 -956
2595i56J932o65j123R59j45k36P16j75j057R76K45j203Q83J172j443q00J181P
$$ -956 976 311 -812 147 2 -234 482 307 -750 226 471 -732 151 1323 -120 -920 261 268
2613B68l94N21j84n16O08q20m5J023L44j297RP92m69l39M99L34j41j79n45L61
$$ 268 -126 395 211 -305 303 -517 -562 461 805 -492 -483 309 -160 -499 0 334 193 14 -531 -170
2633a70O77l61n58N47M83o07m21L37K66j99p6L42K2l79m02J36N15L63m24l49J05
$$ -170 507 146 -412 135 618 11 -410 -73 193 -6 -82 260 282 -97 -499 -363 152 515 91 -258 -153
2654a53J21m97M39Q85m56p24l74R9O55N46j82m53L87p38m25J209J017j103o95
$$ -153 -32 -529 -90 795 339 -385 -759 -660 -5 541 359 -94 293 -445 -870 339 1356 253 -442
2673d42J51J6K58O08L5o36K48n95l40J312Q2j354J9J126n44k97O66m61m24O21
$$ -442 -291 -275 -17 591 626 -10 238 -357 -697 615 697 -657 -638 488 -56 -353 313 -148 -572 49
2693D9J32j12K50m58r92J192J248o81q44L9k63j77J089O65q71k81n96m54J487
$$ 49 181 69 319 -139 -1131 61 1309 628 -216 -177 -440 -617 472 1137 266 -15 -611 -1065 422
2712D22J098j194r59M16k52n0J241M28j302q67L23P34M66K51j240m03P91K91j73
$$ 422 1520 326 -633 -217 -469 -519 722 1150 -152 -1019 -696 38 504 755 -485 -888 -97 194 21
2731B1P32k16j479J51J379K65n73n36m39K50J046L96o75k27l41q59Q62J490m12
$$ 21 753 537 -942 -791 588 853 280 -256 -695 -445 601 997 322 95 -246 -1105 -243 1247 835
2750H35j551m05O41N07P13J66j110q28N23L79P07O83j394j238P25J272M3n4k66
$$ 835 -716 -1121 -480 27 740 906 -204 -1032 -509 -130 577 1260 -134 -1372 -647 625 668 614 348
2769C48j118k22J061P85k7l34j382l03J497J115j085p25j01l18K51J352L62j323
$$ 348 -770 -992 69 854 827 493 -889 -1192 305 1420 335 -390 -491 -809 -558 794 1156 -167
2787a67q23r8Q18J269m2j312o91N10K74O52Q34q76j191l24J057J123J12j086q74
$$ -167 -990 -1088 -270 999 957 -355 -1046 -536 -262 390 1224 348 -843 -1167 -110 1013 1125 39 -835
2806h35J03P92N78Nj85j142m07P37J249K87j356r82J57Q59R12q5n63q98o2N93
$$ -835 -732 60 638 643 458 -684 -1091 -354 895 1182 -174 -1156 -999 -140 772 687 124 -774 -836 -243
2826b43R78N97j084j366J99J139P14l82j22q28n19Q17P99L25m86j470n90J599
$$ -243 735 1332 248 -1118 -919 220 934 552 430 -398 -917 -100 699 1024 538 -932 -1522 77
2844G7R86m72n83n38k47J51J147L90n50q65q29J089J331k61q33o52J37K48N16
$$ 77 1063 591 8 -530 -777 -626 521 911 361 -504 -1333 -244 1087 826 -7 -659 -522 -274 242
2863B42Q12n44p93o58O32J015O68j104j042J37M48N27M90l82q94n25L68J256K67
$$ 242 1054 510 -283 -941 -309 706 1374 270 -772 -635 -187 340 830 448 -446 -971 -603 653 920
2882I20o87j116K59N50N62K02m54m72o19L67P51Q29o04j124j40R54L13K01l88
$$ 920 233 -883 -624 -74 488 690 236 -236 -855 -488 263 1092 488 -636 -776 178 491 692 304
2901C04m04l17n7M62R73k89j332l38R12P67l11l04k96J6k53O13M90j32q97m77
$$ 304 -100 -417 -474 -12 961 672 -660 -998 -86 681 370 66 -230 -214 -467 146 636 504 -393 -870
2921h70N18J042p6p08k00J95j85K86N65P8p98l96J11O37N28l72p34J03M25n58
$$ -870 -352 690 614 -94 -294 -99 -284 2 567 645 -153 -549 -438 199 727 355 -379 -276 149 -409
2941d09N01N35p99n22L27L52L65k95m85J49N16k88k45N57J69p59NM83L19k18l89
$$ -409 92 627 -172 -694 -367 -15 350 55 -430 -281 235 -53 -298 259 428 -331 -326 157 476 258 -131
2962a31l38P45R2l73j84K93Mm43K29L98N3n03j90J96K89k64n4M30j8n36j11K74
$$ -131 -469 276 368 -5 -189 104 108 -335 -106 292 345 -158 -348 -152 137 -127 -181 249 231 -305 -416 -142
2984a42N59r4l72l5K50k69l09P07L82m28n15j93M90N16j12k91P6k93n86O14O22
$$ -142 417 323 -49 -84 166 -103 -412 295 677 249 -266 -459 31 547 435 144 220 -73 -659 -45 577
3005E77k98n60pj86P73lo03J39M04m65p3P09p8q69R8M55L98K89o35p20M56N06
$$ 577 279 -281 -288 -474 299 296 -307 -168 236 -229 -302 407 329 -540 -442 13 411 700 65 -655 -199 307
$$ [...]
8191i7
##END NTUPLES=NMR FID
##END=
