##TITLE=1H_E3e0607TFA1
 CDCl3
 8 sc, 
 7.7.2023
##JCAMPDX= 6.0         $$ Bruker NMR JCAMP-DX V2.0
##DATA TYPE= NMR FID
##DATA CLASS= NTUPLES
##ORIGIN= UXNMR, Bruker Analytische Messtechnik GmbH
##OWNER= root
$$ XWIN-NMR		Version 3.5
$$ Fri Jul  7 14:58:32 2023 Russian Standard Time (UT+4h)  she@DPX200
##.OBSERVE FREQUENCY= 200.13135
##.OBSERVE NUCLEUS= ^1H
##.DELAY= (6, 6)
##.ACQUISITION MODE= SIMULTANEOUS
##.ACQUISITION SCHEME= undefined
##.AVERAGES= 8
##.DIGITISER RES= 18
##SPECTROMETER/DATA SYSTEM= spect
##.PULSE SEQUENCE= zg30
##.SOLVENT NAME= CDCl3
##.SHIFT REFERENCE= (INTERNAL, CDCl3, 0, 15.7039)
##AUDIT TRAIL= $$ (NUMBER, WHEN, WHO, WHERE, WHAT)
$$ ##TITLE= Audit trail, XWIN-NMR		Version 3.5
$$ ##JCAMPDX= 5.01
$$ ##ORIGIN= Bruker BioSpin GmbH
$$ ##OWNER= she
$$ F:/spectra/data/she/nmr/H-F/1/audita.txt
$$ ##AUDIT TRAIL=  $$ (NUMBER, WHEN, WHO, WHERE, WHAT)
(   1,<2023-07-07 14:57:00.78 +0400>,<she>,<DPX200>,
      <created by zg, POWCHK disabled, PULCHK disabled
       configuration hash MD5:
       00 E9 B6 7A A2 85 ED C7 34 08 36 98 17 FE 4E 26
       data hash MD5: 16K
       73 B5 A9 44 5D 41 37 2B 96 3F 73 07 63 01 B2 7C>)
$$ ##END=
$$ 
$$ hash MD5
$$ 0F 9A F2 82 12 39 DA D5 61 89 91 18 18 DB F6 76
##$RELAX= 
##$RELAX= 
##$RELAX= 
##$RELAX= 
##$RELAX= 
##$RELAX= 
$$ Bruker specific parameters
$$ --------------------------
##$DU= <F:/spectra>
##$EXPNO= 1
##$NAME= <H-F>
##$PROCNO= 1
##$TYPE= <nmr>
##$USER= <she>
##$AMP= (0..31)
100 100 100 100 100 100 100 100 100 100 100 100 100 100 100 100 100 100 
100 100 100 100 100 100 100 100 100 100 100 100 100 100 
##$AQSEQ= 0
##$AQ_mod= 1
##$AUNM= <au_zg>
##$AUTOPOS= <>
##$BF1= 200.13
##$BF2= 200.13
##$BF3= 200.13
##$BF4= 200.13
##$BF5= 200.13
##$BF6= 200.13
##$BF7= 200.13
##$BF8= 200.13
##$BYTORDA= 1
##$CFDGTYP= 0
##$CFRGTYP= 5
##$CHEMSTR= <none>
##$CNST= (0..31)
1 1 145 1 1 1 1 1 1 1 1 1 1 1 1 1 1 1 1 1 1 1 1 1 1 1 1 1 1 1 1 1 
##$CPDPRG= <>
##$CPDPRG1= <>
##$CPDPRG2= <>
##$CPDPRG3= <>
##$CPDPRG4= <mlev>
##$CPDPRG5= <mlev>
##$CPDPRG6= <mlev>
##$CPDPRG7= <mlev>
##$CPDPRG8= <mlev>
##$CPDPRGB= <>
##$CPDPRGT= <>
##$D= (0..31)
0 1.2 0 0 0 0 0 0 0 0.06 0 0.03 0 0 0 0 0.0002 0 0 0 0 0 0 0 0 0 0 0 0 
0 0 0 
##$DATE= 1688727420
##$DBL= (0..7)
120 120 120 120 120 120 120 120 
##$DBP= (0..7)
150 150 150 150 150 150 150 150 
##$DBP07= 0
##$DBPNAM0= <>
##$DBPNAM1= <>
##$DBPNAM2= <>
##$DBPNAM3= <>
##$DBPNAM4= <>
##$DBPNAM5= <>
##$DBPNAM6= <>
##$DBPNAM7= <>
##$DBPOAL= (0..7)
0.5 0.5 0.5 0.5 0.5 0.5 0.5 0.5 
##$DBPOFFS= (0..7)
0 0 0 0 0 0 0 0 
##$DE= 6
##$DECBNUC= <off>
##$DECIM= 32
##$DECNUC= <off>
##$DECSTAT= 4
##$DIGMOD= 1
##$DIGTYP= 9
##$DL= (0..7)
0 120 120 120 120 120 120 120 
##$DP= (0..7)
150 150 150 150 150 150 150 150 
##$DP07= 0
##$DPNAME0= <>
##$DPNAME1= <>
##$DPNAME2= <>
##$DPNAME3= <>
##$DPNAME4= <>
##$DPNAME5= <>
##$DPNAME6= <>
##$DPNAME7= <>
##$DPOAL= (0..7)
0.5 0.5 0.5 0.5 0.5 0.5 0.5 0.5 
##$DPOFFS= (0..7)
0 0 0 0 0 0 0 0 
##$DQDMODE= 0
##$DR= 18
##$DS= 0
##$DSLIST= <SSSSSSSSSSSSSSS>
$$ [...]
##$SUBNAM2= <"">
##$SUBNAM3= <"">
##$SUBNAM4= <"">
##$SUBNAM5= <"">
##$SUBNAM6= <"">
##$SUBNAM7= <"">
##$SUBNAM8= <"">
##$SUBNAM9= <"">
##$SW= 18.05172834244
##$SWIBOX= (0..15)
0 0 2 0 0 0 0 0 0 0 0 0 0 0 0 0 
##$SW_h= 3612.71676300578
##$TD= 16384
##$TD0= 1
##$TE= 0
##$TE2= 300
##$TE3= 300
##$TEG= 300
##$TL= (0..7)
0 120 120 120 120 120 120 120 
##$TP= (0..7)
150 150 150 150 150 150 150 150 
##$TP07= 0
##$TPNAME0= <>
##$TPNAME1= <>
##$TPNAME2= <>
##$TPNAME3= <>
##$TPNAME4= <>
##$TPNAME5= <>
##$TPNAME6= <>
##$TPNAME7= <>
##$TPOAL= (0..7)
0.5 0.5 0.5 0.5 0.5 0.5 0.5 0.5 
##$TPOFFS= (0..7)
0 0 0 0 0 0 0 0 
##$TUNHIN= 0
##$TUNHOUT= 0
##$TUNXOUT= 0
##$USERA1= <user>
##$USERA2= <user>
##$USERA3= <user>
##$USERA4= <user>
##$USERA5= <user>
##$V9= 5
##$VALIST= <valist>
##$VCLIST= <CCCCCCCCCCCCCCC>
##$VD= 0
##$VDLIST= <DDDDDDDDDDDDDDD>
##$VPLIST= <PPPPPPPPPPPPPPP>
##$VTLIST= <TTTTTTTTTTTTTTT>
##$WBST= 1024
##$WBSW= 4
##$XGAIN= (0..3)
0 0 0 0 
##$XL= 0
##$YL= 0
##$YMAX_a= 254928
##$YMIN_a= -314093
##$ZGOPTNS= <>
##$ZL1= 120
##$ZL2= 120
##$ZL3= 120
##$ZL4= 120
##$ABSF1= 10
##$ABSF2= 0
##$ABSG= 5
##$ABSL= 3
##$ALPHA= 0
##$AQORDER= 0
##$ASSFAC= 0
##$ASSFACI= 0
##$ASSFACX= 0
##$ASSWID= 0
##$AUNMP= <proc_1d>
##$AZFE= 0.1
##$AZFW= 0.1
##$BCFW= 1
##$BC_mod= 2
##$BYTORDP= 1
##$COROFFS= 0
##$CY= 11.3945322036743
##$DATMOD= 1
##$DC= 2
##$DFILT= <>
##$DTYPP= 0
##$F1P= 15.7292609196834
##$F2P= 12.9074282941183
##$FCOR= 0.5
##$FTSIZE= 0
##$FT_mod= 4
##$GAMMA= 1
##$GB= 0.15
##$INTBC= 1
##$INTSCL= 1
##$ISEN= 128
##$LB= 0.24
##$LEV0= 0
##$LPBIN= 0
##$MAXI= 10000
##$MC2= 0
##$MEAN= 0
##$ME_mod= 0
##$MI= 1.114404
##$NCOEF= 0
##$NC_proc= 0
##$NLEV= 6
##$NOISF1= 3.799351
##$NOISF2= 2.8
##$NSP= 1
##$NTH_PI= 0
##$NZP= 0
##$OFFSET= 15.70392
##$PC= 1
##$PHC0= -20989.56
##$PHC1= 11.65272
##$PH_mod= 1
##$PKNL= yes
##$PPARMOD= 0
##$PSCAL= 0
##$PSIGN= 0
##$REVERSE= no
##$SF= 200.130013532006
##$SI= 16384
##$SIGF1= 3
##$SIGF2= 2
##$SINO= 400
##$SIOLD= 16384
##$SREGLST= <1H.CDCl3>
##$SSB= 0
##$STSI= 0
##$STSR= 0
##$SW_p= 3612.71676300578
##$SYMM= 0
##$S_DEV= 0
##$TDeff= 0
##$TDoff= 0
##$TI= <>
##$TILT= no
##$TM1= 0
##$TM2= 0
##$TOPLEV= 0
##$USERP1= <user>
##$USERP2= <user>
##$USERP3= <user>
##$USERP4= <user>
##$USERP5= <user>
##$WDW= 1
##$XDIM= 8192
##$YMAX_p= 0
##$YMIN_p= 0
$$ End of Bruker specific parameters
$$ ---------------------------------
##NTUPLES= NMR FID
##VAR_NAME=  TIME,          FID/REAL,        FID/IMAG
##SYMBOL=    X,             R,               I
##VAR_TYPE=  INDEPENDENT,   DEPENDENT,       DEPENDENT
##VAR_FORM=  AFFN,          ASDF,            ASDF
##VAR_DIM=   8192,          8192,            8192
##UNITS=     SECONDS,       ARBITRARY UNITS, ARBITRARY UNITS
##FACTOR=    0.0002768,     1,               1
##FIRST=     0,             0,               0
##LAST=      2.2672688,     0,               0
##MIN=       0,             -314093,         0
##MAX=       2.2672688,     254928,          0
$$ Real data points
##PAGE= N=1
##DATA TABLE= (X++(R..R)), XYDATA
0 0 0 0 0 0 0 0 0 0 0 0 0 0 0 0 0 -4 8 -8 8 -8 8 -12 16 -16 17 -24 24 -29 32 -37 43 -48 53 -61 69 -77 86 -96
38 -96 106 -120 131 -145 160 -177 196 -215 237 -261 287 -317 350 -384 423 -471 520 -579 647 -727
58 -727 821 -939 1084 -1268 1513 -1849 2343 -3124 4498 -7375 15654 -83334 -314093 3828
72 3828 27260 -84837 209152 159619 -237323 -116054 93232 -36820 74601 216042 -80189
83 -80189 -181087 34361 -5603 -35270 123698 15348 -135269 -2496 58580 6998 47164
94 47164 9903 -75122 -25507 25181 28362 42346 -42601 -108540 1603 57650 32434 91576
106 91576 18341 -144059 -53646 65801 25624 69499 49944 -135960 -108150 49213 34210
117 34210 69132 123188 -74580 -160881 34171 49360 -16525 108522 29375 -188285 -57513
128 -57513 97354 3660 33275 91948 -73218 -112575 46160 52493 -633 38543 -21961 -94734
140 -94734 1262 54219 9536 29457 7813 -65394 -9737 60944 18136 -9916 -5702 -41392
152 -41392 -38228 35027 54626 -1281 -31422 -25711 -15570 17087 50132 32073 -29656 -61680
164 -61680 -22748 17531 27284 40863 8542 -56788 -38690 21848 31130 30402 24616 -29385 -58353
177 -58353 -5291 33912 18174 15892 1879 -42611 -24693 29662 27001 6153 694 -20128 -30187
190 -30187 1885 28562 8636 -10993 -6679 -15291 -8780 25682 18522 -12860 -7974 -3411 -11875
203 -11875 9193 25821 -7236 -22475 7480 3061 -8246 25137 13402 -30955 -5625 17453
215 17453 -8450 2809 20551 -14820 -24244 11656 8638 -7501 12511 4168 -23894 -1709 11892
228 11892 -6473 4778 8912 -12730 -5144 7555 -3288 190 9782 -1445 -5791 5466 -190
241 -190 -7978 6106 7393 -2599 3490 -267 -9014 -310 3629 4083 5631 -6235 -10097 -583 825
256 825 3471 9835 -491 -15612 -6494 7489 2879 5339 7511 -14066 -14848 7968 9372 7076
270 7076 8274 -8491 -15779 -228 11077 10285 5990 -5827 -17015 -6184 11919 10634 6225 -761
284 -761 -18377 -11762 10736 11875 4780 -3288 -15385 -14130 4424 18340 10915 -5409 -13518 -13486
298 -13486 641 19570 15957 -1371 -16016 -19058 -1042 18243 19141 6228 -13912 -21211 -6286
311 -6286 13988 22534 8685 -13056 -21185 -13555 7564 22717 11925 -8415 -20338 -15559 5646
324 5646 19789 15482 -3302 -21997 -17280 3055 17987 18817 925 -18184 -18031 -1674 18704
337 18704 21795 3176 -14865 -20689 -7363 15796 21938 7813 -12558 -22714 -9744 11311 21578
350 21578 12923 -11176 -23352 -13276 5574 21367 15569 -7328 -21222 -16751 3239 21525 18514
363 18514 -484 -19546 -19327 478 16890 20330 6257 -17742 -20439 -2486 13453 19981 9449
376 9449 -11861 -21473 -9074 12337 18365 7746 -6927 -20453 -14287 9301 18823 10204 -5374
389 -5374 -18709 -14692 3204 18927 16399 -3833 -16892 -14239 -1850 16514 19821 1976 -14318
402 -14318 -15527 -3772 10972 17909 8938 -12613 -16992 -2168 5015 12315 13112 -9522 -19711 -2202
416 -2202 7046 6657 10031 -1428 -21019 -9941 13645 8998 3732 5134 -16301 -19364 11761 16821
430 16821 3923 4777 -8065 -22028 -1118 20361 10242 1099 -923 -17053 -13602 14610 14758
443 14758 766 838 -9779 -15879 2932 13391 4388 -1701 -4794 -8551 -4052 7117 7739 -1855
457 -1855 -5366 -3152 982 3112 2871 2859 -5324 -7911 8261 8577 -4003 2587 -1008 -14033 3681
472 3681 17424 -1570 -5651 3723 -11734 -11732 19591 12075 -13918 1724 -492 -22802 6273 25988
486 25988 -7020 -8807 8511 -14907 -14813 23151 12706 -14475 5179 3611 -23196 3608 24479
499 24479 -6861 -4487 13951 -12193 -15401 15913 6706 -10750 9434 7530 -18511 -3806 12284
512 12284 -7494 -2669 15928 -3271 -13221 1963 -868 -5986 7277 10421 -2359 -7133 -3123
525 -3123 -3371 -985 8504 9785 -4 -8298 -4988 327 -2100 7277 15792 -5488 -13223 4770 -4451
540 -4451 -9706 18609 12099 -17639 -2046 7344 -19121 -2555 27372 -4558 -15299 16160 -8197
553 -8197 -25640 20803 15514 -19045 11300 12718 -30334 -3779 26700 -10163 -4824 27781 -12761
566 -12761 -27955 20015 5221 -18490 23283 12723 -30410 -87 13448 -17973 4736 25417
578 25417 -12289 -14369 10602 -9743 -10873 21229 5674 -12930 5724 -3613 -15129 9037 10547
591 10547 -2430 5291 -1828 -11675 1105 3495 595 11242 1808 -12144 1736 375 -10373
604 -10373 12630 13121 -15955 380 9126 -21073 -175 24841 -11501 -9065 20365 -13530 -22057
617 -22057 23055 5765 -21114 19104 11416 -32439 4344 22489 -20997 2515 30419 -18582
629 -18582 -17969 21587 -7368 -14872 27447 6980 -25045 6064 6186 -20701 9782 22605 -13908
642 -13908 -7368 7878 -14188 -4686 19082 2195 -7308 1656 -6590 -7560 7707 7378 271 839
656 839 -5041 -5694 4173 2176 1429 7101 -4317 -7173 7423 -690 -6193 8917 640 -9830 7317
671 7317 5263 -12429 322 7354 -9304 945 15009 -8461 -12216 8370 -3743 -6654 17656
684 17656 4302 -16536 113 2990 -8232 9969 16221 -9392 -11209 4102 -4222 -615 18168
697 18168 2757 -14623 -1811 -201 -4315 10548 10258 -8766 -9221 84 -1380 1848 9848 -251
711 -251 -10832 -2199 2091 379 5658 2481 -6812 -4654 2257 4255 3335 1019 -3410 -5552 1095
726 1095 6943 4243 286 -4287 -6223 -409 5647 6789 1748 -6830 -7303 -1817 2966 7821 4760
741 4760 -5789 -9554 -3522 3279 6005 6240 -393 -10921 -6376 4515 5472 5509 3375 -8271 -8604
756 -8604 2702 6685 5154 3235 -4238 -9977 -1184 8506 4995 1977 -1079 -10208 -5537 7612 6097
771 6097 1096 -858 -7924 -7669 3734 8455 2572 -2109 -4760 -7126 156 9215 4501 -1514 -3574
786 -3574 -6784 -805 8419 5820 -232 -3962 -6183 -1858 6167 7452 649 -4696 -5700 -3892 3915
801 3915 8186 1036 -4125 -5509 -5254 2778 7615 2425 -2636 -5520 -5318 1435 6909 4730 -1695 -4962
817 -4962 -3950 -331 6502 6576 -1153 -3911 -3884 -1957 5550 6841 58 -3855 -5011 -2694 3453 6253
833 6253 2044 -4149 -5275 -3175 763 6073 3272 -3447 -4020 -3605 -601 5413 3771 -1452 -2905 -3145
849 -3145 -141 3857 4095 188 -3169 -2138 -111 2506 4481 375 -3007 -1997 -1244 2072 4030 -92
865 -92 -2415 -2672 -2478 1565 3541 494 -2025 -2652 -2183 23 3384 2315 -2022 -1515 -1214 -1769 3318
882 3318 3654 -1900 -561 118 -1980 1942 3737 -288 -1290 420 -709 -770 2621 998 -2375 401
898 401 88 -2409 1241 799 -2239 133 278 -1301 70 -77 -364 274 103 192 -62 -261 -389 1040
916 1040 1039 -679 1042 819 -2530 1491 3082 -2810 384 2942 -3372 -462 4291 -2214 -3017 2854
932 2854 -599 -3373 3688 1294 -6212 435 2902 -3720 2459 4586 -5700 -2793 3560 -1166 1140
947 1140 5528 -1956 -5218 851 1839 342 4734 1664 -5666 -2494 1299 919 4247 1825 -3653 -3338
963 -3338 -3008 662 5621 1045 -2554 -975 -4199 -2524 5971 3355 -4400 70 425 -5910 3162 8057
979 8057 -5389 -2900 5828 -4249 -1539 9684 -2932 -8074 5771 1891 -4432 7409 2552 -12159
993 -12159 -475 7544 -3491 3214 7558 -11069 -8751 7036 1124 745 8356 -4297 -12328 215
1007 215 4430 1845 6694 2003 -9778 -4656 2791 2430 6459 3824 -5866 -4331 -913 549 6607
1022 6607 2934 -4576 -1423 -1548 -3283 5701 4634 -7040 -2087 4121 -4597 -41 8551 -6297 -8223
1037 -8223 8317 592 -4966 8800 -1184 -13401 5109 8579 -4892 4294 5635 -13778 -4939
1050 -4939 13644 571 -2550 9350 -7289 -14646 8742 8536 -3744 5053 506 -14622 -2412
1063 -2412 10350 1487 171 3578 -7994 -8955 6006 5378 -195 2821 -2207 -7337 -126 5051 2781
1078 2781 173 -1518 -1029 -1112 97 4070 2038 -4536 -1559 4506 71 -2293 3385 -2083 -7660 4589
1094 4589 6522 -4144 -286 678 -8553 -298 10003 569 -3460 2013 -5778 -7519 9289 8429 -5412
1109 -5412 694 1081 -10858 1136 13257 -151 -4473 3000 -4522 -6788 7664 7394 -4947 -1113
1123 -1113 1224 -7249 274 8738 -1828 -4048 2693 -2990 -3984 5272 2757 -4638 -256 2961 -2838
1138 -2838 -188 4103 -2162 -3103 3132 1790 -269 1047 -1137 -2334 118 2706 2795 193 -2055 -2627
1154 -2627 -1791 1473 3788 1817 -2324 -3035 -1743 -1844 2278 5707 -1422 -4698 584 -2167 -2597 6454
1170 6454 3665 -5380 -892 2208 -3916 518 7087 -1448 -4533 4141 -707 -4251 5399 2113 -5583
1185 -5583 2174 3158 -5059 198 4178 -4092 -2374 5525 -901 -4525 3281 -392 -5111 3473 3256
1200 3256 -3623 663 1128 -3553 423 3961 -263 -848 1318 -1696 -1574 3047 1566 -960 892 -704
1216 -704 -1929 1188 848 345 806 -1438 -1214 597 -664 -85 1246 -765 -1884 818 489 -1892 1036
1233 1036 1875 -2248 17 2271 -2022 -230 2957 -1286 -839 2432 -438 -2005 2277 1145 -2209
1248 -2209 1175 1797 -2876 -138 2647 -2241 -752 2383 -1557 -1443 1745 -466 -1611 963 444 -1679
1264 -1679 620 1229 -1692 -220 1628 -929 108 1951 -925 -669 1175 21 238 1074 -103 -789
1280 -789 -97 505 6 539 402 -1589 -639 225 -428 569 443 -1568 -603 -137 -256 724 320 -836 -880
1299 -880 139 722 257 932 157 -1289 274 1084 83 1187 231 -1362 125 935 497 512 2 -1065
1317 -1065 -1278 773 1153 -386 -57 -968 -2103 317 1317 -53 340 -586 -1953 -54 1515 956 152
1334 152 -320 -929 -758 1572 1734 -75 237 -664 -1366 1580 1560 -166 -222 -1008 -973 695 1533 143 -1008
1353 -1008 -1428 -1268 -69 2004 814 -1122 -1093 -1810 -579 2402 1286 -455 -725 -1432 -383 1804 1877
1370 1877 292 -697 -888 -871 1067 2250 -31 -1292 -511 -1289 690 2350 -343 -1606 -803 -1221 171
1387 171 2381 571 -1907 -1453 -531 -275 2055 2271 -1714 -2177 -206 -194 1800 2913 -576 -1936 -791
1404 -791 -84 1600 2228 645 -1652 -1813 -318 1139 2141 930 -1617 -1990 -1119 487 2235 611
1420 611 -1638 -1244 -1830 271 2846 656 -1255 -673 -1188 -397 2496 1921 -1400 -983 142 -999 1422
1437 1422 3526 -1348 -2161 845 -596 430 3238 -65 -3052 -847 382 69 1877 1251 -3152 -2510
1453 -2510 588 181 1687 2189 -1979 -3027 -531 636 1844 2072 -344 -1865 -1788 245 2405 1899
1469 1899 2 -729 -1441 -1145 1745 2852 -907 -1321 655 -1997 -595 3718 -544 -3019 1123 -440
1485 -440 -2411 2612 1707 -3728 -495 2286 -1787 404 3599 -2688 -3051 3330 278 -1189 3680 -436
1501 -436 -4450 1129 2387 -607 1755 1341 -3626 -1939 2172 566 463 1763 -2301 -3015 266 485
1517 485 1205 1448 -1539 -1712 -827 -1077 1868 1986 -1397 -561 586 -1946 170 3754 -763 -2076 2953
1534 2953 -680 -3192 3611 1158 -4173 2601 2593 -4217 761 3161 -3932 -812 4872 -2018 -2896 3757
1550 3757 -1672 -4430 4185 1941 -4208 1918 1353 -5074 908 4060 -1870 -176 2501 -2591 -2094
1565 -2094 2817 825 -895 1922 -403 -2418 734 605 -213 1482 -121 -1178 -118 -1221 -54
1580 -54 1614 -542 -448 1171 -1847 -2131 2084 798 -1475 2435 671 -4287 982 2945 -2324 1441
1596 1441 3808 -3906 -2101 3710 -1143 -1161 4565 -383 -4509 2098 1451 -3416 2314 3104 -4423 -736
1612 -736 3116 -2872 -1180 3703 -1229 -2349 2407 107 -2465 969 1291 -1803 1001 2098 -1502
1627 -1502 -952 942 -555 298 1968 413 -883 -1268 -428 1095 788 1186 466 -2270 -2204 845 1310
1644 1310 307 1161 -407 -3825 -1067 2245 23 581 1792 -2906 -2682 2376 1180 -582 1981 125
1660 125 -3171 444 2938 -771 -74 1939 -2026 -1644 3021 540 -1747 705 -36 -2047 1191 2298
1676 2298 -1523 -1872 587 -740 -458 2628 297 -2898 -818 373 151 1765 1946 -1514 -2455 21
1692 21 1172 1076 2033 686 -2960 -1491 1480 1128 1395 1000 -1507 -2674 -250 1686 812 307 -294 -2505
1710 -2505 -1382 1458 1078 149 -154 -1405 -1384 401 2034 858 -941 -790 -629 -117 1945 1731 -652
1727 -652 -1355 -488 258 1083 1696 260 -2115 -1155 864 283 1435 1167 -2183 -2315 510 757 781 1125
1745 1125 -923 -2757 -723 1760 725 827 387 -2465 -1582 1888 1377 888 709 -1457 -1965 778 1887
1762 1887 961 339 -796 -1972 -374 1951 1151 182 -504 -1986 -729 1153 906 350 -635 -1746 -833
1779 -833 673 1333 784 -522 -1588 -1062 637 1486 769 237 -924 -1520 794 1549 608 662 -844 -1880
1797 -1880 248 1614 734 311 -566 -1595 -999 1220 884 -112 -88 -1526 -1370 891 1212 -40 -65 -949
1815 -949 -1412 485 1520 382 -28 -732 -1187 -76 1610 912 -227 -399 -906 -549 1469 813 -194
1832 -194 -257 -949 -583 753 811 30 -578 -847 -783 166 1091 35 -582 -424 -907 31 1251 323 -67 -220
1852 -220 -586 136 1019 617 82 -266 -479 -289 668 818 -60 -296 -163 -817 345 628 -130 -425 -504 -753
1872 -753 57 421 151 -475 -332 -232 -176 343 537 -383 -170 131 -23 400 568 130 -144 -147 230 254 277 427
1894 427 -39 -240 224 87 -56 229 -346 -171 -341 18 -211 -281 66 -9 -184 216 143 -410 25 289 18
1915 18 156 284 -293 -342 212 296 89 283 345 -384 33 680 37 -76 39 -359 -282 67 347 -374 -401 48
1937 48 -321 -267 458 -76 -631 -207 145 0 276 261 -376 -734 236 623 130 719 18 -1028 18 793
1957 793 347 379 31 -878 -981 656 1065 -151 -15 -95 -1596 -514 1469 370 -523 -55 -712 -1057 611
1976 611 1428 -232 -506 93 -895 -104 1948 458 -870 114 -183 -553 892 962 -544 -852 347 -170
1994 -170 -128 1358 -303 -1650 -87 217 -50 611 254 -1421 -1148 533 819 364 602 -563 -1749 -190
2012 -190 1411 986 470 -115 -915 -1125 586 2107 666 -622 -286 -1276 -1016 1753 1666 -717 -725 -650 -1294
2031 -1294 228 2053 161 -1808 33 -477 -1077 1588 1294 -1862 -606 863 -733 488 1993 -743
2047 -743 -1841 1059 652 -595 1708 619 -2494 -39 1624 -61 553 935 -1915 -1710 1086 1127 131
2064 131 434 -613 -2373 -209 1711 847 469 -563 -1747 -1200 700 1771 1150 -702 -925 -981 -402
2081 -402 1553 2084 -284 -1070 -537 -578 68 2062 909 -1885 -689 491 -1072 906 1874 -1753 -1576
2098 -1576 1073 -216 -850 1716 -167 -2530 559 1835 -1062 227 1056 -2401 -946 2588 704
2113 704 -325 1020 -1040 -2126 1125 2251 137 54 -322 -2091 -728 2248 1132 -403 -304 -1507
2129 -1507 -1539 671 1349 680 -651 -975 -921 -282 1086 1462 -349 -1127 -321 -102 203 1269 1075 -1066
2147 -1066 -749 1013 -93 175 1475 -699 -1603 892 799 -523 701 123 -1596 -308 1486 -79
2163 -79 -508 641 -1141 -1241 1321 806 -725 398 -420 -1509 481 1590 138 -606 210 -696 -550
2180 -550 1487 1223 -558 -478 -309 -678 546 1148 322 -615 -827 -238 -211 409 857 -593 -800 -24 -202
2199 -202 -169 527 241 -617 -188 683 -182 -252 809 -230 -672 845 547 -384 420 337 -537 192 790 35
2219 35 -406 147 -411 -664 637 443 -479 13 -42 -738 271 571 -102 -513 -268 -50 -354 116 604 -301
2239 -301 -296 433 0 -187 355 377 -120 -236 390 -96 -396 509 113 -302 353 95 -628 -109 132 -308 150
2260 150 212 -546 -718 228 190 -369 483 -115 -730 292 403 52 246 78 -435 -70 348 546 141 8
2280 8 -276 -372 204 721 157 -131 -623 -398 213 229 489 -168 -710 -314 122 108 689 87 -826 -617 39 433
2302 433 487 450 -225 -850 114 644 315 521 13 -812 -142 561 502 529 -53 -905 -682 425 561 488 -73
2323 -73 -797 -1026 100 702 495 448 -728 -1178 87 566 681 658 -655 -928 -221 576 850 569 -115 -813
2343 -813 -477 542 766 664 215 -1036 -811 644 328 668 224 -1207 -913 160 723 525 132 -762
2361 -762 -1163 -237 825 609 381 -233 -1173 -150 1090 814 599 10 -1043 -657 758 853 546 -26 -843
2380 -843 -945 359 1039 511 22 -863 -1408 175 913 773 192 -843 -1244 -313 845 967 386 -670
2398 -670 -1068 -721 748 1088 287 29 -1123 -761 654 744 696 374 -986 -931 444 741 470 143 -596
2417 -596 -1085 -100 862 494 106 -212 -1346 -704 907 674 64 -132 -944 -656 649 1123 546 -204 -555
2436 -555 -738 124 1109 472 -228 -531 -700 176 711 965 181 -938 -894 -99 380 647 534 -739 -1126 -353
2456 -353 173 743 590 -104 -1143 -645 562 347 401 627 -887 -922 647 220 231 551 -129 -994 141
2475 141 1001 259 -180 223 -1048 -505 928 243 -394 -48 -603 -725 435 683 38 -482 -374 -333 -19
2494 -19 894 599 -376 -405 -226 -69 595 886 185 -624 -528 214 262 334 698 -358 -1023 79 237 -120 555
2515 555 277 -1099 -471 554 -200 -193 852 -241 -1086 554 406 -568 344 443 -839 -9 935 -247 -480
2534 -480 665 -215 -759 885 558 -805 46 405 -578 289 781 -186 -787 27 -32 -545 469 641 -621
2553 -621 -318 187 -282 99 517 67 -415 -105 157 -101 119 826 -55 -675 387 49 -430 636 689 -363
2573 -363 -350 268 -259 -603 634 546 -784 36 254 -1005 -32 920 -179 -520 387 -472 -923 626 932
2592 932 -759 90 530 -889 -194 984 -9 -458 619 96 -685 321 844 -558 -285 732 -362
2609 -362 -384 756 -14 -900 490 381 -451 134 395 -914 -442 748 260 -424 485 46 -1027 300
2627 300 775 -73 -12 225 -533 -411 766 906 19 -74 -69 -773 -10 928 535 -331 -166 -521 -710 148 1196
2648 1196 -71 -770 -94 -487 -534 986 460 -807 -365 157 -257 216 1122 -202 -1042 350 293 -220 819
2667 819 298 -1160 -196 640 -21 10 536 -809 -1165 535 799 -69 237 -146 -1442 -319 1053 308
2685 308 -2 -65 -756 -719 653 1108 127 -288 -370 -1095 70 1483 1020 -314 -458 -615 -325 529 1127 258
2705 258 -881 -402 -384 3 953 539 -761 -640 -218 91 637 656 -168 -996 -410 503 255 785 15 -1099
2725 -1099 -664 743 595 556 83 -602 -978 125 1008 469 -87 -215 -980 -689 1003 904 -19 -330 -809
2744 -809 -750 242 1207 415 -485 -581 -773 -271 1095 998 -293 -539 -613 -190 841 1131 130 -985 -693 4
2764 4 377 1003 576 -773 -834 -221 201 673 497 -391 -1097 -552 326 433 583 -155 -1170 -730 243 670
2784 670 741 -8 -763 -694 -87 723 923 84 -321 -581 -410 743 920 85 -627 -846 -189 405 670 479
2804 479 -546 -874 -384 42 735 755 -465 -727 -548 48 733 629 133 -763 -743 118 501 531 532 -661 -827
2825 -827 6 390 571 433 -313 -725 -246 206 679 287 -197 -603 -630 168 395 382 -212 -740 -355 89 520
2846 520 489 22 -371 -344 -253 468 686 105 -382 -491 -223 371 670 311 -340 -400 -49 118 381 434 -296 -480
2868 -480 -258 -17 397 288 -131 -484 -394 105 219 218 40 -420 -291 -74 87 343 266 -311 -232 -29 73 428
2890 428 127 71 -226 -234 138 253 -32 -82 -209 -139 -99 82 254 -139 -260 -76 -27 -120 252 -4 -117 116 -84
2913 -84 -51 185 117 -34 -134 188 7 34 336 85 41 346 4 -171 187 146 15 -73 28 -238 -82 193
2935 193 102 -261 0 -149 -295 289 56 21 15 -155 -124 92 217 256 -18 -305 -28 -43 16 340 254 -276 -172
2958 -172 101 117 242 276 -218 -764 156 121 38 494 -91 -760 -293 170 59 62 231 -364 -626 114 277 -100
2980 -100 283 -204 -793 232 599 73 25 -110 -485 -266 474 681 -94 -158 -210 -672 171 732 81 -353 -496
3001 -496 -352 -69 397 771 -283 -891 -274 51 213 782 204 -936 -471 -82 358 483 670 -510 -939
3020 -939 68 468 71 684 326 -1169 -255 519 334 145 338 -739 -811 372 632 -460 175 -129 -1049
3039 -1049 -77 944 220 -222 -158 -593 -322 663 881 -118 -479 -456 -187 390 1091 307 -709 -603 -42 164
3059 164 756 720 -273 -1268 -280 454 118 771 125 -1210 -669 415 287 22 353 -377 -1361 211 882
3078 882 2 272 97 -969 -363 1067 285 -211 175 -356 -710 483 866 -453 -389 -59 -534 -80 923
3097 923 207 -701 -246 -264 -193 557 768 -226 -1013 -4 77 165 933 77 -990 -489 283 592 413 506 -482
3118 -482 -981 -93 589 23 553 81 -1038 -582 573 155 124 150 -271 -837 54 957 -181 -214 204 -514
3138 -514 -278 832 111 -662 -112 1 -366 273 767 -133 -753 -50 -9 -19 872 283 -781 -223 227 148
3158 148 245 429 -195 -956 246 366 -260 387 156 -953 -376 582 263 -207 388 -69 -840 250 636
3177 636 -33 -30 204 -679 -298 596 46 -164 160 -39 -499 263 576 -282 -266 241 -91 -318 289 -39 -577
3198 -577 -12 90 -107 -16 167 -38 -516 32 258 94 122 190 -235 26 370 210 -103 85 28 -419 -57
3219 -57 514 -158 102 366 -367 -255 417 11 -368 0 -15 -353 -66 320 -313 -243 416 -134 -344 323 -13
3240 -13 -259 263 59 -162 -74 2 -76 -231 347 123 -343 358 93 -411 190 197 -100 -10 -59 -49 -195 40 185
3263 185 -109 -161 29 -226 -62 124 -161 -100 -37 50 -109 57 243 118 -36 342 53 -63 -13 68 5 153
3285 153 15 -186 -250 78 106 -47 233 167 -427 -89 265 -108 80 -3 -198 -199 -24 120 -169 -172 182 -76 36
3308 36 379 -33 123 139 -58 -186 103 87 8 -70 -18 -137 -158 298 -112 -138 -144 -107 70 92 44 6 -117 -18 135
3333 135 -51 206 -116 -281 106 15 262 283 51 -146 -233 12 196 -9 40 -142 -128 -87 170 75 45 -324 -262
3356 -262 -151 67 246 99 -94 -383 57 165 344 -5 -125 -115 -157 265 111 210 -9 -312 -274 177 213 -15
3378 -15 64 -442 -162 44 184 259 -122 -269 -300 -13 308 150 -167 -258 -380 -199 239 134 -2 -267 -318 52
3400 52 283 333 343 -125 -247 -314 38 651 23 -263 -148 -365 157 469 270 -125 -367 -275 -70 240 334 -54
3422 -54 -520 -235 -159 198 383 -1 -423 -426 -150 417 455 238 -271 -629 -62 418 496 281 -19 -342 -121 221
3444 221 587 239 -295 -267 -372 32 545 232 -102 -199 -606 -69 526 290 -26 -689 -336 13 225 631 70
3465 70 -516 -277 24 96 532 314 -295 -192 -27 278 278 388 20 -568 -215 433 20 358 -45 -433 -262
3486 -262 95 363 78 -119 -248 -458 -131 587 196 -147 -189 -450 69 336 571 11 -291 -46 -145 89 725
3507 725 16 -201 -284 51 33 387 205 -256 -466 -201 201 2 362 83 -473 -118 493 91 387 286 -222
3528 -222 -386 109 383 157 15 50 -509 -30 563 200 -48 137 -235 -260 265 379 -108 -164 27 -153 -32
3549 -32 587 49 -463 -151 1 -157 153 450 -229 -392 135 -37 -190 324 167 -609 -147 319 -142 3
3569 3 489 -66 -382 195 233 15 173 305 -456 -196 186 -101 -183 434 -137 -471 265 207 -178 -73 321 -187
3591 -187 -282 442 -230 -237 148 18 -122 106 223 -340 -90 302 91 -145 155 63 -229 8 212 -57 -75 274
3613 274 -59 -303 40 143 -300 2 227 -325 -200 352 -335 -281 234 176 -174 102 242 -412 -88 442 19
3634 19 -304 435 -150 -379 514 82 -190 -95 77 -370 -204 593 207 -308 -112 -36 -364 234 343 -224 -151
3655 -151 107 -161 9 246 198 -66 -36 115 -16 183 521 -272 -185 319 177 -28 99 168 -134 -277 380
3676 380 166 -64 270 -305 -550 276 223 -147 33 -133 -425 -143 365 100 -219 -39 -84 -285 416 532 -117
3697 -117 -255 -147 -196 120 450 277 -314 -392 102 95 169 460 -349 -369 -53 -41 110 321 140 -276 -346 74 256
3720 256 124 262 -252 -318 249 206 86 65 -112 -372 -203 288 461 -63 -65 -258 -455 540 398 46 2 -242
3742 -242 -302 89 487 400 -214 -274 -123 -91 347 516 -44 -320 -99 -28 403 227 55 -460 -419 126 296 409
3764 409 184 -273 -378 82 277 316 22 -155 -312 -208 178 444 -70 -284 -159 -346 226 295 49 -79 -306
3785 -306 -279 -71 265 337 -142 -238 -42 -208 386 448 -146 -205 -48 -113 250 353 -3 -144 -445 84 229 93
3807 93 176 -283 -345 -15 56 444 304 -263 -223 -284 68 360 132 -47 126 -88 113 274 122 121 -44 -129 33
3830 33 101 179 45 -272 -150 -121 148 244 -56 -57 -164 -159 263 111 35 -105 -207 -85 184 227 307 -144 -143 33 110
3855 110 195 207 76 -285 -72 86 215 -17 13 -98 -106 97 115 139 -29 -149 27 89 -152 175 -91 -92 18
3878 18 -151 153 79 49 -126 -171 -58 -7 87 143 -48 -178 136 41 126 81 -212 -213 -15 -148 241 -38 37 -115
3902 -115 -22 78 130 -71 -94 -174 -71 166 -251 32 153 -51 29 39 82 89 -177 -59 -66 -30 97 46 66 -10 -21
3927 -21 56 9 99 74 61 -201 43 -25 -125 84 -153 -152 18 42 50 -20 36 -38 -30 237 88 -159 99 -32 -160 136
3953 136 93 -118 -4 -4 -96 -43 -73 27 -53 87 16 -277 30 118 -40 71 -1 62 -138 26 123 56 -70 -43 -88
3978 -88 -50 214 167 -43 -15 -21 -37 -42 60 160 -67 67 47 -184 119 77 -181 317 87 -113 80 192 61 -181
4002 -181 81 -24 -211 103 246 -114 23 122 -199 -93 41 -102 -284 68 103 17 -8 127 -60 74 159 -44
4024 -44 -105 -17 -24 -18 12 67 -6 -43 85 -158 -90 163 74 -36 51 -95 -247 110 210 -13 -288 -39 115 -131 180
4049 180 409 -31 23 156 -74 249 95 -156 -235 -26 23 -160 188 261 -256 -39 418 17 -51 88 -141 -246
4071 -246 179 154 7 -61 170 -123 -238 150 195 -115 171 -142 -309 112 298 -42 -151 68 -66 -136 312
4092 312 282 -206 11 -34 -174 -5 259 -80 -329 -56 143 -225 198 433 -257 -164 96 -182 88 393 -99
4113 -99 -206 -38 215 -60 0 215 -375 -203 231 220 -20 53 -194 -240 123 391 131 -76 -22 -212 -265 263
4135 263 349 -178 107 -159 -240 -67 366 -50 -189 -146 -46 -138 287 183 -356 -171 26 51 79 447 -15 -366
4157 -366 -278 131 196 350 115 -296 -239 178 -84 37 216 -127 -373 58 148 133 -18 -15 -109 -325 160 240 -145
4180 -145 92 68 -215 21 273 -24 -168 -35 127 -86 194 259 -208 -139 -120 -138 46 346 -61 -167 -114 9
4202 9 67 19 130 -79 -178 259 97 133 243 78 -226 -81 127 27 93 73 13 -181 42 319 -288 75 -165
4225 -165 -99 49 196 88 -207 1 -4 -181 -122 405 -207 -134 225 -265 -44 126 107 -103 -52 116 -43 25 143
4248 143 -118 -336 44 -47 46 133 -100 37 -33 15 -96 119 -69 12 -350 232 11 -204 -5 -23 -92 -177 86
4271 86 -72 -107 33 154 158 -78 79 -76 -83 40 -86 -3 -28 -88 47 83 188 -219 -95 -94 80 26 13 -66 -78
4296 -78 -38 2 147 48 35 -101 -241 67 -11 -17 -28 91 -134 197 20 270 142 -77 -69 -71 152 229 174 -69 26
4321 26 -171 -101 30 107 80 -131 -57 70 106 192 147 -115 -114 -9 227 212 -134 -75 -301 -158 223 168 -1 6 -355
4346 -355 12 203 127 166 -164 -418 -137 20 -24 91 -76 -130 -161 -50 140 104 -102 -97 -279 -84 217 142 105
4369 105 -336 -103 126 21 357 37 -129 -359 -122 108 374 226 103 -268 -128 147 175 40 88 -309 -136
4390 -136 -5 189 125 -68 -372 -105 29 154 262 105 -247 -240 9 216 290 189 -16 -243 66 64 280 -14
4412 -14 -113 -291 -118 249 414 114 -87 -338 -156 257 120 160 -191 -144 -145 -5 225 131 -56 -263 -132 253
4434 253 238 416 62 -253 -89 -12 166 188 57 -155 -314 -120 68 176 146 21 -440 -169 261 56 413
4455 413 -48 -208 -122 119 306 90 8 -57 -276 48 287 38 27 -263 -270 49 90 242 -28 -61 -196 -148 40
4478 40 342 -65 19 -260 -194 155 120 113 30 -266 -197 108 229 185 -71 -284 -34 113 128 162 12 -52 -270 -90
4502 -90 231 -79 -68 58 -178 -33 75 -133 -102 -144 -230 -102 2 78 -74 -66 -138 -41 55 358 87 -79 -165 -166 -8
4527 -8 24 -107 66 -219 -46 149 31 108 -41 -119 1 -125 -28 101 -74 181 -119 160 116 -132 118 -25
4549 -25 -80 -4 284 -60 -46 -94 -56 -55 124 201 8 101 112 3 -55 192 153 -162 5 5 67 -100 83 55 -226 14
4575 14 -9 -86 79 -93 -136 121 -24 -77 -92 -64 -162 38 -73 218 -9 2 171 -46 137 205 111 -85 220 -80
4599 -80 30 132 102 -136 -105 42 81 28 134 18 -182 76 25 44 -133 -20 -7 63 58 37 -90 26 -1 0 21
4624 21 141 -66 24 70 155 -59 136 232 -19 -114 15 -36 76 158 -173 -166 -10 44 138 -8 -25 -362 -23 105
4648 105 44 128 -71 -96 -96 70 47 -29 -46 -37 -43 16 80 170 -100 84 -112 -159 138 91 -191 -31 93 77 -61 357
4674 357 -3 -81 -31 44 -95 57 239 -70 -161 8 163 -106 149 197 -88 -91 186 152 87 32 -289 34 -13 243
4698 243 -86 66 34 -149 -83 201 119 -130 170 -211 47 220 98 226 4 1 36 3 140 215 -64 -136 67
4721 67 -46 199 123 -74 21 12 199 100 -24 201 -210 -207 178 57 -155 34 -254 -33 -162 31 160 90 -44
4744 -44 -113 -28 11 84 -124 39 -136 -33 95 190 184 29 -203 -70 -52 92 61 45 -121 -86 4 0 202 -108 -124
4769 -124 -191 165 22 74 -84 -146 -130 138 73 93 231 -93 -102 -92 181 310 147 4 8 -73 154 169 40 197
4793 197 -7 -146 121 8 206 -56 -149 14 32 273 24 -6 -152 -103 20 178 147 -85 63 -87 -133 167
4815 167 154 86 -13 33 -6 1 199 39 -13 13 -104 -71 184 53 8 109 -83 95 16 86 -61 1 8 36 50 92
4841 92 81 33 113 -145 238 74 -81 95 -154 -191 85 55 -26 42 -45 125 113 19 27 61 106 13 88 111 112 3 2
4868 2 -116 -154 -34 65 -11 -90 93 -67 6 -76 131 -41 -148 90 29 -25 -16 13 -67 51 59 98 -74 -88 38 -106
4894 -106 25 47 45 -93 -126 135 -12 -2 195 -64 -76 100 24 -19 27 50 -11 -42 158 24 -12 65 101 53 55 227
4920 227 -26 -107 -47 30 115 -119 -113 -13 99 54 -235 83 24 -77 -34 -82 -17 -97 -60 -12 -48 -146 72 113 -160 -31
4946 -31 -53 -165 108 -27 -195 50 -107 35 -144 -4 12 15 -45 -138 -18 -214 -94 -207 -12 -188 53 -2 38
4969 38 -111 16 -10 146 -39 121 -84 -103 66 -154 7 138 -140 -23 101 -183 65 153 -22 136 -69
4990 -69 -75 67 -70 53 60 -142 -36 -63 -67 -81 -19 -1 -19 -85 140 128 28 99 -83 52 110 94 114 4 -36 -4 -97
5017 -97 -65 83 -112 -9 -82 -24 78 -128 34 100 -61 24 75 14 108 8 -13 -17 10 139 -26 -69 4 -55 -23 108
5043 108 -108 44 98 97 -28 100 -10 -42 -81 -41 -91 147 -67 -79 -46 -73 -161 134 -10 2 81 -10 -191 -85 64
5068 64 -96 -49 -119 -163 -72 128 84 14 84 109 -23 203 -8 25 -94 27 -2 -33 51 -24 -139 -56 85 -51 -22
5093 -22 41 -33 19 -136 45 -101 28 153 -48 135 -79 25 -33 4 46 -118 -40 -142 -34 65 -20 -111 26 42
5117 42 134 156 31 66 -134 -46 108 -1 -36 106 -50 29 -122 193 130 73 46 82 23 225 127 42 -23 -143 55
5142 55 22 101 29 -161 117 -86 40 198 120 -60 -157 -7 32 81 82 -117 62 72 58 173 39 -89 -261 -41
5166 -41 28 -23 27 28 -49 -44 -8 -47 20 -6 34 -48 57 187 -44 -57 142 -117 -90 159 146 106 -98 -2 -48 102 64
5193 64 47 -40 -124 109 73 161 211 108 3 -8 -12 -137 25 90 47 99 161 129 -55 -104 42 -57 -150 88 2 21 20
5220 20 -203 72 18 191 191 -87 -32 57 -45 101 50 50 -29 -150 87 218 -97 82 10 55 91 28 -105 160 4
5245 4 78 20 52 167 -31 89 46 -39 163 0 47 -1 -81 -72 -56 51 -75 42 43 -58 32 -135 -181 4 -6 89
5271 89 -140 -96 -25 18 -16 -12 -91 63 65 -117 118 -104 162 113 78 -8 -110 55 -16 83 82 246 -184 98 176 -123
5297 -123 108 -148 31 56 86 1 -26 -36 12 15 -60 -109 -92 -82 -18 60 3 -45 -62 -17 -122 -101 -108 -87 125 -157 21
5324 21 -82 104 -27 118 -61 137 12 -33 -90 -22 47 -97 48 4 -112 94 91 -39 101 4 2 27 -118 -21
5348 -21 15 108 154 -145 -94 -82 29 64 -25 -103 29 -113 -1 94 14 134 217 13 29 65 36 -14 52 -27 29 -45 25
5375 25 -23 -79 -55 -22 -72 87 -102 -103 28 -65 68 44 -75 -15 35 -40 164 -66 245 76 -107 -90 41 69 260
5400 260 50 184 -30 -47 -119 43 9 -8 -157 -117 -118 30 15 35 -101 -123 40 -79 205 -19 -56 38 102 117 107
5425 107 137 133 152 68 70 -106 64 -25 39 19 62 38 6 88 -125 28 -55 45 184 -275 -45 10 -56 113 -43 61
5451 61 102 -28 31 18 110 -123 -191 -15 -41 -139 116 -5 -21 67 -52 130 118 103 17 -16 -97 -70 37 18 -121 40
5477 40 90 69 49 18 116 -14 -72 -20 70 161 -82 -1 46 -88 4 51 43 -173 -123 -3 -12 168 110 55 10 -61 10 -75
5505 -75 -88 -56 3 11 -86 -37 -82 137 48 -57 -42 18 -19 10 52 154 40 -42 162 158 42 21 -49 -70 41 30 -114
5532 -114 104 30 44 -41 25 97 -28 103 -35 -55 196 -14 7 84 48 22 199 -16 49 -59 157 -19 -36 -41 -38
5557 -38 -39 -69 -54 78 30 -41 -63 -126 -173 -92 25 131 159 106 -13 -136 -16 -89 35 58 -24 38 -66 -20 82 -144
5583 -144 -71 -34 16 -99 -88 -149 62 137 47 -52 -77 -25 6 13 -199 90 134 -23 -174 44 39 -65 16 -26 -52 -22 -109
5610 -109 -53 -74 122 47 105 -98 -122 63 -38 -76 53 -55 108 3 102 -144 -11 -54 -60 14 149 -281 133 -89
5634 -89 -13 121 -23 115 -15 75 -49 158 63 25 -15 86 -109 -108 -14 39 -58 -39 76 -120 37 -133 44 52 76
5659 76 68 -46 -41 -50 -78 83 12 10 -247 3 1 -211 13 -21 113 -137 -67 -35 -82 -29 -60 -72 41 6 -1 13 -103 -138
5687 -138 17 -61 83 0 166 -18 -88 18 -76 115 -9 199 123 -91 -4 124 -151 0 38 -29 84 -183 -2
5710 -2 -288 -189 67 -102 -9 66 18 -113 103 -187 15 23 -134 54 3 -47 312 174 30 60 -133 -38 -77 -40 -72
5735 -72 -140 -17 58 -130 34 129 -65 4 -117 97 175 24 31 169 -11 -93 13 87 126 21 -34 42 30 105 -58
5760 -58 21 54 -165 49 -19 81 -59 28 -78 -105 -7 -16 -76 -172 -20 -101 -6 209 20 -71 -11 -8 15 -120 -23 100
5786 100 151 -171 -9 -72 248 41 4 -7 -11 96 -100 -50 -51 -131 -94 76 152 -173 -15 -81 107 3 -220 65
5810 65 62 -29 -108 -8 -43 102 -88 35 -1 232 -18 162 30 56 -126 -55 -104 31 199 96 0 51 18 45 17
5835 17 -37 25 -168 -136 51 97 69 -88 -36 -73 -136 40 102 -231 201 -105 57 238 -14 36 -29 -206 -127 96
5859 96 31 29 30 -163 84 48 170 18 159 -75 25 54 94 -107 -195 -143 11 30 -61 -117 30 21 -161 96 -42
5884 -42 17 -53 -77 -113 20 50 -83 -143 -82 -7 30 -152 -24 -55 51 -53 57 76 91 138 -5 -60 52 26 -107
5909 -107 59 -1 -9 -28 91 -81 43 -48 -97 -118 2 -86 38 -21 -172 5 103 -40 -43 -65 -64 -124 -16 -227 -132 -174
5935 -174 49 46 38 -41 118 56 2 1 2 77 -32 124 -5 59 86 -125 14 -31 83 -4 -20 178 74 -137 -194 -45
5961 -45 11 9 -21 153 -131 -57 72 58 -87 -56 -23 82 -61 -34 -62 176 -149 -46 -146 -30 -4 85 4 -126 89
5986 89 -79 -52 -62 -66 -43 -31 112 111 15 110 -37 -74 35 171 -20 -83 -106 58 -27 -1 19 145 -103 80 46 193
6012 193 115 74 -31 26 171 -11 86 98 -1 9 -11 79 -7 64 -44 8 88 168 2 -77 88 -166 -41 -18 86
6037 86 -8 150 -158 179 -23 20 -41 -173 191 6 70 133 67 55 84 80 98 190 16 88 139 -126 -126 130 83 129
6063 129 -56 -10 60 33 123 36 93 34 47 52 209 -73 135 16 47 133 -26 -54 -65 -126 -125 -45 -49 108 -69 -20 -144
6090 -144 -45 115 63 -82 -16 26 124 165 9 -138 -54 -75 -45 -46 -94 61 57 -99 147 -109 -112 -32 -82 78 36 -25 -43
6117 -43 26 55 149 -21 0 51 109 71 93 -71 160 102 58 -50 -71 -86 -87 291 -185 136 66 -1 108 -7 -16 83 160
6144 160 18 -35 57 174 -28 -39 -102 -46 -199 -176 -94 -48 -88 -41 44 -181 37 85 -34 -188 40 -13 -14 63 -61
6169 -61 53 0 134 115 12 -137 -48 -85 -171 107 23 201 89 -81 -133 -76 -40 -86 -89 -272 -14 89 145 51 -108
6194 -108 -146 36 1 181 140 82 -129 -81 -23 20 14 -195 -265 92 146 135 93 -254 9 -17 19 138 52 113 -63 33
6220 33 128 11 -60 20 67 73 84 246 -152 -11 52 62 -62 55 -151 -56 -84 -42 -67 242 -18 82 17 -39 -106 60
6246 60 125 3 72 42 -16 -49 63 -106 81 -71 -68 -148 98 -18 -14 -44 -35 19 -28 -20 -17 -22 82 -37 -5 10 51 45 -50
6275 -50 -151 52 -103 -83 31 32 15 -2 -5 24 27 39 43 -31 25 157 5 -76 80 2 -24 -143 -105 11 57 3 -60 11
6303 11 -26 18 -25 152 131 7 11 50 -168 -12 -17 50 102 -38 -36 29 -55 -19 57 -232 -59 -73 28 -100 -71 -46 102
6330 102 221 -51 -14 -61 -35 -9 -151 -26 -43 21 -39 85 19 -1 151 145 -102 -64 -166 39 91 37 -79 28 -81
6355 -81 2 -73 -108 -20 38 81 60 68 -50 -24 -73 -14 -130 104 -6 -35 -30 62 -1 8 99 -63 -8 74 82 39 86 68 88 11
6385 11 -7 -50 126 -123 -58 -16 -74 -67 -16 81 72 36 -174 65 -105 -35 -25 21 59 -151 -48 234 -19 84 59 -54
6411 -54 0 -80 -4 25 -15 -73 -74 63 68 -173 -85 -114 -35 107 66 -22 -63 -97 44 75 -72 66 -143 43 2 -95 -36
6438 -36 -120 49 -62 -137 75 96 -77 19 -106 -175 129 -112 6 47 -60 0 127 75 4 26 -165 12 5 161
6462 161 166 95 -14 45 -11 85 135 58 91 -87 59 -43 182 43 0 -74 -128 -5 14 -136 -20 -50 -155 -147 134
6487 134 15 -21 -187 -34 53 176 151 9 -22 -105 -142 184 191 17 -118 -74 177 -143 81 43 110 -56 -106 -112 9
6512 9 -25 -27 30 -18 68 197 2 -8 50 -124 113 -236 29 85 -83 -46 33 -21 -48 69 66 -20 -47 -68 -69 87 1 -34
6540 -34 -37 -70 -64 -104 39 -138 -9 26 -62 -65 -3 -148 97 75 74 -165 119 -26 75 -78 -63 143 49 127 -4 -114
6566 -114 -6 17 -10 -201 -122 72 -61 -171 27 -62 6 39 81 14 -54 -151 -57 65 -20 102 -79 44 -65 112
6590 112 154 -79 39 59 92 52 -23 -4 47 -85 -45 2 111 -52 138 36 14 -27 -45 85 31 -87 -11 -61 -104
6615 -104 60 4 37 -125 46 6 -8 26 -18 -17 147 78 107 -110 60 -150 -14 184 64 -36 -301 -35 1 -53
6639 -53 -137 101 -72 7 35 165 -103 15 -82 -173 -142 28 29 11 12 19 -8 -104 48 7 68 -40 -58 58 76 -34 115
6666 115 101 68 43 -10 170 56 -117 -76 0 55 -56 -23 -154 -80 -38 58 -193 -108 38 59 84 177 -36 134 19
6691 19 -85 -104 103 38 50 77 33 -83 12 88 -38 11 -3 -56 -7 267 29 -12 1 -138 -7 15 43 -114 -35 -165
6717 -165 60 -90 104 50 -145 -120 -4 -50 20 43 -56 -2 -67 -59 -71 32 45 9 87 -74 -44 53 -4 -1 6 -40 -103 148
6745 148 171 -88 -110 122 128 4 -51 -2 -21 -320 -53 59 106 100 -8 47 18 62 -72 43 48 -98 74 -37 148
6770 148 137 -50 -24 28 20 103 59 108 -71 -81 17 142 96 44 -76 128 59 71 -82 13 -196 74 -243 -82 -28
6795 -28 130 138 -140 98 -2 72 267 -68 18 -46 -31 58 -128 59 -227 -259 -110 -71 56 40 12 61 -265 10
6819 10 31 63 38 113 -13 109 14 161 -147 -157 70 -119 -73 57 -130 49 28 107 -95 -133 57 -130 -54 -46 21
6844 21 168 107 -88 24 -15 -81 69 142 84 28 -13 27 -79 95 26 -56 47 4 -31 212 -41 -33 -53 157 -43
6869 -43 -136 71 67 -82 20 204 51 -52 -40 -45 2 193 135 97 45 0 -92 30 -23 112 -69 93 54 -81 69
6894 69 -22 -3 3 164 -20 85 -43 -17 245 99 -40 -142 -14 -169 -27 -6 -14 -112 -21 -94 100 61 4 78 27
6919 27 48 -52 -10 -148 -89 -126 23 42 -34 -72 -201 -87 182 0 34 44 66 35 -84 3 -81 -6 61 -191 40
6944 40 -74 59 -195 89 -6 -25 -1 -11 43 -92 -204 66 -37 10 -137 -226 -90 -1 168 -13 54 72 44 24
6968 24 -160 -16 -123 -94 -75 56 57 -117 -63 -73 -89 -68 -3 -19 136 28 44 -84 -138 54 -74 -136 -51 195 -126
6993 -126 1 21 78 134 3 20 -75 -30 80 -38 118 -44 -76 -135 121 8 -16 101 77 -38 87 118 -26 -18
7017 -18 -79 -220 -25 105 -62 64 35 -235 -10 91 58 107 -66 -49 113 118 84 -13 52 264 -121 -60 -60 67 97
7042 97 -101 -156 46 -127 83 200 -82 37 147 3 43 119 67 -71 -62 200 71 45 -25 -101 9 45 -138 12
7066 12 7 -24 -15 -39 105 17 20 103 -142 -54 -58 -53 -123 45 88 147 45 103 124 9 42 -108 80 -50 -37 -30 33 -155 -59
7095 -59 -150 -193 40 59 -124 -174 -42 -42 48 -28 -112 26 -37 55 47 54 -99 -130 0 66 117 26 -3 1 96 -32 -2 -6 5
7124 5 -95 292 11 96 54 -23 196 -83 -17 38 78 -154 -128 -4 45 -115 190 -20 45 60 95 -268 44 94 39
7149 39 44 60 -41 123 77 -66 46 -17 62 -50 46 -47 74 -92 -59 -59 77 -131 -41 59 116 -206 -5 -84 147
7174 147 -101 -25 -52 83 118 35 -140 6 -14 -55 6 -13 -41 29 44 25 18 -108 18 -28 100 -83 68 249 124
7199 124 -53 -78 37 52 -74 31 48 26 32 -27 -4 -171 53 -162 9 100 16 -52 43 24 80 60 -101 -104 -2 23
7225 23 -59 133 -14 -6 -50 -129 -146 -99 56 172 1 -30 43 141 -43 -120 -111 -257 -42 -38 97 -32 137 21 42 84
7251 84 138 -53 74 -24 -36 -88 -13 80 -24 39 125 23 -79 72 -51 -119 -8 38 48 -166 30 2 71 74 74 26
7277 26 118 -174 66 -56 -81 64 3 15 -59 232 -60 -183 -39 89 -79 -28 -76 -62 91 161 31 3 -107 14
7301 14 70 -123 -18 70 -45 37 -21 -52 33 -58 -67 -140 -62 251 81 -61 50 -121 82 85 85 -31 46 -87 155 -127
7327 -127 29 50 -264 89 55 245 -9 26 104 79 -74 -148 -85 144 -73 123 -76 173 193 -7 -192 -57 -24
7350 -24 48 -82 -13 5 44 140 45 10 70 99 6 -33 117 -26 -152 -47 72 -58 81 37 131 104 -46 -30 78
7375 78 -4 -162 -73 3 140 -165 92 96 -131 202 26 -101 23 69 40 94 -61 207 -234 -207 77 -89 24
7398 24 -38 -6 -106 31 65 36 -58 39 81 28 94 -18 87 114 -131 132 24 -25 61 39 54 -91 159 48 -117
7423 -117 40 176 -90 125 95 -145 8 87 21 -121 -3 127 196 -28 -47 -144 -4 10 17 -121 -38 68 8 140
7447 140 58 -162 -37 16 -38 25 -61 139 96 -109 -65 35 -43 167 36 -19 -32 4 -8 6 -81 -125 -14 152 -56
7472 -56 112 33 -31 -30 -40 -168 67 106 -232 -52 61 -195 -124 -86 14 -113 84 36 14 77 -136 -63 79 -51
7496 -51 32 48 18 -22 144 24 79 61 -60 -12 20 14 39 93 -7 69 -88 7 -47 -114 129 -81 14 -52 -48 81 -55
7523 -55 -110 62 173 -49 -73 -70 66 81 -26 82 -177 41 42 -125 -124 33 122 7 88 45 62 -50 -24 23 -30 2
7549 2 -149 -132 6 51 12 -87 200 55 42 -4 -98 152 44 -52 -44 152 159 -50 160 -38 11 -117 16 -188 -115
7574 -115 -169 39 -97 -2 37 9 146 -94 -18 114 -14 41 -108 85 -22 -89 41 190 82 152 -35 -78 42
7597 42 -10 -18 133 8 71 63 -136 101 21 -76 -32 -109 41 -109 -67 27 130 129 -30 56 -1 64 86 -86 42 -20 -14
7624 -14 -12 -117 -132 -59 29 71 106 29 -6 -88 27 -14 -83 58 -44 -153 -199 -14 131 112 15 -50 -45 43 -28 -89 -147 -42
7652 -42 22 -42 30 -79 -85 105 23 106 -20 -83 36 57 27 -5 -18 -101 -91 105 -13 22 247 72 -138 68 25 116
7678 116 -8 125 -14 12 57 -114 56 -67 107 -23 125 -8 -169 15 61 -33 -39 -65 -58 108 32 81 -56 52
7702 52 5 69 28 -74 -203 -9 27 -70 -88 40 18 -14 -31 165 -74 66 -107 100 -21 -90 -20 135 2 8 33
7727 33 -79 -197 63 34 -72 73 -83 62 151 48 -32 -107 -16 37 3 -103 -66 124 92 -102 -18 62 -13 -57 -22
7752 -22 58 -24 -176 -42 138 85 -89 -57 99 116 109 5 -42 -18 -38 71 84 -116 170 244 74 -97 25 197
7776 197 73 64 58 -25 67 49 39 77 144 -48 89 40 13 -4 -43 -120 -16 -11 -61 -35 53 -120 -18 137 73 -78 113
7803 113 -139 24 -56 -11 -113 -34 -123 28 121 -129 82 100 -89 -28 -52 103 -20 -182 -186 37 -12 89 14 -24
7827 -24 225 -173 -48 -48 -47 96 105 -12 7 54 -23 74 84 -33 -94 129 108 38 47 15 -57 35 30 -48 -142 -18 15 -63 -70
7856 -70 -31 -25 47 -27 -47 131 113 -56 -102 -26 -76 113 -47 20 110 -45 -61 23 -45 51 63 -133 82 -100 63 19
7882 19 -87 21 -192 8 -37 12 53 -65 -202 -117 72 76 270 -5 -38 18 -154 127 13 53 3 -39 9 88 175
7907 175 17 -6 -24 199 33 -42 111 74 -77 75 57 -54 -57 -21 83 -72 -116 -36 58 190 -47 -47 45 -29 -4
7932 -4 29 -67 -39 3 -8 -40 -34 9 -56 28 11 -69 147 113 -41 11 40 130 -49 71 -49 -36 -89 -63 -102 115 44 -42
7960 -42 193 9 106 35 -34 -53 128 111 -36 59 -88 -11 -75 -82 35 68 -74 91 -175 11 -174 -61 -85 -92 82
7985 82 85 -111 -43 54 26 120 -19 -112 -82 -136 19 11 103 69 41 -59 2 -56 -130 69 10 -250 6 63 -78 -12 -45
8012 -45 21 114 -105 -17 -111 87 88 40 67 32 2 -97 49 -62 -4 124 -68 -133 184 78 -204 -95 30 -22 -90
8037 -90 -119 40 42 95 128 -12 -140 0 -46 46 45 31 80 46 -71 64 7 17 38 24 -5 58 -52 -121 -53 -38 89
8064 89 -181 109 12 11 -92 16 101 77 -125 97 9 -115 99 -67 7 -60 42 -12 167 27 91 -14 7 35
8088 35 81 -90 -113 -12 107 57 75 57 68 -23 50 16 15 96 79 18 18 39 11 -126 -109 2 -141 -55 -36 -39 139 80
8116 80 -58 43 101 147 -70 25 -16 164 -84 -111 -165 -59 5 67 94 34 -81 14 -76 111 96 28 8 20 -101 66
8142 66 -57 33 80 120 154 -29 138 80 49 -105 52 -56 15 -76 1 97 133 -27 -99 -23 -145 14 56 -18 -71 -109
8168 -109 -87 40 -98 6 31 10 67 4 64 141 40 -40 -125 -86 -10 -102 329 13 53 -25 -71 3 188
8191A88
$$ Imaginary data points
##PAGE= N=2
##DATA TABLE= (X++(I..I)), XYDATA
0 0 0 0 0 0 0 0 0 0 0 0 8 -8 8 -8 16 -16 24 -24 32 -40 48 -56 65 -80 96 -112 128 -145 168 -193 224 -254
32 -254 289 -327 369 -416 466 -524 583 -653 726 -806 894 -991 1096 -1211 1335 -1474 1624
49 1624 -1788 1971 -2171 2392 -2640 2917 -3228 3581 -3990 4462 -5018 5684 -6501 7526 -8858
64 -8858 10665 -13279 17386 -24835 42613 -175839 -34758 254928 -61859 88917 144707
75 144707 -209574 -192080 168306 85319 16877 96371 -86848 -197073 39235 58637 -2055
86 -2055 100695 605 -151055 33993 105319 -25040 9991 28617 -96971 -41365 80149
97 80149 35975 -25760 -40411 -54436 19894 75778 40539 34388 -37286 -150183 -20168 118788
109 118788 21141 6710 30735 -132587 -104801 128583 103475 515 46730 -62640 -167172
120 -167172 36198 129600 -6557 16909 9582 -150354 -44801 143478 46123 -10532 38480
131 38480 -78699 -104630 69553 73622 -27403 4445 -20747 -89957 20911 95302 -843
142 -843 -15165 10848 -52236 -20376 71802 23964 -45428 -23204 -11334 -10504 37396 53329 -8514
155 -8514 -48827 -21402 15252 32895 30211 1564 -40942 -56407 -6542 48687 37089 8435
167 8435 -16148 -50633 -26453 37718 42121 12268 -9647 -42442 -43856 14718 47635 17502 -2320
180 -2320 -11314 -36845 -9355 45268 26314 -11650 -10192 -18339 -22110 15486 36516 1642 -23314
193 -23314 -5306 -2636 -5515 24305 18498 -25703 -19964 6511 -1794 2023 19930 -4719 -28819
206 -28819 3312 18447 -4487 8181 11211 -26074 -11237 22448 2126 -2385 12535 -12024
218 -12024 -19170 16045 14808 -7671 6738 3177 -24510 -103 21615 -7339 -4646 12237 -12584
231 -12584 -13228 12706 3468 -7552 4553 2807 -8752 -1749 3532 -2695 2368 5961 -1220 611
245 611 -2327 -7414 6031 7995 -1251 3830 -1774 -11490 1451 10423 4125 730 -2836 -10826 -5609
260 -5609 8982 7667 152 -2097 -13228 -9703 12102 9882 637 1450 -12327 -15868 7825 16543
274 16543 4026 -2580 -6440 -13421 -1971 19540 13256 -4602 -7110 -11139 -5382 14793 14161 -868
288 -868 -10393 -14256 -4082 12507 15634 3093 -12240 -15919 -7193 8882 19971 6008 -14218
301 -14218 -17362 -10555 7152 22899 13818 -7607 -20194 -14240 6008 19864 17456 -757 -20892
314 -20892 -18060 1358 18349 21048 2576 -16860 -18740 -5440 15529 21371 4168 -14739 -21886
327 -21886 -8969 12824 20212 9394 -11157 -22952 -10390 9797 20562 13956 -8487 -22106
339 -22106 -14239 5352 22595 17327 -4171 -18346 -17345 1912 21123 19108 932 -18878 -20573
352 -20573 -1205 16205 20508 5885 -17917 -22280 -5364 13506 21308 8547 -13236 -23480 -12607
365 -12607 11670 21338 10576 -6375 -21615 -15712 8524 20878 14585 -2497 -18558 -16463 2219
378 2219 19587 17504 -1351 -14972 -16440 -3360 17918 18519 610 -13606 -18278 -6412 13076
391 13076 19119 6070 -14113 -19946 -7011 7664 18025 13126 -9411 -20560 -9963 6438 15440
404 15440 13213 93 -17372 -15537 6637 14361 8871 5054 -11234 -18312 3661 15582 6648
417 6648 1341 -5860 -17249 -4806 18568 10868 -5505 -3970 -13105 -13909 16161 19719 -4702 -7277
431 -7277 -8347 -15816 4712 24829 7250 -10742 -6852 -10274 -6708 18918 17893 -6500 -7854 -6274
445 -6274 -9021 8003 17007 1779 -7831 -6341 -4582 488 8353 6043 -5126 -7826 -1818 2424
459 2424 3074 334 -1253 -4440 -5949 6805 9046 -6688 -3622 1608 -8200 3438 18074 -2050
473 -2050 -12744 2310 -2585 -7090 18097 14222 -18045 -6932 6904 -12945 4341 27148 -7346
486 -7346 -19892 6480 -4607 -12373 20959 14994 -20789 -5961 8172 -15681 326 26862 -5304
499 -5304 -15726 10632 -4817 -15176 16321 13108 -12888 1745 9373 -14875 -5927 17345 -564
512 -564 -6735 12726 -1417 -16268 2372 5795 -3654 5494 7970 -6564 -10645 -1870 1124 1807
526 1807 7346 5357 -5777 -10429 -3892 4474 3495 4922 10261 -6795 -16524 5199 5874 -6319 13939
541 13939 12755 -19579 -8596 12961 -8419 -4501 25991 -451 -24542 9470 2985 -23007 15867
554 15867 22976 -21761 -3739 15299 -23505 -9021 31225 -2326 -16406 19598 -5076 -30571
566 -30571 18298 19174 -19242 11170 16852 -29839 -6851 24360 -8886 -3098 24181 -9988 -22528
579 -22528 11875 2224 -11177 17712 8878 -19739 -1221 3840 -12106 7728 14326 -6883 -3175
592 -3175 -949 -10645 1932 9260 398 4739 933 -13490 -846 7857 -5244 7416 14280 -15020
606 -15020 -7865 13486 -10993 -4647 25834 -5421 -18829 16133 -3201 -23338 19828 15280 -24064
619 -24064 6394 16402 -29304 -4747 29997 -13326 -10587 27689 -12599 -27019 22086 6413
631 6413 -18557 19979 12066 -28582 -811 17138 -13248 3698 24293 -13061 -16763 11351 -4099
644 -4099 -5782 19116 3092 -14764 -994 -1184 -5666 8583 8009 -4902 -4211 -3845 -4814 4867 5117
659 5117 -1430 2457 -2990 -7789 6444 3797 -6745 5898 4322 -9936 4104 8582 -10403 -2302
673 -2302 11256 -4538 -3537 13000 -5182 -15702 8838 4898 -8146 11304 5243 -19807 -3205
686 -3205 10070 -4120 4148 12774 -11336 -15492 6929 4165 -1075 13155 1739 -18245 -2500
699 -2500 8209 -167 7451 8389 -10533 -10492 4680 4789 1709 6357 -1368 -11949 -1606 7002 1410
714 1410 1756 334 -7670 -4391 4582 4677 504 -2514 -4360 -3628 2509 7278 1979 -3798 -4742 -3336
730 -3336 3065 7540 4638 -1815 -7415 -5064 3466 6633 5905 979 -7969 -8169 1109 7033 5760 1163
746 1163 -4643 -10266 -4061 8124 6641 322 -1629 -8621 -7206 6362 8806 1435 -1777 -5471 -7285
761 -7285 2101 11035 4346 -3389 -3286 -6376 -2061 10363 7261 -3209 -4192 -5381 -3488 6620 8776
776 8776 -654 -6314 -5155 -3603 2797 9280 1764 -6798 -5100 -3590 1348 8756 3875 -5056 -5667
791 -5667 -3573 1664 7493 5720 -2510 -6680 -3490 1288 6165 7090 -1229 -6740 -3945 -694 5069
806 5069 7746 -646 -6279 -4964 -1854 3617 6524 1590 -5436 -6265 -1674 2399 5750 3980 -4602
821 -4602 -6234 -1845 1532 6074 5226 -3004 -5510 -2589 1031 5589 5614 -573 -5704 -4171 704 3521
837 3521 5282 1741 -5655 -4580 -483 1697 4817 2126 -4358 -4315 -1783 1289 3863 1988 -2269 -4197
853 -4197 -1682 1602 2842 2859 -855 -4194 -784 1573 2638 3569 -682 -3486 -1111 346 2750 3614
869 3614 -591 -3013 -2100 -497 1519 2834 836 -3686 -2563 263 -659 2104 2876 -3418 -2922 958
885 958 -830 1112 3313 -1040 -2363 320 565 -29 2443 1446 -2414 -49 1421 -1273 1119 2114
901 2114 -1935 -251 1283 -1285 -55 633 -689 -274 -76 -364 -687 -798 -485 551 590 -1011 -415 741
919 741 -1839 375 3441 -2357 -1159 3573 -1604 -1382 4559 -528 -3709 2749 1834 -2927 2250 2622
935 2622 -5239 -575 4866 -2464 -715 3908 -5091 -4415 4928 512 -1434 3253 -2215 -6158 1490
950 1490 4032 154 1913 655 -5875 -2132 4538 2524 2363 834 -4574 -2717 939 2763 5150
965 5150 374 -4731 -1535 -1097 -962 5547 3290 -5906 -2585 2083 -3523 876 7409 -4868 -6433
980 -6433 5837 -1031 -4214 7489 -823 -9626 5047 5852 -5049 3304 3859 -10246 -1273 11625
994 11625 -989 -2166 5840 -8297 -8855 10535 5839 -3317 3655 -3775 -12110 2277 9090 1110
1008 1110 1083 -958 -10011 -4308 6778 4195 2379 1032 -7384 -4838 3147 3117 4827 2102 -6372 -2662
1024 -2662 2051 -430 4168 4751 -6534 -3734 6050 -1043 -2402 6942 -3593 -9671 7671 4792
1038 4792 -7770 3860 1328 -12648 3418 12134 -5558 -2713 5207 -10160 -5673 15521 3820
1051 3820 -8492 4426 -2897 -12727 9579 13316 -6111 -1879 1847 -10668 -947 13859 2749
1064 2749 -5158 309 -5485 -7041 7805 7975 -3518 -1897 -2090 -6191 1230 6758 1667 -2559 -2906
1079 -2906 -1089 263 559 2955 1265 -4081 -1692 4896 1220 -3202 1835 627 -5533 4045 7994
1094 7994 -4840 -4023 2463 -4488 -378 10268 534 -7957 -44 -1635 -5109 8138 8491 -8129
1108 -8129 -4887 2649 -6393 459 13548 -474 -9681 1150 -371 -4918 7451 8581 -6521 -4666
1122 -4666 3211 -3230 -57 9442 -759 -6896 2008 146 -3757 4357 3423 -5443 -1942 3544 -1888
1137 -1888 -1976 3208 -1331 -4088 2682 2253 -1795 -404 -766 -1825 1255 2997 1677 -1287 -2603 -1220
1153 -1220 445 2854 3474 503 -3356 -2972 257 1166 2492 4247 -2167 -6522 549 1465 -2035 4583
1169 4583 3220 -6820 -3099 3562 -1752 -929 6072 -953 -6486 2936 2143 -4513 3587 3942 -5623
1184 -5623 402 4965 -3793 -1363 5270 -2078 -3314 5353 792 -5545 2193 2008 -4735 2199 4244
1199 4244 -4377 -1838 2047 -2553 -279 3975 -671 -2787 633 -475 -1677 2812 1767 -2020 -329
1214 -329 244 -1457 1486 1816 -275 451 -859 -1014 1295 501 -174 1262 -318 -1971 445 1184 -1572
1231 -1572 7 1766 -2175 -1430 2040 -1582 -1601 2658 -641 -2202 1840 73 -2291 1526 1707 -1956
1247 -1956 443 2464 -1865 -712 3377 -698 -1532 2707 -248 -2136 2049 412 -1928 868 982
1262 982 -1774 -221 1229 -1485 -907 1611 -518 -1096 1293 -806 -1580 1081 458 -333 690 72 -807
1279 -807 342 992 593 327 590 -901 -369 1273 160 343 552 -1226 -687 769 -52 300 166 -1154
1297 -1154 -973 254 417 -62 -17 -505 -1444 123 1379 -260 -68 297 -1469 154 1593 451 -9
1314 -9 -137 -577 -189 1339 1445 -192 -679 -506 -1316 800 2006 -466 -961 -540 -1525 416 1639 282
1332 282 -888 -995 -836 -252 1213 1165 -971 -1111 -99 -614 1441 1764 -652 -658 -274 -238 1395 1792 5
1351 5 -1360 -823 95 791 1699 437 -2187 -1195 -306 -78 2079 754 -1880 -1411 -757 -128 1765 1218
1369 1218 -1023 -1448 -680 265 1257 1903 -256 -1728 -2 167 976 2392 -416 -1982 10 354 826
1386 826 2073 1 -2564 -1420 610 568 1278 1033 -2266 -2915 501 855 991 1571 -1633 -2935 -467
1403 -467 1030 1749 1526 -466 -2162 -1366 936 2046 1561 65 -1772 -1359 852 1538 1950 274 -2019
1420 -2019 -1060 -315 882 2365 106 -2381 -1068 -435 130 1932 1061 -2333 -2032 830 46 728 2559
1437 2559 -1490 -3045 1221 1040 112 2337 -209 -3116 40 2213 926 1137 698 -2717 -2147 1939
1453 1939 1567 447 831 -2394 -3054 813 1833 1314 522 -1752 -2418 -778 1214 2372 965 -1533
1469 -1533 -1625 -781 12 1883 2546 -872 -2347 916 -98 -341 3502 463 -3694 915 1402 -1951 1691
1486 1691 2111 -3625 -1339 2828 -879 -1513 2703 -1923 -4133 3139 1692 -2533 1581 354 -4433
1501 -4433 1081 3869 -779 -112 1289 -2949 -1365 3296 1735 -432 819 -1593 -2430 1804 2146 650
1517 650 634 -1828 -2186 399 359 1364 1505 -1998 -1834 867 -1006 -439 2908 -239 -3127 1634 733
1534 733 -3231 2456 2763 -3905 772 3670 -3482 -957 4356 -2358 -1996 5011 -316 -4163 2971 633
1550 633 -4533 3232 3471 -4957 -338 2459 -4241 -266 4937 -1821 -2580 2010 -1351 -2381 2949 1755
1566 1755 -2031 677 150 -2534 971 2287 -134 869 32 -1437 268 227 110 1803 -16 -1289
1582 -1289 613 -830 -1907 2214 1385 -2119 374 876 -4090 -260 3952 -1879 -1094 3310 -3088 -3353
1598 -3353 3944 678 -2244 3384 539 -4855 1365 3483 -2580 918 3857 -3555 -2245 4101 -1041
1613 -1041 -2052 3574 -359 -3299 1665 1049 -2891 348 1852 -1698 -430 1936 -1760 -1708 1384 85
1629 85 -78 1302 -175 -1554 -774 639 1706 1195 212 -30 -1975 -1317 1878 2188 27 -135 -575 -2824
1647 -2824 -659 3454 487 -1159 846 -2157 -2825 2689 2192 -1592 136 21 -3002 88 3370 -514
1663 -514 -1636 1546 -1106 -1775 3077 1561 -2481 270 1065 -1298 1009 2245 -1171 -2087 1034 790
1679 790 -385 1862 258 -3210 -844 1498 377 674 807 -2149 -2615 452 2280 626 427 -373
1695 -373 -2914 -1099 2506 1782 338 -3 -1747 -1866 1145 2625 840 -585 -681 -1700 -509 2518
1711 2518 1294 -954 -1024 -1139 -908 1024 1523 34 -1784 -1207 -109 293 1340 1023 -1849 -1648 257
1728 257 1032 1169 987 -458 -1979 -563 1970 1196 407 591 -1889 -1770 1574 1593 440 159 -1191 -2485
1746 -2485 -43 2434 722 -638 -614 -2079 -1412 2306 1534 -582 -364 -1510 -1646 1342 2222 379 -817
1763 -817 -916 -1113 343 2341 911 -721 -739 -969 -59 1925 1016 -599 -999 -1340 -113 1278 1088 -174
1781 -174 -1088 -1479 -496 1087 1348 -287 -951 -1198 -1202 1005 1894 -3 -659 -694 -1388 770 2003 580 -505
1800 -505 -813 -831 -192 1874 1313 -652 -688 -638 -812 1287 1367 -1011 -941 -612 -938 631 1422 -237 -1052 -894
1820 -894 -475 272 1426 580 -1108 -659 -198 -29 1299 989 -757 -339 -474 -174 1268 889 -257 -793
1838 -793 -549 -204 664 1068 -156 -1252 -482 -400 39 1241 -46 -712 -482 -505 185 878 246 -511 -331
1857 -331 -334 130 668 775 -359 -497 223 28 619 913 -332 -532 200 -105 423 473 -174 -598 -583 -40 -105
1878 -105 211 94 -611 -586 154 -256 -100 203 -256 -265 -55 81 315 -9 -26 10 -218 331 355 93 250 -118
1900 -118 -89 139 385 73 -332 -111 141 -305 -291 299 -538 -128 142 -259 50 -257 -368 -261 123 382 -178
1921 -178 -237 140 -232 3 595 128 -192 294 34 9 332 553 -172 -522 342 106 -39 513 -2 -747 -8
1942 -8 125 -4 -35 -10 -542 -543 294 466 -209 -167 94 -1023 122 1199 260 -27 -175 -551 -602 725 1204
1963 1204 -187 -624 139 -788 15 1762 274 -956 -241 -440 -769 591 1164 -498 -1399 95 -377
1980 -377 -287 1507 239 -1540 -136 436 -207 736 906 -646 -996 750 634 -79 878 48 -1616 257
1998 257 1132 206 247 -22 -1264 -809 897 1139 -80 -539 -811 -1414 19 1775 663 -694 -777 -1020
2016 -1020 -543 1197 1830 379 -1486 -690 -101 -50 1917 1436 -1239 -1323 70 -142 613 1860 128 -2095
2034 -2095 -292 752 -586 1128 1383 -2230 -1303 1318 -205 -325 1344 -794 -2241 829 1383 -784
2050 -784 487 646 -2272 -350 2443 279 -603 663 -1361 -1298 1919 1845 -444 -381 -594 -1588 358 2340
2068 2340 655 -937 -900 -1412 -402 1479 1569 145 -1678 -1626 -269 341 1560 1482 -1179 -1875 -213 630
2086 630 448 1626 928 -1945 -842 1234 29 351 1980 -1254 -1981 1869 719 -993 900 323
2102 323 -2328 142 2250 -1002 -974 849 -1724 -1252 2668 761 -1796 189 -568 -1575 1542 2499
2118 2499 -343 -1073 -240 -1166 -79 2542 1168 -1200 -803 -814 -617 1401 1671 44 -1349 -1100 -114
2135 -114 295 959 814 -865 -1434 -129 397 257 789 201 -1594 -951 1100 432 -323 769 -341 -1728
2153 -1728 1054 1477 -672 97 466 -1167 -128 1760 200 -1176 293 -480 -957 1523 1096 -1438
2169 -1438 -505 -93 -1155 505 1595 -289 -1530 -252 -89 -311 1193 1105 -1032 -912 203 -38 607
2186 607 1205 147 -689 -570 405 542 415 703 -433 -1014 222 260 -129 327 45 -873 -424 719 15
2205 15 -596 339 -69 -1095 504 858 -520 -10 303 -351 56 832 269 -348 -27 123 -329 482 687
2224 687 -590 -217 301 -461 121 547 -60 -637 -141 -16 -311 -105 264 -179 -539 251 52 -174 220 284
2244 284 -245 -57 257 93 -265 492 293 -314 374 113 -609 3 700 -6 69 142 -399 -514 216 407 -270
2265 -270 -5 166 -864 22 703 -184 -89 -86 -430 -133 336 320 -63 -388 33 -160 455 592 106 -228 -301
2286 -301 -95 473 555 213 -207 -786 -101 295 237 323 -35 -752 -521 373 315 183 -45 -579 -819 131 775
2307 775 91 -82 -231 -995 32 935 462 152 -389 -610 -122 778 848 126 -228 -766 -534 525 1087 47
2327 47 -253 -634 -907 301 812 211 -33 -956 -967 13 765 768 -80 -634 -762 -171 928 766 -54 -360 -881
2348 -881 -392 954 947 12 -146 -1108 -557 674 959 118 -414 -804 -940 120 1165 300 -393 -605 -1082
2367 -1082 -273 1162 509 -113 -575 -921 -217 926 1033 127 -524 -680 -387 824 1372 234 -537 -577 -655
2386 -655 482 1272 274 -325 -798 -1018 176 1008 702 -144 -1039 -903 -105 871 874 -233 -621 -961 -438 990
2406 990 807 -1 -243 -1004 -503 961 982 144 -192 -720 -694 467 1343 744 -529 -475 -769 -85 1230 441
2426 441 -493 -554 -800 -290 964 826 -205 -1000 -590 -310 424 1241 46 -941 -735 -158 357 1133 500
2445 500 -568 -1037 -691 679 867 586 -112 -913 -773 299 735 504 136 -498 -1014 -524 852 604 -252
2464 -252 114 -906 -934 858 727 -138 119 -292 -753 300 1048 208 -383 -61 -352 -256 1122 574 -569
2483 -569 -60 -67 -334 520 803 -256 -875 -390 -97 251 629 297 -605 -720 -24 182 539 482 -350 -916 -356
2504 -356 468 661 235 345 -249 -837 371 777 69 368 377 -819 -412 826 337 -353 466 -165 -1272
2523 -1272 483 913 -749 -96 587 -782 -392 842 -346 -860 466 106 -699 431 858 -754 -157
2540 -157 662 -258 93 706 -259 -545 146 209 -149 239 520 -613 -514 381 217 -134 496 -200 -749 -280
2560 -280 300 -16 -150 505 -183 -787 -90 480 -158 237 612 -412 -498 427 250 -399 630 552 -774 -276
2580 -276 600 -284 -4 934 -133 -847 188 83 -771 271 832 -725 -525 590 -508 -574 1040 226
2598 226 -987 351 338 -443 199 714 -499 -385 779 85 -687 820 348 -857 448 639 -646 -119
2616 -119 529 -447 -379 907 342 -727 10 -146 -851 176 906 -395 -460 -180 -388 -340 724 951 -181
2635 -181 -508 44 -529 203 1265 326 -575 -310 172 -171 339 980 -402 -1024 62 172 -227 847 354
2654 354 -1133 -558 380 -199 -18 639 -394 -905 290 686 -422 365 349 -1099 -241 1253 186 -124
2672 -124 308 -385 -857 658 1066 -201 -450 -90 -997 -112 1318 215 -690 -280 -569 -575 748 1052 -378
2691 -378 -976 -432 -235 326 1051 260 -1127 -905 -236 248 842 943 -288 -1152 -197 461 328 847 274
2710 274 -1214 -782 319 397 492 382 -348 -1100 -117 878 420 -59 -185 -1008 -530 1004 729 19 -168 -535
2730 -535 -460 460 1200 301 -568 -371 -471 -87 1161 797 -524 -844 -497 -282 704 1015 -49 -1202 -740
2749 -740 49 182 1042 444 -1062 -1037 -115 286 983 694 -416 -1105 -384 690 601 865 125 -970 -720
2768 -720 365 850 565 252 -706 -777 60 785 788 106 -504 -893 -334 641 749 52 -348 -902 -370 474 591
2789 591 284 -360 -948 -350 91 851 683 -329 -648 -540 300 695 792 64 -598 -672 143 588 791 424
2809 424 -883 -1057 -212 403 591 306 -428 -898 -719 432 682 179 -69 -999 -753 287 566 522 118
2828 118 -662 -521 135 529 588 81 -438 -559 -136 693 705 16 -336 -692 -302 282 393 223 -449 -557 -404
2849 -404 -27 400 531 -244 -493 -276 218 511 418 36 -408 -506 128 452 393 216 -497 -541 9 219 371
2870 371 165 -277 -396 -274 231 239 186 29 -430 -402 311 125 58 110 -307 -313 -66 210 201 30 -218 -162 64 253
2894 253 377 265 -145 -54 70 22 161 26 -156 -260 -44 130 73 414 59 -304 12 -92 -25 15 -27 -108
2916 -108 -113 112 -239 -327 233 54 -343 306 68 -302 230 170 55 238 68 -9 16 291 185 -31 158 217
2938 217 -341 153 96 -186 -182 -236 -194 218 20 101 -135 -495 -218 146 166 226 -128 -363 -3 63 350 144 234
2961 234 -225 -347 93 449 86 290 132 -616 -112 688 282 -151 -72 -388 -587 254 608 -288 -216 -168 -663
2982 -663 208 527 79 -188 40 -233 -120 517 607 -273 -556 -33 -65 347 679 13 -489 -347 16 412 432
3003 432 316 -426 -1007 -18 379 73 616 -135 -1030 -401 375 424 297 269 -451 -1060 250 1021 -83 346
3023 346 52 -767 -180 907 218 -236 128 -424 -455 529 958 -347 -210 -87 -764 159 1043 62 -644 -331
3043 -331 -304 -110 754 508 -583 -915 -152 358 469 810 -66 -1035 -461 384 573 539 397 -479 -946 187
3063 187 1103 138 213 -14 -1133 -530 833 584 -147 -90 -363 -950 214 1265 -76 -539 132 -769 -364
3082 -364 1185 402 -606 -4 -142 -423 561 995 -403 -699 281 -218 100 1087 133 -921 -211 334 114
3101 114 475 291 -671 -1078 155 617 70 502 -135 -1084 -308 562 407 65 -35 -374 -860 268 939
3120 939 109 -83 154 -736 -404 884 525 -164 53 -181 -479 213 847 -238 -574 301 -162 -186 662 196
3140 196 -712 -227 -19 -168 45 550 -362 -820 20 452 11 370 182 -817 -40 530 271 145 258 -292
3160 -292 -646 150 797 -191 -82 109 -780 -388 607 231 -342 -42 -115 -656 101 699 -242 -514 316 -400
3180 -400 -314 759 337 -333 237 249 -315 111 572 66 -456 240 320 -125 469 53 -590 -132 476 44 -98
3201 -98 9 8 -406 -33 394 -83 -46 224 -290 -240 467 84 -99 -24 217 -472 130 640 17 -454 120 -30
3223 -30 -237 349 46 -235 -140 84 -215 -52 545 17 -512 115 126 -317 54 95 -450 94 317 -60 -204
3244 -204 269 -6 -234 142 89 -261 10 257 -262 82 314 -120 -26 78 49 80 49 21 -34 -213 167 -44
3266 -44 -245 154 45 -51 -167 -190 -122 -114 -95 108 -108 86 -88 -201 113 66 -160 32 109 -110 -157 99 135 -52
3290 -52 62 175 -331 -177 294 -113 65 -36 -150 -148 -105 -21 29 -188 14 77 -38 396 9 -209 21 -56 -33
3313 -33 157 241 273 -282 106 184 23 60 2 -272 -45 -20 -29 169 -158 -36 -80 -36 -65 -34 -32 -44 -384 -62 209
3338 209 -4 51 -157 -205 -47 141 279 -55 -237 -161 17 171 328 -11 -162 -44 -180 129 243 128 -159
3359 -159 -294 -220 197 36 134 48 -330 -176 -11 460 241 -67 -95 -147 -37 311 325 37 -98 -399 -105 332
3381 332 117 78 -96 -319 -78 198 444 215 -173 -217 -274 140 574 77 -281 -378 -183 -68 303 96 -105
3402 -105 -308 -366 34 225 473 165 -297 -105 -47 317 570 -50 -142 -337 -56 387 347 344 -37 -492 -195 342
3424 342 191 131 -193 -476 -322 291 283 144 -24 -215 -414 91 518 151 -109 -94 -392 147 436 459 209 -479
3446 -479 -372 -51 165 451 41 -245 -199 -124 75 494 333 -113 -561 -149 298 70 232 -169 -574 -398 114
3467 114 133 404 -93 -444 -389 45 412 254 67 -102 -589 -101 558 134 -33 -47 -556 -167 413 502 87
3488 87 -333 -263 -295 43 533 127 -336 -249 -255 -154 584 312 -380 -257 -142 303 104 458 146 -532 -320 157
3510 157 281 418 321 -351 -394 148 518 30 185 86 -696 -177 377 149 77 -37 -403 -535 151 241 150 -150
3532 -150 -75 -422 -153 638 201 -367 86 -232 -182 149 550 -240 -159 95 65 12 516 177 -614 -225 135 15
3554 15 125 244 -164 -382 23 268 -24 -17 64 -522 -150 352 -2 -97 163 30 -259 352 596 20 -90 320
3576 320 -358 -194 548 220 -312 198 -48 -472 158 298 -229 -220 329 28 -432 335 -23 -597 48 219 -357
3597 -357 -72 153 -66 -39 404 154 -266 -6 34 -283 -10 433 -100 -230 217 102 -1 106 268 -162 -115
3618 -115 459 -85 -182 365 -89 -378 225 93 -420 -96 78 -162 -37 263 108 -418 248 112 -494 245
3638 245 457 -381 -70 242 -85 -29 435 130 -476 -80 -1 -176 127 317 -249 -274 96 64 135 385 192 -335
3660 -335 -270 311 -103 4 254 -143 -378 309 305 95 120 -3 -189 -75 452 214 -388 202 -257 -398 320
3681 320 326 -198 -326 -65 -127 131 380 366 -597 -159 -103 -136 337 397 -437 -530 -96 -36 146 392 97 -254 -239
3704 -239 258 194 81 318 -374 -424 83 415 23 31 -77 -494 -228 429 143 -195 -15 -148 -417 198 628
3725 628 -99 2 -67 -276 201 659 281 -239 -170 -118 -234 289 625 -179 -244 -117 6 348 367 77 -404 -437
3747 -437 142 69 275 408 -359 -377 -5 104 347 -25 -211 -365 -246 172 522 89 -36 -220 -316 89 324
3768 324 298 -37 -224 -276 -206 292 480 -203 -381 -9 -130 192 434 -192 -310 -140 -110 119 268 167 -260
3789 -260 -463 38 60 65 193 -303 -561 -115 -102 322 161 26 -284 -214 232 211 128 149 -176 -261 131 69 110 56
3813 56 -289 -232 -57 -43 122 -40 -194 -125 -106 135 301 31 -152 -257 -192 178 151 83 -197 -171 30 57 176
3836 176 324 -181 -197 92 -83 141 22 -57 -145 -243 46 168 -44 113 -161 -390 91 75 276 81 -442 -264
3858 -264 -31 208 123 -251 41 5 -115 115 234 -25 -99 -25 -73 207 -9 127 -187 -134 35 67 102 90 -62
3881 -62 -231 -78 -12 1 185 -44 -125 -194 -85 82 79 6 -24 -97 114 137 50 -81 107 35 44 306 135 -88 -77
3906 -77 61 -84 92 103 -14 -362 82 -94 221 27 -19 -176 -104 -68 96 51 108 -170 69 66 52 163 76 63
3930 63 16 -109 36 88 -68 38 85 -80 121 182 73 -34 -43 -54 -165 8 78 -183 -15 45 -143 170 74 -187
3954 -187 -30 64 -107 8 25 248 -98 -50 8 53 15 274 -48 -11 189 -193 -94 -95 -9 125 -108 -145 -29 39
3978 39 151 56 -170 38 -68 -40 -112 99 -269 -184 147 91 16 20 84 -152 -15 120 -18 120 25 250 -222 -13
4002 -13 167 -148 97 45 -348 -77 228 -257 -172 50 -212 -34 54 22 -28 -104 38 -133 -194 113 34 -215 18
4025 18 -118 -154 16 189 73 -89 7 61 -208 44 150 -237 38 -93 -188 124 -4 -213 -220 -83 13 -26 196
4048 196 155 -162 -219 185 31 29 308 79 -238 78 216 -77 123 148 -254 -215 203 188 -31 336 -118 -228
4070 -228 -10 150 54 -271 -38 47 -171 249 167 -218 -120 -87 -241 225 211 -28 -223 -41 93 -82 262 236
4092 236 -297 -253 109 115 67 281 -46 -212 -90 192 29 88 377 -106 -240 250 93 16 153 -35 -245 -188
4114 -188 287 98 -20 4 -246 -174 232 189 -88 -14 -206 -161 140 394 46 -213 -232 -129 -109 208 243 -211 -174
4137 -174 4 -134 95 281 -34 -337 -171 320 48 125 62 -279 -317 186 196 175 100 -99 -150 -105 203 265 -39
4160 -39 121 -210 -326 244 268 84 -49 -66 -208 8 69 170 -133 -78 -74 -182 246 296 -282 -50 -95 -116 81
4183 81 242 -25 -182 -93 -27 -11 150 375 -145 -242 -14 39 247 336 -59 -68 -180 146 79 -199 73 -188 -303
4206 -303 145 188 4 -15 -307 -299 70 308 226 -152 -13 -42 -198 60 92 -250 75 1 -49 -19 -57 92 -258 -192
4230 -192 51 -57 2 309 -19 11 145 -177 14 145 -55 -48 -203 92 -65 -63 135 -93 -193 144 26 -147
4252 -147 195 70 -57 -149 82 198 -83 114 69 -187 39 43 -48 91 -30 19 -39 -99 86 75 63 36 -195 -116
4276 -116 248 -186 -70 271 -182 -22 144 123 -81 -44 89 -5 -35 -9 141 -161 239 -3 -173 39 129 20
4298 20 -115 -33 -53 -42 233 123 35 142 -102 -103 19 144 118 -40 -43 -270 136 102 32 -203 -120 -60 103 218 235
4323 235 -106 72 -72 -67 98 35 112 -134 -121 -56 -19 129 93 -102 -289 14 178 0 7 -155 -63 -141 -12 227
4347 227 81 -6 -220 -233 176 102 40 -1 -214 -144 1 81 325 24 -172 -166 -162 121 194 7 -22 -255 -200 151 322
4372 322 44 -174 -166 -41 21 166 149 -12 -182 -148 -66 31 168 -42 -43 -316 86 282 73 176 -150 -163 95
4395 95 28 245 110 -250 -57 -89 8 249 105 47 -31 -178 90 303 3 -27 -197 -186 62 231 218 20 -305
4418 -305 -186 45 -28 373 150 -272 -158 -270 201 153 33 -47 -315 -138 176 60 136 -9 -192 -120 137 379
4440 379 301 -44 -207 -317 -34 442 243 161 -30 -212 -108 262 146 41 -143 -124 -91 87 387 -36 -166
4461 -166 -81 -7 80 231 8 -64 -229 -227 209 136 120 -145 -306 -56 227 293 75 53 -1 -241 -140 90 255 -100
4485 -100 4 -112 -73 228 103 -90 40 -193 -87 273 114 61 -120 -192 -59 25 261 171 22 15 -65 -138 365
4508 365 0 -175 -104 -275 -32 125 166 -155 -41 140 -51 84 216 -104 -45 -51 -159 56 159 -65 -214 -309
4530 -309 147 94 -44 36 12 -231 -61 181 154 11 -182 62 -25 27 237 85 -228 11 -263 -170 189 45
4552 45 -154 28 25 102 119 108 -51 -80 129 -47 -38 152 91 -260 -167 57 36 291 151 14 -160 36 167 71
4576 71 143 -65 -25 96 48 -16 -22 -104 21 -184 59 -19 -146 -98 71 -31 -55 208 -41 -87 29 -180 -116 -190 211
4601 211 -6 -282 95 -2 -153 95 69 -48 92 37 -39 179 23 -170 -40 142 107 -288 35 67 -74 131
4623 131 -7 -1 -129 -122 55 -92 -26 -106 -150 -88 155 -110 59 126 -63 -75 86 236 24 95 -151 -68 2 145
4647 145 65 -130 -25 -55 -32 162 55 13 -11 69 -3 -35 92 137 -148 -131 110 -24 106 123 -176 -26 -84 167
4671 167 95 53 58 -94 -101 77 26 229 69 -184 40 68 21 150 -67 -40 -111 -73 -172 -60 -113 60 -124 -61 107
4696 107 265 -6 -128 90 -181 -55 191 60 -17 -61 38 -114 50 107 -112 74 -145 6 -95 143 11
4717 11 -205 -77 212 73 47 -65 -104 -139 69 17 -58 73 3 -148 -267 104 35 -28 2 -61 -174 107 201 112
4741 112 102 -131 -188 66 210 149 -215 -35 -150 36 180 -9 -31 94 -66 87 32 283 -33 -32 -100 142 57
4764 57 45 278 -50 2 85 85 -17 -192 -103 -196 -194 164 111 16 -121 -107 -27 10 351 81 -56 -65 -109 65 -126 172
4790 172 -51 -136 -122 22 304 29 141 -150 -115 91 45 134 157 -134 -124 116 34 142 -82 -72 -39 -63 149 -3
4814 -3 -190 -21 -96 -52 93 147 -98 -53 -209 45 17 77 -19 83 -151 -127 152 -1 215 -113 -135 29 -96 181
4838 181 59 24 -27 -213 198 3 103 187 110 -143 117 -197 84 128 80 16 -86 -74 -113 15 8 -49 -100 56
4862 56 1 101 -62 58 -25 -74 26 81 29 19 -17 51 113 46 -49 171 -85 21 -5 91 -5 236 -35 7 141
4887 141 -157 9 -128 -38 100 57 -124 -8 -106 -59 -207 53 -15 -112 -50 -56 130 12 -61 -41 148 -6 44 0
4911 0 -52 -104 24 140 193 -124 84 -82 5 -31 -139 -33 60 -76 34 33 24 103 62 121 5 -157 120 80 -186
4936 -186 152 -53 -17 29 -102 -18 108 -65 -63 -111 -133 -112 -35 60 112 -83 1 78 -44 72 -77 -111 150 26 80
4961 80 105 -52 -147 -63 -23 63 44 14 -83 -104 12 -97 -156 250 -138 -67 79 193 86 -31 -194 -173 78 -16 -66
4986 -66 -76 -24 -138 -93 34 8 76 36 14 55 35 116 114 -29 -120 66 -93 53 3 32 135 -45 2 174 -78 -75
5012 -75 0 -81 146 -12 56 149 -93 -7 93 -7 -122 130 -228 -64 163 94 49 -78 99 -53 -30 -62 -93 103
5036 103 57 100 95 -121 47 45 -59 31 54 -92 215 30 -95 40 -62 -100 70 35 120 71 105 17 74 69 28 120
5062 120 1 59 -156 132 175 22 -17 -92 -61 72 -17 35 48 -91 31 -17 186 93 -319 -6 13 168 90 -69
5086 -69 115 35 -49 52 184 28 10 -102 -88 -57 92 24 29 -96 44 -83 35 151 90 108 -27 -124 -107 -72 -28
5111 -28 179 -92 -93 34 27 13 -262 94 -6 -154 -72 65 -76 15 39 -57 54 24 279 -9 32 -9 68 51 106
5136 106 -66 -189 -4 -37 -80 89 3 -1 -64 -131 50 180 68 -39 -11 3 -24 38 -23 131 -132 -195 -82 -34 111
5161 111 27 53 -2 -111 35 134 28 44 38 -51 170 30 168 83 -31 16 -103 121 100 117 -48 18 132 2
5185 2 36 116 40 -245 200 -65 -37 -62 -4 -37 -37 73 28 -21 37 -167 -64 -9 -38 -160 32 -53 -133 45 -71 13
5211 13 122 10 -167 22 127 -54 39 112 -114 21 113 39 -83 57 -76 -51 43 73 19 3 136 -109 -105 119
5235 119 -58 -103 23 94 -48 -117 103 -97 39 129 110 71 -18 131 -198 32 -139 61 -42 -28 -51 -110 -167 -3
5259 -3 66 -101 19 -25 86 67 112 27 -110 24 -12 50 -39 25 -170 -50 113 -222 144 -99 73 70 32 -261 52
5284 52 158 52 -139 31 18 29 117 51 -54 204 83 -9 -13 125 14 194 -127 167 -6 -32 60 -27 124 27
5308 27 67 -36 242 -115 -4 -60 111 2 -82 92 144 40 -46 98 -7 -23 0 -140 -25 -66 8 -55 -128 155
5332 155 -67 4 -63 12 149 48 43 -67 88 39 33 -153 102 10 -94 -148 -21 -16 -27 105 -42 -84 43 5 116
5357 116 114 -14 -18 25 115 9 183 26 -158 -47 103 141 -83 -43 -6 -1 -58 -119 -124 51 -37 -83 58 -49 -90 99
5383 99 -76 -41 250 9 -17 -142 72 176 -116 103 36 4 -11 58 21 -37 161 -15 45 -253 -42 160 83 -6
5407 -6 -9 -99 229 102 130 -89 -116 -50 -86 124 -5 -187 -89 -60 56 -8 143 -85 -12 -13 -67 100 123 37 69 136 57
5434 57 -26 -92 134 -67 -161 118 64 40 -45 1 -53 -84 -148 14 26 202 -77 -50 60 73 143 -123 -56 39 5 7 160
5461 160 -16 -69 -113 42 196 64 29 -92 13 25 83 -63 -7 -70 23 48 -7 107 91 -223 -119 120 53 13
5485 13 15 -48 23 -82 11 -179 -69 117 -232 -14 -63 20 -17 -26 -240 22 16 -89 94 -38 -8 55 -77 -10 144
5510 144 58 63 -3 -114 -47 187 28 68 157 -113 -111 -36 134 -55 119 -90 18 70 -11 -100 32 -36 44 -28 -28 -54
5536 -54 -235 -32 -29 -37 -63 -57 -66 -10 75 -133 -13 84 -34 -87 -164 23 -68 -49 -12 -30 115 45 52 41 -101 55 -47 133
5564 133 -68 -25 -174 -100 64 -132 17 62 50 58 -50 -38 -107 52 89 65 25 -50 115 -83 149 20 -186 49
5588 49 206 -115 17 107 61 -71 2 -40 -58 87 62 -4 109 -186 -13 122 133 115 -167 33 -115 -90 -19 42
5612 42 154 105 -40 -63 12 16 -29 -46 19 -91 79 154 84 22 110 -91 178 142 -113 -44 122 -52 121 -40 -124
5637 -124 103 -95 140 -15 1 -57 38 28 9 170 15 66 -93 -87 142 17 120 -42 126 16 -112 8 112
5660 112 71 50 -95 -170 49 -43 -140 -12 -12 -17 98 -2 -110 -55 -61 -130 147 37 -67 -11 -29 -43 29 -42 3 27 -7
5687 -7 -14 -136 -64 40 -96 145 24 99 -25 -5 143 -33 -56 -143 51 -124 81 105 -8 44 -99 -112 -68 -116 22
5712 22 -123 -47 42 25 -7 -18 -128 52 88 -14 -49 -93 60 37 145 8 87 -33 54 104 178 -77 122 -16 -20
5737 -20 -37 111 57 -95 145 67 10 96 50 -74 -76 -87 -119 -69 -20 230 141 -107 49 -33 -29 81 37 150 28 -97
5763 -97 116 59 -24 -260 -36 116 -44 70 107 -151 -24 57 -52 160 33 -24 23 -12 -12 89 9 13 -40 83 104
5788 104 -49 23 29 -179 86 -76 102 103 -175 -27 -23 32 159 -28 21 34 69 6 83 -52 36 -139 -21 -27 -3 35
5814 35 27 -25 -141 27 -27 60 111 -97 -119 53 -137 -25 -52 67 -50 -30 -51 -13 128 -23 24 -86 -41 55 8
5839 8 75 -87 -60 -210 -39 31 -65 85 -61 54 6 -34 146 69 -154 0 0 -10 137 24 -45 -96 18 26 104 -98
5865 -98 209 -4 -114 -58 0 -43 -70 22 -54 -27 -139 26 -137 -116 42 70 -92 -36 -214 100 -41 187 71 195
5889 195 -80 -37 58 -21 101 21 20 56 124 -6 102 -63 -10 -26 73 77 46 19 -97 5 14 59 12 -72 -47 -15 3 41
5917 41 -102 25 -124 26 27 -117 22 -42 62 -180 -35 32 -16 -109 59 -63 -16 73 -129 5 105 47 -32 -3
5941 -3 113 85 57 71 103 124 199 -79 72 68 154 18 -51 305 54 50 -1 31 158 -37 111 42 -74 118 36 4
5967 4 -60 -11 -82 -229 16 -5 -112 -91 118 -2 87 16 68 92 -39 144 47 -3 70 -108 -96 -87 -116 -85 -53 104 110
5994 110 -31 175 -50 102 74 -54 -76 0 -92 -20 -24 -12 30 -31 -10 -118 -59 -92 -72 0 -48 50 1 -135 34 21
6020 21 117 -88 -121 -197 -103 -74 -7 98 -21 47 50 -69 -52 72 116 -25 -61 150 -116 37 22 -37 -108 -163 31 -72
6046 -72 -36 -135 -206 69 -68 16 -51 -48 60 -59 0 -38 -61 101 163 -179 -120 49 84 -14 241 -82 -184 59 38
6071 38 47 -60 -131 71 -26 -172 103 -39 -186 -12 52 -154 47 76 -91 -201 11 -59 39 -118 85 -21 -32
6094 -32 -26 -72 79 -132 -149 -76 31 -10 97 -90 -42 162 -37 22 47 82 -79 19 9 77 138 -70 193 145 69 6
6120 6 37 110 -105 50 -77 -136 -69 -73 -42 -16 -119 -55 -19 -38 25 -132 -205 153 46 3 7 -116 -9 117 -96 -22
6146 -22 -42 17 -64 -43 82 -10 88 43 -64 -102 -32 -87 40 -48 -18 -179 79 114 -10 -70 -165 -125 15 -88 38 -61
6172 -61 45 42 -79 -1 -89 -46 86 57 131 83 80 242 124 -27 -175 126 109 86 123 54 18 62 -48 16 -52 -59 109
6199 109 -73 23 26 -7 -54 25 50 7 -4 108 -70 -53 -53 75 247 93 77 15 -46 -95 48 -100 -45 -10 36 76 27
6226 27 -20 -35 -4 -6 58 -45 -33 29 106 -101 -60 156 229 7 -51 74 -181 57 -146 189 148 23 118 11 -98
6251 -98 21 -4 22 47 -177 169 -9 -197 -43 2 -53 234 -18 -106 94 -72 -79 -127 114 110 -32 -35 -15 36 126 77
6277 77 26 -103 -114 124 116 -47 56 -174 50 -93 -128 103 7 53 -46 51 24 1 31 101 14 -47 -26 -51 -90 1 -92
6304 -92 136 16 1 16 -17 -21 0 137 -29 29 203 -29 36 -1 91 75 -49 -18 154 -80 -21 -116 63 -112 -103 95
6330 95 133 -48 -109 -4 143 129 145 -28 23 23 -71 54 -73 151 -16 -80 -19 -1 40 -155 -117 84 -122 -217 -236
6355 -236 54 87 -90 -5 322 21 93 -27 -146 -98 -112 -109 212 -8 -85 -168 0 -77 103 73 51 39 45 55 184
6380 184 -44 44 -83 -72 -59 30 156 75 -64 50 2 -23 212 -79 115 13 101 176 17 13 129 166 -160 -84
6404 -84 247 122 -85 -33 107 -32 -33 -216 -129 -2 -74 -28 57 39 139 -157 55 -82 -114 67 39 -25 27 98 -37
6429 -37 38 35 89 42 -103 -18 64 172 65 -174 74 21 218 29 -112 259 -54 134 202 229 113 -106 -152 -65
6453 -65 121 70 96 -124 -80 2 49 236 -24 -173 -42 69 -78 137 69 18 -153 26 23 74 31 -61 -48 38 -171
6478 -171 7 -106 -47 92 -77 12 -80 31 88 -45 145 48 16 29 -112 180 -58 -32 247 -6 -57 -42 65
6501 65 171 -64 41 19 -91 91 -86 6 -87 44 16 -100 -69 57 93 83 -100 34 -87 106 70 -61 -89
6524 -89 24 17 -16 101 -35 40 -130 202 99 -13 102 13 99 117 70 -97 -57 202 34 4 -18 -13 -68 38 -5
6549 -5 93 -98 8 -5 2 -154 10 1 -67 37 -68 30 -99 122 -62 23 23 15 18 -135 70 82 32 20 87 117 -137
6576 -137 -17 -151 -108 74 14 120 20 -15 88 -64 -139 -42 -207 47 -49 11 74 91 -42 -139 56 36 123 148
6600 148 -44 29 145 -13 -63 97 203 -95 -60 -63 79 44 -29 13 -94 -39 -92 142 171 14 7 23 -41 57 39 160
6626 160 -48 35 48 64 175 10 29 26 -46 5 52 -145 74 -32 37 -49 -174 125 -28 20 -131 -38 -176 -167 27
6651 27 40 82 -35 304 50 -6 -10 63 47 -1 89 190 12 -138 -39 -93 93 48 89 -66 -128 -155 85 36 109 16
6677 16 208 218 -63 105 35 100 -55 -73 -145 13 -199 -58 -19 -39 -101 204 39 -32 -59 17 39 -76 14 -100 64
6702 64 -39 22 45 -14 -133 -86 -81 131 -4 166 172 42 -82 52 68 124 -17 -94 40 39 8 -55 58 66 -146 -177
6728 -177 39 19 74 -127 -107 -63 -42 -192 -49 21 17 90 -94 -73 96 182 8 -122 7 -48 29 60 79 5 -166
6753 -166 20 -48 184 80 130 -64 -19 60 25 192 124 70 -118 48 11 37 62 -25 -148 -33 -44 -137 -106 -45 -12
6778 -12 -182 -89 39 59 52 -120 -71 -40 -71 -74 -18 -64 -128 12 -110 -73 -8 48 -22 -60 79 90 134 24 -75 -5 75 -57
6806 -57 90 67 -25 -57 95 142 -62 58 -136 8 -121 3 137 -187 -69 7 97 -69 88 -137 -102 81 -18
6829 -18 193 68 65 -37 -77 3 -137 -62 41 22 -43 -138 -17 177 40 113 -60 -30 -111 72 49 -109 -38 -43 -121 -6
6855 -6 52 130 121 -97 71 2 -31 -56 -43 -52 109 36 109 142 25 -161 -85 -14 90 109 -92 -132 -66 59 23 3 75 -71
6883 -71 -165 140 56 -129 78 4 -192 85 74 15 80 34 83 -137 -129 118 -60 -40 -41 -46 3 35 -183 -109 93 185 166
6910 166 -104 83 25 44 38 -9 -29 34 201 -18 -93 -6 -88 -116 -34 -25 90 -11 138 61 25 97 96 -74 -38 137 -6
6937 -6 -38 -61 1 -23 16 6 0 112 189 115 -51 -19 -71 212 32 -10 -132 76 242 41 87 76 3 -9 -66 -2 5 139
6965 139 -119 -15 50 47 46 229 67 3 -165 -66 35 118 21 -13 -75 -66 84 145 -72 115 -182 -131 50 -50 -15
6990 -15 86 -34 93 -92 100 -60 108 97 -95 56 -47 37 -48 66 -184 -185 48 -141 -17 -166 -33 6
7012 6 -163 41 -102 32 139 91 -7 -14 -2 46 -13 35 204 -68 63 188 -101 195 -64 -6 57 -38 -39 -66 -61 6
7038 6 -34 40 -16 45 -208 39 29 169 69 -113 61 -29 -120 58 -28 -3 72 68 194 15 -74 -151 -138 -129 43 127 14
7065 14 56 -45 76 81 159 -150 105 117 -34 -92 21 -35 106 121 -57 -42 -156 48 224 -30 -15 -87 -99 82
7089 82 72 -17 -265 -19 158 96 4 38 -124 50 27 52 40 -32 -46 52 21 -205 32 -155 -267 -88 -200 144
7113 144 54 -23 -49 -148 -21 -172 45 28 -110 -109 -77 126 -19 -38 30 -60 -89 69 83 -126 -161 35 13 -160 -19
7138 -19 32 8 -48 -33 15 -19 69 -35 -51 -26 106 19 -58 25 45 -74 -4 66 72 103 44 59 -96 -51 201 -48 22 26
7166 26 -167 44 26 64 19 -161 -14 1 221 35 66 84 30 60 -123 -131 145 -141 -127 -23 -41 61 111 -63 -41
7191 -41 24 -174 10 -51 -20 4 -150 -27 43 24 0 18 -178 16 -164 -78 148 -30 -150 32 106 -48 -181 11
7215 11 49 -63 -41 57 169 -72 -53 -79 87 117 -42 94 -169 89 27 -111 164 142 -107 -9 58 -20 55 -18 76
7240 76 -88 -21 73 -56 127 -59 -63 68 -17 -79 -87 74 3 -23 15 -43 13 -130 26 -150 86 -2 -47 -94 -65 116
7266 116 -30 16 -103 -74 82 -55 -177 -30 156 -178 -37 -29 -102 18 46 39 108 4 -94 25 -41 39 -13 -102 -36
7291 -36 -27 117 1 -15 75 7 -108 19 184 95 -116 65 5 110 -27 -88 129 -128 77 11 -66 7 -50 44 -79
7316 -79 128 56 16 88 120 -117 124 -65 79 -36 -24 11 -81 -75 76 -2 45 77 178 73 50 101 -5 -25 129
7341 129 99 -70 82 128 54 -74 124 42 96 -76 112 -77 -137 41 -85 -34 83 -136 -64 -224 3 183 -39
7364 -39 -14 -95 -153 21 -98 -66 -14 152 74 33 5 51 125 -10 34 -49 20 -45 -100 23 -124 112 26 -71 -53 -27 11
7391 11 37 -76 48 13 159 -53 2 35 -21 -75 -41 -170 156 84 32 -142 -42 124 138 34 -27 -46 120 120 -67
7416 -67 -11 104 -7 -133 -133 41 -71 -113 56 -41 -5 96 187 -72 58 -46 2 161 -91 91 1 -38 41 89
7440 89 11 -2 -50 -125 77 -53 10 168 21 -59 -40 -1 37 144 -114 -151 -65 -107 -56 220 -16 60 -107 92 25
7465 25 -68 -5 123 -69 4 132 -18 36 -100 123 60 -8 40 58 -240 -49 -59 129 -73 -89 -28 -90 66 -5 -137
7490 -137 25 -2 -222 -55 166 113 -58 169 -161 135 200 -182 32 -44 43 -131 205 -142 63 -80 -5 -133
7512 -133 33 99 81 60 -80 -162 -52 30 37 -104 -167 75 -15 136 18 66 -65 34 135 238 100 -62 148 -98
7536 -98 -23 31 18 38 -85 180 -80 83 -86 3 -29 50 39 -97 -44 113 18 35 -70 -21 62 9 63 5 -115 -15
7562 -15 48 -60 6 -88 52 164 57 107 -71 40 -47 -136 6 -41 79 31 30 74 4 -33 24 22 143 20 -38 -19
7588 -19 136 -39 41 -88 142 54 30 -1 14 -195 112 222 -4 -3 -26 126 162 110 100 53 4 131 4 30 82
7613 82 -65 -169 -43 -68 29 100 -62 95 93 -1 192 80 35 125 -43 -63 55 -61 20 -190 -50 22 -81 -231
7637 -231 -90 -40 36 69 -16 187 -70 133 -29 50 62 -95 -70 -32 -71 128 -52 92 101 -45 -28 -22 107 -8 25
7662 25 27 -25 44 79 -60 -1 -60 -81 -84 198 -158 32 4 -21 122 24 -16 -64 -51 2 -98 67 29 -93 117 -28
7688 -28 19 62 -56 -55 165 -45 11 61 -256 -104 -70 96 -26 -189 45 172 147 -162 -116 48 80 -30 88 74
7712 74 -104 17 37 15 28 -157 48 13 -61 -14 -12 70 12 52 -76 154 47 66 169 13 -40 -15 16 13 -35 -8 -39
7739 -39 20 65 -77 -28 80 -108 -59 -63 -185 10 -68 -133 -18 9 -26 -18 -195 -124 41 -46 161 35 -33 -70 64 -53
7765 -53 -13 26 -7 -48 16 -63 106 -68 141 73 -131 109 -205 104 30 134 83 16 -105 -88 -44 103 -87 -150 -96
7790 -96 82 46 35 138 15 96 131 24 53 -40 -107 22 104 63 33 18 62 -74 46 -198 -99 178 -28 153 -30
7815 -30 -136 -155 -42 36 79 -44 31 90 -66 62 170 -42 -43 89 130 66 167 98 -140 -124 53 83 62 -71 -30
7840 -30 -16 98 38 59 -81 88 53 37 -124 38 150 -124 -17 -31 -121 69 85 -45 -38 -65 10 83 -35 67 -163
7865 -163 -119 -94 303 31 219 -48 -33 55 86 209 -7 -72 -17 198 21 -77 -32 -27 -30 -100 111 64 5 84 21 -22
7891 -22 73 -196 -2 148 82 44 16 53 21 -60 -37 82 112 -75 -165 70 -127 -32 85 -106 17 -71 -5 65 -14
7916 -14 -11 -9 -23 3 -194 24 -80 130 80 -44 88 120 -214 -156 83 -115 -69 97 34 -41 -68 -11 -98 -81 48 -74
7942 -74 -168 48 53 84 -84 -75 65 101 79 -106 -81 61 50 -53 -205 -2 27 33 22 -26 -87 -56 26 -146 201 -96
7968 -96 -13 176 -33 -32 -144 -101 25 54 -144 -85 163 6 110 -7 -57 -67 -103 68 129 36 21 35 88 -35 -132
7993 -132 110 100 10 -199 -47 -20 18 -68 -22 -60 110 -14 -27 -24 -60 5 89 -152 -80 -17 -174 10 45 -61 37 -17
8019 -17 -6 -2 -57 61 130 76 94 -6 -122 103 -36 -124 -14 -32 -12 186 1 101 -108 -48 15 88 -119 -32 -26 83
8045 83 -109 40 145 143 73 75 51 -49 -34 17 0 28 -94 -30 53 -44 -24 -98 8 -51 -100 -17 -48 -16 77 -29 -42 56
8073 56 25 -59 -42 -7 -36 -105 -59 -141 59 138 -155 -135 198 75 61 -95 1 -4 -35 -10 105 5 -67 -116 -152 -87 -153
8100 -153 151 61 -85 -29 50 12 51 -123 37 -110 -81 81 6 101 95 87 -14 75 90 43 -56 56 113 7 7 -164
8126 -164 51 -124 -13 141 223 -173 -66 -108 3 50 73 -47 -61 13 -151 20 -50 57 69 33 -113 -104 4 168
8150 168 68 -90 11 -13 98 20 61 22 1 59 -124 -27 6 104 60 163 -59 -55 -151 126 -10 150 72 96 -104
8175 -104 -43 -41 -47 -1 -40 153 -20 -26 60 169 146 57 -31 161 33 -96
8191i6
##END NTUPLES=NMR FID
##END=
