##TITLE=1H_E3e-N3
 CDCl3
 8 sc, 
 23.11.2023
##JCAMPDX= 6.0         $$ Bruker NMR JCAMP-DX V2.0
##DATA TYPE= NMR FID
##DATA CLASS= NTUPLES
##ORIGIN= UXNMR, Bruker Analytische Messtechnik GmbH
##OWNER= root
$$ XWIN-NMR		Version 3.5
$$ Thu Nov 23 15:02:41 2023 Russian Standard Time (UT+4h)  she@DPX200
##.OBSERVE FREQUENCY= 200.1313
##.OBSERVE NUCLEUS= ^1H
##.DELAY= (6, 6)
##.ACQUISITION MODE= SIMULTANEOUS
##.ACQUISITION SCHEME= undefined
##.AVERAGES= 8
##.DIGITISER RES= 18
##SPECTROMETER/DATA SYSTEM= spect
##.PULSE SEQUENCE= zg30
##.SOLVENT NAME= DMSO
##.SHIFT REFERENCE= (INTERNAL, DMSO, 0, 15.7039)
##AUDIT TRAIL= $$ (NUMBER, WHEN, WHO, WHERE, WHAT)
$$ ##TITLE= Audit trail, XWIN-NMR		Version 3.5
$$ ##JCAMPDX= 5.01
$$ ##ORIGIN= Bruker BioSpin GmbH
$$ ##OWNER= she
$$ F:/spectra/data/she/nmr/H-F/1/audita.txt
$$ ##AUDIT TRAIL=  $$ (NUMBER, WHEN, WHO, WHERE, WHAT)
(   1,<2023-11-23 15:01:46.79 +0400>,<she>,<DPX200>,
      <created by zg, POWCHK disabled, PULCHK disabled
       configuration hash MD5:
       00 E9 B6 7A A2 85 ED C7 34 08 36 98 17 FE 4E 26
       data hash MD5: 16K
       87 80 8F FF 88 78 04 4F 4B 5F 24 E2 E8 49 02 8B>)
$$ ##END=
$$ 
$$ hash MD5
$$ 61 2D 69 E0 1A 6C DD 88 55 A5 79 D6 C5 A8 B6 25
##$RELAX= 
##$RELAX= 
##$RELAX= 
##$RELAX= 
##$RELAX= 
##$RELAX= 
$$ Bruker specific parameters
$$ --------------------------
##$DU= <F:/spectra>
##$EXPNO= 1
##$NAME= <H-F>
##$PROCNO= 1
##$TYPE= <nmr>
##$USER= <she>
##$AMP= (0..31)
100 100 100 100 100 100 100 100 100 100 100 100 100 100 100 100 100 100 
100 100 100 100 100 100 100 100 100 100 100 100 100 100 
##$AQSEQ= 0
##$AQ_mod= 1
##$AUNM= <au_zg>
##$AUTOPOS= <>
##$BF1= 200.13
##$BF2= 200.13
##$BF3= 200.13
##$BF4= 200.13
##$BF5= 200.13
##$BF6= 200.13
##$BF7= 200.13
##$BF8= 200.13
##$BYTORDA= 1
##$CFDGTYP= 0
##$CFRGTYP= 5
##$CHEMSTR= <none>
##$CNST= (0..31)
1 1 145 1 1 1 1 1 1 1 1 1 1 1 1 1 1 1 1 1 1 1 1 1 1 1 1 1 1 1 1 1 
##$CPDPRG= <>
##$CPDPRG1= <>
##$CPDPRG2= <>
##$CPDPRG3= <>
##$CPDPRG4= <mlev>
##$CPDPRG5= <mlev>
##$CPDPRG6= <mlev>
##$CPDPRG7= <mlev>
##$CPDPRG8= <mlev>
##$CPDPRGB= <>
##$CPDPRGT= <>
##$D= (0..31)
0 1.2 0 0 0 0 0 0 0 0.06 0 0.03 0 0 0 0 0.0002 0 0 0 0 0 0 0 0 0 0 0 0 
0 0 0 
##$DATE= 1700737306
##$DBL= (0..7)
120 120 120 120 120 120 120 120 
##$DBP= (0..7)
150 150 150 150 150 150 150 150 
##$DBP07= 0
##$DBPNAM0= <>
##$DBPNAM1= <>
##$DBPNAM2= <>
##$DBPNAM3= <>
##$DBPNAM4= <>
##$DBPNAM5= <>
##$DBPNAM6= <>
##$DBPNAM7= <>
##$DBPOAL= (0..7)
0.5 0.5 0.5 0.5 0.5 0.5 0.5 0.5 
##$DBPOFFS= (0..7)
0 0 0 0 0 0 0 0 
##$DE= 6
##$DECBNUC= <off>
##$DECIM= 32
##$DECNUC= <off>
##$DECSTAT= 4
##$DIGMOD= 1
##$DIGTYP= 9
##$DL= (0..7)
0 120 120 120 120 120 120 120 
##$DP= (0..7)
150 150 150 150 150 150 150 150 
##$DP07= 0
##$DPNAME0= <>
##$DPNAME1= <>
##$DPNAME2= <>
##$DPNAME3= <>
##$DPNAME4= <>
##$DPNAME5= <>
##$DPNAME6= <>
##$DPNAME7= <>
##$DPOAL= (0..7)
0.5 0.5 0.5 0.5 0.5 0.5 0.5 0.5 
##$DPOFFS= (0..7)
0 0 0 0 0 0 0 0 
##$DQDMODE= 0
##$DR= 18
##$DS= 0
##$DSLIST= <SSSSSSSSSSSSSSS>
$$ [...]
##$SUBNAM2= <"">
##$SUBNAM3= <"">
##$SUBNAM4= <"">
##$SUBNAM5= <"">
##$SUBNAM6= <"">
##$SUBNAM7= <"">
##$SUBNAM8= <"">
##$SUBNAM9= <"">
##$SW= 18.0517328524113
##$SWIBOX= (0..15)
0 0 2 0 0 0 0 0 0 0 0 0 0 0 0 0 
##$SW_h= 3612.71676300578
##$TD= 16384
##$TD0= 1
##$TE= 0
##$TE2= 300
##$TE3= 300
##$TEG= 300
##$TL= (0..7)
0 120 120 120 120 120 120 120 
##$TP= (0..7)
150 150 150 150 150 150 150 150 
##$TP07= 0
##$TPNAME0= <>
##$TPNAME1= <>
##$TPNAME2= <>
##$TPNAME3= <>
##$TPNAME4= <>
##$TPNAME5= <>
##$TPNAME6= <>
##$TPNAME7= <>
##$TPOAL= (0..7)
0.5 0.5 0.5 0.5 0.5 0.5 0.5 0.5 
##$TPOFFS= (0..7)
0 0 0 0 0 0 0 0 
##$TUNHIN= 0
##$TUNHOUT= 0
##$TUNXOUT= 0
##$USERA1= <user>
##$USERA2= <user>
##$USERA3= <user>
##$USERA4= <user>
##$USERA5= <user>
##$V9= 5
##$VALIST= <valist>
##$VCLIST= <CCCCCCCCCCCCCCC>
##$VD= 0
##$VDLIST= <DDDDDDDDDDDDDDD>
##$VPLIST= <PPPPPPPPPPPPPPP>
##$VTLIST= <TTTTTTTTTTTTTTT>
##$WBST= 1024
##$WBSW= 4
##$XGAIN= (0..3)
0 0 0 0 
##$XL= 0
##$YL= 0
##$YMAX_a= 317681
##$YMIN_a= -431675
##$ZGOPTNS= <>
##$ZL1= 120
##$ZL2= 120
##$ZL3= 120
##$ZL4= 120
##$ABSF1= 10
##$ABSF2= 0
##$ABSG= 5
##$ABSL= 3
##$ALPHA= 0
##$AQORDER= 0
##$ASSFAC= 0
##$ASSFACI= 0
##$ASSFACX= 0
##$ASSWID= 0
##$AUNMP= <proc_1d>
##$AZFE= 0.1
##$AZFW= 0.1
##$BCFW= 1
##$BC_mod= 2
##$BYTORDP= 1
##$COROFFS= 0
##$CY= 11.3945322036743
##$DATMOD= 1
##$DC= 2
##$DFILT= <>
##$DTYPP= 0
##$F1P= 15.7292609196834
##$F2P= 12.9074282941183
##$FCOR= 0.5
##$FTSIZE= 0
##$FT_mod= 4
##$GAMMA= 1
##$GB= 0.15
##$INTBC= 1
##$INTSCL= 1
##$ISEN= 128
##$LB= 0.24
##$LEV0= 0
##$LPBIN= 0
##$MAXI= 10000
##$MC2= 0
##$MEAN= 0
##$ME_mod= 0
##$MI= 1.114404
##$NCOEF= 0
##$NC_proc= 0
##$NLEV= 6
##$NOISF1= 3.799351
##$NOISF2= 2.8
##$NSP= 1
##$NTH_PI= 0
##$NZP= 0
##$OFFSET= 15.70392
##$PC= 1
##$PHC0= -24027.71
##$PHC1= 9.45269
##$PH_mod= 1
##$PKNL= yes
##$PPARMOD= 0
##$PSCAL= 0
##$PSIGN= 0
##$REVERSE= no
##$SF= 200.130013532006
##$SI= 16384
##$SIGF1= 3
##$SIGF2= 2
##$SINO= 400
##$SIOLD= 16384
##$SREGLST= <1H.CDCl3>
##$SSB= 0
##$STSI= 0
##$STSR= 0
##$SW_p= 3612.71676300578
##$SYMM= 0
##$S_DEV= 0
##$TDeff= 0
##$TDoff= 0
##$TI= <>
##$TILT= no
##$TM1= 0
##$TM2= 0
##$TOPLEV= 0
##$USERP1= <user>
##$USERP2= <user>
##$USERP3= <user>
##$USERP4= <user>
##$USERP5= <user>
##$WDW= 1
##$XDIM= 8192
##$YMAX_p= 0
##$YMIN_p= 0
$$ End of Bruker specific parameters
$$ ---------------------------------
##NTUPLES= NMR FID
##VAR_NAME=  TIME,          FID/REAL,        FID/IMAG
##SYMBOL=    X,             R,               I
##VAR_TYPE=  INDEPENDENT,   DEPENDENT,       DEPENDENT
##VAR_FORM=  AFFN,          ASDF,            ASDF
##VAR_DIM=   8192,          8192,            8192
##UNITS=     SECONDS,       ARBITRARY UNITS, ARBITRARY UNITS
##FACTOR=    0.0002768,     1,               1
##FIRST=     0,             0,               0
##LAST=      2.2672688,     0,               0
##MIN=       0,             -431675,         0
##MAX=       2.2672688,     317681,          0
$$ Real data points
##PAGE= N=1
##DATA TABLE= (X++(R..R)), XYDATA
0@%%%%%%%%%%%%%%%%Mj2J6j6J6k2L0l2L7m5N2o0P1q3R6j11J26j42J58j79K04k27
38a19K54k86L20l57L96m40M89n39N94o56P24p98Q78r69J069j177J297j433J585
57H32j756J954k182K448k767L156l637M256n087O258q056J1228k6034J51333M6901
72A78847K2747l587m38517j91165M64559K08653l17237O9847L18667k00814l68804
83b56804O0386K06000P4813l2395j14704K2045K09694o1658l04482L3925K58980
94I5800o5263j94634J15358K58125J5749k61434k15313J25001K06746r0671p4004
105h4540K69838J21089l33866k57922J16254J81447P3381r332m6933N3496K6276
116A09188k57033j66473L13564K48755k34471j53214K07339N8447j98789o0175
$$ y = [0, 0, 0, 0, 0, 0, 0, 0, 0, 0, 0, 0, 0, 0, 0, 0, 0, 4, -8, 8, -8, 8, -14, 16, -16, 21, -24, 28, -32, 39, -44, 52, -59, 67, -75, 83, -96, 108, -119, 135, -151, 169, -188, 208, -232, 257, -282, 312, -344, 380, -418, 460, -509, 560, -617, 680, -753, 832, -924, 1030, -1152, 1296, -1471, 1685, -1952, 2304, -2783, 3475, -4581, 6647, -19387, 131946, 178847, 201594, 198007, -240510, -431675, 32884, 241537, -75700, -5853, 312814, 112000, -256804, -196418, 9582, 84395, 52000, -62704, -40659, 169035, 107377, -197105, -163180, 95800, 30537, -164097, -48739, 209386, 225135, -36299, -251612, -126611, 80135, -10536, -84540, 185298, 306387, -27479, -285401, -169147, 12300, 85681, 76349, 29416, 82912, 109188, -147845, -314318, -754, 248001, 13530, -139684, 67655, 126102, -72687, -132862]
126a32862J09055P4949m403q7178l8898J66734J06842k17676j85166J56200J45269
137I2866j18176n3968J86273R8728j94152k22861L9794J98025O4639q3791k62
148G115J05062l4525k14863q5630K00458J86715r3857j44342Q6551J08540j36281
159a5057j58019J01510J76999k6574j33369P379J35134K1785j70286j07093J31605
170c5986J29979q4021p5672J26052R2830j50693j87653M3863J88369N5843j00034
181B877j0476J12959l6450k08701m7044J91871J27142o9889q3353L2859N2601
192F4396p6563j38731M6490K07298K8324j71449j8428J41765k4222j67169j9737
203a28026J36503Q4744m7569p9504L2077R0111p5098j75501M8284K12532J5875
$$ y = [-132862, -23807, 51142, 46739, -40439, -79337, 87397, 194239, -23437, -208603, -52403, 92866, -25310, -79278, 106995, 205723, 11571, -211290, -171496, 26529, 91168, 7377, 7115, 112177, 77652, -137211, -222841, -22383, 164332, 70475, -73867, 12684, 121224, -15057, -173076, -71566, 105433, 78859, -54510, -47131, 88003, 109788, -60498, -167591, -35986, 93993, 9972, -65700, 60352, 153182, 2489, -185164, -141301, 47068, 102911, 2877, -7599, 105360, 68910, -139791, -186835, 5036, 132178, 62289, -21064, 11795, 64396, -12167, -150898, -104408, 102890, 131214, -40235, -58663, 83102, 58880, -108289, -128026, 8477, 93221, 45652, -33852, -1775, 88336, 13238, -162263, -113979, 98553, 114428]
214A14428j39252N661R4949m5495j35678k5493J28876J26509m6075j24153K8888
225a6835R3399r2279j42350Q7567J79742o673j18385j7117O8082l357j08940m9694
237a26840J32107J33516p5796j24814N1480P7251r3936j05850Q0703J49369R045
248A06235j12290m8414P1421K3541j11180m7091J42882J10523r3104j06686N2766
259a1397O8138p0736r5345N1928J39850K4038j12168m6649Q1463J1502j24847
270h4223l7933J46536J09357p4922j03155K1870N0691n7500q1533O5964J55133
281A10285J5285j38978o3441P7137K5152q8226j5608J27419P8434r1934j09896
292g4371L3351Q2748l5571q9238M0099J27516O516j17011l5116Q3459J5494j02886
$$ y = [114428, -24824, -19163, 75786, 30291, -105387, -130880, -2004, 124505, 78430, -45723, -16835, 76564, -15715, -158065, -70498, 109244, 102571, -15814, -32931, 35151, 31794, -77146, -126840, 5267, 138783, 62987, -61827, -10347, 66904, -27032, -132882, -52179, 97190, 106235, -6055, -54469, 16952, 40493, -70687, -117778, 25104, 135627, 42523, -64163, -11397, 56741, -13995, -109340, -57412, 82438, 106476, -5692, -52341, 29122, 40624, -84223, -122156, 24380, 133737, 58815, -44340, -22470, 28221, -29279, -110812, -44848, 110285, 125570, -13408, -76849, 288, 25440, -62786, -78394, 49025, 127459, 35525, -74371, -41020, 41728, 6157, -83081, -42982, 84534, 91050, -25961, -61077, 22382, 37876, -65010]
304f5010l4419J21448J00582o3871j05473J3454N6548m7458p5060O8511J46964
315A16216O823j37492o9606O2780L3541o1378p175J15627O9786r8699j21759K6936
327f4400R1785j3783p0030L7156J05809q667j18850l6232Q7096L5198q2443l6768
339g4129R9477Q2665o5945r9702J8592O4563l4954p0535N5581J29185K930j29218
351b1490o6144N9842L9602m7846o745J02616O2850r7620j24795K3431R7634L9
363B1374n7102L5600Q7231k2511j16355l6433Q4774N3519n9105m2942P6416P0814
375I5280o9862r9910K8429P7342k5389o5820M2694J04744j254j14033o1065N9390
387b9454N0587m0055j5849Q9049N7674r2997j18504K0888R7018J3279m9312K4465
$$ y = [-65010, -99429, 22019, 122601, 58730, -46743, -33289, 23259, -24199, -99259, -30748, 116216, 123039, -14453, -84059, -21279, 12262, -49116, -56291, 59336, 129122, 30423, -91336, -64400, 27385, 13602, -56428, -19272, 86537, 77870, -40980, -77212, 9884, 45082, -37361, -74129, 25348, 108013, 42068, -57634, -39042, 25521, -9433, -79968, -24387, 104798, 107728, -21490, -87634, -27792, 11810, -36036, -42781, 59835, 122685, 25065, -99730, -76299, 21335, 21374, -35728, -128, 87103, 64592, -51763, -88196, -3422, 50097, -9008, -51950, 24466, 95280, 25418, -74492, -46063, 31279, 5890, -59930, -17236, 87508, 86254, -27779, -88844, -29454, 21133, -18922, -34771, 54278, 111952, 18955, -99549, -78661, 18357, 31636, -17676, 6789]
399F789P6606k5915j22174l5601R3935O0015m7407l3506N4428M2147o2500q7105
411h0288K2247R2185K628p5691J6436R9766p377j18388l7294P6054L9548l8073
423h247r779O2202M0281o9612j05756R238J02347K5777n8098J3591P5132k9974
435D7102j21696k7720R6897O3990l7906l4646L9314K7823o5228p5098L5990R5051
447D3873R833o7754o997O7561R72r6445l6377Q7183N8020n5313l6307O1729L6294
460F6272p2252p4998K8071P8680J7966m4624o508N4298l052j00419m3699R4638
472e627P7773m7808m8373M6594K9330p3362o5972M8329Q7087M664n6275j1858
484a5498M3034J402p1259l3972P5899P1067m7981o2945M7962N2902o8810p6015
$$ y = [6789, 83395, 57480, -64694, -100295, -6360, 53655, 6248, -27258, 27170, 69317, 6817, -80288, -58041, 34144, 36772, -38919, -22483, 77283, 69906, -48482, -85776, -9722, 29826, -8247, -18026, 44176, 84457, 14845, -90911, -81673, 20674, 46451, -11647, 1944, 77076, 47102, -74594, -102314, -5417, 58573, 20667, -13979, 25335, 53158, -12070, -87168, -51178, 43873, 53706, -14048, -21045, 46516, 47488, -48957, -85334, 1849, 59869, 4556, -31751, 29978, 66272, -5980, -80978, -52907, 25773, 43739, -885, -7393, 46905, 43853, -56566, -100265, -5627, 72146, 24338, -24035, 22559, 51889, -21473, -87445, -39116, 47971, 52635, -3640, -15498, 27536, 28938, -42321, -76293, -394, 70673, 22692, -40253, 7709, 60611, -8199, -84214]
496h4214M8298P9607p171m3255L499L4166l800o6518m3305O9424Q5873l6616o6298
509c0310M1529M2519p5397o8403N5983Q3920K197m7236j6488K8531K000o5405
521d6560l0787Q2639P2705m7695n9963L1109L3242n0324n7101L6278Q7092J2818
533F3453o8669k0786N1888n589p7889p833Q3658M7181l5226m5031M189K8260k3727
546f121o2870K5536J07632J1219r2416j5488N7425j9415o4134J4304O8970L6294
558F0936k4707n6350r724M5301j2823o8380L2034J06051o137r0365q248M7244
570A4832j2705m4992N344N7875M5065l1576o8758L764N1814k1441n5552L8760
582a7570Q1367j0752p2833j7830M0767J2322m2357j6773O1224N0421m7748o2559
$$ y = [-84214, -35916, 43691, 36520, -6735, -3236, 30930, 27130, -39388, -82693, -13269, 72604, 35988, -30310, 11219, 53738, -21659, -90062, -34079, 49841, 52038, 4802, -11686, 16845, 18845, -46560, -77347, 5292, 77997, 30302, -29661, 1448, 34690, -15634, -72735, -36457, 50635, 63453, -5216, -26002, 25886, 20297, -57592, -65425, 18233, 65414, 30188, -14843, -10654, 17606, -6121, -68991, -43455, 64177, 75396, -17020, -32508, 24917, 5502, -58632, -44328, 24642, 60936, 36229, -20121, -29845, 15456, 2633, -65747, -33713, 72338, 66201, -24164, -32412, 14832, 2127, -42865, -37521, 20354, 65419, 33843, -34915, -31151, 20663, -778, -56330, -17570, 63797, 53045, -19788, -37618, 3149, 15471, -26886, -43659, 17565, 67986, 20238, -42321]
594d2321K4534M2773l1118m3022L3484O5766J604o0445k9158L6977J8558m7440
606b9808j7990P1102N0073n3443o1779J9727L6612k1844l2509L0882O1248j624
618E0647o7074k9969M4795K4196m4620j8106O1319M0265m8499n1369K1923L6125
630A9633k2076l9670K2360O5198R726o2221l2528L8651J4514m9192p380P4446
642C1461M1444n1756n6998N573K7220m570j8991K3643N9893J578q1075m1322N4154
655i746L2359m0688n719O0093J8745n4214m2976J5926L6115j49l2699O925N9209
668D3181R331o9743l0989M6775J5862m2265j398O1984L2488m5375o1408j393L9741
681c209M527k1858K9120N6063j9318q0530k9135M4653L7795j0164j1178L0450
$$ y = [-42321, -17787, 24986, -6132, -49154, -15670, 50096, 51700, -8745, -37903, -926, 17632, -29808, -47798, 23304, 73377, 19934, -41845, -22118, 14494, -7350, -39859, -8977, 52271, 50647, -16427, -46396, -1601, 22595, -22025, -40131, 21188, 61453, 12954, -38415, -16492, 19633, -2443, -42113, -19753, 45445, 55171, -7050, -39578, -927, 13587, -35605, -42985, 31461, 72905, 21149, -35849, -30276, -3056, -7626, -26617, -2974, 56919, 58497, -22578, -63900, -9746, 22613, -18075, -23794, 36299, 55044, 830, -42146, -26220, 9895, 9746, -22953, -16028, 43181, 52512, -17231, -48220, -1445, 14417, -27848, -29246, 32738, 65226, 19851, -41557, -42950, -3209, 1318, -20540, 8580, 64643, 45325, -35205, -64340, -19687, 18108, 7944, -3234, 27216]
693B7216K1706n2092o2677K9412O6921p836m0710J8013L6704j7334m4831j1222
705c6730L1444K7289k1668k7514L9021M7855m3743o8848J8486M8467j2561k0593
717a9095L4318L7364k2055o0522l0183L6144M8826p054k1940K8717J9697n7004
729a2787n4230L5193O1746Q0l3648P48K6536p929m5710j1920M7271K9057l4047
742C60k4500L5566K9327l4753m6140J0306M0634L303k5758J2325M4015j0582o9327
755c5224k5519M9388L7921j4046q974K2554L680m5507m3213K2877O2703J5417
767D2057l8512j1163K8098r975m9943k503N4941K6009l1570k4579K1223K1933
779B6016k5134l8508J2257M4667L064l2857N668L8538r182n7542j8546M4602L6721
$$ y = [27216, 48922, -3170, -65847, -36435, 30486, 22650, -18060, -47, 36657, 19323, -25508, -36730, -5286, 22003, 335, -27179, 11842, 59697, 15954, -52894, -34408, 14059, 1498, -19095, 15223, 52587, 30532, -29990, -60173, -24029, 24797, 17743, -4197, 24520, 44217, -12787, -67017, -31824, 29922, 30002, -3646, -2898, 23638, 15709, -30001, -41921, 5350, 34407, 360, -24140, 11426, 40753, 6000, -40140, -29834, 10800, 14103, -11655, 670, 44685, 34103, -35224, -60743, -11355, 26566, 12520, 3546, 26100, 29780, -15727, -58940, -36063, 26640, 42057, 3545, -7618, 20480, 10505, -39438, -41941, 13000, 39009, 7439, -17140, 4083, 26016, 882, -37626, -25369, 19298, 22362, -10495, -4827, 33711, 24529, -33013, -51559, -6957, 29764]
792B9764j2521j7057J5883Q660m0348m1378K6825O1820J0664l6998j1798J8563
804A2079j0129l9014p77N1023L1838k8774l4535J3551K2447k3102l1931K1016
816a6308M4564j993l4943j352K9492l451m2966j4529M0918L5005j6845k4762J3714
829F544J3235l3473l5371K6144N4925P396l5336j3960J5719n329l2880j791M8247
842A4070L2724k7904l7295R026K0213j9493k5283K3709M3249k282l7512r767K3682
855G137K086l2356r320M0107L1205k2616l0830J0546J6761k3139k7403K3750M7083
868C3011L257l6861j5387J7542O43k8127k697M3147K9254k6454l5848O051J9104
881F635j4907k2129K2355M3068j301m0038j4633K0795L994k4710k379L8468K5620
$$ y = [29764, 17243, 186, 16069, 24729, -15619, -56997, -30172, 31648, 42312, 5314, -6484, 12079, 1950, -37064, -37841, 13182, 45020, 16246, -18289, -4738, 17709, -5393, -37324, -16308, 28256, 26263, -8680, -10032, 19460, 16009, -26957, -41486, -568, 34437, 17592, -7170, 6544, 19779, -13694, -49065, -22921, 32004, 39400, 4064, -9896, 5823, 494, -32386, -34177, 14070, 46794, 18890, -18405, -9379, 10834, -8659, -33942, -10233, 33016, 30734, -6778, -16545, 7137, 9223, -23133, -32453, 7654, 38859, 16243, -14587, -4041, 12720, -10419, -37822, -14072, 33011, 36268, -593, -15980, 1562, 2205, -25922, -28619, 14528, 43782, 17328, -18520, -12469, 6635, -8272, -30401, -8046, 35022, 33721, -6317, -20950, -155, 3839, -20871, -23250, 15218, 40838]
894D0838k5584l5365N168K0541j1428k0831K1009M0871l065m0820j5402K1330
906b738P508k1278l219L5510K2916k6818l3803P215K0899j0349j9252J7944L7356
919C1891Q2l8297j8639K0070R316k1670j926L8906K1351l0438l4405M626J9179
932D6k568j1818J4502L2091k783m3357j8848K8560J5595k1103l532L0749J2864
945C0398k6647k6096O780K1283k036k0225Q607L6299J521m0177j5225K2800O148
958C430j7947K848L0499J6765k3399l6736k519K6749M266j5838J5398L2101j2877
971B2740m3640j0676K4923J5665p668n816J5839J4534k1977l2593J0398L1111
983A2840n805k2340J2462K7607m269k9154j4020J4122J3700j0838o678K8858K2027
$$ y = [40838, 15254, -20111, -14943, 5598, -5830, -26661, -5652, 35219, 32154, -8666, -24068, -2738, 4770, -16508, -19727, 15783, 38699, 11881, -21922, -14707, 6192, -4157, -23409, -5465, 31891, 31973, -6324, -24963, -4893, 4423, -17247, -19173, 19733, 41084, 10646, -23759, -19133, 46, -2522, -14340, 162, 32253, 29470, -13887, -32735, -4175, 11420, -9683, -13215, 17534, 30398, 3751, -22345, -15565, 5718, 3682, -16543, -7936, 28363, 29884, -10293, -25518, -2718, 3430, -14517, -11669, 18830, 35595, 12196, -24540, -27059, -310, 3956, -11882, 3516, 35617, 22740, -20900, -31576, -6653, 9012, 1344, -4472, 11367, 25901, 3924, -28669, -18271, 12840, 7035, -15305, -2843, 24764, 20495, -8659, -22679, -8557, 5143, -5695, -12373, 16485, 38512]
996C8512l0466l8979O155K3798K493k896J3460J6205r739l8005k1356K8168L2220
1009A9570j0173j2763K0029N678l3717k1137J9257K4186J770j2230l557J4718
1021A1631M824k7070j8034K4879K0316j8897r198K7517J2857k8956k7696O276
1033b1551K1450Q568l923M028J2915q448l5712j6385K9953L1861o062j5654P838
1046H878M781k6071k2225K0857L4528N12k1751l779J1427l439j8326m271K0120
1059A241J6521j1502j6896J1905J9223j6555l0555P697K9806R92j5664Q611J6013
1072B0837j4215k8857m922K1551K1953J173j3671k816P383j4127k5609J3853M0577
1085B3110K075k9428k149J5977r416j8790N701J8286Q593n580j3011L08J5788
$$ y = [38512, 8046, -30933, -24778, -980, 1513, -1383, 12077, 28282, 18543, -19462, -40818, -12650, 19570, 9397, -3366, 16663, 22341, -11376, -32513, -13256, 10930, 12700, 470, -3087, 11631, 16455, -10615, -28649, -3770, 16546, -2351, -11549, 15968, 28825, -131, -27827, -21551, -101, 8467, 4544, 8572, 21487, 13039, -22673, -39058, -9105, 22756, 16694, 1040, 8878, 13659, -12412, -34637, -13780, 20748, 21260, -491, -4270, 7157, 3718, -14608, -18879, 1241, 17762, 6260, -10636, 1269, 20492, 3937, -26618, -18921, 10885, 11877, -3787, 4824, 20837, 6622, -22235, -27157, -5606, 16347, 17520, 3849, 1033, 8416, -5711, -31320, -17467, 23110, 25185, -4243, -6392, 9585, 169, -18621, -12920, 5366, 13959, 8379, -4632, -4324, 11464]
1098A1464n254k8280J714L2960M919k1758L323J8570j1482k8359l063K3222J9662
1111A7638j595j2500j864L628j4014j9021J2882L4116P371k3363j1819J0708l41
1124A826k0192j611K8784J5781j7924j4806Q447N257j1904j0121P106J9120R361
1137A9124j4288j2759J2086M192k6501r130L2906K0692j6833j2103O031m117j4104
1150a4804l531J2008K1744J0741j8682k1176P545Q141j6490l088K9588J6004k0450
1163G550j9052N360P500p097p609R723J9149K481j8305j0915R735N066j4001n888
1177a6303K1324J9119j2748k1365L217J0681j0475j1604J5735K2767k229j9069
1189i50r289M594L705n941k319J7165J7003j3362k4565K535J5031o373j0986J3601
$$ y = [11464, 6210, -22070, -20356, 12604, 17523, -4235, -912, 17658, 6176, -22183, -25246, -2024, 17638, 16043, 3543, 1679, 5307, -8707, -27728, -14846, 19270, 26641, 3278, -8541, 2167, 1826, -18366, -19977, 8807, 24588, 6664, -8142, 305, 5562, -6342, -16463, -9357, 9763, 19124, 4836, -7923, 4163, 8355, -18146, -27276, 5630, 26322, 9489, -2614, 3417, -700, -14804, -18335, -6327, 15417, 26158, 7476, -13700, -6155, 1986, -14504, -17592, 11996, 28000, 7550, -11502, -6142, 1358, -5739, -13348, -3625, 15524, 18005, -300, -11215, -1480, 3586, -10415, -16303, 5021, 24140, 11392, -9973, -6756, 3925, -6550, -18154, -2419, 20348, 18119, -950, -10239, -5645, -1940, -7881, -10200, 6965, 23968, 10606, -13959, -11424, 3607, -2766, -13752, -151]
1203a51J9343m466j8371p349O440M836o110l186J4795J5273j1167k2083P00J3655
1217B159l614j0631J0306K0237j810k0575r461Q773N663o993j580J5343J2223
1230B0040j1966j9974k85J2667p09r334Q028J9346q75k1707j0582R910O621o595
1244e415n3J5555R689j3563j9616m47J2799K440o491O030J5733j976k1724j0683
1258a7722J2010R753o012k067J2924P851j3011j7197J077J2736K434p131M123
1271b32J5101m31k0385j1027J0857R437n080j343J2694P478j3524j8571J35J4380
1285e11N012n900L627J2448l458k0529r018J2603J1659l163l698P991O099j1802
1299A360j6935K323J5969L623p968K433J1376k732j7529q282J0372J1437k148
$$ y = [-151, 19192, 14726, -3645, -10994, -4554, 282, -5828, -9014, 5781, 21054, 9887, -12196, -11496, 2159, -1455, -12086, -1780, 18457, 16647, -3928, -13389, -4616, 1047, -5946, -7526, 7817, 20040, 8074, -11900, -12185, 482, -227, -9561, -1533, 17813, 16938, -4769, -15351, -5441, 1180, -5415, -5468, 10087, 19776, 6213, -13403, -13850, -1051, 1389, -5102, 928, 16661, 14685, -7039, -17722, -5712, 4041, -1971, -4038, 8886, 16737, 3726, -13471, -12394, 342, 2776, -4355, -232, 14869, 14438, -5947, -16974, -6117, 3320, -1760, -3103, 9591, 17069, 3545, -15026, -14891, -511, 4501, -1399, 2228, 14676, 11218, -9311, -18329, -5726, 5933, 2770, -928, 7063, 13162, 1360, -15575, -13252, 2717, 6340, -1628, 805, 12181, 9449, -8080, -16362, -5990, 5447, 3299]
1312C299m378P860P107j2409j8069K538J6254M685n750J749P970l815j6567q246
1326a7772J2110J4286k367o982N726N578j1937j4570M625J5312M467o645j325
1339E06P180r05j5049q441J2346J3409l599o332N869M403j0880j3756L082J5435
1353C268O945o703k934O596j966j5697o338J3917J3330k786o994K166L193q367
1367b370j2307L610J6799N914q992l712O245j846j2870m661J1985J2610k137q767
1381d99J275N231p926j2735M930J6565M172q170l250L866j640j0309n277J1286
1395b481J4375k468j0842J317N128q594j0638O360J5012M558p359n861K406M63
1409A376r853n128J3174J3956m573j0719N47L204o042p571M845J4469N520j0188
$$ y = [3299, -1079, 6781, 13888, 1479, -16590, -14052, 2202, 6887, 1137, 2886, 10856, 7041, -9526, -17772, -5662, 8624, 6257, -725, 5001, 10579, -1358, -15928, -11303, 4009, 8476, 1831, 506, 7686, 6781, -8268, -16709, -4363, 9046, 5447, -885, 4984, 9387, -1493, -15249, -12167, 3268, 10213, 3510, 576, 7172, 5206, -10491, -16829, -2912, 10418, 7632, 638, 2804, 5997, -2370, -14677, -11067, 5732, 11646, 2654, -1058, 5187, 3341, -9529, -14190, -2205, 10405, 8268, -499, 776, 6007, -1919, -14654, -9724, 6841, 11013, 2843, -407, 3459, 1819, -8490, -13767, -2481, 11894, 9426, -1416, -99, 5029, -3565, -14203, -7843, 7169, 11727, 4368, -1493, 913, 1376, -8477, -13605, -431, 13525, 8952, -1767, -1220, 1984, -4058, -11629, -6784, 7685, 13205, 3017]
1423C017p762N269J242j0113k326J2494R276l772p954k111L453j573r170J080
1437h950J6613O500j2595n914O512k033j0231O54J1365Q980q33r528o014M178
1451a296l96r013M054J7741L459j3681o541M061o5n265K26R278R381l408j1853
1466c318k686O180j550o975L854J2670L910r347q404K711L621o575l958J2507
1480B640J1804o652j1178q43J527k444j107M583R869N747r833j3910K693Q117
1494A013n197l083J3465Q833j0222j1073j4L344O16o50K412P772M055r692j1161
1509i582L618P550l787l764R794R585p238j2794p55O038n98k484N273Q171M00
1524I427q634r330M50P968J250m761O229J0616p276j5687J058R444r75l090N459
$$ y = [3017, -4745, 524, 1766, -8347, -10673, 1821, 11097, 7325, -629, -2740, 713, -860, -10030, -8950, 7663, 14163, 1568, -4346, 2166, 133, -10098, -9444, 1921, 10901, 10068, 540, -5474, -1296, -1692, -10705, -6651, 11090, 14549, 868, -5673, -1612, -1677, -6942, -6716, 2562, 11943, 8535, -3318, -6004, 176, -1374, -8349, -4495, 8175, 12085, 2738, -5666, -2955, 666, -5909, -9867, 2640, 14444, 7792, -3386, -4229, -2702, -5146, -6253, -1670, 8199, 13946, 4113, -9797, -7104, 1013, -4184, -7267, 6198, 15031, 4809, -6264, -6278, -2934, -2318, -2968, -556, 7216, 11271, 1579, -9582, -5964, 1586, -2201, -5965, 3829, 13414, 6176, -6618, -7373, -1335, -1933, -4417, 856, 9027, 9427, 793, -8537, -8087, -119, 1131, -3630, 2599, 13215, 5939, -9748, -8690, 754, -221, -3311, 2148]
1539B148N806j114p097p822Q08Q308R83n272N259R330n950j3527p99Q287J999
1554A347l514K432P869M97j0598p519M167N894k52o39L876M478k672j1100n642
1569a1376R164O956o415k94J1694l34j4210m634N646K670J556K438N83K840k93
1584E991j2537p028J2107P923p397M76J0229l102j2539l337M429M954L390j231
1598B328n11M894k297j2664k895J0798M780l838J063N313r80q879q140L238J0463
1613B673K294l990L362M049q446j0504J012Q226O530R15l563j05J633q106r285
1628a3305Q339J3041k331o184L316J291o507m652Q04N494O824j351o282L098M495
1643F090r179q643P569R499j343k292K165O8m856p111j944R373R757k893o064
$$ y = [2148, 7954, 6840, -257, -8079, -7271, 1037, 2020, -3252, 2007, 11337, 5387, -8140, -8939, -652, 1347, -2167, 265, 8134, 8631, -1967, -9486, -5319, 575, 323, -316, 3560, 8038, 5366, -5734, -11376, -2212, 4744, -1671, -1965, 9729, 9395, -4815, -9449, -3803, -1133, 423, 2861, 3444, 6284, 5991, -6546, -13574, -1467, 6456, -941, -465, 9764, 6662, -5877, -9214, -4785, 169, 3559, 2328, 1817, 6711, 4414, -8250, -11145, -347, 4433, 595, 1658, 6971, 5991, -2888, -11028, -7790, 2673, 4967, 977, 4339, 8388, -58, -10562, -9550, -1324, 5206, 6121, 2558, 2453, 4086, -4020, -13305, -4966, 8075, 5744, -440, 2876, 4167, -2340, -6992, -6188, -694, 6130, 4779, -1503, 1595, 6090, -3089, -11732, -4163, 5336, 3993, 1701, 3866, 3934, -922, -8033, -9977, -604, 9153, 6260, 196]
1658A96J910l18q835l591Q651R455L12o010l556J752o12n901K68R901M615o400
1674A837m493L379J822m944m571L314P903J568n268r23M148l036r019l61R964
1689A320O564k438m311o78n74n208m142O635J1598Q35q775l886K282j641m235
1704f654K559Q642M054n336o646P88L728k586m783M020Q370j28o636j118L750
1719B024j909o732j29Q559O302k707n649j167O61l827l563O172J1079Q11r338
1734E87n184K201r7l181K885Q711L465o250p706k47M205k59l148L509P570r29
1750F132q142k406M375M73m790j96P262N395l738o893n13K364k493k872N690R047
1766H695p5q653n632J706K252j692J122Q013M298p510r127J006N000r9j330L707
$$ y = [196, 2106, 1788, -7047, -10638, -1987, 7468, 7780, 1770, -1786, -34, -646, -6547, -6279, 3622, 8237, 1837, -2656, 723, 2545, -2399, -6970, -3656, 4247, 5815, 547, -376, 3772, 736, -8283, -8644, 1320, 7884, 5446, 1135, 457, -117, -5325, -9467, -2832, 8766, 9601, 826, -3060, -778, -2419, -6654, -4095, 4547, 8601, 3265, -3381, -2593, 1135, -1451, -6234, -2214, 6156, 6028, -608, -1726, 2024, 115, -6617, -6746, 1813, 8115, 5408, -241, -1408, -747, -4574, -8137, -1965, 9114, 9925, 587, -4597, -2396, -2493, -5674, -2789, 5922, 9387, 3137, -4569, -4816, -611, -870, -4018, -509, 7061, 6132, -2010, -4416, -41, 432, -4358, -4554, 2708, 8103, 4365, -2528, -3041, -677, -3170, -6042, -352, 8695, 8620, -33, -5665, -3959, -1707, -3399, -2277, 5736, 10034, 2524, -6603, -5597, -597, -696, -2026, 1681]
1782A681M871j440p321m052M167L977l432j923O753M670n817o788J124L128j238
1797a640j802L789O683L95q392o002L227L688k064O48P214L010p124q033O9N243
1813a091J950j648K223N317j514r037l729N363L946k099o76M553K730m774p119
1828e605K49N698R13l293K494O258j337q423l792L871L676p31l60M409K972n641
1844A358q551O04O844J808k470K214M389k328p973l494M797N264q47j886L548
1859C277K651n666p280J404O439J709k622J184M119j310p720l776N127N326j295
1874A567j622L376J947n501o743J107O737K775k854j79M013j365p955l007N967
1889a737N285j339j867K212J646m705o372J125P363K781l484m09L622j563p366
$$ y = [1681, 6552, 5112, -2209, -6261, -2094, 1883, -1549, -3472, 3281, 7951, 2134, -4654, -3530, -402, -1640, -3442, 347, 7030, 7425, -967, -6969, -3742, -54, -2118, -1470, 5744, 8754, 1630, -6403, -6334, -1091, 859, -789, 1434, 6751, 5237, -3800, -7529, -2166, 1780, -319, -995, 3558, 6288, 1514, -5605, -5356, 342, 1255, -2038, 456, 6714, 5377, -3046, -6838, -2967, 709, -22, -382, 4027, 6999, 1358, -7193, -6589, 255, 2063, -407, 1807, 6196, 3868, -4105, -7599, -2802, 2462, 1615, -271, 3277, 5928, 262, -7018, -5614, 825, 2534, -88, 1096, 5215, 3905, -3815, -7591, -2464, 2862, 1567, -55, 3321, 5268, -233, -6976, -5869, 868, 3643, 789, 610, 4623, 3258, -4697, -7704, -1737, 3548, 2209, 342, 2554, 4200, -505, -6877, -5752, 1611, 4392, 908, 499, 4121, 2558, -4808]
1904d808k594N734N617q68k796J552J919m765o163J934P408K465l243j053K524
1919B863q82o263l147N895O544j522l892J827J882n062n276K678O732K533k855
1934B055k112J606N0n752l272O364P099k096m552J437J583m405m558K537O921
1949B905K668l508k917J917J05n486k582O380O564j754m718K41J836l469m652
1964f470K648P659K418m521l049J593j64m215j512N607O225j468n838p15K935
1979A133k240m782K693P724J585n072k815J668J50l601j391N149O056j425o003
1994a171j140K788j763m101K554P734J751n663l875J836R08k999r44N242N265
2009F422k259o146j153L357m78l942J648O975J609n844l315K542R28l193j188
$$ y = [-4808, -7402, -1668, 3949, 3081, 285, 1837, 3756, -1009, -7172, -5238, 2170, 4635, 1392, 339, 2863, 1981, -4282, -7429, -1534, 5010, 3488, -404, 1423, 3305, -1757, -7033, -4355, 2377, 4910, 2055, -57, 1549, 1599, -4153, -7425, -1061, 6038, 3942, -610, 827, 2410, -1995, -6553, -4016, 2905, 5573, 2065, -852, 1065, 1170, -4316, -6898, -518, 6046, 4292, -426, -185, 1651, -1818, -6470, -3822, 3837, 6255, 1734, -1315, 278, 114, -4101, -5613, -6, 6219, 4751, -1087, -1802, 1133, -1107, -5889, -3196, 4528, 6113, 1041, -1774, -106, 44, -3557, -4948, 201, 6257, 4832, -1171, -2311, 477, -1286, -5387, -2833, 4901, 6652, 989, -2886, -1050, -142, -3141, -4085, 1157, 6422, 4163, -1983, -3136, 221, -257, -4199, -2551, 4424, 6033, 189, -3126, -584, 344, -2849, -4037]
2024d037M739N259j476n982j758L131n03l864K233P447J467o222m208J674J783
2039c17j763q23M500M834k619p065r76M375J41l417J709N749R74n264l782K096
2055a648K551k388k319M573N488k254o244j190K828l13k423J814O405K139o311
2070G08n846J901L331j681o37N307L647l981o497j417L780K625j898j97M931J454
2086E530o909m660M268L654k578j386L896L007k222n127j895L333K212k610j57
2101a644O216J964p169n489L032L626j041l29L868K788l658o840j391N058L392
2116B383j883m39L673L65o159m303L923N292j141l194K427L620l131n799L10M485
2132D29J248k272PL556J411m808n333K166N613m38l093L217M141m369p056M69
$$ y = [-4037, 702, 5961, 4485, -1497, -3255, -124, -627, -4491, -2258, 5189, 6656, 434, -3774, -2100, -317, -2080, -2903, 1597, 6431, 3812, -3253, -4229, 146, 287, -3130, -1421, 4328, 5302, 38, -3744, -1648, 903, -1485, -3804, 769, 6257, 4003, -2241, -3431, -603, -916, -3339, -1525, 4880, 7019, 708, -5138, -3237, 94, -1587, -2224, 3083, 6730, 2749, -3748, -5165, -1385, 1240, -658, -855, 4076, 5530, -1379, -6039, -1771, 1883, -695, -2081, 1815, 4822, 2600, -2527, -4422, -1089, 1123, -1487, -1644, 4572, 6536, -633, -6122, -3090, 536, -505, -834, 3034, 5822, 2164, -4676, -6067, -1009, 2383, 500, 61, 3734, 4099, -2060, -6363, -2440, 2852, 1711, -1483, 944, 4564, 1433, -4366, -4056, 429, 1677, -595, -588, 2968, 4379, -429, -5762, -3596, 2017, 1579, -1514, 1703, 5844, 1475, -5581, -5112]
2148e112N227K096j283j54K044J45m706m485L085O362k40m206J544M032l225o221
2164e097P71N552J402k693k27K951N74m492m213K225N450M20l281J344L831k971
2180A546p240O1O539K684k643o96K546m16n060l192L484N578L14l450n7K802j974
2197H26n864j49O554L136l671j764L157L25n309l014L995M984M3k871k31K086
2213B233j600n380o40O722L988l929k685K934M05n245k471M508N008l30l321p45
2229e48K053j167m805l27O572L717l915l123K385P56m538k559M385N635m49m229
2245a57j089K164j208m168O63O322L086l981l689J580J747l231k784L944N651
2260D850j202m926k23K963j308m223M91N478K989k992l458J201J654l533l196
$$ y = [-5112, 115, 2211, 928, 774, 2818, 2963, -1743, -6228, -3143, 3219, 2979, -1227, 317, 4349, 1124, -5097, -4326, 1226, 2628, -65, -292, 2659, 3233, -1259, -5472, -3247, 2203, 2623, -658, 686, 4517, 1546, -5694, -5633, 906, 3590, 947, 251, 2797, 2381, -2679, -5871, -2387, 3191, 3505, 55, -2, 2800, 826, -5038, -5187, 1367, 4503, 832, -932, 2225, 2550, -2759, -5773, -1778, 3206, 3249, 378, 147, 2233, 633, -4747, -5387, 1335, 5323, 1394, -1291, 1643, 2048, -3197, -5668, -1160, 3848, 3518, 197, -548, 1505, 338, -4467, -4794, 1778, 5495, 1580, -1543, 842, 1598, -2940, -5499, -1114, 4521, 4072, -157, -1246, 918, -290, -4458, -3795, 2527, 5613, 1632, -2057, -477, 1270, -1961, -4745, -801, 4850, 3648, -1278, -1501, 1462, 154, -4069, -3578, 1900, 4889, 1897, -1561, -360, 1294, -2239, -5435]
2275e435M427O568r58n339j063K048j184l093J426N855K756m340m828J124K722
2290F86k001k294L968M871j918n462n86L429R8l574j54N083K698l689l606J773
2306f78J930l100k731L872N825n09n329k000K238j43l027J285O380K385n120n140
2322c862J168K765j072j311L482M253k187o217j131M130J450l107k77M521J794
2337D399m243l556K121K827k168k827L041N155p54n404j800K673M66k770R33N758
2353C851K267n206n319J109L297l90j221L309L830k678o402j378M462K384k358
2368d43n57L802J196m629l720K627L677j453k907K197M375j068n266j451L393
2383b27J136k739K75N018J965n059n082J444L679L5j464K637L467k616o525j336
$$ y = [-5435, -1008, 5560, 4602, -737, -1800, 248, -936, -4029, -2603, 3252, 6008, 1668, -3160, -2036, 686, -1315, -3609, 359, 5230, 3312, -2150, -2736, 693, 791, -2783, -2937, 2146, 4844, 1155, -2451, -678, 1252, -1848, -4579, -707, 5118, 4609, -720, -2720, -482, -625, -3652, -2367, 4013, 6398, 1278, -3862, -2694, 71, -1001, -2312, 1170, 5423, 3236, -2981, -4112, 18, 1468, -1639, -1916, 2605, 4399, 156, -3400, -1279, 1548, -620, -3447, -406, 4749, 3995, -1409, -3209, -536, -70, -2840, -1907, 3851, 6118, 912, -4407, -3298, -1, -391, -1612, 1697, 5527, 2849, -3553, -4931, -469, 1915, -443, -1000, 2802, 3998, -631, -4351, -1724, 1953, 500, -2407, -210, 4165, 3097, -2169, -3620, -227, 909, -1830, -1555, 3463, 5428, 369, -4713, -3269, 410, 445, -1019, 1618, 5085, 2469, -4056, -5392]
2399e392M826K938j967p59L063P09m755l737K998M549p47l177J377L530j339m985
2415b868r10L873J775k625o84M051J943m684m773J806M289p3j789J973K992k437
2431A859n969j236M877L479j786j404K393P43m834l680L374N150m24l226N68K753
2447B637j536m566m82M603K383k683j700K973J775m081m147K318M699k45k619
2462f71J188K882k087n369p89M841L335j831j863J907Q78m227l647L266N652j78
2478C287l737J06K466j687m283J66M896K591k773k368J907J691l355l513K671
2493a935N036k84l557K40K917j546m712k20N049K797k390k157J497R59l288l083
2509d677K669N458K27m047p75K790j129m548K89N579K357l083k300J404R53k651
$$ y = [-5392, -566, 2372, 405, -354, 2709, 3418, -1337, -5074, -2076, 2473, 1726, -1451, -74, 3456, 2117, -2868, -3778, 95, 1870, -755, -1439, 2612, 4555, -129, -4902, -3096, 1193, 1120, -669, 1304, 4296, 1859, -4110, -5346, -469, 3010, 1224, -180, 2213, 2956, -1878, -5558, -2184, 2966, 2542, -684, -116, 2637, 1101, -3465, -3947, 656, 3039, 356, -1344, 1629, 3404, -677, -4824, -2506, 2193, 1948, -671, 517, 3399, 1312, -4057, -4846, -5, 3330, 1499, -364, 1543, 2421, -1806, -5453, -2187, 3465, 3287, -450, -344, 2122, 435, -3848, -3682, 1214, 3805, 1032, -1336, 571, 2262, -1093, -4606, -1935, 3101, 2817, -740, -500, 2417, 871, -3841, -4061, 988, 3785, 1395, -762, 735, 1694, -1594, -4677, -2008, 3450, 3677, -370, -1145, 1645, 516, -4032, -3743, 1836, 4193, 1110, -1190, 214, 1167, -1484]
2525a484k519K454N017K90m316j112L053o29m514J40N644K436l327k647J463R72
2541I21k561k163K757M823k1m346j399K671j18l831r7N372K764l610l279J744
2557c73J443k814k040L191M511m29l879j592J965L19l134l26N289L213m057m126
2573b839J788K038k653j700L644L956j219m074j413K116R41k520n68M515K944
2588D956m011m142K066K513k530k176L374M082j156m074j298K080N53k320j85
2603b268M510K804l838m514J279K877j588j995L210M126j587n047j208K913J065
2618G39k068n8L652J802l459l965J316L342j074k747K230M386j177m978q80L128
2634A89M92k444L14L881J819l354m133N60L220l42k247K353M352j700n760j100
$$ y = [-1484, -4003, -1549, 3468, 3758, -558, -1670, 1383, 754, -3760, -3620, 2024, 4460, 1133, -1514, -51, 921, -1640, -3803, -1046, 3777, 3756, -590, -1989, 682, 564, -3267, -3364, 2008, 4772, 1162, -2117, -373, 1070, -1744, -3784, -593, 3918, 3489, -390, -1982, -17, 302, -2832, -3158, 2131, 5344, 1287, -2839, -1051, 987, -1666, -3366, 278, 4234, 3015, -1059, -2472, -356, 585, -1935, -2503, 2012, 4956, 945, -3197, -1131, 1382, -1148, -3324, 50, 4132, 2976, -1098, -2396, -316, 237, -2083, -2268, 2242, 5046, 1208, -3306, -2027, 850, -738, -2733, 477, 4603, 3016, -2031, -3239, -326, 739, -1329, -1387, 2265, 4067, 608, -3357, -2041, 1301, 227, -2520, -290, 4096, 2919, -2059, -2939, 189, 681, -1763, -1449, 2432, 4251, 897, -3236, -2676, 544, 202, -2045, 308, 4660, 2960, -2800, -3900]
2650c900L669J228j922L51L150R80l596l790J363L822k39k779J590L845j399n020
2666b647o56L545J030k410j90L485J629l421l941J120L296l27j962K031L596j569
2682B609n393j538L661K302j669m99L058R65m372l807K345M037j17k131Q76K463
2698B790j265m429q26M014K280k585j396L139J548l809l348K016L268m26j854
2713h83J175K883j040m876j657L929K796j923r16K788P91m366l374K335M286L73
2729B321k314J08K086j259m260n60M574K599k637j845K246J166l185k857K171
2744a646L846k23k748M46K807r75m354r79L959K548j947j396K195R31l711l351
2760d598K421M574L36k741j06J990j387m043n3M620K610k315k402J454J222k835
$$ y = [-3900, -231, 997, -925, -574, 2576, 3556, -40, -3830, -2467, 1355, 1116, -1663, -73, 3772, 2373, -2647, -3303, 242, 1272, -1138, -1328, 2157, 3786, 365, -3576, -2456, 840, 513, -1449, 582, 4178, 2609, -2784, -4322, -661, 1641, -28, -527, 2531, 3496, -876, -4683, -2338, 1699, 1582, -549, 327, 2790, 1525, -2904, -3730, 284, 2564, -21, -1417, 1722, 3270, -539, -3887, -1871, 1397, 971, -883, 292, 3175, 2135, -2741, -4398, -469, 2327, 404, -512, 2276, 3067, -1299, -4673, -2338, 1948, 2321, 7, 115, 2201, 942, -3318, -3878, 696, 3295, 658, -1187, 1059, 2225, -960, -3817, -1646, 2200, 1977, -771, -325, 2482, 1507, -2847, -3826, 133, 2681, 734, -662, 1533, 2464, -1247, -4598, -2177, 2397, 2733, -8, -114, 1876, 489, -3554, -3607, 1013, 3623, 1308, -1094, 360, 1582, -1253]
2776a253k556K575M171m41l274mK406p50l742l09L934K346k074k032J617J293
2792A907l079l023K439M620N3l100l69J845j279l350R1M446K735k380k825R12
2808c57J429k375k396K884M277n61l654n87K208m82k927j65L978K378k530k776
2824a656J413J551k389k472K581M153k54l384q98J897k72k990k5M423K429k806
2840A301l099J093J387j912j865K647M023n31l846j267K190K25k620K3M159K062
2856C970l080k906J072J665j538j892K301L872m83l892j278K301L05k542O2M061
2872A998J915l024l110R44J852j215j807K274L777o47m135j303K302O20k276J39
2888a696L773J849l156l419J036K125j019j563K253L424q79m204j325K384J040
$$ y = [-1253, -3809, -1234, 2937, 2496, -778, -782, 1624, 874, -2868, -3177, 757, 3103, 1029, -1003, 614, 1907, -1172, -4195, -1756, 2864, 2917, -183, -552, 1293, 14, -3336, -3245, 1201, 3936, 1556, -1269, -357, 1072, -1303, -3699, -815, 3462, 2901, -753, -1340, 868, 386, -2541, -2706, 1272, 3650, 1120, -1656, -243, 1308, -1081, -3553, -972, 3181, 2927, -457, -1355, 542, 270, -2720, -2745, 1678, 4107, 1301, -1798, -705, 682, -1230, -3095, -448, 3575, 3044, -802, -2069, 121, 346, -2274, -2251, 1908, 3970, 890, -2016, -944, 721, -817, -2709, -408, 3464, 2981, -911, -2189, 112, 417, -2125, -2063, 1998, 3913, 889, -2221, -1277, 575, -640, -2447, -173, 3604, 2957, -1178, -2481, -179, 441, -1835, -1696, 2077, 3926, 770, -2649, -1613, 512, -507, -2070, 183, 3607, 2728, -1476, -2801, -417, 623]
2903F23j880p2L459J714l483l255J220K429q79j588J862L107q38m016j217K546
2919b68J107j973k41L384J694l282l331J024K457o27j434J910L105j173m312j305
2935c265K681J514j481j50K859J145l440l325J388L118l02j819J451K738j403
2950A709l889p82K812J417j637n81K557J588l046l403J246K950l62j758J716K768
2966C305j397m160j113K703J987j170m88K220J001l483l294J692L551J7j835Q04
2982C40K149j333l735n80L285J835j713r98K053J160k821k863J326L132n9j897
2998g19Q98K537j112m133r73L293J913j338m74J778N36l064k934J595L735N98
3014B136k149R8J976j281l775k57L801J954j868j235J487P37k426k344J595L280
$$ y = [623, -1257, -1329, 2130, 3844, 361, -2894, -1674, 755, -124, -1712, 150, 3257, 2419, -1597, -2814, -268, 839, -1134, -1375, 2009, 3703, 421, -2910, -1886, 571, -56, -1490, 420, 3525, 2352, -1960, -3265, -584, 930, -551, -701, 2158, 3303, -137, -3462, -2074, 1044, 742, -1077, 374, 3112, 1709, -2180, -2962, -150, 1267, -370, -951, 1606, 3194, 148, -3255, -2009, 941, 579, -1179, 537, 3305, 1908, -2252, -3365, -662, 1325, 155, -333, 1887, 2888, -595, -3889, -2197, 1354, 1371, -464, 340, 2489, 1156, -2579, -3159, 126, 1961, 248, -750, 1303, 2463, -358, -3221, -1895, 1237, 1178, -719, 179, 2716, 1604, -2529, -3502, -209, 1704, 366, -108, 1670, 2206, -858, -3792, -2197, 1538, 2136, -13, 85, 2061, 780, -2995, -3252, 549, 2503, 635, -600, 887, 1624, -802, -3146, -1551, 1729]
3030A729P9k239K52K173q18l762o97L447K128j499j156J614N61l026k509J928
3046a795L629M97k042l43J369r98l172l09L891K456k110j911J359O85k516j843
3062c153K220L149j23k356l10J748n18k951n93L469K216j872j702J478O83k722
3078a337k086K221L556P4k296n66J226p83k765M1L803K345k108k364Q98R30k104
3095a315j690K387L429m43k820m35J418l88k318q7L264K115k083k235J061J120
3111I80k136j854K264L527l60k609p03J148m05k097O2L625K082k211k654O29J239
3128E27j607j559K465L257o64l082q45J580j17j852J77L228J681k241k587P41
3144h98J437j382j633K131L452n63l290p07J461j49j758M41L150J620k220k789
$$ y = [1729, 1808, -431, -179, 1994, 1176, -2586, -3283, 164, 2292, 793, -363, 1251, 1812, -1214, -3723, -1795, 1834, 2331, 289, -54, 1315, 317, -2855, -3164, 727, 3183, 1073, -838, 521, 1206, -1310, -3153, -933, 2216, 2093, -263, -573, 1175, 657, -2294, -2887, 582, 2798, 926, -776, 702, 1385, -1337, -3423, -1202, 2354, 2428, 132, -434, 792, 9, -2756, -2715, 1088, 3433, 1325, -1039, -141, 789, -1315, -3005, -618, 2811, 2368, -452, -887, 531, 143, -2175, -2262, 1002, 3117, 1034, -1201, -140, 980, -1156, -3010, -746, 2781, 2421, -188, -891, 257, -148, -2245, -2183, 1442, 3524, 1313, -1341, -712, 527, -1080, -2639, -174, 3083, 2419, -663, -1508, 72, -45, -1897, -1720, 1508, 3189, 948, -1639, -898, 539, -843, -2476, -345, 3107, 2544, -746, -1453, 8, -141, -1899, -1458, 1692, 3312, 1092, -1697]
3160a697L74J581r29j475K147L270q56l506p98J708J55j450M46K784J330k335
3176G49k797O35J783p77j347J910K981q82l443j047J924N76j544L66K882J164
3192C133k690k659P37J652m95r68J589K627p84l510j075K093Q47j538K28K865
3208B052R25k826k522P95J796k60r63J450K355p92l572j126K299J123j436R5K597
3225A990P31k892k460J010J966j33r23J190K093q72l371j016K319J270j365l1
3241d94K425P14k881k467R88K179p9r96J269J940j146l322r44K315J540j101j70
3258b30K023N41k839k490J319K545j03j093R19J620j215l053o18K456J488j077
3274A93m75J724O65k579k450J336K554l8j226R30J611j328l093n58K484J618q81
$$ y = [-1697, -1323, 258, -671, -2146, 1, 3271, 2415, -1091, -1889, -181, -26, -1476, -1030, 1754, 3084, 749, -2048, -1413, 370, -407, -1754, 156, 3137, 2255, -1188, -2235, -311, 265, -1279, -913, 1969, 3133, 443, -2216, -1479, 173, -322, -1290, 299, 2926, 2142, -1368, -2443, -350, 497, -1041, -813, 2052, 2977, 151, -2371, -1576, 220, -40, -1003, 447, 2802, 2010, -1562, -2688, -389, 734, -702, -607, 1990, 2721, -171, -2631, -1621, 345, 212, -711, 479, 2572, 1700, -1671, -2687, -368, 902, -463, -494, 1931, 2645, -236, -2703, -1715, 464, 385, -611, 658, 2598, 1452, -1870, -2814, -499, 1041, -60, -230, 1793, 2334, -505, -2995, -1676, 869, 766, -327, 592, 2212, 997, -2056, -2674, -218, 1270, 193, -282, 1442, 2107, -472, -2922, -1586, 968, 930, -296, 634, 2245, 917, -2176, -2734, -250, 1368, 487]
3291D87n53J481M56k665k389J466K946J28j383N73J262j368k774k02K657J660
3307A782j095q81J205N32k407k054J536K725K7j524M47J328j169k730k87K663
3323I8J746j101q25J098L37k442j982J771K897J94j600l5J080j098k613K5K961
3340E11J798j446j151Q63L15k047j524J670K780J8j775j55J214q55k471r4K942
3357E93J590j261j209P64L82k049j590J764K958J83j949m75J023p98k276K22L072
3374I44J648j523j574M63M68j601j274J896K718k28k077m70R97m10j950J24K815
3391I66J532j576j609O39M51j575j251J916K693q0k104p00Q95m90j763L10K971
3408A225J570j737j972L93O45j252q97J928K556m39k339q35J115p2j511L42K626
$$ y = [487, -66, 1415, 1871, -794, -3183, -1717, 1229, 1357, -26, 547, 1809, 441, -2333, -2535, 122, 1782, 687, -194, 1011, 1543, -864, -2918, -1382, 1343, 1370, -154, 293, 1621, 452, -2278, -2565, 98, 1844, 743, -82, 1016, 1353, -1089, -3071, -1300, 1597, 1791, 191, 156, 1236, 138, -2475, -2450, 511, 2309, 863, -288, 575, 890, -1157, -2681, -1011, 1769, 1787, 12, -143, 1071, 216, -2255, -2349, 593, 2183, 922, -287, 477, 859, -1190, -2780, -1016, 1942, 2125, 176, -299, 724, -74, -2350, -2128, 944, 2592, 1069, -505, -42, 426, -1175, -2449, -553, 2165, 1937, -140, -610, 387, -23, -1973, -1849, 966, 2498, 922, -687, -48, 403, -1172, -2423, -507, 2186, 2106, 2, -698, 197, -293, -2056, -1746, 1225, 2795, 1058, -914, -521, 124, -1128, -2025, -97, 2459, 2020, -319, -1154, -39, -111, -1622, -1280, 1346]
3425A346J347j913j929N00Q31j122r59J817K487l62k363q44J048j24j394M40K629
3442A435J385j951k171L44Q98r06o29J831K365o57k562r25J048L07r96L85K346
3459A547J093k011k192M48J298p53p64J663K171p09k510q95J196L76r74K74K248
3476A506J069k029k254M24J320n06o60J640K090r00k711q90J359N10p36L98K043
3493A673P49k107k215M83J498j79p42J381J898r36k763o53J476O06p46L93J823
3510A639N31k044k131N06J655j2p40J135J800r74k828o75J686Q33p60L54J681
3527A656L30k133j956N74J739J44p29R51J559r76k733p02J848R92o91J69J583
3544A625J64k147j896P90J737L40o18O17J287q82k716o31J993J210p85n8J451
$$ y = [1346, 2693, 780, -1149, -649, 182, -940, -1899, -82, 2405, 2043, -320, -1164, -116, -240, -1634, -1194, 1435, 2820, 869, -1302, -958, -60, -966, -1595, 236, 2601, 1944, -618, -1543, -495, -188, -1184, -799, 1547, 2640, 629, -1563, -1115, 183, -570, -1334, 329, 2500, 1791, -719, -1614, -418, -42, -1016, -742, 1506, 2575, 546, -1708, -1284, 36, -470, -1130, 510, 2600, 1700, -1011, -1901, -542, -32, -768, -370, 1673, 2422, 315, -1900, -1417, 81, -98, -840, 541, 2439, 1503, -1260, -1913, -437, 169, -577, -184, 1639, 2170, 126, -2005, -1499, 156, 144, -596, 539, 2339, 1365, -1463, -2138, -452, 381, -379, -25, 1656, 1986, -147, -2103, -1529, 210, 354, -375, 576, 2135, 1159, -1574, -2276, -428, 564, -127, 42, 1625, 1789, -358, -2254, -1464, 273, 613, -5, 612, 1899, 1017, -1699, -2330, -337, 873, 88, 30, 1481]
3561A481J42k202j652R03J723K96o13M99J054q45k472o34K006J467p51k77J236
3578A361O2k260j631J176J967L24p29L31P16r62k115m89K055J636q51o51J121
3595A061K02k079j545J315J915J82p68K39O67r04k041m36K045J575o46p57Q94
3612I19J74k086j525J459K229J57r56P6M48r34j803p1K111J532p92j001M72K97
3630G06j715j328J525K158Jj219O3O40q78j694k3J973J403o28r31L35K64j635
3648i83j393J437K459J48j385j86M76r66j541K91K221J371q29j268N7L01j166
3665i56j032J410K370j32j703k96O98n79j495K96K092J102r02j069J31K99j139
3682i05j056J352K290K27j675n99N10n80j442N12K300J234j100j454q6K53p83
$$ y = [1481, 1623, -579, -2231, -1328, 395, 691, 78, 577, 1631, 786, -1686, -2320, -314, 1153, 402, 125, 1361, 1423, -837, -2468, -1292, 675, 999, 270, 601, 1317, 355, -1760, -2249, -194, 1442, 591, -60, 1061, 1263, -816, -2361, -1046, 869, 1051, 283, 522, 1189, 285, -1756, -2192, -147, 1428, 782, 25, 919, 1093, -993, -2518, -1059, 1170, 1327, 371, 447, 895, -39, -1842, -1913, 198, 1730, 938, -63, 409, 706, -1009, -2337, -812, 1346, 1347, 128, 191, 831, -47, -1741, -1764, 209, 1612, 984, 53, 388, 652, -983, -2376, -939, 1520, 1668, 283, 97, 573, -393, -1934, -1643, 578, 1949, 1120, -148, -91, 210, -956, -1988, -578, 1792, 1660, -43, -339, 359, -220, -1715, -1419, 673, 1775, 873, -196, -65, 234, -905, -1961, -609, 1681, 1908, 233, -366, 144, -436, -1878, -1366, 934, 2168, 1068, -386, -472, -219, -1002]
3699a002n74J316K161l8j889q06P12j72j176M06K172R39j327j425K27M09p85n68
3717a420J203J964M2j828q36O84q7j178M00K245J077j356j672L5L61n65k72J370
3735A67J829k44k042r60O72L36q16L37K042Q21j607j618K62O62m61l91J250J670
3753A909l44j874q61O32L14p57L36J932Q79j602j746J36P97l28k72J357J527n82
3771A453k037q78P00N91l59K79J606O93j786j738K75J093j34l46J164J276n99
3788A253j937q48R28O09m80L08J508N81j632j817K22J173k3k66J068J325p80k093
3806i01q13R78Q37k57K27J272L62j683j749L32J382K32l70Q27R98p67k012o66
3824a771J193Q52k72J35J062L19j576j675L53J441L11l98O35R91p84k047n98J258
$$ y = [-1002, -1576, -260, 1901, 1863, -26, -832, -120, -292, -1468, -1062, 1110, 2049, 722, -703, -476, -67, -852, -1420, -217, 1747, 1789, -39, -875, -191, -278, -1456, -1056, 1189, 2266, 910, -762, -727, -366, -931, -1203, 167, 1996, 1752, -290, -1250, -578, -242, -1058, -721, 1321, 2142, 535, -1083, -821, -159, -620, -1011, 239, 1909, 1565, -309, -1170, -538, -224, -981, -645, 1287, 2166, 564, -1182, -1046, -249, -577, -849, 508, 2035, 1453, -584, -1462, -762, -171, -530, -251, 1355, 2048, 262, -1476, -1201, -108, -242, -588, 576, 1852, 1253, -684, -1532, -604, 5, -475, -167, 1341, 1922, 290, -1527, -1305, -132, -155, -421, 647, 1972, 1192, -901, -1714, -736, 101, -156, 71, 1343, 1705, 22, -1727, -1395, -13, 219, -151, 676, 1674, 907, -1105, -1771, -578, 274, 2, 137, 1199, 1518, -58, -1733, -1380, 61, 372, -26, 609, 1600, 816, -1231, -1829, -571]
3842e71R94j94P3R42J32j693j587N69J482M58m46M87Q09q27j963n77J457J174
3860G19l16j73Q42M5j602j424O73J548N12n24K74N93p97j754m51J532J193k90
3878F00l25O02O6j547j271P22J659M56n55P6N34p38j720l56J583J278l50m32N02
3897G84o5j454j183Q15J746M69o89n4M53p81j460l02J680J312m51n89K71n4j262
3916h14j024R07J820L88q12l01L87o05j406j11J610J349m31p70J50J3j214r33
3934a797J023J785L49q89l36J90n85j233l4J737J310n10r77Q4L1j051p94J121
3952e76J784K06j008n86K94l87j077J18J600J291o45j099k3J44q86p07J054J757
3970A254J88j139m73J54l87r10J68J680J200o72j255j46J86p48n54J142J787Q0
$$ y = [-571, 423, 229, 302, 1244, 1376, -317, -1904, -1335, 147, 605, 159, 646, 1455, 628, -1335, -1912, -455, 719, 403, 230, 1072, 1117, -485, -1909, -1236, 312, 824, 300, 574, 1167, 370, -1384, -1835, -303, 890, 600, 275, 877, 943, -604, -1875, -1153, 506, 962, 407, 483, 1017, 279, -1441, -1797, -214, 1064, 714, 282, 784, 719, -735, -1918, -1103, 643, 1112, 423, 369, 822, 41, -1419, -1721, -41, 1271, 820, 231, 502, 448, -814, -1838, -931, 889, 1277, 465, 164, 551, -54, -1460, -1571, 39, 1388, 957, 187, 337, 350, -864, -1797, -774, 1011, 1360, 471, 135, 325, -260, -1493, -1527, 210, 1520, 1010, 33, 117, 148, -903, -1697, -576, 1208, 1414, 406, -180, 114, -273, -1350, -1232, 368, 1659, 1014, -85, -108, 36, -850, -1557, -503, 1254, 1442, 303, -170, -16, -403, -1313, -1145, 535, 1735, 1063, -192, -338, -152, -900, -1454, -312, 1475, 1555]
3988A555j292p06J90k05p14K82J562J044q00j306k07L88m28o15J107J640mj392
4006I9p37L31j01o76K86J571Q86q06j352j89L90l66m16J091J578j7j601q62M12
4025d79N4n05M33J537O55r48j430k64N15p7k46R30J388j75j638q21N30K88n33
4044g86M05J406N55r75j331j56N09K1k38P59J377j46j664r53N92M04l84L53J395
4063A143M98j200j454p9O52J75l7P27J037l15j635q77O75P01k92J75J164M02j211
4082B49j335J07P51J08q1O12R82k94j602q87O54P46j41Q6J135M11j313j550J55
4101a207Q78L17L2O34O74m68j526q84P85R88j06J8Q54K97j343j349K96J032K61
4120A83j22M79O48m99j427p49Q07R40L5j04O78L95j345j376K55J208L20j43M96
$$ y = [1555, 263, -443, -253, -458, -1172, -890, 672, 1716, 916, -390, -597, -209, -637, -1252, -145, 1495, 1491, 99, -638, -307, -408, -1084, -798, 773, 1659, 853, -499, -688, -298, -664, -1080, 11, 1589, 1572, -29, -891, -479, -425, -930, -497, 1040, 1695, 747, -683, -947, -432, -509, -755, 175, 1563, 1388, -250, -1071, -541, -253, -786, -381, 1025, 1580, 605, -726, -882, -373, -352, -590, 169, 1546, 1400, -264, -1217, -625, -221, -605, -252, 1143, 1641, 441, -1013, -1092, -440, -265, -302, 425, 1462, 1147, -488, -1365, -690, 11, -281, -106, 1058, 1460, 249, -1086, -979, -228, -120, -201, 411, 1393, 1099, -503, -1390, -736, 10, -131, -45, 1090, 1501, 188, -1362, -1207, -329, -12, 20, 654, 1328, 860, -666, -1550, -765, 223, 117, 135, 989, 1286, -57, -1406, -1110, -78, 183, 61, 540, 1188, 689, -738, -1487, -680, 260, 295, 191, 869, 1264, -81, -1457, -1202, 6, 326, 183, 679]
4139F79N29o63j525n67Q74J037J39j72M51K00j248j295L80J399M16l56K14M52
4157I44o38j328l57Q55J058Jk13K85K33j044j323L62J430N01m52J23M78o80j405
4176a170k76J126R75R4l06Q4K1r80j104M90J502N49n34j84L75n96j262k12J243
4195a65J013j00m15Q2n1q82q81M77J440N90o19l57M02n03j218j23J302J037j68
4214H61n49l4p4q24p45N96J382N82p13m81K58l23j077j04J341J071l25o88l5j12
4234Go56o42O40J431N19p56n80J02k73q75n7J413J040m48q31r6L8o35m57O63J285
4255H32L70p07o65Q3j94o54j37J381J028m39q92k20J47o18m66Q02J336K62q44
4274D05p61Q5j29n46J54J253R67n14j143k04J59l26l64P96J207K43j043p72J99
$$ y = [679, 1208, 545, -980, -1547, -673, 364, 503, 331, 782, 982, -266, -1561, -1181, 218, 634, 278, 492, 944, 306, -1022, -1379, -524, 534, 535, 322, 607, 840, -204, -1527, -1165, 265, 766, 314, 437, 915, 235, -1170, -1446, -320, 655, 749, 443, 527, 548, -432, -1536, -1046, 456, 1005, 471, 287, 662, 66, -1196, -1408, -165, 848, 748, 333, 415, 364, -518, -1399, -922, 518, 1108, 489, 132, 534, 31, -1187, -1310, -8, 1029, 861, 312, 278, 204, -620, -1365, -769, 613, 1195, 482, 1, 259, -64, -1141, -1245, 96, 1167, 842, 154, 119, 7, -649, -1291, -651, 780, 1299, 543, -37, 65, -208, -1083, -1140, 273, 1313, 865, 34, -62, -24, -659, -1116, -453, 832, 1202, 495, -170, -87, -281, -935, -1072, 309, 1337, 898, 6, -214, -67, -685, -1151, -349, 987, 1249, 405, -356, -271, -400, -946, -792, 461, 1428, 914, -229, -433, -274, -600, -964, -168, 1039, 1282, 239, -533, -334]
4293c34K5m48O6J178Q84m96j157k17K47l15l41P84J314N3j021p86M0J56l37J32
4313e73J230Q46o58j332k74L94j29j30P03J135m3j162q51K41K61k14K04R66O94
4332A308o90j153k27L91K1k33O89J084Mj247p94K52L04j76K62J036N49p45j280
4351f45l50O23J28o5N66R07j36j238q22L67N19n0J14Q21M96q63j172j52O35K36
4371h1j67N43Q30j91j192q34L99N91l4J39Q53L64q55j321q6O43M51j14M65P15
4391A118k74j295q02N87P03O3N9N98K07q00j176J4Q34L73j11K03O05j82j242o88
4411a206O19O72O9j1N58K37q41j155l5R40M31p6K64M59l01j292o48O60R43J48
4431D35j48L72J29r51j011J78J036N12k26N9L57l62j127m84O87R73k0j61K42K15
$$ y = [-334, -309, -757, -691, 487, 1371, 875, -282, -499, -252, -567, -908, -124, 1190, 1243, 222, -564, -524, -368, -705, -573, 657, 1503, 845, -487, -761, -367, -496, -626, 77, 1212, 1169, 7, -844, -603, -342, -556, -352, 614, 1308, 618, -535, -762, -371, -350, -583, 106, 1190, 1194, -53, -847, -595, -291, -467, -205, 831, 1380, 635, -645, -995, -372, -244, -309, 257, 1164, 1028, -210, -1032, -665, -146, -196, -82, 739, 1235, 372, -800, -952, -317, -81, -248, 295, 1125, 934, -258, -1092, -693, -102, -136, 3, 856, 1220, 365, -956, -1042, -399, 52, -62, 403, 1118, 844, -451, -1253, -666, 37, 100, 159, 757, 964, 164, -1012, -998, -164, 209, 98, 301, 906, 724, -518, -1206, -587, 85, 154, 143, 701, 938, 97, -1058, -1093, -153, 278, 202, 466, 925, 624, -668, -1316, -656, 287, 435, 287, 659, 788, -163, -1174, -996, 40, 552, 326, 385, 742, 380, -747, -1231, -544, 429, 409, 248, 490, 705]
4451G05p91j073J66J023N31k04JK52k72j109m67P37R97J35l01J40M3p80r65K83
4471i49J121N25k16j57R2l01r29l73P98J034O6m28N2J11p90q25L15J097N48l58
4491D33j69J30l52q77l30R15R36Q8n74J2L8o55p83M13J176N13m62l51J89l49p97
4512h56j76R34R35l8n59j98P0m73p35L98J169N34n87l65J20k82p65j23J017Q72
4532H92o9o42j93Pm76m90M23J236L57n90n47R3k08o08r5J023Q37j88o49k89P1
4553a05l33m60M80J099M88p05p04P0oo26k1J025Q86k81q24j98L0k60l13M43J049
4574G34M35p51p52J1O8m25k2R75R03m56q80k17R8j95k13N06R63K71o77q20O4J67
4596b13l48l3R48P96m86q51k14R2j73j03N27R38J22p43q11J8K83j31q2Q49Q18
$$ y = [705, -86, -1159, -993, 30, 561, 357, 358, 610, 338, -771, -1238, -501, 496, 631, 330, 470, 513, -267, -1232, -949, 172, 697, 481, 324, 416, 115, -814, -1187, -389, 645, 711, 283, 335, 446, -344, -1169, -854, 243, 791, 433, 264, 394, 42, -835, -1165, -250, 686, 774, 200, 212, 250, -405, -1188, -775, 401, 914, 452, 101, 290, -59, -856, -1032, -98, 837, 799, 240, 42, 112, -361, -1096, -698, 471, 1005, 418, 53, 173, -109, -874, -997, 20, 892, 823, 181, -12, -5, -481, -971, -548, 688, 1045, 455, -92, 1, -207, -815, -910, 113, 950, 762, 113, -176, -105, -438, -898, -418, 681, 1169, 464, -240, -170, -176, -802, -823, 202, 1088, 807, -17, -215, -185, -445, -758, -315, 734, 1169, 418, -334, -323, -255, -680, -702, 273, 1176, 720, -160, -377, -279, -474, -687, -181, 782, 1053, 376, -444, -380, -213, -561, -594, 354, 1150, 664, -187, -401, -309, -482, -585, -58, 880, 1002, 259, -552, -534, -251, -382, -464, 385, 1203]
4617A203n20j113j98L36m6j69N56Q20N6q20o92M7L04o2n9Q09O09m62j079j84L63
4638c01j1j04N03R41j03q71p19J1L57J07pP33N03n26j121k51O21J50j55M61O57
4659H75j15r23n83J61M45M4P0M82N05n12j013k67N48K77j81L72P31j03j051o77
4679i15L28L84J28K05M41L41o04j010k75P01M89j68K48N52j80j014o45N11N12
4698B9P1M7L28K97o24q12k21O90L97j81J57N16j7r90o26M11N64J05P0L49J15n10
4720A65j043j19P46N68n9J8L95k12r99m84N54P05J27k06L47M4n96p73LP64M57
4741D02j49rK69k6r69m82M66P76R2j84K34K13p08p79m5Q60N53j08j57K51k31r20
4763f51l83O15Q93P4l11R4N0o34o31K04Q16M18k07j35J01j80p07l11N28Q41N7
$$ y = [1203, 683, -430, -628, -292, -338, -507, 49, 869, 925, 105, -587, -540, -236, -298, -357, 452, 1061, 599, -480, -664, -301, -312, -416, 87, 1028, 925, 54, -665, -654, -297, -190, -197, 536, 1039, 513, -608, -859, -238, -88, -243, 218, 875, 760, -163, -746, -585, -140, -96, -26, 456, 961, 449, -564, -831, -283, -6, -187, 185, 916, 813, -238, -915, -587, -203, -75, 130, 571, 912, 308, -702, -977, -276, 213, 45, 293, 845, 665, -349, -994, -483, 29, 100, 147, 475, 772, 148, -664, -885, -195, 202, 21, 178, 694, 677, -313, -939, -528, 36, 141, 211, 560, 675, 165, -878, -997, -251, 317, 258, 276, 671, 459, -540, -1024, -470, 235, 362, 156, 503, 547, -49, -822, -819, -55, 402, 253, 244, 513, 487, -482, -964, -498, 278, 370, 186, 420, 633, -75, -854, -899, -39, 514, 406, 249, 500, 269, -651, -1034, -419, 474, 548, 237, 331, 381, -253, -884, -680, 136, 554, 347, 212, 313, 133, -574, -885, -357, 484, 541]
4784E41l21%J59n41p03J46Q43N21k01k87J14k64o69k80O87Q57K8l84j27M6m93
4805c28n82K94R68M22m01l26J32j98n52k05N86Q15K4m71k13J76m19n97K44J008
4825C77L63l00m63P6j22o05j05O45Q94No21k68J10l57l65K89R03L85m23m98M0
4846d0j01m38j03P33O84j54n60j79J07l23k99K73Q47M09n29n24P2m0l71j25P00
4867C9P37j38o42k64J22j79k25K13R07K89n37n78J4P5m03P2O71O75k51o42k84
4888c29J26m7k57K90P95K74o15n68RJ02k02kO52O62l55p14k69J60N5j74K91P25
4910F09K17o10o18M6K24j70p5O31N97k82p64k66J55M6j25L38P26K06o76p28N2
4931d67K77o0P4N93M70m13q11k72L41J18p3K48N78J44p58n47R1L86Rj12N15M70
$$ y = [541, 220, 220, 379, -162, -865, -719, 124, 645, 444, 157, 271, 7, -662, -942, -255, 602, 630, 246, 119, 165, -328, -910, -616, 352, 774, 373, 47, 179, -19, -571, -776, -190, 625, 649, 178, -35, 141, -278, -875, -631, 377, 740, 440, -23, 53, -69, -674, -779, -134, 760, 765, 144, -124, -14, -371, -736, -447, 456, 841, 418, -80, -40, -141, -579, -682, 51, 735, 581, 21, -158, -51, -374, -673, -400, 447, 856, 327, -197, -125, -165, -536, -661, 39, 776, 638, -4, -268, -146, -325, -550, -337, 570, 859, 322, -256, -242, -167, -570, -498, 173, 848, 597, -45, -329, -203, -250, -507, -217, 578, 852, 237, -331, -322, -220, -422, -424, 228, 890, 535, -179, -448, -288, -233, -407, -116, 609, 826, 216, -402, -356, -132, -302, -377, 254, 851, 569, -195, -461, -306, -260, -385, -47, 679, 885, 209, -519, -467, -190, -250, -176, 417, 887, 474, -337, -609, -268, -150, -223, 25, 603, 747, -11, -558, -467, -81, -72, -184, 331, 801]
4953H01l67q59j28L15J96j62L26N63L5p21o44R3L92O3N8M21M03m03r83j33M75
4974b59K66kJ72M20k1p39n43J82N23O2n7L15L22l15p91k04N12K23n2R6M94j1p22
4997a29o45K28M95J19KL01K26l54q54j64O08L44rKL75j03p83m16L57M91J62j18
5019A35K05J77l79p40r8N72M40k05N9L34j16o65m98L26N37J54o9J19K10m28p21
5040f51r7O12M87j51j9K48j52p08l71M54N93N5j51L7J35l47o43K6O15L96j36j41
5062I1J77J07p78l54M05O22J03j95M7N4m33m82l7O97M76j56j48jm5o03l20M89
5084b84P12J4k84mM5l72m12J5O48M83k01l22Q0K9m99l74M57O62J19m07qJ01l50
5107a52m73J20O46M53k24l27qK9m74k60M84P48j9m06j78Q4k38m21J78O50M03k76
$$ y = [801, 434, -425, -553, -238, -42, -204, 122, 685, 720, -1, -645, -552, -160, -97, -39, 382, 785, 382, -601, -734, -259, 7, 5, 177, 597, 576, -163, -706, -524, -1, 61, 4, 319, 641, 326, -465, -669, -157, 66, 14, 110, 604, 593, -129, -774, -546, -51, 68, 70, 371, 597, 243, -611, -775, -167, 177, 168, 170, 545, 442, -341, -757, -400, 91, 253, 135, 340, 517, 138, -602, -700, -128, 312, 107, 166, 500, 384, -281, -779, -453, 84, 238, 169, 288, 498, 70, -651, -748, -136, 351, 200, 181, 429, 277, -431, -802, -348, 245, 300, 149, 186, 321, -26, -669, -643, -28, 368, 232, 91, 268, 375, -403, -757, -352, 270, 373, 178, 225, 279, -154, -636, -673, 24, 500, 344, 196, 195, 150, -453, -773, -284, 428, 442, 158, 154, 199, -173, -585, -570, 78, 561, 360, 38, 118, 147, -352, -726, -269, 393, 512, 105, 97, 198, -152, -625, -505, 141, 594, 370, 43, 35, 64, -410, -670, -186, 562, 543, 137, -41, 43, -195, -616, -438, 212, 615, 339]
5129C39l59kk9l18k56N05O41qm87j37J55k26m07J68P06L48k63m24m3j6k87j10
5151e10M75O05K1n45k57J80j41l83K14O96L01m02l22q5N0k24j75M26O43l2n78
5172d3k46J94p5l16J93P21J99l63m34p9R0j95m4M34N43n0n33l29J49%j76J53O46
5195D39K14m60m89pK25k32OL99M83p4n62k92J76L8k13J76N99J92n41m32N6K10
5217h9j70L4L83M57j59n94k90J43J94j06J15N17J98m79o04J46K67j36j6L72L78
5238E61j34n78l39K52J80j21J52M34K12n89n33J31L06L4j16M07L47k88o40j78
5258e00K64K65j25J12M04J51n58n68J32L86N4n9L03L02k41o59k09L82J82o7R4
5279D5L45J54n68m94J06M42M6j44K46L83k93o52j36L91K53j02O2L00P4n45m81
$$ y = [339, -20, -22, -51, -369, -625, -120, 521, 513, 26, -111, 44, -182, -589, -421, 285, 633, 370, -54, -97, -113, -400, -510, -35, 570, 591, 46, -211, -31, -172, -555, -341, 355, 656, 254, -68, -153, -103, -327, -502, -76, 567, 535, -43, -289, -95, -170, -486, -293, 428, 627, 264, -170, -249, -159, -354, -398, 36, 579, 529, -4, -333, -184, -184, -360, -207, 439, 653, 193, -296, -303, -78, -310, -304, 95, 578, 504, -58, -350, -174, -136, -349, -173, 426, 618, 77, -355, -299, -89, -259, -225, 158, 615, 456, -138, -428, -285, -91, -197, -82, 435, 633, 154, -450, -304, -37, -173, -189, 183, 561, 427, -151, -490, -238, -58, -179, -27, 407, 619, 30, -503, -372, -66, -32, -148, 259, 606, 318, -322, -500, -236, 29, -96, 16, 420, 571, 13, -555, -423, -37, 17, -42, 261, 563, 322, -337, -546, -164, 18, -49, 45, 390, 544, -24, -518, -412, 30, 76, -68, 178, 561, 268, -384, -520, -129, 124, 22, 84, 384, 458, -87, -568]
5300e68J68M17J41k00K42K51k01o62j72L86L92j22PK47N9m96m58J93M31J94j85
5321F4J24K32k68o22n7M31L46j15q1K66J0n27m03K18N11R0j55O5J80k08n68r8
5343e65M80L41l8j60K15o0m43l61K92M83J19j69LJ47k30n00j11N20M02j07k12
5364D6J25P7m85l43K67N67Q8k33k1J66k56m73m8N26M10j89j73O5J6m16k53L13
5386b24M93J11k88q1J37j80m38o2N82M02j78k87Q7M4l62k74L30N53N2l04p9O4
5408I8j49l95L7N02L38j97k43N5Nk72l06L54N77Ml47j46R3r2l07j5N60K73j77
5431B50l27k6J11k65j93L23N39K0m31j07J29p4l55J07M82L19k96l42O3L9j25k54
5453d13L52N37r5l80j86J07J9k61O8M93K50k50m08N8R9j66j12K59M69k6m57k01
$$ y = [-568, -400, 17, 158, -42, 200, 451, 250, -412, -584, -198, 194, 72, 79, 326, 385, -111, -569, -376, 55, 249, 64, 188, 420, 152, -470, -527, -96, 250, 135, 54, 320, 330, -197, -600, -382, 129, 219, 64, 129, 309, 101, -467, -565, -85, 256, 218, 58, 273, 213, -230, -591, -299, 184, 303, 134, 137, 284, 54, -446, -557, -37, 365, 258, 46, 171, 248, -237, -580, -313, 254, 342, 109, 88, 254, -2, -475, -523, 3, 413, 224, 51, 116, 132, -284, -537, -224, 269, 380, 92, 11, 148, -32, -470, -532, 50, 452, 274, -13, 74, 118, -244, -518, -188, 365, 417, 113, 34, 98, -51, -446, -409, 93, 431, 234, -9, 46, 51, -221, -527, -173, 404, 408, 61, -85, 8, -84, -391, -406, 154, 427, 250, -77, -103, 8, -257, -450, -127, 412, 432, 1, -106, 23, -51, -406, -299, 183, 502, 206, -136, -73, -34, -159, -413, -61, 476, 381, 1, -185, -78, -59, -320, -252, 241, 491, 241, -167, -109, -10, -176, -288, -29, 440, 414, -43, -244]
5475b44J52Qk09N2N10K44l09m06JJ27n3k03K82M90l6m58k06J67M3k00R1M25K15
5498D83l99l01l6J88j06j30K97M77q5n05k39K26J26j91M4M09K06k98m60N5K20
5519a9j09p4K34M21n9n17k82K70Q0j25K0M71K16l85m97J48J83J0j86K79L18m3
5541C54m90k38J92K35j63K1L82R4l33m20J08K33k7m7K27K57k9n40k18K90J08l6
5563d0l5L31J54l61m50J80K06M3n8J40K78j51m82k06K71L34j75k2K81J65l89m61
5585d47J65L68J0k03K15K08j10m51j41K55K21q6j01L69M0k88n09K01L48M2j24
5606a8Q0K95k16l87j59K95K57n3j05K15P5l66l71J88L75N5k07J27J81r9m53p7
5628c68L00K58r8j00J64J12k94m04J45M04J10k90Q3K26j17m75n0L98K21j26r6
$$ y = [-244, -92, -84, -293, -241, 269, 513, 204, -202, -201, -74, -127, -330, -48, 442, 406, -52, -258, -91, -48, -248, -157, 268, 483, 84, -217, -253, -65, -171, -301, -4, 473, 388, -117, -356, -130, -4, -195, -151, 258, 464, 166, -294, -239, -19, -128, -202, 32, 453, 394, -123, -405, -135, -55, -180, -160, 311, 527, 142, -355, -207, -24, -14, -200, 79, 397, 354, -136, -374, -182, 53, -110, -89, 293, 387, 54, -366, -258, -25, -52, -99, 128, 385, 356, -184, -402, -112, -4, -40, -75, 256, 410, 49, -401, -221, -15, 28, -30, 110, 388, 237, -245, -451, -180, 154, -21, -43, 238, 403, 14, -447, -282, 86, 96, -107, 108, 316, 206, -245, -386, -131, 90, 4, -97, 272, 312, 24, -485, -284, 64, 106, -18, 62, 357, 141, -246, -405, -110, 147, 94, -11, 204, 279, -87, -458, -270, 105, 160, -47, 80, 261, 162, -291, -368, -68, 190, 92, -8, 156, 268, -26, -430, -285, 119, 229, -61, 22, 248, 131, -344, -394, 4, 225, 99, 3]
5649CJ49R5l82l18K03M26P0j98j0J90j70l89l8M17K01j44j72J31R0l11k11J96
5671a72L28R3k67n2K33l9m51q4M16K64j57j41K05k1l22k33J97L75J78l00m0Q9
5693I9k0l80o3M04L13k66j40P3Q4k45j83J53L62O1l05K4J02Kl41o5L84K91k26
5716A18k14J76N0l00k13K03M05N1k03j84J48j9k84n4M22K57k04k94J07R0j99j92
5738c33K32L93o8k19q6J19J1k04j35L11L27k08k76J04R8j93k35K41M23Kl15j53
5760a64J64pk12kL58K08j97k99L4J42q8j75J63L56ml82m3P8J28k42p1L53K57k78
5784G7j93K6J35j00k31K35L17Q1m12j59J32M9j57%L37K29k97k44Q0J62p7k04J66
5807d8K82R9m27j41J96J01k06M5K90J49k48k61j1K96j52j63J90K94l1l77j29K18
$$ y = [3, 152, 247, -135, -453, -250, 176, 246, 48, 38, 228, 58, -331, -369, 48, 249, 105, -67, 64, 154, -157, -368, -172, 156, 249, -18, -70, 163, 124, -327, -411, 5, 269, 112, -29, 176, 155, -167, -400, -203, 172, 350, 50, 10, 99, 79, -301, -364, 40, 353, 87, -53, 20, 104, -141, -324, -171, 191, 252, -53, -29, 73, 75, -266, -331, 53, 344, 118, -96, 80, 130, -170, -383, -180, 225, 276, 73, -111, 37, 18, -266, -320, 102, 359, 155, -139, -32, 58, -141, -333, -101, 292, 224, 5, -81, 38, 49, -155, -290, 21, 348, 140, -136, -32, 66, -127, -362, -121, 302, 304, -11, -164, 0, -7, -219, -221, 137, 345, 148, -151, -117, 25, -63, -238, -75, 281, 277, -105, -148, -70, 58, -184, -255, 98, 355, 77, -116, -90, 45, -55, -286, -51, 266, 347, -65, -224, -92, -43, -200, -200, 137, 366, 69, -175, -95, 67, -10, -214, -48, 234, 333, -94, -235, -39, 62, -144, -99, 191, 340, 92, -169, -180, 116, -36, -199, -9, 285, 254, -123, -252, -34]
5829c4Q2j89l0L05K72l66k44Q7J71o6j13J41K81k4l44j60J92J49k30m4L12K06
5851C54k84l10P3K11m8j20J47K20jl15j86J73J84j54q3K43J68k99j74K4K62l5
5873E0j56J05K29%l35j88K37J04j08k0K54J55l11k91N3K62L2j99J55J87o5l21
5895a71j16K27J91j09j02K52Q3k40k61N8K67Kj84R3K08k7l17j11K10J38p5q9J04
5918C1J83k04l31J24K88j3j78J24J90p1l65j18L42J59j28j01J52J62l13k62J53
5939a76K76Oj37p7K72k1k87j42L00R8o3j28J45J70k20k69K2L15M9j56N2J60j11
5962G8k20j54K55K33j69j10J50J14k48k26J13L55n7j45l9K17n5k38q8K19J53r5
5984D3j14K0K59j77l01J47K33Jj27l6J50Pl49j4K82J67j15j33Q7O7r4k78J27L74
$$ y = [-34, 48, -141, -171, 134, 406, 40, -204, -117, 54, -12, -125, 16, 297, 273, -71, -231, -39, 110, -120, -164, 148, 354, 70, -240, -167, 44, -4, -124, 23, 243, 242, -73, -259, -86, 98, -56, -139, 104, 272, -27, -201, -177, 85, 50, -106, -1, 228, 228, -107, -295, -58, 46, -62, -82, 172, 327, 16, -275, -222, 40, 72, -127, 28, 215, 150, -171, -287, -60, 131, 22, -80, 172, 255, 15, -246, -188, 79, 81, -103, -10, 198, 171, -146, -257, -47, 91, 16, -73, 31, 214, 10, -321, -197, 91, 78, -100, 24, 214, 143, -222, -340, 2, 161, 33, -68, 84, 246, -67, -329, -176, 100, 106, -31, -108, 164, 143, -144, -286, 14, 112, 49, -79, 66, 236, 16, -253, -231, 84, 133, -23, 29, 189, 78, -142, -296, -41, 192, 23, -87, 63, 177, -71, -297, -184, 171, 114, -31, -70, 147, 92, -146, -234, -15, 138, 43, -71, -51, 208, 31, -270, -123, 110, 111, -16, -52, 98, 105, -244, -258, 24, 191, 76, -57, 30, 97, 3, -275, -148, 226]
6008B26Ol00m8J74K2j82j18J85K52j59k24J29J79j34k77J07K88jj91PJ17P0k55
6031a27q0K72J53j91j15J57M1j56j89J20K85K6k10j03J64O4k88j9K08K16k30j70
6053a72J35J29j59j30J00K75j6k12l0J19N0k48r9K28K86j55k62J07J65j55k36
6074b80J91K45N4j92j58J81J8j95J3K00J63j42k90J45J39j17j58J05K80p1j89
6095e8j07J87L5j25j00K46J05j30j47J9K23j43k30J59K25L9k78m2J19M3j69j6
6117a45K15J75j48k30M6J41l1k09J14K63k9k11j00J86K1r2j12J91J75j68k15M4
6139a19K00p0j52Q3K75l8j92j37J28P3j18r3K57J37j18l08P8J57Jk01J29K22N8
6162B52l46p3K20P5k01o1K85Q5j67k14O6J29k1k16J02K53Pk50q3J41J34k17k5
$$ y = [226, 232, -68, -116, 58, 80, -102, -220, -35, 217, 58, -166, -37, 142, 8, -269, -162, 126, 125, -66, -59, 58, 128, -127, -207, 65, 218, 27, -88, 69, 110, -46, -235, -115, 170, 196, -14, -117, 47, 111, -177, -196, 12, 228, -2, -172, -37, 92, -67, -197, -97, 178, 162, -50, -80, 39, 89, -159, -258, -30, 256, 101, -161, -54, 111, -44, -280, -89, 156, 210, 18, -140, 41, 59, -136, -123, 77, 240, 98, -192, -47, 92, -25, -183, -78, 202, 131, -58, -165, 22, 57, -68, -168, 78, 183, 53, -94, -75, 148, 5, -225, -66, 159, 198, -80, -122, -3, 40, -129, -145, 70, 245, 97, -133, -87, 54, 23, -186, -72, 191, 162, -49, -149, 37, 58, -34, -146, 45, 220, 52, -163, -119, 81, 11, -141, -58, 217, 179, -13, -150, -22, 51, -67, -160, 97, 234, 116, -192, -114, 43, 44, -157, -28, 194, 252, -94, -167, 53, 128, -73, -134, 151, 236, 69, -145, -79, 50, 29, -187, -85, 168, 175, -75, -158, -17, 117, -100, -125]
6185a25J86J35j59k01J10J12k3j11oK36J7k48j04K01R9j47m6J49J86k19k04O2
6207a00J41k9j09O6K46p5k30j18K05J08j31m1J11J60j78k10N6K34n1j41L0J70
6229A14J7k20r1J75J25j54q1J43J24j06j65J06K7M2j76M4J93P1k69j45K39J21
6251A34j90j7R8J16j99j29J07J73m2j19N5J60j2k33j17K10J25j37j53J77J84k03
6273a2k00Q5K15J7k30O4K22l8j75j58J97J11q3j05J21J81k09j61O3J43%o8j9J17
6297G8N9k17j03J66J00n8p8K3J01j9k97J05J87N8j91J5J58N8k52j39K56J16j31
6320ej19R9J67j12k10K5J89R5j99nK32k5k40n0J58J09q9j36J37J01j09j90KK40
6344F5O3j85l2J93mj76r5J94R3j05q6R2R5j64o7N6J77O5j75j7J10J0j61j50J15
$$ y = [-125, 61, 196, 37, -164, -54, 58, 35, -76, -82, 154, 171, -77, -181, 20, 119, -28, -74, 75, 261, 42, -162, -100, 41, 12, -97, -31, 215, 140, -90, -208, -3, 105, -26, -67, 44, 204, 26, -184, -128, 106, 55, -86, -56, 114, 131, -89, -180, -5, 120, -34, -115, 28, 152, 46, -119, -13, 14, 56, -120, -76, 117, 188, -81, -226, 13, 134, -56, -73, 25, 141, -58, -187, -80, 93, 51, -68, -13, 147, 135, -98, -215, -5, 120, -17, -170, 7, 191, -12, -212, -127, 88, 105, -125, -61, 161, 123, -52, -210, -13, 98, 15, -90, 31, 212, 3, -158, -95, 48, 48, -20, -39, 78, 137, -80, -183, -17, 83, 25, -53, -30, 71, 52, -245, -140, 47, 105, -86, -71, 87, 145, -107, -246, 10, 126, -5, -124, -25, 142, 30, -180, -155, 34, 129, -70, -75, 157, 132, -108, -158, 0, 109, 20, -116, 21, 122, 13, -177, -175, 65, 128, -57, -89, 104, 100, -76, -171, 23, 116, 11, -75, 17, 112, -52, -119, -63, 114, 179, 4, -13, 97, 107, -54, -204, -89]
6369h9J99r6p0O8J13q8k14R5J74L9j57m7J23O5k05n4J71J42j25j40R8L9k9j51
6393a39kK28L7j19pR6L6j88q0J27J73j58m0JJ63j20j69L4K05Q5j86n1J43l8j06
6418g5n5J47J63p3j85K9J16n5j58O0J74M5j18j41J80Rj47r2J67J52j13j21R7J33
6442A39j28j39K8K18J8j87l9J06K2j26r1J69J14r6o8J9J07o2j10L0K31k1j63m3
6466g2Q9P4j35j40J77J51q7p7l9J29r1j08N6J88K8j10j53J14L1r2j33J81J02l4
6490D9j04o2J79l7j51L6J89P2k47p2J94jp7r7J45J28p4j56L9J49o5j26N4J33P8
6515A76k09j04J66M9j14j41K29O1q3j06k6J52l9j32N7J93L2k13m1P5O4q6o9P5
6539c4K13j28j05m0J45k1j42M4J42N5j50j05J62lr7m8J37R4p5j46N0J19k3j20
$$ y = [-89, 110, 14, -56, 12, 125, 37, -177, -82, 92, 131, -26, -73, 50, 115, -90, -144, 27, 169, 44, -96, 2, 41, 12, -139, -141, 87, 124, 5, -2, 94, 130, -58, -138, -11, 162, 4, -36, -35, 128, 8, -161, -127, 78, 163, -23, -74, 69, 31, -75, -130, 17, 180, 107, -78, -49, 67, 12, -146, -86, 88, 133, 15, -126, 54, 63, -84, -176, -9, 143, 30, -91, 6, 139, 11, -128, -100, 118, 136, -51, -90, 16, 38, -88, -179, -10, 104, 8, -60, -41, 66, 4, -106, -76, 155, 134, -29, -72, 17, 91, -44, -184, -7, 144, 57, -20, -59, 70, -21, -129, -73, 115, 143, 33, -120, -6, 25, -67, -200, -19, 83, 49, -55, -117, 62, 25, -126, -90, 99, 171, -76, -148, 46, 45, -32, -129, 16, 144, 70, -86, -47, 102, 37, -89, -35, 98, 176, -33, -137, 29, 78, -36, -177, 52, 113, 30, -76, -102, 50, 11, -121, -64, 129, 161, -52, -93, -18, 46, -40, -109, -34, 179, 51, -54, -94, 51, 30, -112, -68, 74, 129, -21, -126, 36, 33, -64, -112, 25, 119, 44, -102, -52, 67, 44, -76]
6563g6NR7N7j01j56J33Q6j07n2J50J32j02j73N2R9n4o7P5P9M6j24j09O5J38r7
6588dp3J09J21j36j62M6J25m1j04O4J20N3j47j16J16O2o8o2J38J14p2k21M9J27
6612C8l1o2M8J00J3j40q3P7J36j48m6R6J02p0j25K3J01K6l1q1J93k4j52j15R1
6637f4J34p8q7R5J75r6k53J03P2P1j45O1J45n1q8j13R9J34r9q3R7J00r2j70j9
6662a52J55N4j27L2J37K6j73r7O8J37n7o1N6J23j14j45J9J49M3j26L1J43l2j52
6686f3q0J27J10q0p5O1R3r4o5rP4N8q8j0J08K0j15j86J68J14l7p7P4N7j3k16N
6713a39J67K2j42RJ93m5j43p4N8J29M5j45N6Q4m3j95P2J48J0m2p5J13l0q2j52
6738b01J52R6N2j77N6J09p7j36lJ64R1j54OM2K8m2j77J41J21o1l2j8O0pj56mJ73
$$ y = [-76, -71, 26, 83, -18, -174, -41, 45, -62, -114, 36, 168, 66, -107, -55, 44, -10, -77, -2, 77, 123, -1, -110, -45, 93, -4, -77, 32, 153, 17, -145, -99, 26, -15, -119, -55, 65, 118, -29, -145, -29, 33, -35, -97, 41, 155, 83, -138, -89, 38, 7, -55, -7, 93, 106, -34, -117, -40, 96, -52, -98, -2, 100, 30, -95, -72, 29, 55, 24, -57, 136, 112, -40, -155, -64, 70, -8, -95, 0, 175, 79, -174, -71, 1, 72, -73, -12, 133, 82, -6, -119, -20, 114, 15, -68, 29, 129, 37, -133, -152, 3, 57, -70, -38, 99, 125, -48, -145, -77, 60, 3, -58, -2, 121, 7, -138, -119, 30, 73, -53, -22, 121, 89, -63, -143, -16, 94, 14, -61, 0, 93, -1, -66, -75, -1, 57, -31, -41, 67, 87, -28, -214, -46, 68, 31, -46, 28, 85, 72, -144, -139, 28, 50, -92, -83, 110, 65, -78, -152, -94, 35, 80, -65, -9, 75, 32, -163, -91, 57, 67, 25, -50, 63, 33, -49, -201, -49, 47, 99, -78, -22, 87, 10, -126, -129, 35, 126, -28, -22, 20, 48, 6, -171, -30, 91, 30, -2, -20, 40, 33, -123, -127, 46]
6765D6J02j21n0L4O6j52p2J06J27J3j80K2J24n4j21k8J92O5j43RM6mj17o0J80
6790C0N4qj09M0L5j6j05j8J99j1n7m8J3R6j21j40J80J02l5j05l5J05r0n7J6J28
6816D3Q5j90l3R1Nq0j7J12J30p7j41K9N4m9p3K8J41L8q0q2J0P6k1j30J01J68n9
6843G9q6m9N5Np6L9O0J20j03j46R5P0j23k7J06J05o9j18k5Q9L1o9k2Q5R9j14q7
6870g6J25m4n8o9J27J71r7j80qR1no3K0J30N0q8j27L4N0k4l4J18Q7j7k59J35K8
6897A7Mr7L9O5M7j04m2LP5q3m7J37J26o9j60L3L7M5j00J6J25N2n7j46%J79j09
6924a4m7J13Q0p8j02m9R6K5p6j6J23Kj27l1J01K6j7p8J20O7n2j02j16K03j1q1
6950d1j2O6J23k10l3M8Q4J7r7J06L1n0j22K0Q3Ll9p3J56O2j08j33J02M3om9Q2
$$ y = [46, 148, 27, -23, 11, 77, -75, -147, -41, 86, 99, -81, -59, 65, 11, -110, -138, 54, 119, -24, -15, 31, 27, -90, -150, 30, 84, 76, -33, 7, 42, 26, -79, -97, 102, 91, 34, -14, -1, 95, -26, -166, 14, 116, 81, -24, -59, 46, -44, -101, -85, 43, 128, -62, -95, -4, 1, -79, -96, 16, 146, 69, -72, -43, 11, -38, -111, -83, 58, 96, 16, -66, -56, 20, -1, -131, -30, 138, 79, -7, -56, -1, 4, -72, -33, 27, 147, 44, -102, -7, 63, -60, -87, 19, 124, 55, -63, -88, 1, 32, -37, -59, 26, 125, 11, -76, 49, 5, -53, -122, 5, 176, 79, -101, -109, -18, -23, -86, -66, 64, 114, 26, -101, -67, -17, -41, -75, 43, 130, 113, -146, -11, 17, 21, -76, -37, 28, 75, -29, -71, -68, 7, -76, -123, 14, 140, 71, -89, -56, -19, 26, -74, -58, 67, 119, 62, -84, -84, 95, -14, -61, 52, 132, 54, -48, -97, -1, 24, -52, -68, 55, 57, -70, -101, 0, 26, 9, -69, 51, 118, 66, -36, -152, 51, 40, -41, -53, 13, 136, -74, -107, -59, 25, 42, -55, 51, 82, 32, -90, -70, 13, 16, -23, -96, 60, 122, 14, -119, -17, 26, 20, -29, 53]
6977E3J13j21j13o2J38P4r4l1R9J17k36j08J46Q6j7n8L2PL4j04p8J47kl5l5J13
7003F5J9q6j13K2J55l9q9O8Q3lj59k6J42J2p2JP3j5l5j42N9J35m9q6R1P2n7j13
7031h7o9J34O1j0m1N2K3j25o1J05P6o3o7K1R9j6j52L0R9M0j14M4R4K8j42j08P8
7058g1J39mj01L9L6l7j09p2J73J67j83KO7m3k5r9Q5Q9No3%O7n6j07J0J34P1n3
7086F1j17R4kj14o9K2K01Lj57P3Q7j21k9l5J29P3m7r4N5J1p0n7j2J88qn8k6N4
7114C5n4n1j7R8R6r9m6P7K1j00m5J0J72ln1p0J05q7r5N2P4J34j34o4M3K9n5k6
7142e1N0J10q4q7n9J41q3j8K2J23O5j16m7J4Q0j18m3J20L1L0j54j5J09Mj12j3
7168a01J35R4j13j21J07J9o9o1R1J41rj24pJ9R1j63L6R6O3j35n8L4K5l4l5J22
$$ y = [53, 166, 45, -68, -130, 8, 82, -12, -43, 56, 173, -63, -171, -25, 61, 44, -14, 18, 25, 59, -45, -123, 24, 22, -13, -48, 65, 84, -2, -115, -93, 62, 23, -66, 2, 85, 82, -77, -103, 39, 51, -21, -20, 53, 38, 3, -139, -80, 55, 6, -80, 11, 83, 26, -87, -156, -22, 39, 29, -12, 40, 63, -62, -123, -18, 58, -5, -72, -51, 48, 32, -120, -90, 9, 49, -65, -21, 73, 101, -41, -149, -71, 68, 64, -37, 2, 38, 1, -108, -180, -7, 160, -23, -21, 46, 3, -22, -121, -36, 53, 58, -5, -5, 62, 6, -101, -91, 43, 114, 61, -56, 38, 36, -78, -147, -125, 76, 79, -78, -5, 82, -39, -68, -103, 26, 99, 52, -42, 13, 24, -46, -103, -115, 73, 65, 7, -19, 35, -19, -70, -87, 11, 107, 8, -38, 39, 60, -40, -85, -75, 97, 94, 43, -27, 78, -9, -104, -52, 22, 156, 22, -42, 1, 30, -25, -51, -1, 109, 25, -62, -121, 20, -63, -81, -59, 64, 129, 13, -34, -20, 60, -58, -101, 19, 50, 80, -74, -89, 20, 24, -88, -101, 34, 128, 15, -106, 1, 20, -49, -110, -19, 122, 113, -11, -18, 1, 92, -71, -35, 61, 124, -11, -69, -35, -10, -44, -79, 43]
7194D3L7J0o8q5Q2l5p4JJ17R0q2j36M4O5r9L5K3J88q6j13n4J33k6q6J8J01L1r1
7222a7Lo2Q3rp9Q8R2k2j28m7P3K1jm7J96k0j51n2J1J23l8j00M2R3L3j09p7J20
7250A9N2q1m6O8J34j52q7L3O3kq9P7J74n1k19L9N7L9j17K4J14L4p0j23P2P7J3
7277E2j45L0J43n5o8r3J27Q1j41QJ09Nl0p9j4Q8n6l1M1J22k7j24p7J75k4k9j1
7304b3Q1N3j35j00N7Q1K3o5J2J37q6q3n6R3L0rl7M7O8q9j23J18O3k5j03P1J11
7331A11J1k25J7N4J12j20m3Q2O3j05m4j5J75j7m0n6J28m0j85L7J27Q2q4j14J66
7356G7M3j37o1R8P5j06k0%J08n1n8p9J38O4o3n5P9R9j44j58J7J81J5r1K9K3L8
7383F1j40M0J5R5j7p4J6O9q2n2K7J07J5j03m1J12j7p6l7P2N1o1p0J19M6o1j37
$$ y = [43, 80, 90, 22, -63, 19, -16, -90, -89, 28, 118, 36, -100, -56, 9, -90, -55, -32, 156, 70, -43, -97, 36, 10, -76, -58, 43, 74, -17, -14, -76, 7, -2, -81, 7, 99, 77, -51, -98, -25, -4, -5, -52, 144, 124, -27, -79, -68, 55, 17, -83, -41, 52, 85, -24, -101, 19, 71, -10, -56, 12, 146, -6, -93, -60, 3, 1, -88, -11, 163, 112, -107, -68, -11, 28, -89, -65, 49, 83, 13, -110, -38, 39, 52, -93, -63, 80, 25, -43, -136, -9, 72, -69, -61, 48, 53, 23, -56, -70, 18, -38, -69, -28, 94, 67, -57, -134, 41, 17, -12, -23, 58, 111, -24, -124, -67, 14, 37, -28, -16, 121, 35, -48, -104, -11, 19, 10, -27, 20, 88, -1, -124, -6, 57, 32, -71, 0, 111, 122, -103, -86, -32, 80, -40, -83, -1, 62, -43, -87, -102, 73, 56, 16, -40, 88, 48, -137, -100, 27, 109, 25, -89, 77, 120, -17, -78, 20, 95, -11, -31, -31, 77, 26, -32, -111, 27, 91, 28, -27, 52, 151, 7, -151, -134, 47, 62, -29, 0, 23, 61, -79, -39, -24, 71, 54, -20, -4, 65, -17, -69, -42, 65, 80, -23, -64, 48, 31, -45, -82, -10, 41, -20, -90, 29, 75, 14, -123]
7410a23L3J95k6r5j5J02mj30j1M8J37n4j31Q9L4q8j10J47N7L8r6QL4qj73J17K6
7437AQ7j3j01rJ04r0q0M4R7N7j19lQ7mj17j5P9J12j17r0O3P1n6q5K6J20L8j32
7465d5pO3N1j36k5J21Q8m9j63P2J00r4j09P6J79o6r0k7R5K2p5q8P3J45p3n6M0
7492B2N5q1j14R0Q1ol6l5P0N0j66m1J29R7o7q4M6J2Jj32O8J58l8r0o5J06M3j18
7520d5l1J01J00r1j54Q2J25j12n1OJ50Kj08k8Q4L1j35l7J19J07j31k2lQ8l8o4
7546e5j8J43L2j39n2R7O2q2l0R3O1q2r4K5R6o0j15Q5J10J8j16j10J28no1pR0Q3
7574I7p7q9l7J99p1j41J41O9l5n1o7P7rm6m8J21O5o0j35N3Q8j2q7K3J58j8p0j36
7602i8P0J36j27k0Q9J2j5j70J17Q0j02m0K8J22l9p5n6N5Q4q5j9N7N5o7p8jJ04
$$ y = [-123, -90, 105, 79, -16, -31, 71, 67, -63, -74, -26, 111, 57, -74, 15, 49, -39, -149, -2, 55, 93, -3, 5, 39, 31, -142, -25, 1, 88, 75, -26, -35, 69, -21, -101, -57, 40, 97, -22, -25, 62, 58, -59, -74, 5, 117, 0, -90, -27, 44, -12, -97, -71, 49, 87, -45, -52, 11, 62, -74, -99, 22, 110, 61, -102, -30, 70, -24, -133, -57, 122, 56, -34, -61, 34, 56, -19, -107, -34, 111, 38, -18, 22, 77, -4, -118, -28, 53, 47, 11, -24, 46, 96, -70, -111, 18, 115, 48, -36, 10, 22, 23, -109, -41, 117, 79, -11, -76, 30, 73, -45, -76, 25, 125, 34, -120, -38, 87, -25, -76, -70, 80, 82, -26, -54, 30, 61, -74, -111, 8, 115, -16, -38, -41, 47, 9, -55, -73, 70, 102, -37, -89, 8, 70, -12, -42, 51, 112, 30, -64, -39, 57, -3, -118, -33, 77, 95, -21, -131, -3, -8, -69, -76, 14, 97, 20, -69, -106, 93, 22, -119, 22, 91, 56, 5, -62, 15, 6, -40, -88, 33, 98, 38, -97, -44, 44, 32, -55, -32, 126, 108, 38, -98, -28, 108, -19, -39, 50, 62, 47, -123, -6, 74, -28, -68, -40, 82, 43, -32, -88, -33, 51, -34, -53, 4, 59, -8, -86, -87, 17]
7629A7N8r9m8J87j2j23o0O1N9o7j02J59J04j70k3j7J04nr9O4J19Lj67n5J62qj6
7656B6j06J60M7j29j02J8J64m0p4Q3L6Pj53m8J38L2o5j23J25N8r0jl2J38n4k4
7682ik3J28p5j00m7P4Q2l2o3P4P5n3j17j0J79j6j26N2O9k0j43J8N6R1n1p0J0J39
7710I2j44j22R2J26K2r8J5Q1J1q3j20Q6P4k6l4N9M6m3j57K2R9O2r4j6J40Jj43
7737e2nQ3N0p0n6pJ40p9j15N8R1Oq1n5J21K5j54J7J09Q2j42l7Q1P4n0j27M7Q4
7765C8M1q6P3nL8j57m0J11M4n9o0M2J34j38r2O8J17j3p4l7P4J2n3j04J22J17j09
7792Dj9L1P7o7j32M7J08Jj07O5L3rq8k9R1J31j06o4O4N5p6q3L8J16Mj17kj7R0
7821C9q4r9J18J83p2j26JO2J2j62J1J79Qj04J9OL8n1j19J04Q7m1p2M4L0j2j15
$$ y = [17, 75, -24, -72, 115, 103, -20, -80, -19, 40, -27, -129, 30, 134, -36, -59, -76, 28, 23, -76, -12, 107, 110, -57, -112, 50, 42, 26, -80, 80, 127, -2, -104, -86, 78, 38, -36, 47, 83, 90, -63, -111, 27, 59, -6, -129, -4, 54, -36, -37, -69, 69, 15, -9, -32, 96, 21, -79, -126, -52, 30, -2, -65, 9, 84, 31, -86, -96, 83, 67, -59, -7, 62, 42, -101, -83, -27, 64, 13, -57, -47, 92, -52, -174, -82, 44, 66, -32, -17, 64, 75, -8, -128, -42, 32, 6, -28, 31, 77, 34, -123, -101, -2, 60, -34, -50, 90, 91, -52, -57, 26, 76, 6, -50, -57, 83, 4, -111, -53, 38, 44, -37, -92, 29, 54, -100, -83, 26, 108, -34, -71, 10, 84, 34, -93, -46, 38, 79, -7, 66, 61, 99, -58, -98, 13, 57, -2, -62, -20, 114, -24, -116, -48, 69, 56, -18, -55, 19, 31, -22, -126, -4, 113, 4, -15, 16, 93, 26, -106, -59, 49, 50, -57, 8, 41, 32, -56, -85, 6, 137, 31, -33, 31, 86, 10, -73, -35, 81, 85, -32, -34, -51, 39, -45, -144, -26, 157, 85, -41, -40, 22, 34, -128, -117, 62, 70, -34, -15, -9, 29, -22, -141, -37, 50, 9, -63, -19, 11, -1, -116]
7848a16K7J93k8q9j0M3R6j14j32J43P3n4r1K9O1l1j44J04R2Jp5LJ8Q5j22m5J01
7875A8O3m9j11M0R7o2r8%K32p8q4k2J13n8k1m4K8J68q3r3L0N7m6n4l8J63Nj29
7903e6lJ11l9kj13J17P4m2r6j7N3J2j17O4J14L2r6j17J47N7j12n1P9J10l9j99
7929a29N8J19m8q9O1J18L6j88n1J02N9p6n0R1Q7l2j33j1M7P8j23M6R5K4j40k9
7955g8K6J30p8p8J15J20p3j98N8J19l3j03K1J20O1j48j02J56rQr8M2J29o1j14
7980f8m5J66m2j13L8J89o4q7p3J05N0j00l5J35K0o4j30Q3O8k4m9l5J81k6j44n4
8006a18J15N8n9p9R7Q4r8m7o4J57k5k8ON9M7j74o8P9Q9l6n7Q6M6k7j40LJ24rq4
8035f3P2M0O5j65k6M9J28l5j26J07J1k1j17K5M9J4J0n7R8Np8j66R3J16k1q4J37
$$ y = [-116, -89, 104, 76, -13, -23, 20, 116, 2, -130, 13, 86, 32, -59, -30, 31, 0, -144, -40, 52, 53, -22, -19, -1, 84, -38, -83, 18, 81, 32, -79, -39, 58, -4, -102, -102, 130, 52, -32, -54, 59, 1, -20, -64, -36, 132, 49, -44, -14, 43, -3, -57, -95, 68, 73, -56, -59, 52, 13, 11, -102, 15, 89, 47, -49, -66, -13, -1, -118, -54, 60, 92, -4, -121, 26, 83, -29, -80, -1, 109, 70, -129, -71, 48, 0, -89, -28, 90, 126, -62, -113, -11, 48, -28, -78, 13, 100, 68, -65, -76, -29, 49, -74, -28, 67, 91, -49, -78, -52, 78, 0, -78, 37, 157, 84, -114, -56, 63, 30, -73, -52, 68, 129, -19, -121, 35, 26, 34, -64, -22, 107, 46, -68, -113, 53, 11, -102, -64, 125, 61, -26, -99, 6, 56, -44, -79, 56, 76, 12, -118, -35, 33, 9, -40, -75, 106, 80, -64, -118, -3, 55, -4, -83, 14, 98, 0, -47, -111, 46, 21, -7, -1, 58, 105, -69, -137, -58, 31, -5, -62, 24, 70, 43, -97, -94, 30, 21, -63, 9, 49, 114, -51, -77, -28, 100, 65, -61, 46, 57, 36, -81, -56, -7, 7, 17, -40, 58, 63, -15, -181, -88, 28, 7, -77, 60]
8062F0P7j24n7p6J23J02r9j1N1J7p6j07J32Q0o4r1J00Pk7j37O8J14l0j05K8J04
8088E9Oj25q9J51Q2p8m6M1N2Lj47J8J02N5p2J4j9N2j45j6Q0J17k3j00L5O4o3j24
8116a16N1J71j6q6l1K7K5r6K0M7Q8m8p9L0M4J7j67P9N9P9j28L1M0Mj04l2L6J57
8144A02q4l0j3Q2j15m5M1J28M4j20j07J57L4r4r0J04J43j29m1QQ3m7j09l2K49
8169A19l1o6p3N6O0j17p9Q4J51lq2k0O0q5l7J8Q2R9r3r6J07n
$$ y = [60, 137, 13, -44, -120, 3, 105, 6, -5, 46, 63, -13, -120, 12, 92, 28, -63, 37, 44, 17, -120, -52, 62, 32, -73, -45, 59, 65, -60, -149, 2, 84, 6, -40, 1, 53, 56, -91, -73, 29, 84, 12, 26, 7, 59, -86, -102, -22, 95, 72, -28, 7, 71, 8, -116, -65, 106, 90, 4, -27, 0, 25, -71, -51, -4, 84, 36, -43, -13, 31, 48, -119, -40, 19, 98, -30, 1, 41, 45, -59, -91, -55, 102, 18, -12, -25, 57, -58, -103, -62, 66, 110, -10, -117, 40, 74, -20, -110, -6, 137, 8, -33, -25, 58, 11, -98, -130, 119, 88, 22, -51, 5, 65, -52, -131, -47, 104, 101, 19, -1, 59, -26, -63, -45, 37, 136, 43, -53, 54, 49]
8191D9
$$ Imaginary data points
##PAGE= N=2
##DATA TABLE= (X++(I..I)), XYDATA
0@%%%%%%%%%Qj6J6k4L2m0M8n6P2q8J04j20J44j76K08k40K80l28L79m36N05n79
31c07O59p52Q51r60J082j216J366j530J707j904K118k348K600k877L181l511L871
48B030m268M704n181N708o291O938p661Q477r402J0455j1676J3110j4817J6892
62I018j9482K2815k7288L3643m3440O0658r9614L43324j4318o04763K97221R5529
74E3303k76624L4279M06444N4879j17674j90871j98713Q4045K79653j32683j65984
85a69946K83527J79644l38443j71551K23128J13553j58320j09093Q7960K22855
95A63314N3331k17428j12531J47378j6974k00180N5428K87889J16298j45517k41420
106a10412q4853J49110O0849j32950J19565L16372j18631m09439j8901K37961
$$ y = [0, 0, 0, 0, 0, 0, 0, 0, 0, 0, 8, -8, 8, -16, 16, -24, 24, -32, 40, -48, 56, -64, 80, -96, 112, -128, 152, -176, 203, -233, 272, -307, 352, -400, 451, -509, 573, -643, 723, -807, 900, -1004, 1114, -1234, 1366, -1511, 1670, -1841, 2030, -2238, 2466, -2715, 2993, -3298, 3640, -4021, 4456, -4946, 5509, -6167, 6943, -7874, 9018, -10464, 12351, -14937, 18706, -24734, 35924, -63690, 279634, 265316, -339447, -42226, 53303, -223321, -189042, 217402, 272281, 154607, -36264, -234977, -150932, 128721, -3962, -169946, 113581, 293225, -45218, -216769, 6359, 119912, -38408, -147501, -59541, 163314, 216645, -783, -113314, 34064, 17090, -183090, -127662, 160227, 276525, 131008, -110412, -195265, -46155, 14694, -118256, 1309, 317681, 199050, -210389, -229290, 8671]
116H671K4454n7978N5299N8507K1747p7837j94202K2661K78108n501k86117N2089
128a00099K97924n3696k56098K7162J59631m9289j47321J4737J86216J30454j21116
139H8505k16408J730J40302k6235r8920J26810K12478p2682k78107p4093J76426
150b0194Q8798q8989n329J42207L2835j71963j40063Q0393J60693r702j34586
161f5900K1601J68454j0744k03052m1281J59856L5008j35446j9104J66733R6446
172A72571j30789j72376K7992J31746j7636q6724R4406J62372o3588k19197o7957
183a69180J32887J03172n4740m5390J15256P3858j76637j74584J10853J71656
193H7151m2527r1290O0695Q9418m7463j39996n0778J24668J07202r4256q1770
$$ y = [8671, 33125, -24853, 30446, 88953, 110700, 32863, -161339, -138678, 139430, 133929, -152188, -100099, 197825, 144129, -111969, -84807, 74824, 25535, -121786, -107049, 79167, 209621, 88505, -127903, -126173, 14129, -12106, -111026, 15784, 228262, 155580, -122527, -196620, -20194, 68604, -20385, -25714, 116493, 149328, -22635, -162698, -82305, 78388, 68686, -65900, -44299, 124155, 113411, -89641, -130922, 28934, 63942, -71504, -90608, 76125, 172571, 41782, -130594, -102602, 29144, 11508, -75216, 19190, 181562, 117974, -101223, -169180, -36293, 66879, 12139, -33251, 82005, 155863, -20774, -195358, -84505, 87151, 44624, -46666, 14029, 103447, 55984, -84012, -134790, -10122, 97080, 2824, -78946]
204g8946J40051R3571j69428j43209R8399J16494l3607n3735M6572Q8611k4067
215H0706j67717p8187J50827J16559r7244n2867J27150L7726j59997j07173Q2598
226f7619J25058P461p8924K024J00971j8525j75822m2989J66523Q1499r7423l7653
238c5419R3570K9650j16960j06435N9994J44639J3055j06141M456J07742l7340
249E0811j62222j2610J51735O8088q0023n1505O5519M8140r4059j12831O2303
260f6654J45629q322j08026K1728J02924l9426j45828k2796J27574Q0286n8310
271B8779n4184O1762M4409j11903j17609P9658J58036J150j00209j80O7333m0518
283A6524j20601l359J42077Q3348q2669q5521N1152N5604q2715q6968P7719J25925
$$ y = [-78946, 61105, 154676, -14752, -157961, -59562, 56932, 23325, -30410, 16162, 104773, 80706, -87011, -165198, -14371, 102188, 4944, -47923, 79227, 116953, -43044, -150217, -67619, 57439, 64900, -14024, -12000, 88971, 70446, -105376, -148365, 18158, 99657, 2234, -35419, 58151, 87801, -29159, -135594, -75600, 69039, 82094, -24047, -19591, 88151, 50811, -111411, -124021, 27714, 95802, 15779, -35726, 29793, 77933, -16126, -128957, -66654, 78975, 70653, -37373, -15645, 87279, 47853, -97975, -120771, 6803, 87089, 28779, -25405, 36357, 80766, -31137, -148746, -69088, 88948, 90098, -10111, -10291, 57042, 16524, -104077, -107436, 34641, 117989, 35320, -50201, 951, 56555, -26160, -113128, -35409, 90516]
295I0516k2895j05331N490Q9041j3744j18889k7755J17989P7539o6158n8903O1207
307B8107M1617j02267j00697P4854J45120R119r5091j9056N3949l0989j08099
318a03433L150J46600Q3486q6566r5395L2597M8118o1707o2264Q0126J19243k5940
330G8015j16606j3934Q3301L904r3977j7361J08345O2394p5153o6593N4580M9935
342E6850p9413q7226O5122J28228L249r4569k2660N3446j9140r4469L787J37731
354E0936P7919q5833r6784K3819M4541m6811m5317P7137J09899k5753j22903l1735
366g0885P9373K0250p6507r147J04030M7087q6273o9886M8149N4250n1795o9719
378h1073N0054J11050Q85r9546k8003O2534l509q4736K421J23467O5839q2541
$$ y = [90516, 67621, -37710, -32220, 56821, 43077, -75812, -103567, 14422, 91961, 25803, -33100, 28107, 69724, -32543, -133240, -58386, 86734, 95853, 762, -18294, 35655, 4666, -103433, -100283, 46317, 129803, 43237, -52158, -19561, 28557, -33150, -95414, -15288, 103955, 78015, -38591, -52525, 30776, 34680, -59297, -76658, 31687, 94081, 18928, -47665, 6915, 56850, -22563, -109789, -44667, 83561, 86810, -7759, -30419, 23027, 3887, -90582, -86795, 50936, 128855, 43022, -53762, -29943, 14598, -32213, -77530, -393, 109506, 83753, -39150, -70885, 8488, 28738, -47769, -56916, 47114, 94201, 7928, -61958, -13809, 40441, -11354, -81073, -31019, 80031, 80916, -18630, -46633, 15901, 12392, -72344, -69923, 53544, 119383, 36842]
390C6842r3597J7929M7592l3429m0556P1801J02729l0030j22526l6603O9445L0652
402B0249n0748p062Q9263M5124r2233q8518N0508P3750m2067n8329N6087Q4141
414H0165k2959q7021k2921N2948J9803n8044j8052R8776O9884q5934j01409L3883
426d0881N9692l8757l5677P2955Q2552l6131j07608l7937O0012M2509l5076r739
438b4086P8301L7918r5016r1284M7092Q4148j9525n3670M1025P2697l4853r8040
450e5293r794P3629K2851n0473j2501O6696M1300o5409q3373K5007P5534j5855
462A2319n8681M5967R0277l4940j12895j6722P2491K5129l5893J467N9816K2509
474G0844p3470q0028K8672Q4714K093n6486K0869P2251k7962j06165j1642R0471
$$ y = [36842, -56755, -38826, 8766, -24663, -65219, 6582, 109311, 79281, -43245, -79848, -10403, 20249, -30499, -37561, 51702, 96826, 4593, -83925, -33417, 40333, -1734, -60063, -3976, 80165, 57206, -29815, -52736, 212, 20015, -38029, -56081, 42695, 112579, 26645, -74764, -40881, 18811, -19946, -55623, 17332, 99884, 63753, -43855, -81792, -21780, 20729, -14347, -24086, 54215, 92133, -2883, -94167, -47075, 37073, 17548, -36122, 4903, 77600, 42747, -55293, -65087, 8542, 31393, -19080, -31581, 35115, 76415, 11006, -72367, -47360, 28174, 12319, -46362, -395, 89882, 54942, -57953, -74675, -2184, 22945, -12948, -11481, 48335, 70844, -2626, -82654, -53982, 30732, 32825, -23661, -2792, 69459, 41497, -64668, -76310, 14161]
486A4161K9805n7364j0652O1978J8836o4552n6302K5479O3474L159n2676J0724
498a3930P9976r236j12959k5623R1318K8988n6624K917O5793P241o9788n9381
510g1308K0271P2249J7422n0392O521O9478k3747j09289j2215R2069L4758m4994
522H23j2019M5203J5208o3729o3758L6244Q1088l048n2652J8146N1697k8966p9840
535e5603j4002O8587N1191l3296l8087M5150L4876p9065p1427O0853P8438j8330
547B9285l6020J7641K2610k2388n8365k4726O9410P1848m4100n7781N1649L3588
559E2651q5572n2398P0441O3890j7157l2143o27K0152n001n8738k6076Q0256O3843
572G3521n6605m9646M8464K1851o8369l8833N4783O3496o551m9610j0086L8982
$$ y = [14161, 43966, -13398, -24050, 37928, 56764, -7788, -64090, -38611, 24863, 28022, -24654, -13930, 66046, 56810, -56149, -81772, 9546, 38534, -18090, -15173, 50620, 57861, -11927, -71308, -51037, 21212, 38634, -11758, -5237, 64241, 40494, -68795, -81010, 11059, 45817, 823, -11196, 34007, 49215, -14514, -78272, -42028, 39060, 36012, -16640, 1506, 53203, 24237, -55603, -69605, -1018, 50173, 16877, -21210, 23940, 58816, -20249, -91676, -30823, 47615, 29285, -6735, 10906, 33516, 11128, -47237, -71963, -2553, 69295, 25195, -32586, 19063, 52651, -32921, -85319, -14878, 49012, 31855, -288, -915, 19237, 14236, -44502, -70578, 9678, 73521, 16916, -32730, 15734, 37585, -30784, -69617, -14834, 48662, 42111, -7499, -17585, 21397]
584B1397m113o5437q369P9551L7473n2842l4620L4367K2037m3832m4499L4340
596b4547P0849j881o0492k403M9892j5081o9573N9P4198L4062l9942l3765K1026
609B402K0484l9398m5053L9359P7000n864o6062n855M4454j1378n6231L521O6867
622B4246K9521m3331l8000K5708L0527l6419m8604L3599O9437p279n5638L341
634a2892M1215j8413n9301j239O4318M1800k8796m2652J0891K3414l9692m6425
646f7772N0557Q4232j3181o8732p121K9078j5084l3921J4419N6602L1238m0122
658B0193n7033J3943M4343k6523m6468M2441O6904k2974n7973N236L3415j1702
670C802m0938k319N5249M3539l2600n1200J2366K4434l7581l1892N3243O9994
$$ y = [21397, 17284, -48153, -56522, 23029, 60502, 7660, -26960, 7407, 29444, -14388, -58887, -24547, 46302, 44421, -16071, -18474, 31418, 16337, -53236, -53177, 21021, 55083, 15141, -18624, 2402, 22886, -16512, -61565, -22206, 54794, 48930, -17132, -22987, 21467, 10089, -46142, -42621, 24246, 53767, 10436, -27564, -1856, 28671, -7748, -56352, -22753, 46684, 39405, -16233, -12892, 28323, 9910, -49391, -50630, 13688, 55488, 26692, -15960, -5069, 18345, -21347, -67772, -17215, 67017, 53836, -14896, -22017, 7061, -8023, -41944, -27525, 29077, 60315, 20193, -36840, -22897, 21446, -5077, -51545, -9104, 57800, 34826, -23147, -17911, 15504, 3802, -37136, -39455, 15794, 59333, 26733, -24467, -12101, 12333, -25248, -57140, -3897, 66097]
682F6097j1235o4898k6980K4521P780k8628J0471O9434K3538o6624n3340K3487
694b6377L2331j0412j3805K4732L8495j1456o1350j7863N3995J8209n2765q432
706c4698O4054K0603m9561k7143K0265J1903j9714j9340K6226N8839L931o9499
718a4134l3490L9846J1903l5883J5396O6544J0205o2272m6794J5250L6335L348
730F254j6750J8967L8400k1074o4937o811N4018J7054l6055q933L9771J9105l7994
743A015l6164K1294L2384k1507l2035L1688N3450j2301n6713j7864K6399J1187
755H33j7375N808M7802K1261n5325n9643J9051M8212k607j7517K7615K8741l2242
768A4614n5968m442M5703K6531k2219j6727K8685J8295m0907l7453K9197L8962
$$ y = [66097, 54862, -10036, -37016, -12495, -4715, -33343, -22872, 46562, 70100, 3476, -49864, -26377, 5954, -4458, -18263, 6469, 44964, 33508, -27842, -45705, 8290, 26499, -26266, -34698, 29356, 49959, 398, -26745, -6480, 5423, -14291, -33631, -7405, 51434, 55365, -14134, -47624, -7778, 4125, -31758, -16362, 50182, 60387, -1885, -48679, -33429, 2906, 6254, -10496, 8471, 46871, 25797, -39140, -45951, 8067, 25121, -10934, -19867, 19904, 39009, 1015, -35149, -13855, 18529, -2978, -35013, -3325, 50125, 37824, -18889, -36753, -10354, 833, -16542, -10734, 37068, 58329, 3004, -56639, -37588, 10624, 8017, -9500, 18115, 46856, 14614, -41354, -45796, -93, 26438, 4219, -12508, 16177, 34472, -6435, -43888, -14691, 24271]
780B4271j8735k9962K3434M0565j1940m9327j5583L0683J7155j9650j097M2519
792C2333J6406n2407m9907J9973M4540K722j5622J6797K3920k6238n5532o208
804d9223N1345L0249k3216j6134K3712Q279m0008k9280K9626M0489q886l0429
816a3476R363L2734r498m6105r910L8418J8684k3525o486L3726J2309m3536l9981
829d7283J9775M2641L841j9850R046K3110k1054n1203m689N0106K9221k1951j6727
842e017J8185N536l5893k6476K8665M3246l499l1541J309K6038r979m1353l782
855c4561M2393K0707k4288j3844K2944J0170l4669l1220K2323M2364J537k5876
867b020K117K1638j4957m2625k389M6108K6365k1987j9276J5271P380l1823k5167
$$ y = [24271, 5536, -24426, -992, 39573, 27633, -21694, -37277, -6594, 10561, -9089, -10186, 32333, 48739, -3668, -53575, -33602, 10938, 13660, -1962, 14835, 38755, 12517, -43015, -49223, 2122, 32371, 9155, -6979, 16733, 25012, -14996, -44276, -14650, 25839, 16953, -13476, -4113, 28621, 19123, -26982, -36892, 1526, 20210, -3315, -9801, 23925, 36234, -7302, -47283, -27508, 15133, 18974, -876, 8170, 31280, 10226, -40977, -45666, 4440, 33661, 11710, -5017, 13168, 18704, -17189, -43665, -15000, 28246, 24747, -6794, -5485, 20553, 10574, -30779, -34561, 7832, 28539, 4251, -9593, 13351, 23521, -11148, -42368, -20045, 22319, 23856, -2020, 97, 21735, 6778, -35847, -38236, 7872, 34237, 12250, -7026, 8245, 15625, -16198, -41365]
880d1365K7631M2721k080l0162k271J9537r974l5463j182M3393K4588k4231k1953
893a0811J5240R542k9269k2927K7697M0754k845l0698m973J8009p306l1576N30
906b8633M2155K2222k5560k3354J3403J1618k4083k2120K4422L9683l025l1742
918e014l526J8990q940l0990K320M0133K2563k1126k5170O294J1329k0480k0738
931c4355K8262M3000p836l7668n617J7318n200j9954N498L2643J7300k4015k8991
944a9615J0842K1059j7918k3333K3840L4925r223k8549j193J4834m470k2792k791
957b4384L4920K7063k2534l0639R179J1945k2077j2669L1152L3299p578l2571
969d894j5530J2958Q052j5689p8L6081J5845l4742k7054J6287J6437j2556j1848
$$ y = [-41365, -13734, 28987, 26907, -3255, -5526, 14011, 4037, -31426, -32608, 10785, 35373, 11142, -10811, 4429, 13971, -15298, -38225, -10528, 30226, 27381, -3317, -8290, 9719, 2413, -29163, -28633, 13522, 35744, 10184, -13170, 233, 11851, -12232, -34352, -9930, 29753, 26728, -5014, -8540, 10450, 1510, -29480, -27160, 12973, 35536, 14410, -10760, -4466, 6863, -13617, -34355, -6093, 36907, 29071, -8597, -14214, 3104, -2096, -22050, -16552, 16091, 33391, 9376, -19615, -8773, 12286, -5632, -28965, -5125, 29800, 20577, -7972, -9165, 5669, 1199, -21593, -24384, 10536, 37599, 15065, -15574, -6395, 5550, -16527, -29196, 1956, 35255, 27677, -4894, -20424, -7466, 586, -15103, -15181, 20900, 36745, 2003, -25051, -8764, 7673, -4883, -16731]
982a6731J5235K4684k158k8625r400K1445K270k7927o57L7802J7581k2760k2406
995a1647J315O991q233r961K1466L8224m952m5098j6098K0586M101j0971J3663
1008f14K7614K451k7624k8305L336K7090M527j8477R864K9019j2555l7740J271
1021b0143K6369p54j7540K956K1618J1914j4890k5391r13J7984l533j5076J9437
1034B038L4409j0460m2519j2747K0250R441o078Q658K2745N66l1931k6571J0419
1047b1780K7203O470j0360L266J4105r747l0808m327L0217J3767k0411q361K1781
1060A1015Q775k2500j6100J0996J2609n270p979R915K0151j298l0378j8964J9218
1073i810J9594j0668l745K5966O394l6591k4516J8666K2326P0l722M121L885p127
$$ y = [-16731, -1496, 23188, 21030, -7595, -16995, 4450, 6720, -21207, -21864, 15938, 33519, 10759, -11647, -10332, -3341, -11574, -21535, -69, 38155, 33203, -11895, -27993, -7407, -3306, -14277, -614, 27000, 29451, 1827, -26478, -23142, 3948, 8475, -10002, -138, 28881, 16326, -21414, -20143, 6226, 5472, -12068, -9112, 12506, 24420, 9530, -15861, -16774, 1210, -2323, -17399, 2038, 36447, 25987, -16532, -29279, -9029, 412, -5666, 2992, 25737, 26303, -5628, -32199, -21780, 5423, 11893, 1533, 4799, 18904, 9157, -21651, -25978, 4239, 18006, -2405, -10766, 11015, 19790, -2710, -18810, -7814, 4795, -475, -8454, 1461, 21612, 20314, -10064, -29028, -9810, 9784, -884, -4629, 21337, 27731, -8860, -33376, -14710, 7616, 7686, 3964, 8085, 11970, 4843]
1087D843k0708r878K4341K3436j7248j8333K1220J4186k7815j8265J9922J4236
1099I937j0703n583J1305J1728l763k2203j6032J5319K0332o903o588J9656P220
1112B3722l0928k5160J5239K6000K702q170M582P201j3422k3723j027K3718J5942
1125A6676p503j0942N219P723j4116k0955J0085K8164j485k0233P713J8975j3269
1138F052k5762Q66J7279R723R1l931K189N872j5205k7143R278L6599M226k1046
1152i12L756J2467j8174k3637Q089K4455J1454o141j0965o56M581j0802j5404
1165b1889J2447K6945o72k0333n64J3492o608k0521L53K2151J1196j0264p788
1178b055O502J923j4263j2359J0132K2470N896j5132p576R464k500k1208j142
$$ y = [4843, -15865, -25743, -1402, 22034, 4786, -13547, 7673, 21859, -5956, -24221, -4299, 9937, -766, -6349, 4956, 16684, 12921, -9282, -25314, -9995, 10337, 3434, -3154, 16502, 23722, -7206, -32366, -17127, 8873, 11575, 3405, 7987, 15188, 1766, -21957, -22984, 734, 16676, 9173, -1769, 3450, 11173, -2943, -23898, -13813, 14351, 12866, -7367, 346, 19321, 6052, -19710, -18844, -1565, 8158, 8249, 4318, 6507, 12379, -2826, -29969, -20691, 15908, 20134, -912, 2844, 15311, -2863, -26500, -18411, 6044, 17498, 11357, 392, -264, 4317, -6485, -21889, -9442, 17503, 16831, -3502, -4066, 9426, 2818, -17703, -17350, 4801, 15997, 5733, -2055, 4447, 6370, -7893, -20252, -10120, 12350, 18246, 3114, -4462, 5002, 2502, -18706, -19848]
1191a9848K7879J4018j5387j1429O142J018j2042o878J1384J9244L381j6751q913
1204h182J0690J093j8478k197K4962J2792j5195j1662O892L213j2219q496J2147
1217d640J9222J476j5535p095P860l70j4528j097K1672J3527j3015j4406M573
1230b356N772j0555r083J2673J9506k84j5779o528O393n94j1612k63J9928J3775
1244B0993j1949j6811K051O970q034q065J3560J9862k383j8608p234P219J332
1257a097q615J033J7423J0673j2692j6596K534R257n778q756J1175J8245k350
1270A4456j7411o227P334J124q667O92J7054J1364j1917j7306Q88Q416m448o100
1284a0748J1840J7048l389j8966q510P601N100n764M92J5331Q494j4411j6708
$$ y = [-19848, 8031, 22049, 6662, -4767, 1375, 2393, -9649, -16527, -5143, 14101, 17482, 731, -8182, 2508, 3601, -14877, -17074, 7888, 20680, 5485, -6177, 715, 3928, -8291, -16787, -4640, 14582, 16058, 523, -6572, 1288, 918, -13610, -14707, 6965, 20492, 7477, -6929, -2356, 3416, -7139, -16222, -3549, 15957, 15673, -106, -6634, -241, -835, -12447, -12710, 7218, 20993, 9044, -7767, -5716, 1254, -6780, -14845, -1285, 18577, 16194, -2414, -9648, -2429, -1097, -9712, -8679, 8744, 19417, 6725, -9871, -7337, 1920, -3858, -12614, -1439, 16806, 14456, -2955, -9182, -1848, -724, -9391, -8699, 8355, 19719, 7802, -9504, -8616, -200, -4648, -10748, 1092, 18140, 14751, -4215, -12725, -5124, -24, -5788, -5296, 10035, 18529, 4118, -12590]
1297a2590L258J0365k426n680Q307J3772k473j7271q109Q898N711p193o13J5452
1311I408Q449j3676j5730J703Q890m89m161P707J3841k679j9460r244J0387P408
1325B354n280M83J2667M984j3510j4946K110J1805J898o090M713J2563l324j8094
1339g667o405J0686O562m807n78J0323N942j1416j5681J375J2563J788n850N785
1353B620J1466m783j7650o807R793R121k269j981Q280N295j2782j5485L886J3832
1367B536K062n429L577Q283l996j5426o528J0765J0233l810l751Q371M503j2339
1381i49j2984L972J2100L167m709J113P962k379j6077o909J2603J0095m547k707
1395b49P235K102j1130j1453K706J3164N322o180n16Q189l394j6319m487J2867
$$ y = [-12590, -9332, 1033, -1393, -7073, 1234, 15006, 12533, -4738, -12847, -3949, 1762, -5431, -6044, 9408, 17857, 4181, -11549, -9846, -956, -1445, -5606, 2101, 15942, 13263, -6197, -15441, -5054, 2354, -2926, -2443, 10224, 15208, 1698, -13248, -11138, 667, 2565, -3525, 1188, 13751, 10427, -7667, -14072, -3386, 3176, -1631, -2209, 8114, 14056, 2640, -13041, -11666, 897, 2685, -3165, 2620, 14086, 9303, -8347, -15154, -5361, 3760, 1491, -490, 7790, 13085, 303, -15182, -11296, 2536, 4598, -831, 2746, 11029, 7033, -8393, -14921, -4156, 6077, 2267, -1484, 6887, 11390, -949, -13933, -9961, 2139, 5306, 597, 1710, 9672, 7293, -8784, -15693, -3090, 7005, 2458, -249, 6986, 9088, -2042, -13495, -10789, 2375, 7697, 1517, 1001, 9190, 5796, -10523, -15010, -2143]
1409b143R523k879l189L646K153r386j1975L941J5356L853p638l50N985m208j1974
1424i285l175J0294J0695k335p592L413O051r805j2726O810J3592L07n085J373
1438B532K797l230r108o290Q690J4310j758r350M342M783j2542j0878Q825J3249
1452F372K131m189k750L94j399q719m770J2025J3059m874r370K870L372q145p892
1467a1885N707J2465L123p477l239M861j717j0792k307J1062R135j539n980j578
1481a61K229m597j0245L546J7753M927j1661l745M917n137r268L099J1194P390
1495A0241j073q671n176L817q64q479M152J6344K250j2792m174N436j821p535
1509h345R63J0252P283l287p832k323K635k031n751L200J3320N037j1054q239
$$ y = [-2143, 7380, 4501, 1312, 4958, 7111, -2275, -14250, -10309, 5047, 8900, 1262, 912, 6897, 2689, -9285, -12460, -2166, 8529, 6194, -1398, 2015, 8066, -1739, -14465, -7655, 5937, 6244, 1159, 2532, 5329, 2099, -7009, -13299, -4609, 9701, 7943, -1407, 2935, 7718, -4824, -15702, -6877, 6372, 8503, 4314, 1564, 1958, 559, -8160, -12930, -905, 12154, 7280, -2090, 780, 4152, -3993, -11885, -6178, 6287, 9410, 1933, -1306, 3555, 1838, -8954, -11261, -199, 8936, 7397, 1417, -161, 2068, -2529, -12774, -9228, 8525, 13452, 1791, -1954, 2963, -2174, -11442, -8343, 2851, 10241, 9168, 497, -4679, -862, -1726, -10205, -6053, 10291, 12541, -251, -4425, 1011, -810, -8345, -7382, 2870, 10153, 6866, -966, -3289, -654, -2685, -8436, -5236, 8084, 13121, 2067, -6172]
1523f172N126J562q841K18J3706O413p205o935j475N25L16j923J229J0508N618
1538A2670j1535r669O734L835q396o21J2238N682o577p287j166K322k54l337K700
1553b661J0333L193r760p710L003L614l770k231Q812R465n782j2294L75N913l484
1568b984l617P057P637j35n692p508j418O027j72n648Q162J2794p912j4685K505
1583e589N918m601n92P780M854p7n464r816l47Q913q97n252Q853R281q894j1592
1599g522J571M506m33o85L133O745K326r268r439L386N644k269J12Q162M677n805
1615D841j0534m592O145N823k457J383R723j120j4387n771O594M394Q83J735J657
1630D317J685k747j0317l549J0786N305p095O59R165k125j0407k869L547L280
$$ y = [-6172, -1046, 516, -8325, -8107, 5599, 12012, 4807, -2128, -3603, -3078, -2762, -4685, -3456, 7052, 12670, 1135, -8534, -1800, 2035, -6361, -6982, 5256, 10938, 4361, -2926, -4092, -1770, -2024, -5361, -2661, 7672, 10865, 1105, -6605, -3602, 12, -3758, -5989, 2823, 12288, 6506, -5788, -5413, 500, -2984, -6601, 456, 8093, 7958, 2266, -5242, -6660, -633, -805, -6453, 1709, 14503, 6591, -8094, -5589, 329, -4272, -4864, 2916, 7770, 7693, 2229, -7587, -7934, 979, 82, -5170, 3683, 12964, 4070, -7522, -5951, -1445, -1878, -2563, 570, 7315, 9641, 373, -9066, -5680, -36, -2305, -2193, 5969, 10646, 4841, -5693, -10285, -4140, 1683, -774, 609, 10332, 9212, -5175, -10946, -4352, 42, 925, 2660, 4317, 6002, 3255, -7062, -10611, 175, 5480, -1615, -956, 8209, 6084, -4323, -7192, -3645, -365]
$$ [...]
8191H4
##END NTUPLES=NMR FID
##END=
