##TITLE=1H_E3e-N1
 CDCl3
 8 sc, 
 23.11.2023
##JCAMPDX= 6.0         $$ Bruker NMR JCAMP-DX V2.0
##DATA TYPE= NMR FID
##DATA CLASS= NTUPLES
##ORIGIN= UXNMR, Bruker Analytische Messtechnik GmbH
##OWNER= root
$$ XWIN-NMR		Version 3.5
$$ Thu Nov 23 15:12:09 2023 Russian Standard Time (UT+4h)  she@DPX200
##.OBSERVE FREQUENCY= 200.1313
##.OBSERVE NUCLEUS= ^1H
##.DELAY= (6, 6)
##.ACQUISITION MODE= SIMULTANEOUS
##.ACQUISITION SCHEME= undefined
##.AVERAGES= 8
##.DIGITISER RES= 18
##SPECTROMETER/DATA SYSTEM= spect
##.PULSE SEQUENCE= zg30
##.SOLVENT NAME= DMSO
##.SHIFT REFERENCE= (INTERNAL, DMSO, 0, 15.7039)
##AUDIT TRAIL= $$ (NUMBER, WHEN, WHO, WHERE, WHAT)
$$ ##TITLE= Audit trail, XWIN-NMR		Version 3.5
$$ ##JCAMPDX= 5.01
$$ ##ORIGIN= Bruker BioSpin GmbH
$$ ##OWNER= she
$$ F:/spectra/data/she/nmr/H-F/1/audita.txt
$$ ##AUDIT TRAIL=  $$ (NUMBER, WHEN, WHO, WHERE, WHAT)
(   1,<2023-11-23 15:11:17.06 +0400>,<she>,<DPX200>,
      <created by zg, POWCHK disabled, PULCHK disabled
       configuration hash MD5:
       00 E9 B6 7A A2 85 ED C7 34 08 36 98 17 FE 4E 26
       data hash MD5: 16K
       97 32 7F 40 9F BF 6F 7A EE F6 F7 3E 73 95 FB AD>)
$$ ##END=
$$ 
$$ hash MD5
$$ 80 55 60 3B 5F 8F 01 B1 F3 1A CD 1C 16 CC BC 7B
##$RELAX= 
##$RELAX= 
##$RELAX= 
##$RELAX= 
##$RELAX= 
##$RELAX= 
$$ Bruker specific parameters
$$ --------------------------
##$DU= <F:/spectra>
##$EXPNO= 1
##$NAME= <H-F>
##$PROCNO= 1
##$TYPE= <nmr>
##$USER= <she>
##$AMP= (0..31)
100 100 100 100 100 100 100 100 100 100 100 100 100 100 100 100 100 100 
100 100 100 100 100 100 100 100 100 100 100 100 100 100 
##$AQSEQ= 0
##$AQ_mod= 1
##$AUNM= <au_zg>
##$AUTOPOS= <>
##$BF1= 200.13
##$BF2= 200.13
##$BF3= 200.13
##$BF4= 200.13
##$BF5= 200.13
##$BF6= 200.13
##$BF7= 200.13
##$BF8= 200.13
##$BYTORDA= 1
##$CFDGTYP= 0
##$CFRGTYP= 5
##$CHEMSTR= <none>
##$CNST= (0..31)
1 1 145 1 1 1 1 1 1 1 1 1 1 1 1 1 1 1 1 1 1 1 1 1 1 1 1 1 1 1 1 1 
##$CPDPRG= <>
##$CPDPRG1= <>
##$CPDPRG2= <>
##$CPDPRG3= <>
##$CPDPRG4= <mlev>
##$CPDPRG5= <mlev>
##$CPDPRG6= <mlev>
##$CPDPRG7= <mlev>
##$CPDPRG8= <mlev>
##$CPDPRGB= <>
##$CPDPRGT= <>
##$D= (0..31)
0 1.2 0 0 0 0 0 0 0 0.06 0 0.03 0 0 0 0 0.0002 0 0 0 0 0 0 0 0 0 0 0 0 
0 0 0 
##$DATE= 1700737876
##$DBL= (0..7)
120 120 120 120 120 120 120 120 
##$DBP= (0..7)
150 150 150 150 150 150 150 150 
##$DBP07= 0
##$DBPNAM0= <>
##$DBPNAM1= <>
##$DBPNAM2= <>
##$DBPNAM3= <>
##$DBPNAM4= <>
##$DBPNAM5= <>
##$DBPNAM6= <>
##$DBPNAM7= <>
##$DBPOAL= (0..7)
0.5 0.5 0.5 0.5 0.5 0.5 0.5 0.5 
##$DBPOFFS= (0..7)
0 0 0 0 0 0 0 0 
##$DE= 6
##$DECBNUC= <off>
##$DECIM= 32
##$DECNUC= <off>
##$DECSTAT= 4
##$DIGMOD= 1
##$DIGTYP= 9
##$DL= (0..7)
0 120 120 120 120 120 120 120 
##$DP= (0..7)
150 150 150 150 150 150 150 150 
##$DP07= 0
##$DPNAME0= <>
##$DPNAME1= <>
##$DPNAME2= <>
##$DPNAME3= <>
##$DPNAME4= <>
##$DPNAME5= <>
##$DPNAME6= <>
##$DPNAME7= <>
##$DPOAL= (0..7)
0.5 0.5 0.5 0.5 0.5 0.5 0.5 0.5 
##$DPOFFS= (0..7)
0 0 0 0 0 0 0 0 
##$DQDMODE= 0
##$DR= 18
##$DS= 0
##$DSLIST= <SSSSSSSSSSSSSSS>
$$ [...]
##$SUBNAM2= <"">
##$SUBNAM3= <"">
##$SUBNAM4= <"">
##$SUBNAM5= <"">
##$SUBNAM6= <"">
##$SUBNAM7= <"">
##$SUBNAM8= <"">
##$SUBNAM9= <"">
##$SW= 18.0517328524113
##$SWIBOX= (0..15)
0 0 2 0 0 0 0 0 0 0 0 0 0 0 0 0 
##$SW_h= 3612.71676300578
##$TD= 16384
##$TD0= 1
##$TE= 0
##$TE2= 300
##$TE3= 300
##$TEG= 300
##$TL= (0..7)
0 120 120 120 120 120 120 120 
##$TP= (0..7)
150 150 150 150 150 150 150 150 
##$TP07= 0
##$TPNAME0= <>
##$TPNAME1= <>
##$TPNAME2= <>
##$TPNAME3= <>
##$TPNAME4= <>
##$TPNAME5= <>
##$TPNAME6= <>
##$TPNAME7= <>
##$TPOAL= (0..7)
0.5 0.5 0.5 0.5 0.5 0.5 0.5 0.5 
##$TPOFFS= (0..7)
0 0 0 0 0 0 0 0 
##$TUNHIN= 0
##$TUNHOUT= 0
##$TUNXOUT= 0
##$USERA1= <user>
##$USERA2= <user>
##$USERA3= <user>
##$USERA4= <user>
##$USERA5= <user>
##$V9= 5
##$VALIST= <valist>
##$VCLIST= <CCCCCCCCCCCCCCC>
##$VD= 0
##$VDLIST= <DDDDDDDDDDDDDDD>
##$VPLIST= <PPPPPPPPPPPPPPP>
##$VTLIST= <TTTTTTTTTTTTTTT>
##$WBST= 1024
##$WBSW= 4
##$XGAIN= (0..3)
0 0 0 0 
##$XL= 0
##$YL= 0
##$YMAX_a= 425692
##$YMIN_a= -408963
##$ZGOPTNS= <>
##$ZL1= 120
##$ZL2= 120
##$ZL3= 120
##$ZL4= 120
##$ABSF1= 10
##$ABSF2= 0
##$ABSG= 5
##$ABSL= 3
##$ALPHA= 0
##$AQORDER= 0
##$ASSFAC= 0
##$ASSFACI= 0
##$ASSFACX= 0
##$ASSWID= 0
##$AUNMP= <proc_1d>
##$AZFE= 0.1
##$AZFW= 0.1
##$BCFW= 1
##$BC_mod= 2
##$BYTORDP= 1
##$COROFFS= 0
##$CY= 11.3945322036743
##$DATMOD= 1
##$DC= 2
##$DFILT= <>
##$DTYPP= 0
##$F1P= 15.7292609196834
##$F2P= 12.9074282941183
##$FCOR= 0.5
##$FTSIZE= 0
##$FT_mod= 4
##$GAMMA= 1
##$GB= 0.15
##$INTBC= 1
##$INTSCL= 1
##$ISEN= 128
##$LB= 0.24
##$LEV0= 0
##$LPBIN= 0
##$MAXI= 10000
##$MC2= 0
##$MEAN= 0
##$ME_mod= 0
##$MI= 1.114404
##$NCOEF= 0
##$NC_proc= 0
##$NLEV= 6
##$NOISF1= 3.799351
##$NOISF2= 2.8
##$NSP= 1
##$NTH_PI= 0
##$NZP= 0
##$OFFSET= 15.70392
##$PC= 1
##$PHC0= -24030.46
##$PHC1= 13.45269
##$PH_mod= 1
##$PKNL= yes
##$PPARMOD= 0
##$PSCAL= 0
##$PSIGN= 0
##$REVERSE= no
##$SF= 200.130013532006
##$SI= 16384
##$SIGF1= 3
##$SIGF2= 2
##$SINO= 400
##$SIOLD= 16384
##$SREGLST= <1H.CDCl3>
##$SSB= 0
##$STSI= 0
##$STSR= 0
##$SW_p= 3612.71676300578
##$SYMM= 0
##$S_DEV= 0
##$TDeff= 0
##$TDoff= 0
##$TI= <>
##$TILT= no
##$TM1= 0
##$TM2= 0
##$TOPLEV= 0
##$USERP1= <user>
##$USERP2= <user>
##$USERP3= <user>
##$USERP4= <user>
##$USERP5= <user>
##$WDW= 1
##$XDIM= 8192
##$YMAX_p= 0
##$YMIN_p= 0
$$ End of Bruker specific parameters
$$ ---------------------------------
##NTUPLES= NMR FID
##VAR_NAME=  TIME,          FID/REAL,        FID/IMAG
##SYMBOL=    X,             R,               I
##VAR_TYPE=  INDEPENDENT,   DEPENDENT,       DEPENDENT
##VAR_FORM=  AFFN,          ASDF,            ASDF
##VAR_DIM=   8192,          8192,            8192
##UNITS=     SECONDS,       ARBITRARY UNITS, ARBITRARY UNITS
##FACTOR=    0.0002768,     1,               1
##FIRST=     0,             0,               0
##LAST=      2.2672688,     0,               0
##MIN=       0,             -408963,         0
##MAX=       2.2672688,     425692,          0
$$ Real data points
##PAGE= N=1
##DATA TABLE= (X++(R..R)), XYDATA
0@%%%%%%%%%%%%%%%%Lj1J6j6J6k0K8l2L6m4N2o2P4q4R6j12J28j46J68j92K17k43
38a28K73l07L41l80M25m74N26n82O45p14P90q69R55j055J161j276J406j548J705
57H94j884K087k311K568k868L214l616M084m619N162n406L497K3678M01212j91486
72B34206k36091J61532l24501k44109M35606K10902k23163R6226M319l37184M1299
83a80958K62255j00128j0093J70641j23443q5579K07726n4737k40714M7769R1111
94a6150k5129J27098R0504j51105j33238k9239J2460J46970J40780k3547o1326
105G8078j12167j55392P7089J91303j9832m2387M0501j05104n4105J61058O994
116F6036j27225N9352J5264j01287J35897J41001j79142j14779N3894q4605L1439
$$ plain form
0 0 0 0 0 0 0 0 0 0 0 0 0 0 0 0 0 0 3 -8 8 -8 8 -12 16 -16 20 -24 28 -34 40 -44 52 -60 68 -78 90 -102 115 -128
38 -128 145 -162 179 -201 224 -250 276 -306 339 -375 415 -454 501 -554 607 -669 737 -811 894
57 894 -990 1097 -1214 1354 -1514 1700 -1916 2168 -2451 2711 -2695 802 24480 425692 234206
72 234206 -1885 159647 -164854 -408963 26643 237545 14382 110608 114927 -222257 -180958
83 -180958 81297 -18831 -28924 141717 18274 -67305 140421 85684 -155030 -107261 -16150
94 -16150 -41279 85819 176323 25218 -108020 -137259 -124799 22171 162951 139404 78078
105 78078 -34089 -189481 -112392 78911 59079 16692 57193 -47911 -102016 59042 66036
116 66036 -61189 -1837 13427 -87860 48037 189038 9896 -104883 -50989 -135594 -104155
127a04155K85258L0456k19431m1498k3492j06584J39155K14285n8690q8665K159
138B8798j23689o7380J61134P4502p0961L6129L0061r8621p154O8341o8419n9850
150i7109J06108P7531l2132l659k2585j23606n6839J05677J11035M0449J6309
161A21179o7789j56188n6629R6614R5056N1171L3339o3396j22578k1051M8093
172d2179J7126M5569N7770l9177n6715J9074j958m2385J0700K6488o04L7817M4873
185G6399l6927p1122l4670k484L7274O9389M4151j1642n9317o9522k0759L1786
197d7444N0055N7985J7504n5824m6199k214k0742NO0694K1285j9261K7316n971
210C7189p8098j2779L5627j6150K9899Q7108j6291p0588j0192l8209m2560Q2717
$$ plain form
127 -104155 181103 211559 -7872 -49370 -72862 -179446 -40291 173994 115304 26639 28798
138 28798 -94891 -162271 -1137 73365 2404 38533 68594 -30027 -37181 31160 -37259 -97109
150 -97109 8999 86530 54398 50739 28154 -95452 -152291 -46614 64421 104870 121179
161 121179 53390 -102798 -159427 -62813 32243 83414 116753 53357 -69221 -90272 -42179
172 -42179 -25053 20516 78286 39109 -17606 1468 -490 -42875 -32175 -5687 -6291 31526 76399
185 76399 39472 -31650 -66320 -68804 -31530 37859 82010 70368 11051 -58471 -79230 -47444
197 -47444 2611 60596 78100 22276 -23923 -26137 -46879 -46874 13820 35105 15844 43160 37189
210 37189 -40909 -53688 -18061 -34211 -4312 82796 66505 -4083 -14275 -52484 -95044 -12327
222a2327Q5656k3160r063m160q8998l8838O6484K7612J1654O1516j4153q7623
234b5400j6457P674k3725M3992P4066p468k4160p267n8219m1881M5521M5287J6195
247B8158K9363j0142o0098k7229J185k121L4561M9073J698j6997j5815l9775k6060
260e4199J8448K5062L0267M1297k807n0901m1736k4401j88N3087N9926O830k3597
273C7088l7243n2706j4686M3810M3160K1577R972k6169m5164j0904P489j671J6205
286i242K8909P303J92j946l2162l8281q77K4865L6430M4969Q840n0969o2439l0439
300g4847J0804N6628O8476J6983m0822n4806l9080j891M2241M8697J5519j3975
312C3927k6899k7423r331R454P345L650J3758K0430J2230o900l1281m1663j6466
$$ plain form
222 -12327 73329 50169 41106 36946 -52052 -90890 -24406 3206 14860 76376 62223 -25400
234 -25400 -41857 -34183 -57908 -13916 60150 52682 28522 21255 -36964 -78845 -33324 11963 28158
247 28158 57521 47379 -12719 -39948 -38763 -40884 -6323 42750 44448 27451 11636 -28139 -54199
260 -54199 -35751 -10689 19578 60875 58068 7167 -34569 -58970 -59158 -6071 53855 60685 37088
273 37088 -155 -52861 -67547 -23737 19423 41000 50972 24803 -20361 -31265 -23776 -25447 -9242
286 -9242 19667 26970 27162 25216 -6946 -45227 -46104 -21239 15191 60160 69000 18031 -44408 -74847
300 -74847 -64043 -7415 61061 78044 37222 -17584 -56664 -58555 -16314 32383 47902 33927
312 33927 7028 -20395 -29726 -20272 -12927 -9277 4481 24911 37141 30241 -1040 -42703 -59169
325e9169K8185N4298M2570q55n0135o6542l1541K8536O6069N6332Q203m5256o2516
338c1821l0509J8001M1870L3541O741k0176k4588p920L688J280j878l94Q417K4464
352B0716K4260p109m0830m5659j7603L0605O4476M6616j0469n8260o4824k4784
364h2865L7338O9905M7598m990m9790n7150k0457K4949M0422K6128j297k1101
376H690j4344K726J553p526p493l598J2388L5003K3690j8973m3988m0854j5073
389f7799L8395P2098L6243k4908n5736n7840k0753M7445P0562K7598j6372l9496
401I437m8878j5705L4591L4667O169j431q404j5773L658J0890j8539k3984R745
414b3557K6337K5477K3665j2603o0513m5587J1390M2242N0892L8901k1311p3674
$$ plain form
325 -59169 -30984 23314 65884 65029 14894 -51648 -83189 -54653 11416 67748 75951 30695 -31821
338 -31821 -62330 -44329 -2459 31082 37823 17647 -6941 -14861 -11173 -9893 -11771 -12165 -3748 20716
352 20716 44976 37867 -2963 -48622 -66225 -35620 28856 75472 65003 6743 -58081 -82865
364 -82865 -45527 24378 71976 66986 17196 -39954 -60411 -35462 4960 31088 29791 8690
376 8690 -5654 -2928 -1375 -8901 -16394 -19992 -7604 27399 51089 32116 -11872 -52726 -67799
389 -67799 -29404 42694 78937 54029 -1707 -59547 -80300 -32855 37707 65305 48933 9437
401 9437 -39441 -55146 -20555 14112 20281 18850 10446 -5327 -1669 9221 -9318 -33302 -23557
414 -23557 2780 28257 51922 39319 -21194 -66781 -55391 -13149 37743 76644 55333 -18341
426a8341m8400P616L5312N0320L9324j8970n4339k5590K109O738K3612K3895r270
439A4016j2899J1372K89k1561j0580l452l289K9612M7191J640m1585l9090k8300
452e6636j180N4018O3886M443m0055m1845l7798n731N2732N4561P4k3141k0922
465B406l2181j0485L3701J9672j3138N974J4441j4453o408R428k4226k6125K7780
478a3614L4577N848R146j1269n6977k8867L2896L3719K3031K5301j9261n7825
490b3295k0301J7904J2758K2339K8571j0671l1821o018J215j2725L193K1543Q083
503A0775L375J6114n486m1218k4655J1071J4476K6559M3779l348n7589l2766k181
516d1094l015M0233O5747o484m8767j3621k4339l1125M5191N6897j4917o180J5001
$$ plain form
426 -18341 -66741 -59125 -23813 26507 65831 46861 -7478 -33068 -30959 -24221 -609 23286 14016
439 14016 1117 12489 12778 -8783 -19363 -22815 -26104 3508 50699 52339 10754 -28336 -56636
452 -56636 -57816 -3798 60088 64531 24476 -17369 -55167 -60898 -8166 46395 46469 23328 2406
465 2406 -29775 -40260 -6559 13113 -25 5949 20390 5937 -471 8957 -15269 -41394 -13614
478 -13614 20963 26811 35957 24688 -32289 -61156 -28260 5459 28490 53791 34530 -23295
490 -23295 -43596 -25692 -12934 9405 37976 27305 -4516 -10534 -9319 -22044 -18851 2692 10775
503 10775 14150 30264 24778 -16440 -41095 -30024 -15548 11011 54790 51442 -6147 -38913 -41094
516 -41094 -44109 -3876 61871 55387 6620 -7001 -31340 -62465 -17274 39623 24706 18526 33527
529C3527m7324l8788L8209J4347j4246M3349K3731n0478j7489J0154l6290O41
541d0657O5646J3910k3646J0072k1701n5534J2374M5364M448J1273K0489l0920
553A1118m0417L954J0389L306K1106J8262p233j6508j1376o143o027Q69K2646
566C946K0112q560m771J775l1277k0531L1232J5400o911L0558P694n3179j3315
579b7827K2379k2415N594O1889j464l9737J3770j4085n4902K5983N4834j1736
591A2283P736K9921n0405n2308K8045J3329m870N1618K3466n3316k4299N356k6496
604c9940P755N6976J2136j9932K938j9587m1159N858L0600R207J6497J9397k1035
617A9711l7074j1687P68P277K9941L0905m314k9110k2229j2969m798K2365L6962
$$ plain form
529 33527 -13797 -52585 -14376 -29 -14275 29074 52805 2327 -15162 -5008 -41298 -40657
541 -40657 24989 38899 15253 25325 3624 -51910 -39536 5828 10276 21549 42038 11118
553 11118 -29299 -25345 -14956 -11650 9456 27718 20485 3977 -7399 -13542 -19569 -18700 3946
566 3946 24058 15498 10727 12502 -18775 -39306 -8074 7326 415 30973 38667 -14512 -27827
579 -27827 -5448 -27863 -22269 39620 38156 -1581 12189 -1896 -56798 -30815 24019 12283
591 12283 20019 49940 -465 -52773 -24728 -11399 -16269 35349 58815 5499 -18800 -13444 -39940
604 -39940 -32185 24791 36927 16995 19933 346 -40813 -34955 -4355 4852 21349 40746 19711
617 19711 -17363 -29050 -28282 -21005 8936 39841 35527 6417 -15812 -28781 -33579 -11214 25748
630B5748P306j8105j0762j5267k0458J2321K7964J41j365J3591j1636k3236N166
643h592J827j4879J4964K9749k285r257l68k4686k5949J7881L0600J0049Q774
656B7828n88l3813l0366R558K0517J0773J9054J1641k4853k7625K177P82n817
669b0732K3484K5478j1526r156M656k7112k6391K4844K4373J445K3522O701n0266
682a0680k9314J6703K740J5825M9829k81m7783j3035m692j9240K9290M6178j0792
695B4748j6960N952k5128k3196K5175J3458r259J9685J3190k3608r647L32k0493
708b5751J253L2342J4262J562N97k7002l1224L767J7902J9451K5146o31k8135
721C539j8243r674k660K4347K3455m144l144l198k2666p885J3560k308K738K5690
$$ plain form
630 25748 33054 14949 4187 -11080 -31538 -19217 8747 8888 7523 21114 9478 -13758 -8592
643 -8592 -6765 -21644 -6680 23069 20784 11527 11159 -13527 -39476 -21595 9005 19054 27828
656 27828 27240 -6573 -36939 -27381 -6864 3909 22963 34604 9751 -17874 -15697 -14915 -20732
669 -20732 2752 28230 16704 7548 12204 -14908 -41299 -16455 7918 9363 32885 39586 -10680
682 -10680 -39994 -23291 -20551 -4726 45103 44822 -2961 -15996 -20688 -39928 -10638 35540 24748
695 24748 7788 13740 -11388 -34584 -9409 4049 -5210 14475 27665 4057 -5590 -5258 -25751
708 -25751 -24498 7844 22106 23668 24265 -2737 -33961 -30194 -12292 7159 32305 31674 3539
721 3539 -14704 -24378 -27038 -2691 20764 16620 13476 10278 -12388 -20273 -6713 -9021 -6283 19407
735A9407L000j6453l90j3651k6539J4404L1183M539Q678M872l7586k9764J5663
748b2637J3678J0964L1134J058l6812j3494J216j0067J5533L0855k874j0604M108
761A2058j5757k0488R634R548L20J9885J4044j7653j7020q616j4444O742L2122
774A0375J6571l374q204k3663k3723O513K1454J5865J4124j439k3416j7172j803
787a7892J108J0903J8354M176n390l250j1244j4227P65Q195Q839J5883Q705j2302
801A2623j7771j2907p965J0094K5958J5643k666j2214k1104j7535N039J8961J5725
814A1881J0245j213j7328j7258m721K676R271J5687R235k897q299j1887j2806
827a7414k494J0972J4910J2211L611j0949j9725j3031R11J2189J8296J3866k591
$$ plain form
735 19407 22407 5954 5564 -8087 -34626 -20222 10961 15500 24178 29050 -8536 -38300 -22637
748 -22637 -8959 2005 33139 34197 -2615 -16109 -14893 -24960 -9427 21428 18554 7950 12058
761 12058 -3699 -24187 -14553 -5005 -4685 15200 29244 11591 -5429 -14045 -28489 -21747 10375
774 10375 26946 23572 15368 -8295 -32018 -25505 -4051 11814 25938 24499 1083 -16089 -17892
787 -17892 -16784 -5881 12473 16649 11259 8009 -3235 -17462 -16697 -8502 337 16220 24925 12623
801 12623 -5148 -18055 -26020 -15926 10032 25675 23009 10795 -10309 -27844 -22805 -3844 11881
814 11881 22126 20913 3585 -13673 -18394 -15718 -6447 9240 18475 15578 7279 -4608 -17414
827 -17414 -19908 -8936 5974 18185 21796 10847 -8878 -21909 -20998 -8809 9487 23353 20762
840B0762j6254j6115q601K103J4309J6350N546m011q754j3640r518L638R328R169
854D312J1160L234j1630j3702q148m765P565J9807J2249j504q329j6657j6544
867b2952K295J5592J3584J1134J835j5868j7768n793J040R426J7709R038m783
880A4489q515j2361j2304J174J2075J1849J0493K453j1820j5653r493j301J1058
893g856J7580R340j307r697j7941j1752N383J1625J2107J2589j501j6394j2007
906i831n662k678J1682J8898N024l887n546j5679j3437O073J2255Q616J1655K212
920A9695j6300j4636l746j028Q291J8506Q354o635q366r884j1673M46J4120J2302
934I446M253Q88o431j6177j0550N421R365P645J2369L448j6550j3992j418l212
$$ plain form
840 20762 4508 -11607 -20208 -18105 -3796 12554 18100 14089 5335 -8305 -17823 -14185 -4857 4312
854 4312 15472 18706 7076 -6626 -14774 -19539 -11974 7833 20082 18578 10249 -6408 -22952
867 -22952 -20657 -5065 8519 19653 21488 5620 -12148 -17941 -16901 -7475 10234 19272 14489
880 14489 5974 -6387 -18691 -17517 -5442 6407 16900 19353 7533 -8120 -17613 -18914 -7856
893 -7856 9724 19064 17757 8060 -9881 -21633 -16250 -4625 7482 20071 18570 2176 -9831
906 -9831 -15493 -18171 -6489 12409 17433 13546 8000 -7679 -21116 -15043 -2788 5828 17483 19695
920 19695 3395 -11241 -14987 -16015 -7724 10782 19136 12501 4135 -5749 -17422 -16976 -2856 9446
934 9446 13699 14587 8156 -8021 -18571 -13150 -3785 3860 16229 19677 3127 -10865 -12283 -15495
948a5495N116K1821Q463j0555l869p443j8611K704J9627L820M202J1735j3314
961H201k2498J696J954l899K0375J9241j2003j0699k706j8589o280K3656J4345
974A2794J44N885r148k4890n310R559O149J3611J2469p628j3574q461p929K227
988a4102J2407R334P219P00j3577j1094k784m658Q495K1908L260p848l21j5705
1002f766j9495J4067J7722j927J1840P620k8284j3867J4798n425j725K8927J474
1015A8959k3700P782K818k6484O128K4446j0831qK4887j3313k6575R691r2j4253
1029b0545K3692K3669j6452q546J961k2607p493K7461J1628l870Q398o997k5355
1042a5056l524J1186K818Q811J3390k786j2273r099o773j315O963J2765J3434
$$ plain form
948 -15495 -10379 11442 19905 9350 5481 -1962 -20573 -17869 1758 5578 9780 21515 8201
961 8201 -14297 -12601 -10647 -14546 5829 25070 13067 2368 -338 -18927 -25207 -1551 12794
974 12794 12938 18823 9675 -15215 -20525 -10966 -4817 8794 21263 13635 61 -8400 -16329 -14102
988 -14102 -1695 7639 14858 15558 1981 -9113 -11897 -16555 -8060 13848 17108 9260 8939 -6766
1002 -6766 -26261 -12194 5528 3601 15441 23061 -5223 -19090 -4292 -9717 -11442 17485 18959
1015 18959 -4741 3041 5859 -20625 -14497 9949 -882 -890 23997 10684 -15891 -6200 -6292 -20545
1029 -20545 3147 26816 10364 1818 3779 -18828 -26321 1140 12768 8898 17296 10299 -15056
1042 -15056 -18580 -7394 -4576 4235 17625 14839 2566 -6533 -13306 -14621 -7658 5107 18541
1055A8541j44j4059j1663r589o278J6181K4505K442o044n664k3286j5082K0394
1068i746J7478M37J1816l78l0814j0037J6406k066R16K4086n24k2200L394L361
1082B129j8687L358K0980l030j780J4187r998k2387L968O106m233J5874J7155
1095B3642j4745j5039K209p938n350K0447J3288j0247k868K340j3616p188J2422
1108b643M648l664R260O410j1332p490K20p591j032J8072J1759m841m118q038
1122c80j8462l023J9411J3685K778K659r599k2110o046J2519R303P539R642n116
1136A2800j7207o556J611j206P271J4720J840p457k073p190j3660K963J5867N910
1150G633K882O300j1246k2058j294J1401M186J0828J3576j0997k0239k055J331
$$ plain form
1055 18541 18397 4338 -7325 -16914 -23192 -7011 17494 19936 13892 8228 -15058 -30140 -9746
1068 -9746 7732 8169 19985 19607 -11207 -21244 -4838 -6904 -5988 18098 17574 -4626 -1232 2129
1082 2129 -16558 -13200 7780 4750 2970 17157 7159 -15228 -11260 -5154 -9387 6487 23642
1095 23642 8897 -6142 -3933 -11871 -17221 3226 16514 6267 3399 5739 -7877 -15065 -2643
1108 -2643 2005 -1659 7601 14011 2679 -4811 -4591 -12182 -13214 4858 16617 11776 7658 -380
1122 -380 -18842 -21865 -2454 11231 14009 16668 7069 -15041 -21087 -8568 735 8274 17916 12800
1136 12800 -4407 -10963 -9352 -10558 -3287 11433 13273 5816 3743 -3447 -17107 -14144 1723 7633
1150 7633 10515 16815 5569 -16489 -17783 -6382 -2196 8632 22208 11211 -9028 -11083 -9752
1163i752j459J3996J3883p923q007O83q743o272J1049O060l237P325M918j2335
1177A86p577K622m453K97J6019Q235p506n198n691j1765N21J5017Q942R73rq082
1193B531j3288k646P183N769O044O599k688j0345n644j521j582N041J1918N169
1207A2540m184m649p362j0719M50J2785R252L441J476q870j5859l837P257O838
1221a441R610Q457o560j3265n302k393K34J1025J1199j214m218l713r937o427
1235a3945O703Q319M281N637O2j0945r605j090K044O332J1230M603n993q050o834
1250g251n076L132J0554P563J357k360p105r575l082M902O820O668M901k444r208
1265b04p747k549J928P357R800L497m471p358p465m662L448R283P014K151k177
$$ plain form
1163 -9752 -11211 2785 16668 8745 738 1421 -7322 -13594 -2545 3515 278 7603 12521 186
1177 186 -7391 -4769 -9222 -8925 7094 15329 7823 2625 -3066 -14831 -14310 707 9649 10622 10613 2531
1193 2531 -10757 -13403 -6220 -451 5593 12192 9504 -841 -6485 -8006 -9588 -4547 7371 12540
1207 12540 8356 3707 -3655 -14374 -13924 -1139 8113 11554 13030 4160 -11699 -15536 -8279 -1441
1221 -1441 8169 16626 10066 -3199 -8501 -10894 -10660 365 11564 10350 6132 2419 -7518 -13945
1235 -13945 -7242 1077 5358 10995 11057 112 -9493 -10583 -8539 -2207 9023 13626 7633 -417 -7251
1250 -7251 -12327 -9195 1359 8922 10279 7919 814 -8761 -11843 -6941 -121 6547 11448 9004 -204
1265 -204 -7951 -10500 -8572 -1215 8585 12082 7611 253 -7212 -11874 -8426 857 7871 10022 7845
1280G845p392q559k577L721O192P146M615k705p898p143l702J414P912R384L504
1295A1757l517p539q892m464M483R428P440K510l712r082p661r39M320O691O944
1310G767K205m280o244n279l353J805O867O564L438r21o588q931m281K254P230
1325a747R534N044m058r225q364l763M496J0234P700J091m595q529p028o9M774
1340d505N955N711J542l826n359m666l540J442O310O277M133k01p416r359l948
1355a1450K210P830J0787M480n747r652q357l448O346J1354O173k78n065r223
1369d040o213K277N040M628N427Q47m885l951l093m017J230O797N136L170O15
1384H968p030r926l043L214O997R665M199o193r667o963j647O197R665N227q80
$$ plain form
1280 7845 453 -8106 -10683 -6962 -770 6376 10991 8286 388 -6755 -10457 -9043 -1131 8253 11757
1295 11757 8240 701 -8191 -12655 -8172 1256 8696 11206 7494 -1588 -9249 -10188 -5868 823 7767
1310 7767 9972 5692 -552 -5831 -9184 -7379 -512 6052 9490 8569 1981 -6950 -11231 -8977 -1747
1325 -1747 7787 12831 8773 -452 -8816 -12579 -8083 2151 9851 10942 6347 -2182 -9210 -9279 -4505
1340 -4505 1450 7161 8703 4877 -482 -5148 -8688 -7246 -936 5341 9474 9273 1857 -7502 -11450
1355 -11450 -9240 -1410 9377 13857 8110 -1542 -9899 -13347 -7001 4353 10526 10248 5183 -4040
1369 -4040 -10253 -7976 -2936 1692 7119 7966 3081 -870 -3963 -7980 -6750 47 5183 8353 8968
1384 8968 1938 -7988 -11031 -7817 -820 8845 13044 6851 -2816 -9779 -11426 -5229 4436 9663 8783
1399H783n487p358l734J499L450M656L816qj661k443n491l937K026L696N412P280
1415A0499o01r583p186l629l90J0067J2849K07o610o190r725l835J0891R886Q84
1430G534J093l724j1006l068N309J345K790O700p39m748m92l678o028K539O418
1445B45L675M577O64q619q678k161K876Q265R088J219n631q659p605J091P585
1460b068N592M431Q60p973o243J676j087k87Q179L049m312K817K12j1140k517
1475h811O354p84M254J2284m106j3057j028k671m818J3227J3167o377m790q13
1489B031j2056l688J4161N175k557N707k532j2941m6N016l505L477R836j632m386
1504B060M67n977p130L976P125M677M780j655r085p535k699M060J0285O532m27
$$ plain form
1399 8783 3296 -4062 -7796 -6297 -2847 1809 5625 5617 3956 1513 -3978 -7915 -5889 -2193 3219 10499
1415 10499 9898 315 -6871 -10500 -10890 -823 12026 12233 5623 -567 -10292 -14127 -3236 6650 7534
1430 7534 8627 4903 -6103 -9171 -3862 -2517 273 6973 6234 1486 994 -2684 -8712 -6173 245
1445 245 3920 8497 9161 542 -8136 -10297 -7421 844 9932 11151 5520 -3139 -10744 -9653 -2068
1460 -2068 3524 7955 8815 842 -5401 -3725 -4812 -5099 3080 6129 1817 4634 4846 -6294 -8811
1475 -8811 -2457 -3241 1013 13297 9191 -3866 -4894 -7565 -12383 844 14011 7634 2844 2031
1489 2031 -10025 -13713 448 5623 3066 8773 6241 -6700 -6746 -1730 -5235 -1758 8078 6446 2060
1504 2060 2527 -3450 -10580 -6604 521 5198 9978 8323 -762 -8297 -10996 -6936 3349 9881 9454
1519I454l682r394q286M106P016K656O284J997j0676n250L169l905K60J1875J536
1534G160o153M012j920j2944J812R131k523L716J0625p827j2281L277p70m498
1548i183J1860R640q418l648J657r276l155J1287L756l057M827r6j0059k243L767
1563b341j649J694Q356J724n037k718k971n281R95Q400N438n5r55m237q909k811
1579a0357O909N612K452M481j792j0991m768L037N45M058J0148M38q502l058k847
1594d635n936N019J1155J440j583M63p717r017L559O864J940M929L415p648q048
1609e800J87O14O59P168N794l381m534j560m404l195N868O952L38K12M01p547
1625b228o925M139M630N98N764L273q940n881L113j975r33R671L028o877R63J394
$$ plain form
1519 9454 5772 -3622 -11908 -7802 -786 1870 8154 10151 -525 -5775 -2606 -6511 -6251 5624 7160
1534 7160 1007 5019 3099 -9845 -8033 1098 -1425 2291 12916 5089 -7192 -3915 -4685 -9183
1548 -9183 2677 12317 3899 251 1908 -7368 -10523 764 4520 1463 6290 6194 -3865 -6108 -2341
1563 -2341 -3990 -2296 6060 7784 2747 29 -2942 -8223 -7228 1172 6610 6555 5600 1363 -7546 -10357
1579 -10357 -3448 2164 4616 9097 7305 -3686 -8454 -5417 -4872 -814 9334 9772 1270 -1788 -4635
1594 -4635 -10571 -5552 5603 7043 5460 5923 -1794 -10811 -7252 -388 1552 6481 9896 2248 -5800
1609 -5800 -5613 -4999 -4340 2828 8622 5241 707 -853 -5257 -8452 -2584 4368 4706 4918 5319 -2228
1625 -2228 -9153 -5014 -384 214 5978 9251 311 -5570 -2457 -4432 -5365 4306 7334 457 1420 2814
1641B814q637j204P773p86l65Q461j120r942r50k4m362O685J1293j627n255j855
1657H99p689m991Q395Q651J137P52k952r011l823L787L845L647L326p38l676l548
1673a989k304n9J259K684N174K434l527l961l863n163K589J0235M451j142j130
1688E688p982r650L948R045K537L843J711j0326p421M566J803N7P288J378p273
1703g88K86K524n814j394N179r02N73P724n63q655k647j208j972P763R912j508
1719H510o035m491o507j038Q958P114K43j810m771o034PM229K393J473P75j140
1735A876q44m79k150k002l78J738N071M486j312n333n907m299K681R434O535n18
1751H599m738q185o642L333Q700M961J445k112p313m755K687L078J193K529L98
$$ plain form
1641 2814 -5823 -7027 746 -40 -405 8056 6936 -3006 -3956 -3980 -8342 -1657 9636 8009 2754 899
1657 899 -6790 -11781 -3386 5265 6402 7154 4202 -4809 -8632 -4845 -1000 2647 5973 5235 1559 -1989
1673 -1989 -4293 -4352 -3093 -409 4765 7199 3672 -289 -4152 -9315 -6726 3509 7960 6818 5688
1688 5688 -2294 -11944 -7996 1049 3586 7429 9140 -1186 -8607 -4041 -2238 -2181 5107 6485 -788
1703 -788 -502 2022 -3792 -5186 -7 -909 -336 7388 6825 -1830 -4477 -5685 -7657 106 10018 8510
1719 8510 2475 -2016 -8523 -9561 -603 6511 6754 4944 173 -5861 -5854 -1625 768 2241 3016 1876
1735 1876 1032 553 -1597 -3599 -3977 -2239 2832 7318 6006 673 -5234 -9533 -6852 2582 9117 8599
1751 8599 3861 -4324 -10966 -7633 1067 6028 7473 5361 -1952 -6707 -4020 -942 251 2780 3178
1766C178k614L24R31l576k993J130J975L741N430o26p468o035j678K625P953P510
1782I807j107p127o843l581K208P671N907m18l971m380k923P95L236J858O5J72
1798A369M59oo61k526l100n54L603N454L404j536o309o722j805M660P916N372
1814I018j166o592p210k609L475O480M468j61l543m001j925Q89J904J119N70Q67
1830A583R08J12j418l314l112M08M247N184K689k240o584n968m69N064O867M388
1846H345j573o623n871j289L056N256M064l25l362k886j556k42J260J541O97J331
1862A823J566o67k733k992k158Q76M767M962J153l051n507m852JN055N906K756
1878F905j644n041m958j255K647M014K958O78j861k868j868o58K99J451K341K077
$$ plain form
1766 3178 564 888 1819 -1757 -4750 -3620 -1645 2096 7526 6900 -568 -6603 -8281 -5656 2297 9807
1782 9807 8700 1573 -5270 -8851 -6643 1028 6935 6517 2546 -1834 -4757 -3962 -726 1132 1197 1369
1798 1369 1828 1822 1161 -1365 -4465 -5019 -1416 4038 7442 5906 -403 -7125 -8930 -4270 3646 9018
1814 9018 7852 1260 -5950 -8559 -5084 1396 5864 5703 2160 -1841 -3766 -2877 -973 146 716 1583
1830 1583 2491 2603 1185 -2129 -5241 -4833 -586 4598 7287 5047 -1537 -7505 -7974 -2910 3957 8345
1846 8345 6772 149 -5722 -7011 -3955 1301 5365 5040 1678 -1208 -2764 -3006 -1746 -205 492 1823
1862 1823 3389 2722 -11 -3003 -5161 -4285 482 5444 6597 3546 -1961 -6813 -6812 -1757 4149 6905
1878 6905 5261 220 -4738 -5993 -3346 668 3626 4304 2443 -425 -2293 -2951 -2652 -1201 1140 3217
1894C217M36j254l068l422j018K609M241L265O38l306n379l073J208L699M470
1909C263K667j566m419l503j120J128L256L527R74j323k038k848k084N97K669
1924h20K529J965O17k586m162j743M54J839L910L117j087l326k644k161m84L563
1940a019M131Q44m95j441m182k992J574K708K242L228M60m302l930r39j87K500
1956a800N359J930k529k389k814k886J427M403J852N02N94k533l858p49R35N69
1972a987K903L513k09k893k666k728j439L227N545K342j181l013m637l291K242
1987d272N447L033L49j291m244l778J162K939J099J537J254k138j875P01j229
2002a306k290J777L006P68J733O16n106n014J101K868L069M859P48o795n176K52
$$ plain form
1894 3217 3653 2399 -669 -4091 -5109 -2500 1741 5006 5644 2338 -3041 -6114 -4906 -1207 3263
1909 3263 5930 4364 -55 -3558 -4678 -3550 -294 3233 4207 2884 846 -2002 -4086 -3489 -820
1924 -820 1709 3674 4291 1705 -2457 -4200 -3746 -1907 2003 5120 4033 707 -1937 -4098 -4582 -1019
1940 -1019 3112 3956 3461 2020 -2162 -5154 -3580 -872 1370 4598 5058 756 -3174 -4113 -4300 -1800
1956 -1800 3559 5489 2960 571 -2243 -5129 -3702 701 2553 3055 3649 1116 -2742 -3491 -2556 -1987
1972 -1987 916 4429 4220 1327 -1339 -4067 -5506 -2279 3266 5608 4427 1414 -3223 -6514 -4272
1987 -4272 1175 4208 4557 3266 -978 -4756 -3594 -655 444 1981 3235 1097 -778 -77 -1306
2002 -1306 -3596 -1819 1187 1955 3688 4304 -802 -5816 -4715 -1847 1222 6081 6829 34 -5142 -4890
2018d890R71L401N854M80n225k587o9j248J459L959l36j771J865N85l192j310
2034b054Rj707K072O281J646l851l381l760l127M730Q517J901k843l520o007l450
2050h544N480P014Q61q44j702n265k233M113K220j208J187R84j833K68J297l224
2066a429l389J951L577K430K439j220o787m942J939M809M596L356j985p534m931
2081g120K101L982L347L089j267n890k155K753P20M6K048j038k571L100K974l680
2097D39k804K16j933J760P984J680o124l499k428k855N521R221n15m786k186m593
2113d902k421O720N429k125r55k44m050m87M062o77k619K342J869p15J361n28
2129B060n438k638L372M108L207J604l590o892l251K804N676M453R66l509o003
$$ plain form
2018 -4890 -3919 -518 5336 5816 591 -1996 -2065 -3313 -1854 2105 1769 -2 1863 2448 -744 -2054
2034 -2054 -2045 -3752 -1680 4601 6247 2396 -985 -4745 -7872 -3142 5375 7276 4433 913 -5094 -8544
2050 -8544 -3064 3950 4811 3967 2265 -3000 -5233 -1120 1100 -108 1079 2063 230 498 1795 -1429
2066 -1429 -4818 -2867 710 3140 5579 4359 -2428 -7370 -5431 -622 3974 7330 5345 -2189 -7120
2081 -7120 -5019 -1037 2310 5399 4132 -1758 -3913 -1160 -440 -394 1654 616 -1955 1145 4119 439
2097 439 -2365 -2149 -4082 -2322 5662 7342 1218 -2281 -4709 -7564 -2043 7178 6663 1877 -309 -4902
2113 -4902 -7323 -603 4826 2701 1746 1502 -2548 -3035 1027 350 -2269 73 1942 1227 2588 2060
2129 2060 -3378 -6016 -2644 1464 4671 6275 2685 -4207 -7458 -4654 1022 5475 6441 2932 -3071
2144c071l190K476M389K269Q14j324l941j119K719mj532J510M60j114L004K041
2160D387m914l747J208N31K391O306J55o877l303m93n79M979O563j812m731j372
2176a308k281j114M935L376k378o35R39k430p80J974j178j757K767K833l38o47
2192A978j765m220j252L797M207J956l61l642m991j467L109M230K583J93k643
2207A712m024j629J732J969J202J364o7j983q08J21j397r18K015K085P51R64j116
2224A973m116k233J433K411K943K549j527m539k533L4J297L307L131p85k913j668
2240a236j082n88J907K437L21k48J74j508k228k56Q45O87K105K228j042k673j732
2257a889j204K1L126L084K1j341j706k893j033K386K227J060J138p49l077j651
$$ plain form
2144 -3071 -6261 -3785 604 2873 3687 2363 -1578 -2697 22 18 -1514 -4 456 -658 2346 4387
2160 4387 -527 -4274 -3066 -2535 -144 6162 6317 -560 -3863 -4356 -4935 44 6607 4795 64 -1308
2176 -1308 -3589 -4703 232 3608 1230 595 1534 -896 -1676 298 -880 -2637 130 2963 2625 1978
2192 1978 213 -4007 -5259 -1462 2745 4701 4340 698 -4293 -5760 -2651 1579 4162 4355 1712
2207 1712 -2312 -3941 -2209 -240 962 2326 2259 276 -532 -411 -1808 -2726 -711 1374 2125 3089 1973
2224 1973 -2143 -4376 -2943 -532 2411 4960 3433 -1106 -3639 -3605 -2308 999 4130 3345 432 -1236
2240 -1236 -2318 -2906 -999 1438 1759 1511 1685 177 -2051 -2307 -1462 -775 1330 3558 2516 -157 -1889
2257 -1889 -3093 -3072 54 3138 3159 1818 112 -2781 -3814 -1428 799 1859 2997 2248 -829 -2480
2273b480K99L16J695K827L55j439j565k043j395J513K571J538P16q19k762j996
2289b669J12R27K003K025K08j149j590j793p63J057J675J696J374p63k592j937
2305b179r87N58K936K712K57j497k280k752k83K472K250J240M55j791k622n59
2321b070M91K93J674J588k70n50m93j978j554Q82J584J704K015l00l104k599q54
2338c541Q31L231L202L0k360k636k223K08K837K393O32o28j790j718k16N72N35
2355f41Q35R22K40J22n96j876j569J68J533K599K040q26l117k691j173J549L751
2372A270K590m98k314k910j820J174K782J659K39o76j761j030M56J61j28O21P76
2389E91O64O91o07k297j927R8J810K999K054j123l421k836p78K034L751K242o64
$$ plain form
2273 -2480 -2181 -1865 -170 2657 3012 1573 8 -2035 -3430 -1917 654 2192 2908 2089 -673 -2669
2289 -2669 -2557 -1630 373 2398 2606 1457 -133 -1926 -2689 -1632 43 1739 3113 2350 -242 -2179
2305 -2179 -3166 -2608 328 3040 3297 1800 -480 -3232 -3515 -1043 1207 2447 2902 1111 -1511 -2070
2321 -2070 -1579 -1286 388 1976 1706 1156 663 -1315 -2869 -1987 -403 1301 3316 3016 -88 -2687 -3541
2338 -3541 -2710 521 3723 3753 1393 -1243 -3466 -3258 -421 1972 2604 1976 186 -1532 -1748 -1176 -641
2355 -641 194 1116 1356 1478 882 -994 -2563 -2395 -862 1737 3777 2951 -166 -2857 -4030 -2481 1270
2372 1270 3860 3362 1048 -1862 -3682 -2508 274 1933 2172 1496 -265 -1295 -839 -678 -806 -185 591
2389 591 1255 1946 1339 -958 -2885 -2787 -977 2022 4076 2953 -468 -3304 -4082 -2048 1703 3945 3281
2406C281k708k762j018J279K351J440J40j057j121m04j16k86J7M06Q65J438P07
2423B452j589k358j371j12K196L745J192k065k885k470q39K805L849R43j211j850
2439D32k793q87K228J894K28K24m28j216j00L85q58o47J055J174J000P67j311
2456A147k903j529R47K310K600J304j820l422k097M09K332K451J322p74k483j781
2472a987K02Q06Q36J214J76p71Q0J62j443j047N34N45J151K291P5k935j985o68
2490b764P2K794L526j99k578j838j870n08K956K957k02q71q17k185r13J638R58
2507A56k6J074O03j312q24l20j316j86K215J946K60n08j631k675p69K127K521
2524A335J235J32j520l026j256J478J634J071J200m94k262r08N47l50K50J982
$$ plain form
2406 3281 573 -2189 -3207 -1928 423 1863 2003 946 -175 -579 -695 -981 -964 -558 307 1745 2452
2423 2452 863 -1495 -2866 -2978 -782 2963 4155 2090 -795 -3265 -4104 -1299 2550 3493 2282 432
2439 432 -2361 -3248 -1020 874 1102 1326 898 -318 -418 -33 -891 -1538 -483 691 1691 2458 1147
2456 1147 -1756 -3285 -2338 -28 2572 3876 2056 -1366 -3463 -3054 -722 1729 3051 2277 -206 -1987
2472 -1987 -1785 -979 -143 1071 1247 476 556 718 -725 -1772 -1238 -693 458 2749 2824 -111 -2096 -2764
2490 -2764 -2692 102 3628 3429 851 -987 -2857 -3365 -409 2548 2346 1475 658 -1527 -2440 -802 156
2507 156 130 1204 1807 495 -329 -649 -1965 -2151 64 2010 2270 1762 131 -2544 -3313 -1186 1335
2524 1335 2570 2702 1182 -1844 -3100 -1622 12 1083 2283 1789 -473 -1381 -834 -1184 -934 1048
2540A048L62p35M13n29k291n17J664O75R48J769j003l170p72M28J27K187K466
2557C070r87k157n71j042q31K066K093l06j45Q2j825j636R58P76K05J706J157
2574B613j701j780m76p07J27K762J813q09j127j130j936l56K518J755O0K85q67
2591A044k584q41J332P02P19J738n5k025j046r9q53Q36K418P70q70l90j076k045
2609b325K65K173Q38L19Q03j214k441j94R31J8J152J866o39j710k08p01j096J228
2627i35K188M8j50L28j878k014Q90J392L08J377J005k090j980K52j80J19K404
2644A084J393j474q20k66j679m07K060J064J5Q49m22k467r72Q11L50J126K073
2661B318m2k038j244o28n57J377K339N95r03p78j316j295N88J831P98L18J66r71
$$ plain form
2540 1048 1410 675 1088 559 -1732 -2249 -585 90 1038 2807 1804 -1366 -2138 -1710 -1583 604 3070
2557 3070 2083 -74 -645 -1687 -2518 -452 1641 1335 1190 1272 -553 -2189 -1231 -455 -250 1456 2613
2574 2613 912 -868 -1344 -2051 -1924 838 2651 1842 715 -415 -2351 -2707 -189 1566 1626 1911 1044
2591 1044 -1540 -2381 -1049 -347 372 2110 2055 30 -1016 -1115 -1968 -1132 1286 2056 1186 796 -280 -2325
2609 -2325 -2060 113 951 1270 2073 859 -1582 -1776 -845 -827 325 2191 1552 -158 -366 -1067 -2163 -935
2627 -935 1253 1301 1151 1479 -399 -2413 -1523 -131 177 1554 2559 469 -1511 -1259 -1439 -1320 1084
2644 1084 2477 1003 183 -83 -1762 -2169 -109 955 970 1819 1397 -1070 -2042 -1231 -881 245 2318
2661 2318 2276 238 -1006 -1634 -2191 -814 1525 2120 1217 439 -877 -2172 -1584 247 1045 1363 1529 558
2679E58j702m37O01L88R26J565k41j540q09o21o62J209K226L55o44m49j503j563
2697b343R04J837N11M54M19j616j676M45K66m3J562J112r53o79k14j441n75J610
2715d20J278J86O79m61k226j087P75O36J155J709l18j996j005l52k18J256J844
2732A435J19o55n09j073j079N48J065O50Q34K49j050j362o68pQ92J482J078l79
2750A570j234j357q42L37J265J497N30o46j097j002o37M40J251Q86J92J01q07
2767D47j339m46L45L67J087J349l09j257q72r57l46J573J795J22k66q22j816o63
2785b008J167J095N81Q30m78j579n59M2j25P40J271J08l10j16j173j198M10R51
2803c51Q12J138J68j427j433n36Q2J169J774M67p52j044j211n85P86J181O76L68
$$ plain form
2679 558 -1144 -1581 -980 -592 334 1899 1658 118 -691 -1312 -1974 -765 1461 1816 1172 723 -780 -2343
2697 -2343 -1439 398 909 1363 1782 166 -1510 -1065 -799 -842 720 1832 879 200 -14 -1455 -2030 -420
2715 -420 858 1044 1723 1262 -964 -2051 -1276 -640 515 2224 1906 -90 -1095 -1447 -1665 -409 1435
2732 1435 1554 899 390 -683 -1762 -1214 -149 501 1335 1584 534 -828 -1496 -1503 -611 871 1949 1570
2750 1570 336 -1021 -1863 -1526 -261 1236 1766 1120 23 -979 -1616 -1176 75 961 1153 1254 447
2767 447 -892 -1338 -993 -626 461 1810 1501 244 -628 -1585 -1931 -358 1437 1559 1293 471 -1345 -2008
2785 -2008 -841 254 835 1665 1187 -392 -951 -909 -1034 -294 977 1085 775 659 -514 -1712 -1302 -351
2803 -351 461 1599 1767 340 -1093 -1629 -1547 -378 1396 1863 1111 67 -1144 -1729 -943 238 914 1282
2821A282l63r98p08k97L6P09J039N14j7n46j305j030L17R48J240J096l18j575
2839B4j343l96L21J470J547Rq60j071r31k44Q89R40M05L09k51q48n88k45j27N54
2859d36J082O37j40n41j216j038J12J261J263P65k67j392j415m16P55J191J079
2876A284K35q32j041o48r1M04Q68O20J14j69n35p94o03J02P37Q95Q26j4j061j212
2896i15o57K57J180J381N74p41j254j065l88P75J304P75qn20j048o85M5L40O17
2915c3P49L30k12o66p33n73R7P20J100P67l72j013j128o15M02J251J165K29n67
2934H98j035j195j40R02R11N40L51m37j156m75J5m8P19J076J53l71l82r54r01
2953a529N34J022O92N99J0j421j189O7L65P16J406K59q90q56o12n47N68J204N80
$$ plain form
2821 1282 919 -79 -787 -1084 -1048 -339 700 1214 1197 651 -654 -1684 -1367 -419 821 1917 1599 24
2839 24 -1319 -1715 -1394 76 1623 1632 772 -299 -1230 -1474 -585 355 760 1069 818 -30 -618 -863 -990 -436
2859 -436 646 1283 1143 602 -614 -1652 -1540 -279 984 1749 1482 90 -1325 -1741 -986 205 1284
2876 1284 1519 687 -354 -1002 -1093 -689 179 799 913 744 209 -585 -1188 -1086 -349 546 1372 1358 297 -915
2896 -915 -1572 -1315 -135 1246 1820 1079 -175 -1240 -1628 -853 451 1226 1218 698 -350 -1035 -990 -650 -33
2915 -33 716 1046 834 168 -565 -1138 -1041 -321 779 1546 1174 161 -967 -1582 -1180 71 1236 1465 898
2934 898 -137 -1332 -1472 -570 341 881 1232 795 -361 -836 -821 -869 -150 926 1079 708 326 -628 -1529
2953 -1529 -995 27 719 1318 1328 -93 -1282 -1215 -850 -134 1272 1531 641 -215 -827 -1374 -806 398 978
2972I78P8j89q67j059j44N56O25Q26M67m26j072p33j93L60Q49J048J93o98p51
2991a52o32m75M46J095O13ll4p23j178j76O55M14P99Q48n90j229n11l17K7J303
3011A80J207l12n22m37j168m08J043R21J86L35j16j248o51K87L4M44J077L84n62
3030F74o55n62p77J74J313R25K07l94q60j359l17J140J006M88K94o31j449n15
3048a298O39K96M56J047k13r21o8j95q44K44J241K03O4O31r31j677L9O75L11J290
3068I89R43j185j596j40k43L49J724P88r50o78k71p58J18J016M79k83K41M4p45
3087a58l43M8k60J65J099P01l66p56p72p98J25J518J256r7o44r89j249p1J519
3106g2J005k7Q2o27j360k0Q60qL1Q50jp20K03j35j219J09J148M81M05M65j149
$$ plain form
2972 978 1056 867 0 -1059 -1203 -647 -22 804 1271 845 -227 -960 -1153 -793 56 1104 1297 599 -152
2991 -152 -784 -1259 -813 282 895 892 858 135 -1043 -1219 -564 -150 649 1497 907 -322 -833 -1150 -1123 180
3011 180 1387 1075 553 116 -1052 -1460 -417 504 690 1025 909 -339 -990 -703 -669 -225 852 1236 674
3030 674 19 -543 -1320 -1146 167 1092 1299 905 45 -1314 -1631 -491 515 1003 1297 666 -783 -1298
3048 -1298 -659 -363 93 1140 927 6 -62 -257 -1101 -857 384 587 651 1282 351 -1326 -1287 -612 -301 989
3068 989 1932 747 -849 -989 -1232 -883 841 1629 679 1 -270 -1028 -910 106 585 302 543 587 -158
3087 -158 -501 -453 -713 -548 551 1252 886 130 -642 -1440 -1315 203 1459 1362 718 -271 -1520 -1591 -72
3106 -72 933 906 988 361 -999 -1019 -159 -167 -136 714 713 -7 196 61 -1158 -1049 99 580 985 1450 301
3127C01j826P4Q54O92J223N40j425j607k0K25N65J347M96j060p11k3l34O4P22
3146I7K88l15K97M19o54o64j17j89K53J281Q76o74j051p72o76M68J852R32n80
3165A071p55q61r33M37J403M97k45Q6o35p84J99M69k63N7Q12N1k07Oo87r77K07
3186a052J145P42L77j65j210j330M4J078R80P11Kj190j234o9O03N15P53K93o59
3205C34n65Q5j84l01L56M41J07L98L21q51j001o9K21N22J297M97j058j163m23
3224a036j79O49J494M87p83o47n21o03M54J023J96j01J61m44n80M4P4j86M44Q01
3244G47O4l47m37p58m96N79J015O37R5m97j159o61K83Q46P61M28j81r04p12j33
3264h30K71M17N89K95k44l28l66m12j98L67P02M02J61k20q76p09J0O63O77O82
$$ plain form
3127 301 -1525 -1451 -597 95 1318 1858 433 -1174 -1194 -969 -404 943 1439 379 -332 -355 -689 -625 97
3146 97 385 70 367 786 132 -532 -649 -838 -585 696 1572 898 -153 -925 -1601 -1133 719 1651 1071
3165 1071 316 -545 -1478 -1041 362 859 614 700 65 -719 -520 -51 -314 -257 555 606 399 405 -282 -1259 -1052
3186 -1052 93 835 1212 1047 -163 -1493 -1449 -371 609 1320 1322 132 -1102 -1171 -568 -53 700 993 334
3205 334 -231 -146 -330 -631 -275 166 273 671 992 141 -860 -929 -708 -186 1111 1608 550 -613 -1036
3224 -1036 -1215 -566 928 1415 632 -15 -536 -1139 -685 338 534 433 594 150 -430 -386 -312 -498 -54 747
3244 747 811 464 27 -731 -1227 -648 367 1004 1099 602 -557 -1218 -935 -89 672 1100 919 15 -697 -830
3264 -830 -559 -142 447 742 498 170 -196 -608 -806 -439 263 665 826 606 -270 -979 -969 -306 371 1053
3284A053m4q02q65k73J15N44R03K88l31n56m09m53J40O34M20K22J66m10p16l97
3304g71J37K64O42O65p2o13o48m25r4O40Q59L36k70m64o30m58K51N84L67M58n4
3325G04m98n81k86NL44P40L97o3m97o86m65K9O74P53K95j53n69o78l11K61N52
3346c3N13K45r4m91n60k75O0M07N04M33Qm28n84n06j15N82P96M66p0o13p63n25
3368a043L24P17O49L19l26o85n64j21K71M59N09J23k14l24l29m62P3L96M29M24
3388F25J85m86p48m25mN58Q66M84k84p38o55l65K86Q47N80k8k79n52m23j9L13
3409b62K96K45K87o7k95l33l72j70K50O24N55P1m37q47n67R5P32Q51L51k03q52
3430d8p65j37M47P69M38O9m38n54k82K7J19L76K60K13q5j56m51m74m0L75N86M93
$$ plain form
3284 1053 1009 207 -658 -931 -816 -272 631 919 588 32 -377 -830 -690 -56 364 586 752 342 -374 -771
3304 -771 -634 -370 272 937 865 252 -396 -821 -915 -275 584 920 650 186 -444 -902 -651 -67 300 758 704
3325 704 206 -375 -661 -656 -312 428 825 762 265 -421 -886 -857 -183 570 865 712 143 -535 -846 -585 -33
3346 -33 480 725 631 140 -420 -695 -635 -228 276 709 717 289 -295 -801 -916 -334 462 928 858 245 -518 -1043
3368 -1043 -719 -2 647 966 640 -45 -609 -730 -459 0 509 632 418 94 -235 -697 -624 -228 201 625
3388 625 810 324 -424 -849 -853 -295 571 1055 771 33 -622 -987 -701 146 726 698 419 -133 -556 -575 -262
3409 -262 34 279 566 499 204 -129 -501 -671 -421 203 758 829 392 -455 -1022 -927 -195 656 1007 804 -48
3430 -48 -813 -950 -503 266 704 773 335 -219 -501 -474 -355 21 281 494 409 253 -198 -672 -712 -337 249 742
3452G42J84o30r45l03J66O29Q91M27n51p93m90j47L53P86L82j84l06k36m49j07
3472e81L13J51K50L78J03n04l47k85l00L71R68L68j61m66p43o05L06Q60O68R3
3492H37j97q48o81J29M71M68L33J46l84m78j37j6k4K83N15P6p2j18n58n95J99
3513f51N19M85L78J19p83q61j19M18M86P46K57o25o56k24j50J92P63L47k90r4
3533B57j49n40k17M12K06J75N56n0o44m45j10j71M92Q53K77m23m59n66l41L12
3553e75Q63L94j16j05o03n74P2M45K54K60L29k42n56j44k2k48L91P73O1k79r3
3574B85o48n68M05O62K82K31J01q93p07K46L07K91O08K51o55m58l7k74O1P66L07
3595E63j89K8k18p51k03M83K27L55M90k27p47l82M6O6M86O23Q3m84m26k11l07
$$ plain form
3452 742 926 296 -649 -952 -786 -157 734 1161 610 -183 -673 -820 -467 319 701 517 211 -25 -474 -581
3472 -581 -268 -117 133 511 614 110 -237 -522 -822 -451 517 885 724 258 -485 -1090 -784 76 744 837
3492 837 640 -208 -889 -760 -289 179 512 658 274 -204 -341 -357 -381 -98 417 493 421 303 -255 -850 -651
3513 -651 -132 353 731 850 67 -794 -913 -495 -9 737 994 369 -287 -511 -661 -469 294 641 351 257
3533 257 108 -432 -649 -237 -31 144 700 650 6 -439 -549 -720 -228 625 902 479 20 -546 -887 -575
3553 -575 288 682 566 461 -142 -716 -644 -199 55 315 644 402 -154 -298 -320 -568 -177 596 657 378 285
3574 285 -363 -931 -526 136 418 649 750 -143 -850 -604 -297 -6 602 853 198 -260 -297 -571 -510 256 563
3595 563 374 402 184 -567 -770 -287 -60 295 785 558 -189 -571 -525 -459 27 650 733 249 -177 -388 -695
3616f95L41O85K15j44l4l07o21k1M21Q1L20M93k94o46j77j26j06N71Q18j59m18
3637A97j48n83l28N46O26J05M9k9o19m96K90J81J63M57K04m61l51l6l11o4O91
3658H3N24r9r3l39o78j96N44M55K90K67l11q43l64L30J89L50N75r1n76k13m1l06
3680e43K35N25J62p0J02k97o50l2L36J20M47N10m19o68k95j18P9P60O03j76l91
3701B20m36m54j2O06M93N0o9j61m40k64J69J52J60K95K45k09l61k69k58K3N32
3722A2N87Kk24l30o85j71N58O03J85J67l62p60l38L07L84K89L03j40m78j14m4
3743b49j14J16M77K3N5J54l38n36j42K46K36N53L27l77o89l69r0L18P71M34j95
3764F11n19n25k18J55N34L41N5j25k24l14j06O0Q2J76K51K10j42k88l79j94M2
$$ plain form
3616 -695 -354 331 546 402 368 61 -560 -581 -160 -79 241 734 440 -206 -383 -509 -615 -44 774 615 197
3637 197 49 -534 -862 -316 310 415 464 435 -184 -680 -390 -209 -46 411 615 154 -197 -233 -544 -608 83
3658 83 607 508 415 76 -602 -798 -254 201 491 758 447 -396 -760 -430 -241 109 684 593 17 -196 -237 -543
3680 -543 -308 217 379 309 411 114 -536 -568 -232 -112 335 845 426 -242 -537 -655 -576 184 787 611 220
3701 220 -216 -670 -682 -76 417 467 398 237 -203 -467 -298 -146 14 309 554 345 -16 -285 -543 -520 12
3722 12 599 601 377 47 -638 -809 -251 352 537 704 342 -418 -756 -449 -65 224 527 387 -91 -205 -249
3743 -249 -363 -247 230 253 308 462 124 -412 -554 -308 -72 481 808 431 -258 -627 -717 -399 372 806 611
3764 611 92 -433 -651 -496 38 379 434 309 85 -229 -335 -275 -193 -17 234 444 302 14 -365 -559 -517
3785e17N87M85J39l02n66n76J6M70O44L15q9n05o16j36L41L64K36J71k19l41j06
3806b05p6j5O0L16K23J05l0l16n08j50J68M97N27K45n19o02m70Q4M54O25L34j96
3828E51o34m07j05K29M61K85L5k35j80j96p0M3L9J90K18K27j27l39l92k06J78
3849d35N25N02J12m03n58n08J44M91N91K37k01m93m86l2K20L67K54M4k08j11k08
3870a56j06m0J50R3L58J38j32l05m56j64K81N42M00M5m11n83l40K10M21N01K62
3891G08k75n15l53l9J95L35L01p7j69q4j95j87R0J46J20L17K05k43m50k12j67
3912e49K35N50M18j59k72n34l42J31N06M17J71j36m31m51k2K63K73K59R9j81k00
3933D5j87k10k2K34L11J62Q5k51l70k62m8L45M40K44J0l60n00k50J50L86L69K96
$$ plain form
3785 -517 70 555 694 392 -174 -750 -734 -264 380 695 606 101 -515 -651 -310 54 290 461 242 -99 -205
3806 -205 -281 -296 -236 80 303 408 378 62 -446 -596 -428 69 596 841 322 -280 -750 -666 -212 413 747 551
3828 551 -83 -490 -595 -366 95 380 415 180 0 -196 -266 -223 -184 6 224 451 324 -15 -407 -613 -435
3849 -435 90 592 704 301 -257 -765 -621 -130 461 698 497 4 -482 -514 -294 73 327 371 163 52 -156
3870 -156 -262 -302 -152 -59 299 437 305 0 -456 -620 -339 203 603 648 237 -346 -686 -476 -55 446 708
3891 708 433 -82 -435 -474 -279 56 357 280 111 27 -168 -355 -265 -119 1 318 523 280 -170 -382 -549
3912 -549 -314 236 654 495 223 -311 -653 -522 -16 401 572 436 5 -446 -468 -205 68 327 426 245 45
3933 45 -142 -352 -374 -140 171 333 418 167 -203 -465 -513 -168 272 516 526 166 -334 -584 -434 -48 321 617
3955F17k27m44k13k31J37L26M21O2j36k11l59k10K31K16K00K94o3l65l01j23L4
3976c45K52L88J76j38k61k12l80J06L52L41J96k3l98m16j73J79L38L41K24j46
3996D01m88k98kJ02L21L55mk24j83k09j79J57K64J30J18J65k79m16q3M4J17L90
4018A99M18j32l90l02l66K0N89L75J02j76m22m29p2M71K53K07M2j99l36j48J24
4039a72J4O2L08J05q4L6k97l49j30L06L58L68mk58p59k51L12M24M64L21m13o98
4061c37j91J61K41L49K28k19l02m8Nj33J54J33j33J61K85j59k65j99j63M8N61
4082A77N11j63m60l89l65J49P70N16j87l54m47l53R6O11L08j14p2k26j40J5J61
4103D4j17j69K44K56L1J7k00n72j45L87N55K56J17n82p67j73M90N04L94J43m85
$$ plain form
3955 617 390 -54 -267 -498 -361 -35 386 448 312 101 -258 -468 -237 -21 179 473 410 45 -256 -379 -345
3976 -345 -93 295 471 333 72 -140 -520 -414 -62 279 475 452 54 -362 -535 -356 -18 323 547 401
3996 401 -87 -385 -387 -285 36 391 387 163 -20 -229 -408 -251 13 143 261 426 147 -269 -352 -308 -191 199
4018 199 617 485 95 -207 -573 -553 36 411 513 337 -85 -514 -586 -115 138 345 387 188 -148 -296 -172
4039 -172 -158 -96 212 317 233 269 -28 -377 -507 -201 157 525 521 263 -496 -747 -435 -11 453 774 361 -337
4061 -337 -528 -367 -126 223 451 232 -70 -118 -113 -246 -92 41 -92 69 354 195 -70 -269 -432 -384 177
4082 177 688 525 65 -324 -689 -540 230 746 559 205 -242 -595 -499 112 420 306 234 8 -132 -117 44
4103 44 -73 -242 2 258 289 306 106 -466 -611 -224 331 587 704 122 -645 -818 -328 176 570 713 228
4124B28p72O9J96L23K93O1l25k34J26Q6j96Pj9o7M35L39k24m60l69n6J71P27M33
4147G72k23o27n00j07K43Q16M27l14m60l68k21K54N15J39k08n1n2j45Q2R4l12
4168b46q5L68L13O1n7l82n37q5N45N12K25r3o20o53J8O19M92J66jn90m61P3L19
4191i9J99J51K1k56r9J43l0j59j58J30J25L20K85k99n96k60O7L63O02M07n33n72
4213b48k87ML57N77K08l06l64k05o6J50L04O3p4p2R1j31p8n7j26k2M36L18r7k42
4237A33l61l73R7N80M33Q0k40m45m74L6M99L48J34n9m10k67m0J79J19J11J31r1
4259A20p3Oj49k28Q3K40J96K14Kl93m33o7J74L36L85L7k71m57j67L8K85M15J45
4282D38j76k33j44k04Q2K18J79RN4p3j65k84L3N0J95K86R8j96j79l05n9J65L11
$$ plain form
4124 228 -544 -475 -279 44 337 398 73 -161 -35 51 -145 -138 -157 -224 211 550 326 -134 -503 -559 -388 339 772
4147 772 549 -78 -578 -685 -442 374 801 487 27 -341 -562 -308 207 346 138 87 35 -110 -28 66 -246
4168 -246 -331 37 350 411 354 -28 -565 -650 -105 407 632 539 -81 -734 -716 -97 395 561 560 -30 -491 -418 -99
4191 -99 100 251 272 16 -83 60 30 -129 -287 -157 -32 288 573 274 -322 -582 -515 -152 450 857 324 -248
4213 -248 -535 -531 -174 403 611 305 -59 -264 -330 -180 124 187 113 41 132 1 -77 -134 -260 -282 154 472 375 133
4237 133 -228 -601 -504 76 509 589 349 -96 -570 -534 -35 313 447 388 -22 -289 -329 -150 -31 80 211 120
4259 120 47 53 -96 -324 -241 -1 195 409 411 18 -415 -482 -308 28 413 450 179 -278 -445 -407 -122 293 438
4282 438 262 29 -115 -319 -237 -19 160 169 223 150 -15 -299 -266 -216 -21 265 363 167 -12 -317 -376 -211 100
4305A00K53N3j99l17k21p2K61L57J71m0k33k56k10O2R5K68K66r2j62k14j81L1
4327b80J16K94J45Oj13k84j89NJ60J82K40Jj10k92j33r8J11L45K71M9k54k78l39
4350d45M1L24K27K79q5k41l75q6J17K54J65J23j27j60p1j12l3Q2J80P9J16m1k28
4373a7k45j40J27L90L04L3j62m72k76j5L79L87J26j09l24l03q2K10K91J12j0m7
4395A57j76k7o2n2K4Q0K23O9R4k59l47j50J11L43L78J47l02m88l55J78L59M48
4417C93J21k56l10k94J5K16K41R9l6j35r2jM0j65o0J47K20J85nk57m26j41K59
4440b42L83L34O0l21n48k44K05M11L82P2l40l14j98J04K39K28o9o3pq5L5r2o1
4463a31j03Q1L68K05n8l24l85j70J94N81L22o3m31l88k21J31M93L10l4k84k58
$$ plain form
4305 100 353 406 207 -110 -331 -403 -142 215 386 346 113 -143 -353 -291 -196 72 338 246 84 -130 -311 -280
4327 -280 -164 130 275 281 168 -116 -305 -300 -140 42 282 283 173 -119 -252 -350 -239 106 377 426 172 -106 -445
4350 -445 -404 -80 147 426 341 100 -275 -361 -244 10 175 298 171 11 -60 -172 -205 -123 57 136 252 211 -17
4373 -17 -262 -402 -275 115 419 452 290 -182 -458 -473 -94 293 419 310 -14 -317 -399 -189 102 214 204 157
4395 157 -19 -46 -108 -160 -136 -56 167 236 330 71 -276 -426 -315 28 406 553 251 -237 -592 -414 -55 393
4417 393 514 258 -52 -346 -331 -115 126 225 189 54 -38 -39 1 -164 -224 -77 143 328 323 66 -360 -501 -242
4440 -242 141 475 535 214 -334 -578 -373 38 420 492 152 -162 -360 -256 -17 211 142 79 72 -13 22 -70 -131
4463 -131 -234 -153 215 420 362 38 -347 -517 -323 258 580 517 86 -302 -523 -392 101 411 377 93 -165
4484a65j70Q4K45O3K1j8Ork2l9k67o3K82K48J94o8l00m97n5K73M62L29j16l30
4508H8m63j52L25L35K89n4k57l61LJ07J02O6J07p2J1Q0q4k78K0l3J44L54J46j61
4532B62m48k06j6K30M81K20k20l22l02j84L07L90J57j39j18k00j13R3J34K8l7
4553cJ19O5j35p0r3k33P5L50K75Pj51k89m01L3L81K64K71j53k77m33k4K66J62
4576FJ90J16k02k38l0k0m0J95J71q0J00M5k66k34J4J42J89K72P3l91k46j06rK24
4600a25M60J14j88l08j59j42N3M00J63p4l4j38k34o6J34J05R2K06m7j85j73q9
4622b35qJ23K90J66j47j16j88k77J09L11J01J23M9k46l02RJ02Q2K39J11j44k22
4644g0n6p3p9K56K73l7m8r1k44k00J56J77J32J73j6k46j97l9K4R9K65J74j87j35
$$ plain form
4484 -165 -335 -251 -6 57 78 60 66 57 35 -4 -271 -334 -52 196 390 322 22 -475 -530 -257 205 534 418 88
4508 88 -375 -527 -202 133 422 368 111 -250 -247 -140 -38 28 135 63 74 154 70 -208 -188 -221 -77 277 423 262
4532 262 -186 -392 -408 -178 303 523 303 -19 -321 -505 -198 192 349 210 92 -108 -221 -128 6 34 -3
4553 -3 116 181 46 -24 -117 -350 -275 75 350 357 206 -83 -484 -451 -70 194 465 312 35 -398 -422 -156 6
4576 6 196 312 110 -128 -158 -178 -218 -23 148 68 168 213 -53 -287 -273 -131 58 330 403 12 -234 -340 -349 -125
4600 -125 335 449 261 -47 -206 -348 -295 105 268 194 160 22 -212 -278 -144 -39 53 259 212 27 -146 -235
4622 -235 -243 -120 170 336 189 73 -115 -392 -283 28 129 252 301 55 -247 -238 -136 -54 185 296 152 -70
4644 -70 -126 -199 -278 -22 251 214 166 75 -169 -369 -213 -36 96 269 253 7 -190 -229 -205 -106 159 333 146 11
4668A1j37j82O1K78K27kkk50j73j38J60J01J53J65p3l62n2K4PJ68K34J2j70qj44
4693i2j19K4K04P0J39L9k02k61q3N9J19L08J41j13k77j40q1j4L31K69j44k7j37
4716A3k32o6K45M2Q8R2jj74j90N5p6R3K15J41j6j62j55k27o2L70K17J24k7k81
4740B6l75P0J58J52K05M0j22k72q4M2K3J33Q6Q1j09p6n9j33M6J23J57P2J16k35
4764F5k86p7O4J73K51J08l3l39j86j9J36K79J33m3j42j35j37m5J75P3N8R0k8j45
4788a0p1p5l6M6K86J16p3j50j00k82P6L20J86P8j08k09k37l1K26J19J27M8j11
4811A35k58l2j6O2J44J38k1n3p8j28j16J6J80J06J84m9j73k18j02L2K51J76J31
4834C11r7k59k31L5R1J93J67j8n7j61j25q3J24J49R8P3m5j92m9j23N4R0K57M7
$$ plain form
4668 11 -126 -308 -247 31 258 256 254 4 -169 -307 -147 -46 107 272 199 -163 -215 -191 -184 -16 218 230 60 52 -92
4693 -92 -211 -187 17 87 226 265 63 -198 -281 -222 -103 205 346 233 -44 -184 -265 -279 52 321 177 150 13
4716 13 -219 -285 -40 2 90 182 181 7 -183 -128 -204 -111 104 245 229 67 -88 -315 -377 -7 210 334 307 26
4740 26 -349 -279 -121 31 236 276 154 -118 -202 -160 -137 -4 82 163 54 -22 -81 -214 -168 -45 112 184 300 65
4764 65 -221 -298 -234 -61 190 298 265 -74 -260 -279 -143 136 269 226 84 -51 -188 -233 -58 15 73 163 135 -10
4788 -10 -81 -156 -192 -146 140 256 183 33 -67 -349 -273 47 233 311 203 -6 -243 -274 -48 71 198 246 135
4811 135 -123 -155 -171 -109 35 173 152 99 21 -107 -223 -207 -27 79 263 214 41 -177 -279 -247 4 180 311
4834 311 214 -45 -276 -241 -150 43 210 192 135 -26 -151 -234 -110 39 137 210 165 -27 -76 -199 -145 -55 202 249
4858B49j14j31j82j22J11K21J35Q7n4k42j95QJ17K00R2rn0j52j34j9JJ96J44L5
4882A92j03r4j13r8P1J47J08J26o9j65j69j08J08J84J83J10j51k04j51q2J54J85
4904F1J91p6n5j42j44oOK42O9L5j07p3j24j21J00J22J75R7j42j40o1j15J7K00
4928IJ73KL1k13j92mO4J81J25N6j00j96k17P4J40J26J41j1o4j63r7l9M6J71R8
4953A41M4p1j07j90m1M5J67J14K04j38k21j21m6J13J39J18P5r8k20j09K8J00J82
4976A08M3lM3k10j23m2Q7J18J34L7l0j71j49j3j5J88J94L6j32j02k05m1J32J91
5000G5J33O0j94k06l8M4MJ65J42J5j50lk02l9Q2J26R8N0N2k77j68N2R0J06R6J75
5026B88j84j50j13n7O4K25R2Lq2j49j57NR8J51J29lm6j64r8L5K5J20R3J17j76
$$ plain form
4858 249 135 4 -178 -300 -189 32 167 254 200 -42 -237 -229 -112 88 180 171 121 -31 -165 -184 -183 13 157 192
4882 192 89 -5 -118 -216 -145 2 110 236 167 2 -167 -275 -167 17 200 310 159 -45 -196 -278 -124 61
4904 61 252 176 121 -21 -165 -171 -165 77 146 181 74 1 -123 -244 -144 -22 153 250 108 -32 -93 -208 -191 9
4928 9 182 184 215 2 -190 -194 -130 51 176 232 132 -64 -281 -207 -67 59 200 189 125 -38 -135 -174 -128 43 141
4953 141 185 114 7 -183 -224 -179 -12 102 306 168 -53 -174 -220 -107 32 150 225 127 -93 -202 -174 -74 108
4976 108 151 148 191 -19 -142 -184 -97 21 155 192 162 -9 -158 -171 -186 2 196 232 100 -2 -207 -248 -116 75
5000 75 208 268 74 -132 -170 -126 -122 43 185 200 50 47 -155 -194 -112 14 112 162 214 -63 -231 -179 -89 17 113 288
5026 288 104 -46 -159 -216 -152 73 165 168 86 -63 -220 -215 -117 34 163 160 114 -50 -148 -113 -88 32 125 242 66
5051F6j20j18p5Q4K26J45%j13j29j37JJ16J11Q8M9q8k31k2L6OO8J90P8k11k8j08
5077a16n4M1J44J11M6n9j33j71k2J56J45O1J02j34k44J0pK2J25J52k1r4q3q0j00
5102b03R6K06L2O4l5j70j87J1N1J66J89Lj41j98m3l2Q3K45Q2q1j13j7j30q2J33
5127g1J04Q3P5ok38j57N0N1K23Q8j5j02j63q0p5J08K42M1Rj14j72j14Q2R7Q2O0
5153H8O8j21j24oK2J2R9J07l9j7q2j32j50J82J50Q4O3q0k54j31M0J40J43R3K1
5178A76j80j46L2l9P2J05J00mK0r6j51qN8R9O4J34q2k66n6o1J19J41J86N1k44
5203B4j18l9o2J61J60M1l2o3j05j33N9N9O2R3jl0o1j20n2O2P8K52n4p4j63j14
5229a70n2J53J93R6k1j08k32q5J26J01J01R2o2j28j90N0M5K7J69J7j6j3r1j36
$$ plain form
5051 66 -54 -172 -247 -163 63 208 208 95 -34 -171 -170 -54 57 145 194 106 -125 -147 -111 -105 -37 153 231 20 -8 -116
5077 -116 -170 -129 15 126 172 113 -20 -191 -213 -57 88 149 251 117 -127 -117 -124 -102 23 175 154 60 -23 -103 -203
5102 -203 -107 99 131 195 160 -10 -197 -186 -135 31 220 223 82 -116 -159 -191 -108 137 219 138 25 8 -122 -204 -71
5127 -71 33 116 191 185 -53 -210 -160 -109 114 202 187 85 -78 -158 -233 -125 117 158 167 53 -119 -233 -151 -54 28 88
5153 88 156 35 -89 -95 -73 -61 38 145 106 89 7 -125 -275 -93 57 141 204 124 -130 -261 -221 -81 62 155 176
5178 176 -4 -150 -118 -157 -85 20 120 116 136 40 -111 -119 -61 38 102 236 154 -112 -168 -229 -110 31 217 268 24
5203 24 -94 -133 -195 -34 126 167 135 72 -33 -166 -107 -48 14 107 106 76 15 -105 -157 -95 -17 235 181 107 -56 -170
5229 -170 -222 -69 124 220 199 91 -141 -226 -100 1 102 194 132 4 -186 -136 -91 -64 105 122 106 93 2 -134
5253a34Q5RL9J45O2r5j96q2O2L9J19J55l1j48j26q5K0J44J39L8q9Rj27q9M9J2
5279g6J16Q8P9j80o7j29J9M3K02R1kj40j02j50L1J65J05N3k9n4r5j76R6J36O9
5304I3J7Oq5o1p3q2R0J48O4Pm3q4j76L2J43J33J0L8r1j93q0O2J34Q2N4%j24l8
5332a7j21OJ18L4Q9j4j6j23o5m2N2J43Q8K2q3j35j13J5J74P5Q8p4p6j05l3N1K9
5359c3R3J22j06n8q5Po2Q3R7L5M3q9r9ml4J3J31J01%m5k29o3l5J67J68Q5q1j13
5387Iq4l0K5R1O8L6jj29k2n3p7J00J25J01rn0j32q6q7K08P7J38o6o3k34q3Q2Q7
5415e9K14j7p3p6q6m0K3J11M8P9j4n4p9n0l8O4N0J23L8p4j21j25n6J29J32J29
5441A78p9q0j80J3P3J48O0oj16m0j2m5N5ON8N0J6m9o7j05KK7J05J28q2Mq3j16
$$ plain form
5253 -134 -49 -40 -1 144 206 111 -85 -167 -105 -66 53 208 177 29 -97 -182 -162 -18 121 159 70 79 -48 -137 -88 -76
5279 -76 40 128 207 27 -40 -169 -150 -107 95 186 184 44 -58 -208 -177 -12 93 146 117 63 -32 -208 -112 24 93
5304 93 110 116 31 -30 -103 -185 -95 53 117 124 81 -3 -179 -147 -4 129 139 177 86 -107 -187 -125 9 91 145 145 21 -17
5332 -17 -138 -132 -14 20 109 95 79 -44 -109 -151 -99 44 132 154 71 -64 -177 -162 12 87 175 101 25 -80 -113 -62 -33
5359 -33 60 182 76 18 -67 -60 -122 -39 58 93 136 47 -52 -56 -90 -77 54 155 155 110 -119 -182 -217 -50 118 203 122 9
5387 9 -75 -105 -80 11 79 115 114 -15 -37 -90 -167 -67 58 159 150 100 -32 -118 -205 3 80 218 152 89 -145 -228 -146 -59
5415 -59 155 138 65 -11 -97 -137 -114 -3 45 124 110 56 -23 -73 -111 -47 3 126 164 90 -31 -156 -212 -83 49 178
5441 178 99 19 -161 -148 -75 73 133 127 11 -29 -41 -86 -31 -25 33 83 99 50 -17 -122 -120 -93 12 140 58 62 -21 -137
5469a37K8R1O1J50o3j23j07m7J03N2J13K4o6o5m3p4j2J11nJ10ol0q8j23MP6J13
5496D7J36j5q8j88o8K9J39J56J1m4j78Lj12Q7J00P3L8k2j12j9o3K4J5P0J31n1
5522I9n8j9j07n3P5J45Q7kj00j79j30R6J08J63j0j3j23q8k0O3Q3P5rL4j27k9q0
5549a19l6J08J27J6k9P0j74j24M5P2R5Q6K3j66r2o5j7J60J50K8p0r2n1r5L7J11
5575bO4L2pr3p3l6J8O6P1Q6m3n7o1m6p8N3K19n0P5j41j04k6k6K02J0Q4j5j23p7
5604g8l3N9M0R3N9n4q0l0j04K6Q4J25l3L2k3j30n0k1P5J14N4J3r9j28nm8R3J02
5632E3R1m9j13k3j30O9J36M9j1Q0j73p1r0J46L6O7N4m8k9j02K6j9K8J35M4r7k6
5659C3n6j16O9N4JJ23k6Mj98L4K7L2J02K7l8j06k7j04P5O4J68l0k8n5j20n6J27
$$ plain form
5469 -137 -109 -18 43 193 130 7 -100 -147 -44 8 121 145 79 14 -29 -103 -115 -4 -9 101 95 65 -23 -146 -142 -66 47
5496 47 183 168 80 -108 -176 -147 -8 148 159 115 -63 -60 -172 -85 15 88 126 104 -8 -27 -90 -66 -51 19 150 99
5522 99 41 22 -85 -138 -63 82 169 167 67 -112 -242 -146 -38 125 115 102 -21 -109 -129 -66 17 92 83 117 -10 -39 -119
5549 -119 -155 -47 80 96 67 137 -37 -161 -116 -44 51 137 160 -6 -98 -163 -180 -20 130 158 88 -4 -55 -150 -113 -2
5575 -2 62 94 87 -6 -79 -115 -97 -31 40 126 83 26 -35 -81 -159 -106 113 63 138 -3 -107 -133 -159 43 53 137 122 -1 -78
5604 -78 -111 -52 -12 81 140 86 6 -24 -128 -102 -18 107 74 106 83 -47 -97 -118 -43 71 125 138 39 -89 -94 -142 -49 53
5632 53 144 95 -18 -41 -171 -102 34 83 72 152 -21 -92 -182 -36 0 67 121 73 44 -58 -32 -51 -23 112 156 59 33
5659 33 -23 -139 -70 -16 -15 108 82 86 -112 -78 -51 -19 83 110 72 -34 -61 -165 -90 -26 142 112 84 29 -91 -147 -20
5686b0k3N1R6j2m6j38K7j6J5J15Q4qn9p2j10LR1J02j9K2n0j29n9J20N2P3M4p1
5714F3j23MlJ8J7R7J4o5kk2q4m8J17P3N0O3k9j97q0K8J24P5J37j17p8r4j00N4
5742a08J17J20L0o1j33n9K0N4LO0Mk4Oo5j6k2l1J38P2M0n0j50j04N9N2J81O8l5
5770A66j40k22L9J29O4J05o9n8q9m1Q8K7LL4l3K7l8M1q8q5J68o6J56P7r8j89p4
5797a66M6P2J31J37r4j61j24J5N4J64N0o4m3l4m5Q1k2%j3OL6K5k1l9j70P1J06
5824bJ18L0l6k05j14P9R9J69Q4j46p0k00mJ26J56M1q4l2r6K9K4L8j4J7lJ9N4j8
5852E9j48n3J16J5J06J01j48m8j98L6J85J47J7p8j43j28N2J02J28Mn3p9JK7Jq
5878A3j7l0N6RP4r1j20m8kJ81Q9K5q7j77p8M8J92J17j5p9r2j21J05N3J07jj10
$$ plain form
5686 -20 -43 8 104 92 46 -92 -65 -81 -66 49 133 125 66 -6 -116 -113 -22 80 61 83 33 -96 -155 -35 17 90 134 63
5714 63 -60 -56 -59 -41 -24 73 87 22 20 -2 -86 -134 -17 56 106 169 140 -57 -137 -109 15 90 227 110 32 -62 -162 -108
5742 -108 9 129 159 98 -35 -94 -74 -20 -17 43 47 23 29 -36 -52 -74 -105 33 105 145 95 -55 -159 -100 -48 133 201 166
5770 166 26 -196 -157 -28 36 141 72 14 -75 -116 -28 -1 2 36 3 30 -8 33 -55 -140 28 -38 118 195 97 -92 -166
5797 -166 -120 -48 83 220 126 -35 -159 -144 -90 74 124 60 17 -17 -62 19 -3 -3 -16 -10 26 51 30 -9 -179 -108 -2
5824 -2 116 146 110 -95 -209 -130 -31 138 222 76 6 -194 -198 -72 84 125 41 9 -87 -58 -34 4 -10 7 4 23 77 59
5852 59 -89 -142 -26 -11 95 196 48 0 -198 -162 23 170 187 109 -34 -162 -110 -8 120 124 71 -8 -7 20 21 13
5878 13 -4 -34 22 31 105 14 -106 -154 -156 25 114 139 52 -125 -203 -155 37 154 139 60 -32 -153 -48 5 112 111 1
5905Aj4m4L4N3l2l4M8K5M1J5m7m2j26P5J46R3L9j92j22k9J2J39J10m8m0j99j4
5932a52P8Q8Q4k2o9j4kJ5p8N2K1j9P3j1Q7j61k7j7j6J51O1J7j41q8l2JR7J77k0
5961A33j51K3j18M7Q3M8k4J9m5k9j2L7Qq6M1Q3qPj00p7M5P6O7J9P9j77p0j2RJ36
5991E1K4J28j33p4p9k7R5L0M4M3j21L7p9pjO9J0J6J8k5Qj37O1J5R1J06j07Nj46
6020h5j02Q7Q7J13k0jq7j29Q7mN7J06J7o5k9q5L9J5L2P4n5l1n9o5L2J6R1J1mJ6
6050E9nj23j7K3M4M3O6qq3m5l6n2J09J67j6m0q6r4j3O3P8K6J3l0q1K1j5L3M4m6
6080aL3N3p3L0j34LM7J57k3K6n4j35o6L5J25P7R0j64q4p8O7M8Q5N7p3j36N4Ql5
6109f1lN2M0N0j4Mn8p2j4LJ29J17j5j33j38o6P4J13R7Q4j09j70o3P7J13L8j0q6
$$ plain form
5905 1 -13 -57 -23 30 -2 -36 12 37 78 93 46 4 -122 -47 99 192 231 39 -83 -112 -100 39 149 101 61 -138 -152
5932 -152 -74 14 98 76 7 -7 -9 6 -72 -20 1 -18 55 44 131 -30 -57 -74 -90 61 122 139 -2 -90 -122 -121 -24 153 133
5961 133 -18 5 -113 -66 17 65 41 60 15 -14 -26 11 19 -67 -26 57 49 56 -44 -121 -76 0 67 86 165 -12 -82 -94 -85 51
5991 51 75 203 70 -4 -83 -110 -15 15 59 102 -19 18 -61 -68 -69 0 10 26 44 19 27 -110 -49 -34 57 163 56 61 -85
6020 -85 -187 -100 -13 100 80 79 -8 -137 -50 -54 3 109 126 61 32 -53 -14 1 33 107 52 21 -38 -103 -71 -55 36 47 43 59
6050 59 54 -69 -86 -63 -19 24 90 82 -1 -46 -82 -134 -25 142 126 86 0 -94 -107 -44 34 60 73 43 -38 -17 -32 1 45 -1
6080 -1 32 85 12 42 -92 -89 -42 115 92 118 64 -71 -137 -102 23 100 190 26 -58 -136 -69 -21 64 121 48 -88 -34 -26 -61
6109 -61 -64 -12 28 78 64 68 10 -62 -76 -73 56 173 158 25 -113 -179 -105 8 105 189 80 -90 -153 -76 37 75 65 -21
6137b1K0j3OKN0j83O4J40m3Q1nj51p6J0J76M7P9j42j55n4N0K04K8J08j60j92l2
6164a62J13Q7L1K7p8n9J5N3pqj1j13J66Q5jn7k16q0R2J59J58k2j49j06o9N3J22
6191B3K03q3j72p4rL6J63P0j47J7k0J9K7o1m7r1Q9L5J66Lj21j22n5Q9J95L1kj28
6219C4k06n6K01R1J32l6k37j9j0P1O6M3Oj44K9N0Mk5n9l2j9J85P1j4j10j68l4
6246a86J17J11J83j02j21j04k7N7J44Q7p9o8r5lR2M7M5r5j1k1J16q5k7m3n8J67
6272D1L4Q8p0j05j44K0J40J16N3o1r4j52OJ15O5R8o3n1o8mK6R6p2J1J9k9nRm9
6301c0m5J3O6J08K5p6j36m8J8N5J91K4r3j08p3j2N0Q4R9l2n2r7L1J8K6M8n4M5
6329D5m6j3m6M8j0j5K1J08j1j12pj9n5J12Q7K1n1q4j6m2M2R4J3jn3k5p5O2L6o0
$$ plain form
6137 -21 -1 -14 -8 -6 44 -139 -75 65 22 103 98 -53 -129 -119 57 104 183 41 -114 -168 -118 86 114 222 62 -130 -162
6164 -162 -49 38 69 96 18 -41 -26 27 20 12 1 -112 54 139 138 81 -135 -215 -123 36 194 172 23 -83 -152 -99 23
6191 23 226 143 -29 -103 -112 -76 87 157 10 27 7 26 53 -8 -55 -146 -57 -22 144 147 26 -96 -151 -62 133 164 162 34
6219 34 -172 -228 -27 64 196 160 -77 -96 -106 -35 31 74 80 -64 -35 15 19 -6 -65 -97 -116 69 140 126 16 -152 -186
6246 -186 -69 42 225 123 2 -102 -129 -72 72 159 80 12 -83 -86 6 53 98 3 -8 -29 87 2 -25 -68 -126 41
6272 41 75 163 93 -12 -156 -136 4 120 173 112 18 -134 -128 -13 52 150 87 36 -32 -36 -10 86 14 25 44 15 10 19 -30
6301 -30 -75 -62 4 112 137 61 -75 -123 -105 -50 141 165 72 -36 -109 -121 -71 13 112 80 28 -69 -38 -20 6 54 0 45
6329 45 -1 -14 -60 -12 -22 -37 -16 92 81 -31 -38 -57 -112 0 87 108 57 -27 -43 -85 -43 51 64 63 10 -15 -90 -28 8 -52
6359e2J20n1O4n6j1m8l3N4J4P7j4m0o5p2R8N5Kk2L0p6j1m2J2N1P8l0N1r6n8j6
6389h7O5%R1Ok2l2o9m5M7O3MPN9j36L1J3o4P2K1ok6N0n3q1m4J15P3P2l4p1p8J
6421e8K3M6J28k5o4q7p9Q3N3jN1l7J2J4p8J3k2j0K3N2P1r0o1l5N3j0Q9Q7k1j30
6451a0q1%M1J37L8p7m6k7m0O2L4rl0k3P5l9nK3p4LMP8J01p3j01o6oP8J10K6N3
6482A56j64r9l4J31Q4K0n3q0n5K7N4j1J08o0J1l7K5jJ3j02J0K2Q4R0q7r3j05R
6510a37J33J40O6j27j91Qq4J59J53Mr2l9q5L9K2M7lj4pQN1k3Qj14k5J03J11L6
6538A47n9j60m8K9J22P3R0r7r6j10N5J03J1L3p6j2o2pJ7M4K2J0j5N3l5K5p1q0
6566i4m9J38O3O2r9q4j08P2J41P7j0r1j41lR0K1J04j0M2j09l6NO9l1m4M0K6M0
$$ plain form
6359 -52 68 17 81 25 14 -34 -67 -13 1 78 64 24 -41 -113 -15 40 42 20 50 -26 -37 -79 -67 -16 62 32 83 -13 -71 -87
6389 -87 -22 -22 69 75 53 21 -48 -93 -46 17 21 28 87 -49 -18 -5 -69 3 24 18 -8 42 -11 -92 -136 -21 52 124 90 19 -59 -58
6421 -58 -35 11 139 114 50 -37 -116 -33 20 19 70 33 45 59 -19 -6 -28 -38 -15 37 108 18 -43 -78 -25 -35 54 141 120 -10
6451 -10 -91 -91 -50 87 125 48 2 -25 -65 -3 31 22 -8 -31 44 5 0 23 -51 -48 -44 34 135 62 -39 -105 -111 -33 77 103 156
6482 156 -8 -107 -141 -10 74 94 41 -39 -94 -67 -13 -24 84 24 35 -2 23 22 35 -67 -57 -35 49 139 52 -41 -146 -137
6510 -137 -4 136 202 75 -116 -108 -192 -33 120 124 32 -7 -92 -53 -31 16 13 -1 -8 0 51 28 36 -78 -103 0 111 147
6538 147 88 -72 -120 -91 31 104 194 97 1 -109 -54 49 60 93 17 5 -57 -64 -47 -3 19 29 14 67 32 57 -14 -94
6566 -94 -143 -5 58 120 21 -63 -171 -99 42 119 109 18 -123 -126 -36 -15 89 79 121 12 -24 -19 50 19 -25 15 41 81
6594H1o9mj15J6M9J75o1j7p9r1K3lQ3R8M2j25q6q0J12N3L4j3M2j22P1k8rQM7n6
6624b4N0PO6j40k4p3N7J34K0J9j66l7n6J16R1N0m5j2r1o2K3J19n6J03km9j4n1
6652d7pM0QOL8K0m6o4m0pO0R9K5j8j33L7r5J27L2lP2p1o9m4J1L4L3J09l4o4l0
6683b1K4p3OK8M4Q3l1p9m8OJ2M7R6k6k8o8m5L3n5R6Q2K3j10l7%l5P5K4J4LL8k6
6715E2m9p3N0J5P3p8N9q9Ol0jN2M9ok1qm9J4L1J1jMP2j22n4M3JL3J44rq2l7r2
6748i2J4P5N1N4m4m1J3p0m3Q4j2J7L1k3j3K4j02L1K7R7M4l4m3r5q7N0J35oJ7l1
6778B8q2k1k3N0R7K3l7j9J0o1m0P4kK6L4P6p6n4m9J4K4M3L9J2o7q6k9N6J8J18
6808I6jn1m2m4j8J2J04K0o4m6M1p9J0ON0j8Q6l7oqj14O4L8M7K3l0n5o7l9J01J10
$$ plain form
6594 81 12 8 -107 -91 -42 133 72 55 -24 -115 -92 -95 -12 86 128 3 -83 -163 -51 2 36 23 65 -57 14 -14 -23 -15 32 -24
6624 -24 26 33 99 -41 -65 -138 -81 53 73 92 -74 -111 -167 -51 40 90 45 33 -58 -120 -97 22 -34 69 67 18 4 -47
6652 -47 -54 -14 -6 0 38 58 12 -52 -92 -99 -39 60 85 67 -66 -29 -124 3 35 32 104 33 -36 -80 -69 -35 -2 107 73 9 -21
6683 -21 3 -70 -64 -36 8 91 60 -19 -67 -61 -49 -2 94 68 40 -28 -73 -40 -95 1 83 106 -4 -41 -41 -76 -1 23 37 40 78 52
6715 52 3 -70 -20 -5 68 -10 49 -40 -34 -64 -65 -13 36 30 9 1 -48 -34 -3 8 7 11 83 -39 -93 -50 -49 -16 128 119 37 0 -92
6748 -92 -78 -3 48 102 58 17 30 -40 -83 1 -11 6 37 14 1 25 -77 -46 -19 78 122 88 45 -50 -137 -87 48 42 59 28
6778 28 -54 -75 -98 -48 49 72 35 16 26 -35 -75 -1 -3 23 57 133 57 3 -46 -32 -8 35 74 86 19 -67 -96 -40 -22 96
6808 96 95 44 2 -42 -60 -48 56 76 12 -34 7 -72 -62 -56 -6 -24 62 25 19 11 -103 -39 -1 46 69 39 -16 -83 -122 -21 89
6839H9Qj7kj15o4N7k1R8%OOm6m2L5m2L0L4M2K0q8L3q9QK5J06J5rj10j2l4J02o
6871A7M1ol3m6Jm2N2L4nM5q7P0l3m6J6pN0M1j7j8n9m7mP5Q5Jn6p5K5o2J06Q4j33
6904c3L6J6l6%o8O6K6J1L7n4M3m9qo7J01K7L9K3j23m9j5RR7P9m8m2j4o5mP8N0
6935F3J2l7l3M6p4k0%O0j5L8j6j7p3J8m2J07N2l6M5j16L6o9Q2L1P5Lj02p3%LJ3
6966c9M1J1N0on0m9J2rO0K1Q4q5n5m1K9%N0N7qp7k0p0O0j2Q3L4m8m8R5j36MM4
6998a8L4K0jL1j25R0r1L8J7K6K4Mn4K0r5N7O8kj7JJ4r5K1L5J0J15pj03k0j6q9
7029a08P2N5qk0M4m6q5OjJ57J5Jp1n7K0n4P4j9J04l6j8k3k7o5J11j7Q3k9rl6o3
7060e0L6l5P9M9K3r3o8Q1qr7P9P3l8j1j6m3Pj8J22p0Q0k4q6J0J1j6l0O9P7l5q6
$$ plain form
6839 89 97 80 78 -37 -101 -44 -65 33 33 39 45 -1 -43 -8 -50 -20 14 56 76 -12 21 -68 -60 -35 71 86 77 -33 -45 -79 23 17
6871 17 58 52 19 -27 -26 -68 -16 18 13 58 -29 41 8 -38 -22 -29 21 62 45 27 -32 -79 -83 -8 77 78 22 -53 -28 -90 16 100 -33
6904 -33 3 19 -17 -17 -85 -19 7 18 55 1 44 -5 -13 -80 21 48 87 110 -13 -62 -77 -68 29 108 60 18 4 -61 -65 13 63
6935 63 75 38 5 51 -23 -43 -43 17 2 40 24 7 -66 -48 -90 17 69 33 78 -38 -2 -71 11 42 117 120 18 -55 -55 -52 -39
6966 -39 2 13 63 57 7 -42 -30 -39 21 42 126 41 -14 -55 -26 -26 24 81 73 -4 -24 -94 -34 -46 37 71 23 -25 70 -66 -62 -18
6998 -18 16 36 35 66 -59 31 -60 -22 -5 21 45 49 -5 15 -80 -23 45 43 26 27 41 -54 -33 2 12 127 120 17 -3 -19 -108
7029 -108 -36 19 11 -9 35 -11 -96 -90 -91 66 81 82 11 -46 -26 -80 -6 -25 79 43 25 2 -25 -90 21 4 87 58 49 13 -50
7060 -50 -14 -49 30 79 102 9 -59 22 14 -83 -4 69 31 20 4 -39 -32 -50 72 2 82 58 -28 -18 -7 -23 -53 16 93 58 -28
7091b8l7K3k4P5QK4k8jo3%J0K4R6rl8m6l4K5j3N5pM3Mp3j22L9L7N5jQ6l7r5k0
7124g2K1L6O2J1J7r3l8J0L8j6K5J9oj5%l7j6J7P4K5pm7lq4j8N5P7Q8q2n9j1k6
7156e5l2M2R5j7k5J2l9m7K2O0kl5Q8o5M8p6J0q1M8J11L6n1l6j00K5OK2Q7M4q2
7186A3m8p5N6N5L1J7Jl8m4J1J4J5j2O6Lk3o9L3l6l6P5M3K7Kn9n3l3M5O3K5Lo6
7218Fj06N8KQ1M0n5l1J4m3j6P9m3NM5k3L5m4l5k8l4R8N1K6k7p9n9m6J18N5Q1o1
7249F4n6r4%P8n2J12J9r0k9O9j2m7mj7R2k4N4q1j0k5MQ5J9K5lj37J1k2M4P8L5
7280H6q4l3L5j05Q5k4R2q0N4j5Jo6L2j5L4j1P9jp4j4n5N6L6Q0j8q5l7rk0O0R1
7311G5J8n7Nr2j1QP0K3Ml1k0n9K3qj6P1N8J8k7o1k7J1K8jJ03l9Mj28k1j2K1R0
$$ plain form
7091 -28 -65 -42 -66 9 17 41 13 12 -51 -51 -41 -17 79 70 32 -14 -48 -23 -36 19 12 55 59 -14 -136 -97 -60 -5 -6 80 43 -52 -72
7124 -72 -51 -15 47 58 75 -18 -56 -46 -8 -24 1 20 14 -1 -1 -38 -54 -37 37 62 55 8 5 -79 -97 -42 35 123 41 -18 -29 -55
7156 -55 -87 -45 50 33 8 20 -19 -66 -44 16 14 -21 67 2 50 -26 -16 -97 -49 62 98 47 11 -89 -64 -58 -36 51 95 13
7186 13 -35 -110 -54 1 32 49 50 12 -32 -21 -7 8 -4 62 65 42 -27 6 -30 -66 9 52 79 81 22 -31 -64 -19 44 69 72 6
7218 6 -100 -42 -40 41 81 26 -5 9 -34 -50 29 -14 -9 36 13 48 4 -31 -59 -93 5 56 82 55 -24 -83 -129 -11 44 125 64
7249 64 8 -86 -86 -8 -60 52 71 -19 -48 21 9 -38 -42 -59 33 9 63 -18 -28 -53 -49 36 55 80 77 -60 -49 -71 -27 51 86
7280 86 2 -31 4 -101 -16 -40 52 -28 26 11 12 -54 -22 -37 -3 -14 65 64 -10 -24 -79 -23 13 93 75 -10 -47 -56 -76 -16 75
7311 75 93 36 41 -51 -62 -54 16 39 43 12 -8 -67 -44 -52 -68 3 61 79 52 -9 -36 -25 3 2 105 66 70 -58 -79 -91 -70 20
7343B0N4n1P8j62L8%K4l1J11l6l2Qq1JM9M5L8%m6o4l5O8j9L1N2K2j34O6p5J9L8
7374dNM2L5o1k0p0L6qL8O1m7j7mPn9P7LM2Nj4p6o1O5N3M1m7M9l7r7j0N4nM6j8
7408DL8k6q2K6j0OM9O9k7n7jn0N7m9Q5L7n0Ok0n5N3l0QQ1j13R0l4l0m0L0j2O0
7440A3N5Pn9p6M8m9R9j7K7k9p1K9l2L5P0Qo3l7j0J2k2M5j2R6L5o1l8m7l7N8RP2
7472E8j9Jk6j27P7M4N1K6o5L7j10p4P4R2j7j7J2qjj8l2k6N3m9O4nM6l6j15O6K0
7503b4L0J20j32j2o3J2M2P6L8o0q0On6L9J06K7K2q7l3L4k7kJ0P4j02L5J04j15
7531a8l1j4l1K3J11L3n5m6o2kP7K2M3jm7m4k6K6K1N5k0o0Q6o1m0j0O3k0M5j4N1
7562E4k3o8l9j1J49j9%L3j19k6OP2R1j7l3j22L2m4R7J6K4p3KRJ7P0r5mK3LP4m9
$$ plain form
7343 20 74 23 101 -61 -23 -23 1 -30 81 45 13 21 -60 -59 -10 35 73 73 27 -37 -72 -4 -23 8 60 82 -52 14 -61 -42 -4
7374 -4 1 43 78 17 -3 -73 -37 -45 -7 54 7 -10 -14 -7 -66 11 14 56 61 47 -29 -90 -25 28 69 22 71 34 -63 -73 -19 -24 22 4
7408 4 42 16 -66 -40 -50 -44 5 74 47 -10 -11 -61 -4 -53 32 69 19 25 5 -50 3 -27 -19 62 -51 39 5 -25 -65 -35 -47 13
7440 13 68 75 16 -60 -12 -61 38 21 48 19 -52 -23 -55 -20 50 58 -5 -42 -52 -40 -62 -17 -29 67 102 41 3 -44 -81 -23 -14 58
7472 58 39 40 14 -113 -36 8 59 85 20 57 -53 -127 -53 39 22 5 17 9 8 -10 -42 -68 -15 -64 0 -5 41 5 -110 -44 -24
7503 -24 6 126 -6 -18 -81 -69 -27 49 87 27 -53 -47 -103 -64 42 69 91 4 -29 5 -22 -24 -14 60 -42 -7 97 -18
7531 -18 -49 -63 -94 -71 40 73 18 -28 -90 -92 -15 7 50 49 2 -42 -68 -42 -21 34 14 -46 40 -21 -61 -71 -8 -28 17 3 54
7562 54 31 -37 -76 -87 62 43 43 76 -43 -69 -63 9 100 83 50 -72 -40 -84 13 29 53 -20 -18 -9 8 78 -17 -21 2 5 79 30
7594C0J7r6k6nM7J01J3l6j33LJQ1O9N1o4n1l9j3M6N1l0K1l5L3r1L3J0p0N7R1M
7625G0q1M5q8m0QR6N8j2q2m3l5Q8j0O3k4Oj8o2O0N9n0qk0J0K8j4l6m3M5MK1pP7
7658F5n7p6J9J05l1M5np4m3k6P2o2J20m2j0Ql3l5N8n7Q4k7K5k9J8n4qJ3K1J03
7688H7o2j3p5j7lR2J1O3l4k5o9k7L3qM6J3%J0r0M5j9J3K6L6J7m9n3L3n0O0j8J02
7720G5k2l1jj39J48l1jL9j5l0k9J9k6L2K1K8N1q6J4j04P6NJJ23q1k5j3p1M7O6
7750D0L1%J2q6r7M7L7L9m7L8M0k3o5pk1J2M4P3jl9k6r6L0k8J30L7kp4n9N8n3Q5
7782B9L1K0o8m2j8K6l3J8qL7K9O5o0m6k1m3Q5N4L5n0l1j5p9N6J14j3J3m8o3m6
7812g2J3O7M0o3J6J9k8J6l7O1n6O2L3m9Qn2o2J8Q6L8j0m2n4j3l2N6O0Q7n4r4m2
$$ plain form
7594 30 47 -49 -75 -80 -33 68 81 45 -88 -85 -84 -3 66 117 53 2 -37 -50 -4 47 17 38 3 36 -55 -22 -12 -82 -25 66 70
7625 70 -11 34 -54 -94 -86 10 68 56 -26 -69 -104 -16 -26 37 13 19 1 -61 -1 58 8 0 -20 -10 18 4 -32 -75 -30 -26 -5 -12 65
7658 65 8 -68 -49 56 25 70 65 -9 -52 -78 -6 -68 52 10 0 8 -25 -60 -2 -59 25 -2 23 -6 12 -42 -50 -37 -16 87
7688 87 25 12 -63 -80 -83 9 20 83 49 24 -45 -72 -39 -47 -1 12 12 22 -68 -23 -42 -29 -3 33 50 1 -52 -19 -69 -9 -27 75
7720 75 53 22 21 -118 30 -1 -2 37 22 -8 -37 -18 -44 -12 9 37 88 2 16 -88 -12 -7 -6 117 36 11 -2 -73 -26 40
7750 40 71 71 83 -3 -100 -53 -16 23 -24 14 54 31 -34 -41 -62 -50 -6 67 66 27 1 -95 -65 -93 37 74 72 -2 -61 -3 -56 29
7782 29 60 80 12 -30 -48 -22 -55 -37 -45 -8 21 86 26 -20 -41 -84 1 55 90 40 9 -6 -85 -29 85 72 85 37 -26 -72
7812 -72 -59 8 48 -15 1 20 -8 8 -29 32 -24 38 71 22 30 -22 -84 -66 20 58 48 6 -48 -61 -93 -37 23 110 56 -38 -80
7843h0L8M9J4m0R1p0ql8O2m7J2k5J8L5L7p0j0j7l0J44l1N6j32%j9l3P6N9K8m8
7873B1p9M7J3j8M3J9k7n1j6O3ll7J0qO3%L0n5j3n5O1J4N7K4p6j02rL6J6J05K8
7904A01p8n3mm4J00N3Kj16N3k3L8n5L4k1j3M7%L2j1q3r5J14L9Q0m5j7p8m3J8O3
7934eN7Ml0q3QL8J3k2Q1n0Pmn6J6R%M9jmL1o7q9M4J3P3M5m1k3n0K0M3K7j8rml6
7970a4mo6Q9L7n1J8KJ0Km0K0o3P5L5l4mk3l1QO5j8L5j4Rm5p8K4O4N9m0pl4pmo0
8005h5J12p5L7Q1Jn6p1K4rQ6n3M0Lq4j7P2n4N2j2M2j2o0Oj3Q2m3Q2r5L6q4O1l8
8037d4O1K1K1k9Lm7J4J6n7M1N5m1k8O1j03L5RL9m0L4k5o4K2M0J1qJ2K7j8k6Ok2
8069b4n2J12JJ3k0l0o0L1J6M1l7J9Rl9J0j6L7J8l0J3K4m3k0k5P9l1N1o7N5oqo5
$$ plain form
7843 -80 -42 7 21 -19 72 2 -6 -44 18 -29 -17 -42 -24 11 48 -22 -32 -49 -79 65 34 90 -42 -42 -61 -94 -18 41 69 21
7873 21 -58 -11 2 -16 27 46 19 -32 -48 15 12 -25 -15 -23 40 40 70 15 2 -53 8 22 79 103 27 -75 -84 -48 -32 73 101
7904 101 23 -30 -34 -78 22 75 77 -39 14 -9 29 -26 8 -13 -26 21 21 53 42 -41 -136 -22 17 97 52 35 -43 -86 -68 -5
7934 -5 52 56 26 -57 -49 -11 2 -20 61 11 18 14 -42 -26 -17 -17 32 31 27 58 -9 -98 -54 -41 32 77 36 13 -37 -17 26 53 35 26 22 -14
7970 -14 -18 -84 5 42 -9 9 11 21 23 -17 3 -60 15 50 16 12 -11 -42 -34 31 13 48 34 43 -2 -80 -56 8 67 27 20 -14 -21 -25 -85
8005 -85 27 -48 -11 70 71 15 -56 -32 -41 45 -8 32 35 -49 -66 6 -48 4 -8 34 22 -38 -32 -45 37 -6 76 -19 17 -67 -6 -44
8037 -44 17 38 59 30 33 -14 0 16 -41 0 55 14 -14 47 -56 -21 -12 27 -13 21 -4 -68 -46 -6 5 -3 9 36 18 -8 -2 -24
8069 -24 -76 36 37 50 30 0 -60 -29 -13 28 -9 10 19 -20 -10 -26 11 29 -1 12 36 -7 -27 -52 27 -4 47 -20 35 29 21 -44
8101d4J4R4lm4rp1NO7K9m2k3Q7r7M6nJ2n0K4nJ01n7j2k1n8J8N5L7K1m0o0Rj5O8
8134C1L5m6K8p7l2O9%N4j7n3j4j9N4k3JK6j7j7M5J6m8m2M7r2P9L4N5j6j19Rk5
8165g4R3K5k7l1j5k7K3RJ20q7l4R1n4j2N6j05ON5N8m4K0n1L0p0k8Q8
$$ plain form
8101 -44 -30 64 61 17 8 -63 -58 9 38 -4 -27 60 -37 9 4 16 -34 -10 -15 86 29 17 -4 -62 -44 11 48 69 29 -31 -22 -37 31
8134 31 66 20 48 -29 -61 8 8 62 45 -8 -22 -41 13 -10 -9 17 0 -17 28 44 -4 -46 1 -91 -12 22 77 61 -58 -49 -74
8165 -74 19 44 17 -14 -29 -56 -33 -24 96 9 -25 66 12 0 56 -49 -43 12 70 26 46 -5 25 -45 -73 15
8191A5
$$ Imaginary data points
##PAGE= N=2
##DATA TABLE= (X++(I..I)), XYDATA
0@%%%%%%%%%Qj6J6k4L2l2M0n6P2q4J00j20J38j62J93k28K67l12L63m20M82n54
31b97O34p17Q13r18J033j164J308j464J632j817K020k240K481k747L037l354L700
48A940m077M493m950N451o007O626p317Q096q977R985j1154J2524j4158J6148
62H623j8629K1826k6123L2233m1667N8277r5973L32183K7700n50867K10522j15258
74a57153j64852M14583K86417l69619n9882P9219k34984K0520L52058o9063j25124
85b7880J38929o6661j56734J70214j724k36198O3132J93569k9799L1079M6685
96A24612j69864j29302P5802R1338J17613P8216j07244j37355o2053n3490J12399
107e9328K05159l8184j28165K4661m0700n3668J45123L7513j54668K8258Q0283
$$ plain form
0 0 0 0 0 0 0 0 0 0 0 8 -8 8 -16 16 -16 24 -32 40 -44 56 -64 74 -88 105 -123 144 -168 195 -225 257 -297
31 -297 337 -380 433 -485 548 -616 692 -772 860 -957 1063 -1177 1304 -1443 1594 -1760 1940
48 1940 -2137 2356 -2594 2857 -3150 3476 -3841 4255 -4722 5263 -5891 6633 -7525 8623
62 8623 -10006 11820 -14303 17930 -23737 34540 -61433 270750 298450 -252417 -41895 -157153
74 -157153 -322005 92578 378995 9376 -50506 28713 -206271 -185751 166307 97244 -27880
85 -27880 111049 44388 -112346 57868 56144 -180054 -116922 76647 46848 77927 124612
96 124612 -45252 -174554 -98752 -7414 110199 188415 81171 -56184 -118237 -171727 -59328
107 -59328 145831 107647 -20518 4143 -36557 -90225 54898 92411 -62257 -33999 46284
118D6284q2665O2046J21112j81606j46140J28548L4343Q943K06243j0488k90204
129a03584n6522J00469j9530J10859J83593j12699j80097J3157k7084k7727J69769
140E0604Q9531j18170k5242M1008q2459k4138Q8488k6424n6073J00758P3043p9147
152C1779n6051r845o5856m180J40656J03199l3771o6894q0406j03464J1532J52248
164A8947R9918j6722m2611p9712r7612K0205J01074L5832R229K1861n2509p0733
176e2833K3298K6413k8887J4700M4177j265O070J6725n1190o8916J819M4319N1362
189B5792M7946J358n4841o7698l8188K3570O6860N0308J8001k1882p1145m5473
201f5392K4724J9228J0324N2330J6158m5715n563j369o1371l169O8085Q435L488
$$ plain form
118 46284 -36381 25665 146777 -34829 -180969 -52421 -18078 -9135 197108 186620 -103584
129 -103584 -160106 -59637 -79167 31692 215285 102586 -77511 -64354 -91438 -119165 50604
140 50604 140135 21965 -3277 37731 -44728 -68866 19622 -6802 -62875 37883 110926 31779
152 31779 -24272 -34117 -99973 -104153 36503 139702 105931 39037 -41369 -144833 -133301 18947
164 18947 118865 102143 59532 -20180 -117792 -97587 3487 39319 48548 70409 17900 -52833
176 -52833 -29535 -3122 -32009 -17309 26868 25603 31673 48398 -2792 -71708 -69889 -25570 25792
189 25792 73738 75096 20255 -47443 -85631 -62061 4799 55107 73108 51226 -19919 -65392
201 -65392 -40668 -21440 -11116 41214 57372 11657 6094 4725 -56646 -59815 8270 16705 20193
214B0193N4038l3000r5570m176J9125p317P6963P5914n8829o1075k281m9544j5101
227h0660R4003M6814k3953J4565k4618r0630n918N4487N940L0381N7028l1789
239D5650o2088r777k3148j4506O5836N6150j1502j1737k3715n7924j2665L6522
251b2904K1782K6905L1461k1306m3678j7850j6830k927L9947L6845J1380O339
263D9164k6695o0033k6271J7135L1785N2293L7438k8539n4778l3561j9129J7073
275d4118O1681L9544r815k3111l4591l7451N738L1752J2231J1997K0115o134k0942
288F896j2009k2194j8964K3086M2430K5876R468k3708o2631m4553J3764N0029
300a2510N8746L6472k5671o9533m8831k301L4073N3534L4679j3814l9380l0925
$$ plain form
214 20193 74231 41231 -54339 -58515 -39390 -46707 30256 106170 47341 -13734 -16015 -65559 -80660
227 -80660 13343 60157 36204 50769 26151 -64479 -70397 -15910 -9970 20411 77439 45650
239 45650 -16438 -26215 -49363 -63869 1967 58117 46615 34878 11163 -46761 -59426 -22904
251 -22904 -1122 25783 57244 35938 -7740 -25590 -42420 -45347 -5400 31445 42825 49164
263 49164 22469 -37564 -63835 -46700 -14915 37378 74816 46277 -8501 -42062 -61191 -44118
275 -44118 17563 57107 47292 24181 -10410 -47861 -42123 -10371 1860 13857 33972 27838 6896
288 6896 -5113 -27307 -46271 -23185 19245 45121 54589 30881 -31750 -76303 -62539 -12510
300 -12510 46236 82708 57037 -12496 -61327 -63628 -29555 23979 58658 44844 5464 -25461
312b5461j3083Q954K4030J5580L098O646P680o516k2012k9282j9238J3818M6480
325A0694M4516O855l8057o0476m0851J3979O2469O3778J8912l7168o6015m7380
337f8744O163M9309M7958J4517j9123l3957k3079K731J5138P901J505L639Q287
350A2245J2828L803k4279m0857k1186J8900N0870N1157P732m9158o7199l4510
362g9654K2301O5948O1066P728m7408o3544l6226J5675N1114M1430N755k2841
374B1344k9780j2446R373Q052l539j240O546J3987K0552J493l6324m2298j1665
387e5945K2662N2445N3005l380o1701o0055k1970K4182O7276N7963r353n3551
399A1578m6061k3591J3923N1174L4319j1252k0447j1974j2058L197J2988j0637
$$ plain form
312 -25461 -38544 -29590 -5560 10020 13118 19764 27444 20928 -1084 -30366 -49604 -35786 10694
325 10694 55210 62065 24008 -36468 -77319 -63340 -871 62907 81819 44651 -21364 -68744
337 -68744 -62581 -13272 34686 49203 30080 -3877 -26956 -24225 -9087 -1186 319 3958 12245
350 12245 25073 28876 4597 -36260 -57446 -38546 12324 63481 71213 22055 -45144 -79654
362 -79654 -57353 8595 69661 77389 29981 -33563 -69789 -54114 -3000 38430 44185 21344
374 21344 -8436 -20882 -11509 -3457 -6996 -8236 -1690 12297 32849 34342 -1982 -44280 -55945
387 -55945 -33283 19162 72167 68787 7086 -52969 -74939 -50757 16519 74482 65129 11578
399 11578 -34483 -58074 -44151 7023 41342 30090 9643 -2331 -14389 -11192 1796 -8841
411h841j4955J9789L0790Q787o546k8529n0613j6950M5854N7056K7129n009m8606
424I356o9787j7559M9064N5368L1091K220m4083n9071r450L0821K3161J8057J2644
437C1832j7656k2521O472L324j9053m504J3677R767K1576K5700k1088n5088k6765
450e4327R129K9139N3191L8116l0687o5005l3499j80K6104N7443L7888k9003m8217
463i908j9270q420P623M0148K1583k1694p767J1817j4163j4364J0616q619j5210
476b7628L2265L5338j2392j8871j6035l8770p033N4897M0851j781q074l0337n0944
489d8514k122M4155K4561Q064Q592k1777l7435j650J6715l92N978K2049M632j0872
503A1984p33j0595l3665r612L2688K8445J2981J3578k2467o1580k0002L2692K4847
$$ plain form
411 -8841 -23796 -4007 26783 35570 29024 495 -50118 -67068 -21214 35842 62971 57962 9356
424 9356 -60431 -77990 -28926 26442 57533 59753 15670 -43401 -52851 -22030 1131 19188 31832
437 31832 14176 -8345 -1873 1451 -17602 -22106 -8429 1338 22914 48614 27526 -27562 -54327
450 -54327 -45198 -16059 37132 75248 44561 -20444 -53943 -54123 -28019 29424 67312 38309 -9908
463 -9908 -29178 -37598 -29975 10173 31756 10062 2295 14112 -51 -14415 -3799 -12418 -27628
476 -27628 4637 39975 27583 8712 -7323 -46093 -53126 1771 42622 40841 32767 2430 -48514
489 -48514 -50636 -6481 18080 26144 34736 12959 -24476 -26126 -9411 -9803 -3825 18224 22856 11984
503 11984 11251 656 -33009 -42621 -9933 18512 31493 45071 22604 -38976 -58978 -26286 -1439
516a439L0555L8930k9076p0015j1997J1639l799M4903N3146l1010l8739Q370k6792
529b5324k8830M9870L4936k2945J6050J6146n6219k7102L1276o270J652N9625
541D2865P961n1479q622m603l5495K3002N9857J19j7618L820k9245l5928J9431
554b5935L0560N210J0152P210j8918k2411n757M421O332Q296J7858J1415j8136
567A0297j8338J169j4820j0287L7290K4347j8395N538L449m9080j3776M2173O51
580B18l828M6988n487n9319K269J1229l4325K6877O4248j7591k7655J5820l7220
593a7776m5909M5136M1312j1320K2539J1078o2821l0703K9748K652Q571M9958
605D2465K515m4815j1133n464k4114J8078M4178O523o377J092k6771l4577M441
$$ plain form
516 -1439 29116 68046 38970 -31045 -43042 -31403 -35202 9701 62847 31837 -6902 1468 -25324
529 -25324 -54154 -4284 30652 7707 23757 39903 -16316 -43418 -12142 -18412 -16760 42865
541 42865 50826 -653 -9275 -13878 -49373 -26371 33486 33605 15987 19807 -9438 -45366 -25935
554 -25935 4625 9835 19987 27197 8279 -14132 -19889 -15468 -9136 -840 17018 28433 10297
567 10297 -8041 -6872 -21692 -31979 5311 29658 11263 16801 20250 -28830 -42606 -433 218
580 218 -3610 43378 37891 -21428 -19159 -7930 -42255 -15378 48870 31279 3624 19444 -17776
593 -17776 -63685 -18549 22763 11443 33982 45060 -17761 -48464 -18716 -16064 -7493 42465
605 42465 44980 165 -10968 -16432 -40546 -22468 21710 28233 21856 22948 -3823 -38400 -33959
618c3959K3867J6935K0839J2430k2795l7917j4232Q589J4611K4938K5527q607
630C0226l3641j5453j552l946J8349L0062l785j6214L893q977k1936Q432J5366
643H24o783J0263K4832j0751k4468l325j0142j1411K7334L4529k247j4065j1536
656C054k7508j6576K5936L2305N623j00l370k8201k4671J3272J8277R12J5642
669A4595J7524k0598k3156M088j0704j4176L2259L1983j0373l385l105m4597k0961
682e0606L8934K3580M875K5857j2624n8329j1410K3176J359K4081L8536k2221
694B5208l7835L831p485j4877L0520K3489j5692L593R154k7303j5093J2120l799
707a4169M975L2403P666j9129j1884j9841j8074K0171L1674J2422M547j4354l4276
$$ plain form
618 -33959 -10092 6843 27682 40112 17317 -20600 -34832 -26243 -11632 13306 38833 30226
630 30226 -3415 -18868 -20420 -24366 -6017 24045 20260 4046 7939 -1038 -22974 -14542 824
643 824 -5959 4304 29136 18385 -6083 -9408 -19550 -30961 -3627 30902 28655 14590 3054
656 3054 -24454 -41030 -15094 17211 22834 22734 19364 -8837 -33508 -20236 -1959 -1047 14595
669 14595 32119 11521 -11635 -7547 -18251 -32427 -168 31815 21442 18057 14952 -29645 -50606
682 -50606 -11672 11908 16783 42640 30016 -28313 -39723 -16547 -15188 8893 47429 25208
694 25208 -12627 -8796 -16281 -31158 -638 22851 7159 10752 19906 -7397 -22490 -10370 -14169
707 -14169 -9194 23209 30875 11746 -138 -19979 -38053 -17882 13792 26214 30761 16407 -17869
720a7869j3108J0497J1838K2734J7161j5909j7863l400j3119k402K2175O792l014
733D513J5621j633k6269n412M37j2049J9180L4980m034j4734m744k8984j9378
746d2506L1702K8468J521R572r039m1501j1109K0565N369J2365K4817j0275k5214
759e265l9n681j3191J6421J9726j906O192M873k4468k0054L842L747J2951K8914
773B6062N795k2018j8018j4748q445J9875K9129Q274m241j2885k4564j1270J2112
786a4942J3021J0768J1711m096j5507p472n729o046Q945J5486P230M626k446j9049
800c500j7391q46P972J6729K1687L332j8396j9489j3313k838J7437K4023Q623
813B4030n141j2529j9038j1154P218J3715J1453R435k42j2656j2926p456k392
$$ plain form
720 -17869 -30977 -20480 -8642 14092 31253 15344 -2519 -5919 -19038 -21440 735 7527 4513
733 4513 20134 18501 -7768 -13180 -12743 -24792 -5612 29368 25334 10600 5856 -23128 -42506
746 -42506 -10804 17664 19185 28757 19718 -21783 -32892 -12327 -6958 5407 30224 19949 -5265
759 -5265 -5304 -10985 -24176 -7755 11971 10065 16257 21130 -3338 -23392 -19550 -15803 -2852 26062
773 26062 31857 9839 -8179 -22927 -31372 -11497 17632 25906 21665 8780 -15784 -27054 -14942
786 -14942 -1921 8847 20558 16462 955 -6517 -12246 -18292 -9347 6139 13369 17995 15549 -3500
800 -3500 -20891 -21737 -13765 2964 24651 27983 9587 -9902 -23215 -26053 -8616 15407 24030
813 24030 18889 6360 -12678 -23832 -16614 -2899 8554 17989 17747 5091 -7835 -15291 -17683
826a7683P714J6421J2196Q76q846j6357j5489j220J3927J7520J2184O58j4342
839G559k0142r870M595J2919J5969J0050n122j3814j1107p369K6J1833J3479N264
853A4270Q78n670j5622j1659J603P276J1984J5932K659j4087j4774j0983m393
866b2586J2967K1259Q832k510r135j8420j3051N776J2856J1851J1421n33j4902
879C825j2999o479j912R859J6624Q097r54p575j5533j2172J489J0313J4620J2743
893A9946j053j2986j3764j1265r83J5313J6170N975j5j0103j9204q019O312P821
907e855J2713J3818l928j4904r143q434l825J4430J7172L661p17o193j8386j1135
921b0726P023R908R798J2507m20j5992j2163m065j352Q224J6860Q343n285q609
$$ plain form
826 -17683 -9969 6452 18648 19524 10678 -5679 -21168 -22388 -8461 9059 21243 21901 7559
839 7559 -12583 -22453 -17858 -4939 11030 21080 15958 2144 -8963 -16332 -16306 -4473 9006 14270
853 14270 15148 9478 -6144 -17803 -16200 -8924 3060 18992 21651 7564 -7210 -18193 -22586
866 -22586 -9619 11640 20472 17962 8827 -9593 -22644 -16868 -4012 7839 19260 18727 3825
879 3825 -9174 -15653 -17565 -7706 8918 17015 16061 8486 -7047 -19219 -17730 -7417 7203 19946
893 19946 18893 5907 -7857 -19122 -20105 -4792 11378 17353 17338 7235 -11969 -19988 -13676 -5855
907 -5855 6858 20676 16748 1844 -7299 -15733 -19558 -5128 12044 15705 14988 8795 -9591 -20726
921 -20726 -13703 -3795 6003 18510 18090 2098 -10065 -14130 -15482 -7258 9602 17945 12660 4051
935D051r105j0887j845J3790J3804L478J262m791j8484j1532Q172Q361O678J5306
949A8258J580j9687r943m21p497P785K3610K883q442J755j2423k0504Q053J5627
963F34L22J2113J2204j9786j9475K512m169P94K6230J3155j2868p220q598j8683
977b2835K864K1226R343M378K822j4407j6966j961L340Q232J4328N407l606o878
991E287j4221q468O421O172Q734J6141l036j8723n224n653r622J8452K3343o818
1005A2785m323K411k4144j3063K3915P215o275J9394J015l0308Q54J2854j7690
1018a5360L547K9394p450j3058J7356r567k9260J2148J5761r878J5108K0313k3453
1031E601k0228P500p757k566L0034J2085j6844m078n233k0018K600K1762O163
$$ plain form
935 4051 -5054 -15941 -17786 -3996 9808 13286 14548 9757 -8727 -20259 -12087 -3726 2952 18258
949 18258 19838 151 -9792 -10213 -17710 -9925 13685 16568 8126 9881 -2542 -23046 -14993 634
963 634 956 13069 25273 5487 -13988 -11476 -15645 -14851 11379 24534 11666 4446 -4152 -22835
977 -22835 -19971 1255 10598 14976 17798 3391 -13575 -15536 -12196 -3964 10364 15771 12165 5287
991 5287 -8934 -17402 -10981 -4809 3925 20066 17030 -1693 -6917 -12570 -22192 -3740 19603 12785
1005 12785 8462 10873 -13271 -26334 -2419 4796 -1479 17915 18930 -11378 -10524 2330 -15360
1018 -15360 -11813 17581 10131 -2927 14429 4862 -24398 -12250 3511 -6367 8741 29054 5601
1031 5601 -14627 -7127 -14884 -17450 12584 24669 7825 3747 -1486 -21504 -18904 2858 9021
1044I021J195N201q888j6442m977K735O575J0823R462L075r170j8158q782K972
1058a5358N863J7124J8735p901j9881q119j0863l717K6484K1208r193m927l733
1071E722k5387o152K6680P426n714J4392k296k6985j9J2663j0687K246K3014k585
1085A2318j2558P092o689k0653Q084J7164j797O703J0620j8598j9564P782M649
1098e447j526J7279J0720j7081j0677M353o560m223J5443P985p199K225L658j2817
1112c867q808N975J551J865J5522O933j3802j1281m141p640N086K3113J1019r077
1126A2448q598j0028j4853K787K0995J1197j082q01r543j6834j901J0892N445
1139A24N549R479l654j3887m704j142n390P501J8112L174p633k523j0245j6255
$$ plain form
1044 9021 10216 15417 6529 -9913 -14890 -12155 -5580 5243 14705 17780 8610 -9548 -18330 -15358
1058 -15358 -9495 7629 26364 18463 -1418 -9537 -20400 -24117 2367 23575 14382 9455 5722
1071 5722 -19665 -25817 863 8289 2575 16967 14671 -12314 -12333 330 -10357 -8111 14903 12318
1085 12318 -240 6852 163 -20490 -12406 4758 2961 9664 20284 1686 -17878 -10096 -5447
1098 -5447 -6973 10306 21026 3945 -6732 -2379 -8939 -13162 2281 10266 3067 5292 8950 -3867
1112 -3867 -12675 -6700 -5149 -3284 12238 19171 5369 -5912 -10053 -17693 -12607 10506 21525 12448
1126 12448 3850 -6178 -21031 -18244 2751 13948 12866 12065 2522 -14312 -16213 -5321 124
1139 124 5673 15152 11498 -2389 -7093 -8235 -13625 -6124 11988 15162 7529 5006 -5239 -21494
1153b1494O121K0368N916R57L580j4310k0410L935J2886K930Q968Q533j2952j3804
1167h776K588q47k673J2337Q221o818k4K596j2160p592Q232L250R00J2225L789
1182A5248j4162r319n19l064N510J6493N641p919o890p356q094L643J2761O684
1196H657N87l41o749j0897k675N209M161N703Q236l05j0300p581l116k649O075
1211e985J4822O154n414o472r110j0546L406J4544Q190K458n0j0951j3912k96
1225a3162O773N229R419O782p449j0333l438m019n03J0788R837k06k304m347j0898
1240g831o113O014Q168O206N836j789j1176q824j393K543P455J0315L186n677
1254F920p297o655m623L001R523P269J888j866o934r440l676M243P086P403N067
$$ plain form
1153 -21494 -15373 4995 10911 11868 15448 1138 -19272 -15337 -2451 479 9447 17980 5028 -8776
1167 -8776 -6188 -7035 -9708 2629 10850 4032 4008 6604 -5556 -13148 -4916 -1666 -766 11459 15248
1182 15248 1086 -8233 -8752 -11816 -6306 10187 15828 7909 1019 -6337 -14431 -10788 1973 8657
1196 8657 9244 8903 2154 -8743 -11418 -6209 -2048 3655 11891 11586 1286 -6295 -9411 -12060 -5985
1211 -5985 8837 14991 9577 3105 -6005 -16551 -13145 1399 9589 12047 11997 1046 -12866 -13162
1225 -13162 -6389 -1160 8259 15041 7592 -2741 -6179 -10198 -10701 87 9924 9718 7414 3067 -7831
1240 -7831 -13944 -7930 238 6444 12280 10491 -685 -9509 -10902 -8359 -904 9411 12597 6920
1254 6920 -377 -7032 -11655 -8654 869 8138 10026 8160 1226 -8214 -11890 -7647 -561 6842 11909
1269A1909k851r480p732k510K243P770R336K859m532o887p094m180L293Q298O524
1284F966K708j539p130q501l227K860O532Q169N123l072q813p834l682K496R052
1299A08R357K331m515q045q077k821N273Q323N688K041l193p730o247j178K305
1314f380N516P184L458k580n576p218n186J927P679Q125M801j911r255r731l169
1329a2316L801Q970R377K399n909q521o919j695N565Q064M854R39l166o707n286
1344f550j086J755M785O828L362j744n230q007n839K562Q116Q184N509k580j0979
1359i14r482k003M341J0095R825K97p477q030o395r28P377P673K685L90k910p141
1375b597l872N33O96L806P221K790k583l884p197o336K737Q880P165M188k405
$$ plain form
1269 11909 9058 -422 -8154 -10664 -8421 -651 8685 11544 7012 125 -6969 -11149 -7856 442 6966
1284 6966 9674 8135 1005 -7496 -10723 -7863 -1331 6838 11961 8889 76 -7758 -11440 -8944 108
1299 108 9465 11796 7281 -764 -8841 -11662 -6389 1934 7622 9663 6470 -1260 -7507 -8685 -6380
1314 -6380 -864 6320 9778 7198 1622 -5596 -10782 -8855 -1176 6949 11750 9839 584 -9147 -12316
1329 -12316 -8515 455 9832 12231 6322 -2199 -9118 -10813 -5248 2816 7670 8609 5443 -1264 -6550
1344 -6550 -7636 -5881 -1096 5732 9094 7350 2120 -5887 -11726 -9164 -1048 7136 12645 10065 -914
1359 -914 -10396 -12399 -8058 2037 11862 12159 4682 -3348 -9743 -10671 -3294 4379 7064 7454 4544 -2597
1375 -2597 -6469 -5936 -5240 -1434 5787 8577 5994 2110 -5087 -11423 -8686 194 7359 11547 9142
1390I142j0421r184r54N379Q950P670l31o922p466m817Q57N807N323K883N37l164
1406C289m391k476k430l72N406N567K446J368m612j0828m550L902N504R161P890
1421A4874o204j2457n186k146K416J3022Q939n045o009m261p711K55R838L822
1435D147k12K995k684p499r88J41k426M687P941J189j499l075q741n489M328P821
1451F36P300L889m867r806o698j264O225R904L726j755l578q085n067N124L779
1466e37K09N858K132p348j361J420p890j113J0651K355m17O500n856j5196Q37
1481i756O239l36J0071J0142j1411j1403J524m255m99J5786O031q754o36j528
1495A215j1119J244J0439o04M45P407l539q841r7j479l500O897Q919R51j855n023
$$ plain form
1390 9142 -1279 -10463 -11417 -6038 2912 10582 10251 3329 -4137 -8954 -8097 -2290 3033 5916 6453 3289
1406 3289 -1102 -3578 -6008 -6380 -974 4593 7039 8407 3795 -7033 -11583 -7681 -2177 6984 14874
1421 14874 8670 -3787 -8973 -11119 -8703 4319 13258 8213 2204 -2057 -9768 -9513 325 4147
1435 4147 3935 6930 4246 -3253 -4241 -4100 -6526 -1839 6102 7291 5792 2717 -6024 -11513 -7185 636
1451 636 7936 11825 6958 -2848 -9546 -10810 -4585 5319 9045 7290 3712 -4373 -9440 -4316 -537
1466 -537 -328 5530 7662 314 -1047 373 -7517 -8630 2021 4376 3959 10459 4603 -10593 -9756
1481 -9756 -3517 -3853 6218 16360 4949 -6454 -4930 -9185 -9684 6102 12133 3379 2743 1215
1495 1215 -9904 -8660 1779 1175 1620 9027 5488 -3353 -3450 -4929 -8429 -1532 7387 8338 6483 1460
1511A460r211l504M349P969Q539J825o894p312o134k585Q235J0097M63o55j410
1526E232j0515n008P373J756k68R357Q52j0550m2J434r194K685J3052j062k660
1541B442O218p473j3399N644P035k650P805P634j1798q330M107l137j561J2288
1555D825M550p496j00K59q846j220P956J361J25N701p02q252l394M49q60L596
1571b048Q421K847n002m946l695m541J428R761O000j858j508l761r527j980Q392
1586b017M475J881N258k871j1402l172K731n35N768J0308j750p813k278m386n084
1601a0887P092R937L44r79l71q187o988M228N558J788M437K589o631o678j26J15
1617d759R5O679O260k808m535j348m940l892P032P485r12N23N38q969n663O395
$$ plain form
1511 1460 -7751 -11255 -6906 1063 9602 11427 4533 -2779 -8913 -11498 -3263 6834 7297 6642 5232
1526 5232 -5283 -10291 -2918 -1162 -1430 7927 8779 -1771 -1813 -379 -9573 -6888 6164 5102 2442
1541 2442 8660 1187 -12212 -6568 467 -2183 5622 13256 1458 -6872 -2765 -5902 -7463 4825
1555 4825 9375 1879 1779 2038 -6808 -8028 -72 1289 1414 7115 6413 -1839 -5233 -4784 -5644 -2048
1571 -2048 6373 9220 4218 -728 -4423 -8964 -7536 2225 8225 6367 4859 1098 -8429 -10409 -2017
1586 -2017 2458 4339 9597 6726 -4676 -7848 -5117 -5652 116 10424 8674 861 -1417 -5803 -10887
1601 -10887 -3795 6142 6486 5507 5136 -3051 -10039 -5811 -253 1535 5972 8561 1930 -4748 -4874 -4759
1617 -4759 -4664 2015 8275 5467 932 -416 -5356 -9248 -2216 5269 4357 4880 5418 -3551 -9214 -2819
1633b819K949r66O782K113r442k208L601n120r18R669J120l996M364j447j0805
1648g123l35N851o14M829Q785n092j0205j317j743p68J0203Q380l840n097l811
1663a897o305l36P817N368Q99l20l277m894k222O94K444L163K356K254o97n837
1679g90m626l63K16M619R374J307p034m678m797m457P449J1469K65k997j676q873
1695e592n486Q318O016j252L339L78q585j467M712l190j464O651Q89k248M138
1710E157j564r709j439M428J657N967O716n808r903k764k90K990R707N230m972
1725E403n840l979k811K890O369K143j002j042k061j600j58q76m46J805K921L308
1741E024J050m449o381k792J208N872Q564K303o372p595n098r98P357R697J604
$$ plain form
1633 -2819 130 -836 5946 8059 -1383 -3591 10 -5110 -6028 3641 4761 765 5129 3682 -7123
1648 -7123 -7458 -1607 -2221 2608 11393 6301 -3904 -5221 -6964 -7732 2471 10851 7011 1914 -1897
1663 -1897 -8202 -8538 -721 4647 5546 5226 1949 -2945 -5167 -4473 -2029 1134 3490 5744 5047 -790
1679 -790 -5416 -5779 -5563 -944 8430 9737 2703 -1975 -6772 -11229 -3780 7689 7954 4957 3281 -5592
1695 -5592 -11078 -2760 3256 2004 5343 5721 -2864 -4331 381 -2809 -4273 2378 3267 1019 5157
1710 5157 3593 -6116 -7555 -3127 -1470 4497 11213 5405 -4498 -7262 -7552 -4562 5145 10375 5403
1725 5403 -437 -4416 -7227 -4337 2032 4175 3173 2131 70 -1530 -1688 -2564 -3010 -1205 1716 5024
1741 5024 6074 1625 -4756 -7548 -6340 -468 8096 10399 4027 -3568 -8666 -9664 -2307 7390 8994
1756H994m282m938n844j917N832N205N3K3o63l380n93J291k143j798L375L452
1772B667J749J372l414p940l359L779N995O357K736n827r273m052K133O025P324
1787F272K659m763o371l183K65L199M072J277j426j066l40p10j091j561r23J843
1803a847M452L523n26m800o286l033L167P454O290L41n935p785l975K360O777
1818A77O048J114m001n396k895O64K838K759Q84m82j48k14j012j896j970m90K802
1835a218M817K804j385n085n941k221M119P140M739l58n595p160k892L128N908
1850H00M522J063l347m965k165O81J675K222J568O8j52m2j781k907j348P47K895
1867d66M554K378k563n393m458r73L826O414L971j373m888n294k388K324N043
$$ plain form
1756 8994 4712 -226 -6070 -7987 -2155 3050 3103 3126 2463 -917 -1510 -219 -2362 -4160 -785 2667
1772 2667 4416 5788 2374 -5566 -8925 -5146 849 7206 9942 4115 -5158 -9210 -7077 -1052 6272
1787 6272 8931 4168 -2203 -5386 -5121 -1922 2150 3427 2001 935 595 -115 -1206 -2767 -3690 -1847
1803 -1847 2605 6128 5602 802 -5484 -8517 -5350 2104 8394 8735 2800 -4985 -8960 -6600 177
1818 177 6225 7339 3338 -2058 -4953 -4289 -1451 1308 2192 1710 1562 1348 336 -1560 -3530 -4020 -1218
1835 -1218 3599 6403 5018 -67 -6008 -8229 -4110 3030 7769 7411 1816 -5344 -8236 -5108 800
1850 800 5322 6385 3038 -1927 -4092 -3411 -1736 486 2054 2122 1970 1928 147 -2760 -4108 -3361 -466
1867 -466 4088 6466 3903 -1490 -5948 -6921 -3095 3319 7290 5917 1029 -4265 -6653 -4329 714
1882G14L701N31k122l346k692m28J342J807J928J583J96j539k551k424j154J600
1898b854M156L567L88k641m556l894J82M246M693K327p89l964m823j508J918L270
1914b82L244J784j453l281k420j213J37K489L428J399l95j649l375k988M84K972
1930a119K896K329O03l321m364j356P80J791L955K967j529l101k141k439p35L778
1946a006L970Q57Q5j550n022k917J964K644K808L427m74m990l159n85k3L057M703
1963C789O78k328j345k369k733J090L082J482J597J423k238m300j909J22J282
1978b677M236M283p00m278l843k339R1M587N547Q13l026l228l234j489L255M305
1994B303N58n98k31k527k182J240M48j167K153L345m92j157p96m253l008L900
$$ plain form
1882 714 4415 4946 2824 -522 -3214 -3642 -2300 -493 1435 3018 3214 1675 -876 -3300 -4454 -2854
1898 -2854 1302 4869 5257 2616 -1940 -5834 -5652 -1406 3287 5614 4825 861 -3962 -5470 -3552 -282
1914 -282 2962 4746 3293 12 -2408 -3621 -3484 -995 2433 3832 3437 1788 -1587 -4575 -4091 -1119
1930 -1119 1777 4106 4709 1388 -2976 -4332 -3552 -1761 2194 5161 3632 531 -1610 -4049 -4784 -1006
1946 -1006 2964 3821 3906 2356 -2666 -5583 -3619 -975 1833 5260 4786 -204 -3363 -3948 -3971 -914 3789
1963 3789 4467 2139 794 -1575 -4308 -3218 -136 1346 2943 4366 2128 -2172 -4081 -3959 -2677
1978 -2677 1559 5842 5142 864 -2979 -5318 -5227 -640 4907 5720 2694 -534 -3768 -5257 -2002 2303
1994 2303 2861 2263 2032 -495 -2677 -1437 -989 -2156 -3 3342 2850 1693 897 -3356 -6364 -2464
2010b464N116J693R90j968p249l615L907M209K561K914j989o753k276K506R47
2025a471J624L225q15l105P96P85l084j068J978M89J744M370p04o272l377r5Q28
2042d152N639O847j620p040l971k162M69P187O447k298m655k372k911k34N479
2057F53L043k422n89R63k063p29J283j878k085L378M171L15r49k933n612j855
2073g309N420O151K087j054m545o717j842N615N689J440n48l059n477q47M665
2088c31J950j063R00m67k563J925K681l933l196K269J152J330N511m23q445l474
2104f177K014J051N275O931l541q355j915o4M02O886M813m666l945L87k092r2
2120c088M682K24l168J814K343j959p49l21l716o79N316M127J15k006m673n144
$$ plain form
2010 -2464 2652 4345 5335 3367 -3882 -7497 -3590 619 3180 6094 4105 -2648 -4924 -2418 -1471
2025 -1471 153 3378 2563 -542 254 1039 -2045 -3113 -1135 -646 1098 5468 4764 -1508 -4885 -4980 -4152
2042 -4152 1487 8334 6714 -326 -4297 -6459 -5990 1197 7644 5346 691 -1681 -4592 -4826 653
2057 653 3696 1274 685 1648 -415 -1144 139 -1739 -3824 -446 3725 4040 3091 158 -5454 -7309
2073 -7309 -1889 4262 6349 5295 750 -5967 -7809 -2194 3495 4935 4387 1328 -4149 -4996 -331
2088 -331 1619 556 1456 989 -1574 351 3032 -901 -4097 -1828 -676 654 6165 5742 -2703 -6177
2104 -6177 -4163 -3112 2163 9094 5553 -2802 -4717 -4781 -4379 2507 7320 2654 -1291 -904 -2996 -3088
2120 -3088 1594 1818 -1350 464 2807 848 99 -222 -3938 -4617 699 4826 4941 2935 -1738 -6882
2136f882M67O114N660J327l036n270m429J56N077M900L66k035k422l052j76L538
2152C03R33j949R48J267j393J004J256m618l114L632K993J167L099j777p928k327
2168f504L578K392L767M066m127o882l55J157O09M619K767l962k383J281j338
2183a315r49K501J87j655K372K433j965k342j284j960Q83M970L286j026l167l923
2199b954k689J461N072L734m4k543l576k815M80L498K639J97l78j000k202q56
2215a976R89r2r9K234J759p28j056j644l030m09L448L187J133j84l045m330q47
2232d690K830K739K347J039k553l737j090R00R75K203J882p24j713n71j050j479
2248b692R33K117R19Q60O60k106l188n56R77J451K874J903j934k925j474j100
$$ plain form
2136 -6882 -6415 -301 5359 6686 3650 -1620 -6049 -5893 -816 4084 4450 2415 -7 -3059 -3235 303
2152 303 1236 -713 235 1502 109 1113 2369 -2249 -5363 -1731 1262 2429 5528 3751 -4177 -6504
2168 -6504 -2926 -534 3233 7299 3172 -3710 -4065 -2908 -2299 2320 5087 1125 -1258 23 -1315
2183 -1315 -2264 237 424 -1231 1141 3574 1609 -733 -2017 -3977 -3094 1876 5162 4136 969 -2954
2199 -2954 -5643 -4182 890 4624 4580 2037 -1539 -4354 -3874 -376 2263 2460 2082 1082 -1120 -1976
2215 -1976 -987 -1079 -1178 1056 2815 2087 1031 -613 -3643 -4052 -604 2583 3716 3532 487 -3843 -4690
2232 -4690 -1860 879 3226 4265 1712 -2025 -3115 -2215 -1240 963 2845 2121 408 -163 -1213 -2692
2248 -2692 -1759 358 1277 2137 2797 691 -2497 -3053 -2076 -625 2249 4152 2218 -707 -2181 -3281
$$ [...]
8191C9
##END NTUPLES=NMR FID
##END=
