##TITLE=1H_E3e-H-4
 CDCl3
 8 sc, 
 28.11.2024
##JCAMPDX= 6.0         $$ Bruker NMR JCAMP-DX V2.0
##DATA TYPE= NMR FID
##DATA CLASS= NTUPLES
##ORIGIN= UXNMR, Bruker Analytische Messtechnik GmbH
##OWNER= root
$$ XWIN-NMR		Version 3.5
$$ Thu Nov 28 14:05:55 2024 Russian Standard Time (UT+4h)  she@DPX200
##.OBSERVE FREQUENCY= 200.1315
##.OBSERVE NUCLEUS= ^1H
##.DELAY= (6, 6)
##.ACQUISITION MODE= SIMULTANEOUS
##.ACQUISITION SCHEME= undefined
##.AVERAGES= 8
##.DIGITISER RES= 18
##SPECTROMETER/DATA SYSTEM= spect
##.PULSE SEQUENCE= zg30
##.SOLVENT NAME= CD3CN
##.SHIFT REFERENCE= (INTERNAL, CD3CN, 0, 15.7039)
##AUDIT TRAIL= $$ (NUMBER, WHEN, WHO, WHERE, WHAT)
$$ ##TITLE= Audit trail, XWIN-NMR		Version 3.5
$$ ##JCAMPDX= 5.01
$$ ##ORIGIN= Bruker BioSpin GmbH
$$ ##OWNER= she
$$ F:/spectra/data/she/nmr/H-F/1/audita.txt
$$ ##AUDIT TRAIL=  $$ (NUMBER, WHEN, WHO, WHERE, WHAT)
(   1,<2024-11-28 14:04:57.31 +0400>,<she>,<DPX200>,
      <created by zg, POWCHK disabled, PULCHK disabled
       configuration hash MD5:
       00 E9 B6 7A A2 85 ED C7 34 08 36 98 17 FE 4E 26
       data hash MD5: 16K
       BB 93 89 7B 28 89 7A 94 9C 5D 19 DA A2 B0 D3 A3>)
$$ ##END=
$$ 
$$ hash MD5
$$ 6E 87 C3 35 D6 0B E5 F4 FF D6 FC 25 B2 FB 86 C6
##$RELAX= 
##$RELAX= 
##$RELAX= 
##$RELAX= 
##$RELAX= 
##$RELAX= 
$$ Bruker specific parameters
$$ --------------------------
##$DU= <F:/spectra>
##$EXPNO= 1
##$NAME= <H-F>
##$PROCNO= 1
##$TYPE= <nmr>
##$USER= <she>
##$AMP= (0..31)
100 100 100 100 100 100 100 100 100 100 100 100 100 100 100 100 100 100 
100 100 100 100 100 100 100 100 100 100 100 100 100 100 
##$AQSEQ= 0
##$AQ_mod= 1
##$AUNM= <au_zg>
##$AUTOPOS= <>
##$BF1= 200.13
##$BF2= 200.13
##$BF3= 200.13
##$BF4= 200.13
##$BF5= 200.13
##$BF6= 200.13
##$BF7= 200.13
##$BF8= 200.13
##$BYTORDA= 1
##$CFDGTYP= 0
##$CFRGTYP= 5
##$CHEMSTR= <none>
##$CNST= (0..31)
1 1 145 1 1 1 1 1 1 1 1 1 1 1 1 1 1 1 1 1 1 1 1 1 1 1 1 1 1 1 1 1 
##$CPDPRG= <>
##$CPDPRG1= <>
##$CPDPRG2= <>
##$CPDPRG3= <>
##$CPDPRG4= <mlev>
##$CPDPRG5= <mlev>
##$CPDPRG6= <mlev>
##$CPDPRG7= <mlev>
##$CPDPRG8= <mlev>
##$CPDPRGB= <>
##$CPDPRGT= <>
##$D= (0..31)
0 1.2 0 0 0 0 0 0 0 0.06 0 0.03 0 0 0 0 0.0002 0 0 0 0 0 0 0 0 0 0 0 0 
0 0 0 
##$DATE= 1732788296
##$DBL= (0..7)
120 120 120 120 120 120 120 120 
##$DBP= (0..7)
150 150 150 150 150 150 150 150 
##$DBP07= 0
##$DBPNAM0= <>
##$DBPNAM1= <>
##$DBPNAM2= <>
##$DBPNAM3= <>
##$DBPNAM4= <>
##$DBPNAM5= <>
##$DBPNAM6= <>
##$DBPNAM7= <>
##$DBPOAL= (0..7)
0.5 0.5 0.5 0.5 0.5 0.5 0.5 0.5 
##$DBPOFFS= (0..7)
0 0 0 0 0 0 0 0 
##$DE= 6
##$DECBNUC= <off>
##$DECIM= 24
##$DECNUC= <off>
##$DECSTAT= 4
##$DIGMOD= 1
##$DIGTYP= 9
##$DL= (0..7)
0 120 120 120 120 120 120 120 
##$DP= (0..7)
150 150 150 150 150 150 150 150 
##$DP07= 0
##$DPNAME0= <>
##$DPNAME1= <>
##$DPNAME2= <>
##$DPNAME3= <>
##$DPNAME4= <>
##$DPNAME5= <>
##$DPNAME6= <>
##$DPNAME7= <>
##$DPOAL= (0..7)
0.5 0.5 0.5 0.5 0.5 0.5 0.5 0.5 
##$DPOFFS= (0..7)
0 0 0 0 0 0 0 0 
##$DQDMODE= 0
##$DR= 18
##$DS= 0
##$DSLIST= <SSSSSSSSSSSSSSS>
$$ [...]
##$SUBNAM2= <"">
##$SUBNAM3= <"">
##$SUBNAM4= <"">
##$SUBNAM5= <"">
##$SUBNAM6= <"">
##$SUBNAM7= <"">
##$SUBNAM8= <"">
##$SUBNAM9= <"">
##$SW= 24.0689530833862
##$SWIBOX= (0..15)
0 0 2 0 0 0 0 0 0 0 0 0 0 0 0 0 
##$SW_h= 4816.95568400771
##$TD= 16384
##$TD0= 1
##$TE= 0
##$TE2= 300
##$TE3= 300
##$TEG= 300
##$TL= (0..7)
0 120 120 120 120 120 120 120 
##$TP= (0..7)
150 150 150 150 150 150 150 150 
##$TP07= 0
##$TPNAME0= <>
##$TPNAME1= <>
##$TPNAME2= <>
##$TPNAME3= <>
##$TPNAME4= <>
##$TPNAME5= <>
##$TPNAME6= <>
##$TPNAME7= <>
##$TPOAL= (0..7)
0.5 0.5 0.5 0.5 0.5 0.5 0.5 0.5 
##$TPOFFS= (0..7)
0 0 0 0 0 0 0 0 
##$TUNHIN= 0
##$TUNHOUT= 0
##$TUNXOUT= 0
##$USERA1= <user>
##$USERA2= <user>
##$USERA3= <user>
##$USERA4= <user>
##$USERA5= <user>
##$V9= 5
##$VALIST= <valist>
##$VCLIST= <CCCCCCCCCCCCCCC>
##$VD= 0
##$VDLIST= <DDDDDDDDDDDDDDD>
##$VPLIST= <PPPPPPPPPPPPPPP>
##$VTLIST= <TTTTTTTTTTTTTTT>
##$WBST= 1024
##$WBSW= 4
##$XGAIN= (0..3)
0 0 0 0 
##$XL= 0
##$YL= 0
##$YMAX_a= 284331
##$YMIN_a= -209482
##$ZGOPTNS= <>
##$ZL1= 120
##$ZL2= 120
##$ZL3= 120
##$ZL4= 120
##$ABSF1= 10
##$ABSF2= 0
##$ABSG= 5
##$ABSL= 3
##$ALPHA= 0
##$AQORDER= 0
##$ASSFAC= 0
##$ASSFACI= 0
##$ASSFACX= 0
##$ASSWID= 0
##$AUNMP= <proc_1d>
##$AZFE= 0.1
##$AZFW= 0.1
##$BCFW= 1
##$BC_mod= 2
##$BYTORDP= 1
##$COROFFS= 0
##$CY= 11.3945322036743
##$DATMOD= 1
##$DC= 2
##$DFILT= <>
##$DTYPP= 0
##$F1P= 15.6554695791079
##$F2P= 12.8336369535428
##$FCOR= 0.5
##$FTSIZE= 0
##$FT_mod= 4
##$GAMMA= 1
##$GB= 0.15
##$INTBC= 1
##$INTSCL= 1
##$ISEN= 128
##$LB= 0.24
##$LEV0= 0
##$LPBIN= 0
##$MAXI= 10000
##$MC2= 0
##$MEAN= 0
##$ME_mod= 0
##$MI= 1.114404
##$NCOEF= 0
##$NC_proc= 0
##$NLEV= 6
##$NOISF1= 3.799351
##$NOISF2= 2.8
##$NSP= 1
##$NTH_PI= 0
##$NZP= 0
##$OFFSET= 15.70392
##$PC= 1
##$PHC0= -26733.05
##$PHC1= 32.78745
##$PH_mod= 1
##$PKNL= yes
##$PPARMOD= 0
##$PSCAL= 0
##$PSIGN= 0
##$REVERSE= no
##$SF= 200.130013532006
##$SI= 16384
##$SIGF1= 3
##$SIGF2= 2
##$SINO= 400
##$SIOLD= 16384
##$SREGLST= <1H.CDCl3>
##$SSB= 0
##$STSI= 0
##$STSR= 0
##$SW_p= 3612.71676300578
##$SYMM= 0
##$S_DEV= 0
##$TDeff= 0
##$TDoff= 0
##$TI= <>
##$TILT= no
##$TM1= 0
##$TM2= 0
##$TOPLEV= 0
##$USERP1= <user>
##$USERP2= <user>
##$USERP3= <user>
##$USERP4= <user>
##$USERP5= <user>
##$WDW= 1
##$XDIM= 8192
##$YMAX_p= 0
##$YMIN_p= 0
$$ End of Bruker specific parameters
$$ ---------------------------------
##NTUPLES= NMR FID
##VAR_NAME=  TIME,          FID/REAL,        FID/IMAG
##SYMBOL=    X,             R,               I
##VAR_TYPE=  INDEPENDENT,   DEPENDENT,       DEPENDENT
##VAR_FORM=  AFFN,          ASDF,            ASDF
##VAR_DIM=   8192,          8192,            8192
##UNITS=     SECONDS,       ARBITRARY UNITS, ARBITRARY UNITS
##FACTOR=    0.0002076,     1,               1
##FIRST=     0,             0,               0
##LAST=      1.7004516,     0,               0
##MIN=       0,             -209482,         0
##MAX=       1.7004516,     284331,          0
$$ Real data points
##PAGE= N=1
##DATA TABLE= (X++(R..R)), XYDATA
$$ plain form
0 0 0 0 0 0 0 0 0 0 -3 8 -8 8 -8 16 -16 22 -24 32 -37 41 -48 59 -69 78 -91 104 -119 137 -154 175 -199 223
32 223 -250 280 -312 350 -390 433 -481 533 -590 655 -723 800 -887 983 -1089 1213 -1349
49 -1349 1510 -1694 1913 -2179 2501 -2911 3450 -4185 5259 -6972 10166 -29296 226511 210966
63 210966 -99045 -9781 168479 11454 -198232 -39004 133058 21612 -98184 -3056
73 -3056 37742 -43882 -25805 71681 23381 -61490 -2839 53763 -35743 -61755 63565 94003
85 94003 -47232 -92057 21200 52491 -42613 -49208 46319 60887 -21048 -51937 -5155 32060
97 32060 21346 -8280 -17643 6498 19126 -20267 -47613 5702 58392 14981 -44820 -17086
109 -17086 29728 7083 -26092 1191 29244 7287 -20596 -20115 -10195 7550 25188 7038 -26443
$$ packed form
0@%%%%%%%%lJ1j6J6j6K4l2L8m6N6o9P8q9J07j28J47j69J95k23K56k91L29l74M22
32B23m73N30n92O62p40Q23r14J014j123J245j378J523j687J870k072K302k562
49a349K859l204L607m092M680n412O361p635R444j2231J7138l9462K55807j5545
63B10966l10011Q9264J78260j57025k09686J59228J72062j11446j19796R5128
73c056M0798q1624J8077R7486m8300q4871N8651N6602q9506k6012J25320L0438
85I4003j41235m4825J13257L1291r5104o595R5527J4568q1935l0889M6782L7215
97C2060j0714k9626r363K4141J2628l9393k7346N3315N2690m3411n9801K7734
109a7086M6814k2645l3175K7283K8053k1957k7883M81R920J7745J7638j8150l3481
$$ plain form
122 -26443 -7359 30987 1556 -43226 -216 58090 11164 -58626 -19705 44917 11095 -41039
134 -41039 -3624 41566 5849 -33014 -9277 16477 6728 2802 6739 -9087 -12328 12794 8680
147 8680 -24708 -8781 38678 17345 -43304 -26666 39824 28049 -34715 -22781 37585 23052
159 23052 -38983 -29292 31486 31002 -19215 -24335 11533 16750 -9178 -13950 4818 12625 4529 -6804
173 -6804 -10194 -2393 10525 9571 -7285 -11811 6399 15586 -4729 -21933 -642 26581 7901
186 7901 -27444 -14538 25199 17168 -25703 -20469 25813 25380 -22022 -29258 15804 28943 -9703
199 -9703 -25972 6264 22972 -3812 -21164 -1159 16493 6039 -9310 -8731 1088 8589 6029
212 6029 -7290 -9914 7534 14790 -6158 -19511 3152 22327 1001 -22241 -5232 20163 8076
$$ packed form
122b6443J9084L8346k9431m4782M3010N8306m6926o9790L8921O4622l3822n2134
134d1039L7415M5190l5717l8863K3737K5754r749l926L937j5826l241K5122m114
147H680l3388J5927M7459k1333o0649J6638O6490j1775o2764J1934O0366j4533
159B3052o2035R691O0778m84n0217n120L5868N217k5928m772J8768P807q096j1333
173f804l390P801J2918r54j6856m526J8210R187k0315j7204K1291K7223j8680
186G901l5345J2906L9737q031m2871N234M6282m33m7402p236M5062J3139l8646
199i703j6269L2236J6708k6784j7352K0005J7652j0454j5349N79R819P501k560
212F029j3319k624J7448P256k0948j3353K2663J9175k1326k3242J7009K5395j2087
$$ plain form
225 8076 -18449 -11200 15107 14315 -10731 -17007 4533 16465 -227 -16072 -4338 14886 8531
238 8531 -13790 -13370 9493 15547 -5641 -16993 1486 16256 1657 -15355 -4979 14230 8042
251 8042 -11051 -11673 7037 12387 -2733 -12901 -1132 11455 4067 -11142 -7226 9212 9122 -5652
265 -5652 -10771 2430 10487 1402 -10144 -4855 8688 8294 -6826 -11837 3623 13382 -1007 -15037
279 -15037 -2167 15153 4823 -15310 -8053 14119 10865 -12426 -12429 10025 12866 -7810 -12662 5448
293 5448 11984 -2846 -10314 138 7469 1952 -4811 -3749 2136 4988 1142 -4306 -3293 4519 5717
308 5717 -3648 -7987 2304 10033 -391 -11303 -2320 11439 4438 -10887 -6140 10372 8120 -8829
322 -8829 -9269 6934 10170 -4642 -10953 2664 11421 225 -10919 -2629 8811 3788 -7834 -5132
$$ packed form
225H076k6525P249K6307p92k5046o276K1540J1932j6692j5845J1734J9224o355
238H531k2321M20K2863O054k1188j1352J8479J4770j4599j7012J0376J9209o188
251H042j9093o22J8710N350j5120j0168J1769J2587p388j5209L916J6438r0j4774
265e652n119J3201Q057r085j1546N289J3543l94j5120n011J5460R759j4389j4030
279a5037J2870J7320j0330k0133P257K2172l254k3291lK2454K841k0676m852J8110
293E448O536j4830p468J0452P331n517o763J062N885K852l846n448J013P812J198
308E717r365m339J0291P729j0424j0912Q983J3759p001j5325M747J6512k252j6949
322h829m40J6203L236j4812o311J3617Q757j1196j1144Q290J1440n023j1622K702
$$ plain form
336 -5132 5531 6028 -3088 -6317 1319 6645 894 -5960 -3598 4494 4710 -3008 -5725 1101 6449
351 6449 756 -6615 -2685 5994 4276 -5056 -6325 3725 7953 -1335 -8296 -366 8533 2688 -8189
366 -8189 -4387 7142 6051 -5613 -7387 3901 8480 -2155 -8354 62 8897 1270 -7573 -3037
380 -3037 6349 3830 -5311 -4696 3604 5339 -2153 -5148 558 4788 874 -3363 -2383 2133 2926 -1317
396 -1317 -3569 -651 3787 2413 -3613 -4184 2978 5415 -1919 -6782 631 6912 592 -7327 -2187
411 -2187 6711 3326 -6521 -4381 5505 5742 -4944 -6158 3624 5876 -2428 -5700 1307 4877 32
426 32 -4059 -354 3603 801 -2500 -1944 1436 2334 -38 -1464 -945 580 1437 -210 -2654 -1012 2734
443 2734 1483 -3048 -2641 3233 3480 -2782 -4336 1734 4551 -1232 -4640 204 4867 246 -4607 -758
$$ packed form
336e132J0663M97r116l229P636N326n751o854K362Q092K16p718k717O826N348
351F449n693p371L930Q679j718r332j269J0050M228r288o961P930Q899n845j0877
366h189L802J1529j091j1664j774J1288M579j0635o199Q416Q835p627q843M536
380c037R386k519r141O15Q300J735p492k995N706M230l914m237R80M516P93m243
396a317k252K918M438j374o026n71P162K437p334m863P413O281o320p919N140
411b187Q898l385r847K140R886K37j0686j214R782K252q304l272P007L570m845
426C2m091L705L957k802l301N56L380Q98k372j426N19J525Q57j647k444J642L746
443B734j251m531M07N874K47o262j554O070K817n783l408M844M663m621m853L849
$$ plain form
459 -758 4038 1301 -3935 -2043 3228 2288 -2628 -2658 2068 2492 -1221 -2180 720 2067 -496 -1287 -278
476 -278 750 888 -273 -456 -405 280 990 161 -1410 -769 1578 908 -1547 -926 2185 1734 -1886 -1713
494 -1713 1459 2201 -1495 -2555 1577 2813 -938 -2663 1126 3104 -550 -3011 162 3328 75
509 75 -2123 114 1953 -56 -1461 -54 1143 -131 -1071 96 842 13 -512 255 205 -644 -405 1370
527 1370 248 -1557 -503 1671 213 -1858 -271 1545 207 -1453 -223 2137 1312 -1988 -1341 1826
543 1826 2181 -938 -1641 1130 1679 -954 -1792 1347 1741 -277 -1506 368 1472 58 -883 41 671
560 671 -10 -379 41 670 -227 -78 482 -106 -761 22 1384 46 -1662 -147 1441 755 -1455 -427
578 -427 1589 59 -1663 -402 1764 1258 -1949 -1471 1571 1359 -1078 -1336 1164 1871 -730 -1180 1206
$$ packed form
459g58M796k737n236J892N271r40m916l0M726M24l713r59K900J347k563p91J009
476b78J028J38j161j83N1O85P10q29j571O41K347o70k455O21L111m51l620J73
494a713L172P42l696j060M132J236l751j725L789J978l654k461L173L166l253
509G5k198K237J839k009j405J407J197j274r40J167P46q29n25P67n0q49K39J775
527A370j122j805J054K174j458k071J587J816j338j660J230K360q25l300O47L167
543A826L55l119p03K771N49k633q38L139L94k018j229J874J104j414r41R24O30
560F71o81l69M20O29q97J49N60n88o55P83J362j338j708J515J588o86k210J028
578d27K016j530j722J261K166n06l207M78L042k12k437k58K500P07k601m50K386
$$ plain form
595 1206 1499 -962 -985 831 907 -322 -429 725 640 -953 -106 894 -295 -1271 -125 1290 -145 -1403
613 -1403 765 1472 -578 -2137 74 1730 -165 -1203 -88 1489 -280 -882 -79 1210 205 -1929
629 -1929 -1242 671 714 -637 -710 136 895 -787 22 -287 -889 -735 -210 930 -200 435 161 579 -523
648 -523 -1325 933 979 -168 -1278 -385 624 -942 -1271 1071 1340 -377 -1524 181 1547 -609 -1048
665 -1048 877 968 248 -611 660 582 -229 -1570 -666 -14 -429 -275 -407 903 -188 -135 509 510 -194 -408
685 -408 749 1160 -320 -1064 739 600 -839 -910 297 1474 -146 -1042 632 843 -806 -2017 703
702 703 1919 -801 -1676 -207 1315 -323 -818 1017 1156 -825 -351 542 635 -531 -578 844 1115 -665
720 -665 -102 249 672 -1109 -567 624 169 -98 -167 -7 -375 -334 -47 204 -405 -816 -97 926 227 -1253
$$ packed form
595A206K93k461k3J816P6j229j07J154q5j593Q47J000j189r76J146J415j435j258
613a403K168P07k050j559K211J656j895j038J115J577j769o02Q03J289j005k134
629a929O87J913M3j351p3Q46P59j682Q09l09o02J54N25J140j130O35k74M18j102
648e23q02K258M6j147j110Q93J009j566l29K342K69j717j147J705J366k156m39
665a048J925R1p20q59J271p8q11j341R04O52m15J54j32J310j091N3O44Jp04k14
685d08J157M11j480p44J803j39j439p1J207J177j620q96J674K11j649j211K720
702G03J216k720q75J469J522j638m95J835J39j981M74Q93R3j166m7J422K71j780
720f65N63L51M23j781N42J191m55k67o9J60l68M1K87K51o09m11P19J023o99j480
$$ plain form
740 -1253 -280 624 82 -995 -1172 870 620 -1390 -92 1203 376 -665 -533 638 372 -768 -807 77
758 77 100 -679 -408 614 149 -368 240 993 -67 -380 341 158 -272 -948 72 620 -482 -488 -448 375 -446
779 -446 -285 275 914 67 -1782 223 1091 36 -1521 -429 976 531 -1329 -364 1035 880 -1163
796 -1163 -831 1669 1001 -269 -56 380 391 -480 -1223 432 -467 -1754 212 456 453 -933 -62 441 -432
815 -432 -661 392 666 -949 -1545 648 1011 -392 -988 676 1120 -338 -610 314 1497 89 -1414
832 -1414 720 1741 -192 -1014 375 326 -64 -291 308 18 -584 -543 659 83 67 88 144 712 -880 -846
852 -846 38 73 -131 -528 416 -39 62 -636 416 -311 -847 -717 463 798 136 -575 141 262 -470 -418
872 -418 74 -447 -38 -1004 684 187 265 -6 -284 567 -198 282 602 75 -566 25 684 -1082 -508 -32
$$ packed form
740a253R73R04n42j077j77K042k50k010J298J295q27j041J32J171k66j140l9Q84
758G7K3p79K71J022m65n17O08P53j060l13P21j83m30o76J020N48j102oM0Q23q21
779d46J61N60O39q47j849K005Q68j055j557J092J405m45j860R65J399j55k043
796a163L32K500o68j270K13M36J1q71p43J655q99j287J966K44lj386Q71N03q73
815d32k29J053K74j615n96K193L63j403n96J664M44j458k72R24J183j408j503
832a414K134J021j933q22J389m9l90k27N99k90o02M1J202n76j6K1N6N68j592L4
852h46Q84L5k04l97R44m55J01o98J052p27n36J30J180L35o62p11P16J21p32N2
872d18M92n21M09r66J688m97P8k71k78Q51p65M80L20n27o41N91O59j766N74M76
$$ plain form
892 -32 511 187 -457 -158 518 136 -752 -877 -119 616 -595 -1007 84 462 -1408 5 370 1234 -784
911 -784 -799 87 1259 -651 -712 828 424 -77 -882 1439 686 -741 -1104 263 636 -330 -59 754 525
930 525 -623 -146 390 5 -467 2 685 -129 -1084 105 1127 -360 -937 119 1006 110 -750 45 284
949 284 80 -2077 -121 838 831 -893 -867 821 652 -586 -792 -120 -168 -797 -947 -123 -7 270 -385 589
969 589 -181 300 -67 -247 -571 821 727 -38 -427 -232 590 -99 -921 -344 902 990 -601 -469 791 1030
989 1030 31 -932 -28 1305 730 -673 -73 524 -27 -405 -314 837 458 -229 -462 386 669 -594 -615
1008 -615 77 393 -187 -151 -336 366 381 511 -224 192 552 954 289 -496 -151 377 97 -479 142 681 -335
1029 -335 -1337 -470 969 273 -1024 -758 783 647 -501 -560 1214 1931 -523 -459 552 1223 -544 -1422
$$ packed form
892c2N43l24o44K99O76l82q88j25P58P35j211m12J091L78j870J413L65Q64k018
911g84j5Q86J172j910o1J540m04n01q05K321p53j427l63J367L73r66K71Q13k29
930E25j148M77N36l85m72M69O83q14r55J189J022j487n77J056Q87q96q60P95K39
949B84k04k157J956R59pj724K6J688j69j238k06O72m8o29j50Q24J16K77o55R74
969E89p70M81l67j80l24J392r4p65l89J95Q22o89q22N77J246Q8j591J32J260K39
989A030r99r63R04J333n75j403O00N97n51l78R1J151l79o87k33Q48K83j263k1
1008f15O92L16n80L6j85P02J5J30p35M16L60M02o65p85L45N28k80n76O21N39j016
1029c35j002Q67J439o96j297K66J541j36j148n9J774P17k454O4J011O71j767q78
$$ plain form
1047 -1422 -6 118 -377 -66 -262 -339 -573 580 86 437 -115 -637 405 -8 -12 -127 113 297 -863
1066 -863 926 711 -1159 -892 335 587 -474 -821 694 1049 -29 -269 215 455 -155 -960 -480 897
1084 897 464 -1400 -609 557 274 -317 -690 -603 349 -392 -504 116 60 79 -576 602 124 471 -53 -165
1104 -165 337 -637 82 -701 -489 301 679 -429 -270 238 552 353 -287 50 150 1350 -744 -521 332
1123 332 771 -60 -346 200 -73 -82 -1497 -63 778 583 -665 -1274 334 248 -803 -561 534 -89 -144
1142 -144 14 -606 693 342 -497 100 -255 -391 558 451 -380 -341 -199 447 -520 129 619 944 -304 -744
1162 -744 1544 8 -1543 -811 871 117 -626 -982 792 588 -386 -1153 -143 1164 -81 3 -207 -118
1180 -118 -42 358 -381 119 -48 -512 814 404 186 -166 -356 -535 11 -88 -112 -923 -51 275 622 -122 -418
$$ packed form
1047a422J416J24m95L11j96p7k34J153m94L51n52n22J042m13mj15K40J84j160
1066h63J789k15j870K67J227K52j061l47J515L55j078k40M84K40o10q05M80J377
1084H97m33j864P91J166k83n91l73Q7R52p41j12O20n6J9o55J178m78L47n24j12
1104a65N02r74P19p83K12P90L78j108J59N08L14j99o40L37J00J200k094K23Q53
1123C32M39q31k86N46k73rj415J434Q41j95j248o09J608q6j051K42J095o23n5
1142a44J58o20J299l51q39N97l55j36R49j07q31L9J42O46r67O49M90L25j248m40
1162g44K288j536j551P32J682p54p43l56J774k04r74p67J010J307j245Q4k10Q9
1180a18P6M00p39N00j67m64J326m10k18l52j90j79N46r9k4q11Q72L26L47p44k96
$$ plain form
1201 -418 -123 -16 -386 -233 402 619 -182 -151 -145 470 525 -386 352 107 593 -476 355 343 569 -176 -350
1222 -350 71 845 448 371 144 293 -118 -81 -371 193 -137 -340 671 -137 -234 -71 -138 -227 -415 1353 246
1243 246 -161 -667 -258 858 -851 -57 25 722 456 -1005 -246 616 101 151 -542 906 69 5 -342 37
1263 37 -194 -889 -272 -400 -70 -379 -268 -182 -60 51 -428 -45 230 -270 -583 -233 -582 124 664 -35 390
1284 390 -1084 -89 935 -249 -212 301 -136 -839 -666 937 536 106 139 -77 -391 435 -857 125 568
1303 568 7 -589 -186 601 10 -347 -12 273 -116 -195 -899 537 -246 -156 363 353 246 323 -778 -478 -342
1324 -342 211 744 -119 -398 -171 381 251 -101 -623 270 -225 -330 -150 -68 61 -748 -332 228 -72 -28 -899
1345 -899 117 771 103 -981 -201 677 87 554 -268 1230 -93 -205 -159 362 -95 -85 477 201 -575
$$ packed form
1201d18K95J07l70J53O35K17q01L1OO15N5r11P38k45M86j069Q31j2K26p45j74
1222c50M21P74l97p7k27J49m11L7k90N64l30k03J011q08r7J63o7q9j88J768j107
1243B46m07n06M09J116j709P94Q2O97k66j461P59Q62n15N0o93J448q37o4l47L79
1263C7k31o95O17j28L30l09J11Q6J22J11m79L83K75n00l13L50l49P06N40o99M25
1284C90j474R95J024j184L7N13m37p03J73J603m01m30L3k16l14Q26j292R82M43
1303E68n61n96M03P87n91l57L35K85l89p9p04J436p83R0N19j0j07P7j101L00J36
1324c42N53N33q63k79K27N52j30l52n22Q93m95j05J80Q2J29q09M16N60l00M4q71
1345h99J016O54o68j084P80Q78n90M67q22J498j323j12M6N21m57J0N62k76p76
$$ plain form
1364 -575 554 -273 351 -535 -411 -410 -485 96 -779 372 -26 -600 -355 521 966 -880 -401 917 276 -682
1384 -682 -263 533 -458 -752 -559 -36 185 -693 -811 -301 -280 600 -620 1202 549 -257 -509 337 508 -637
1404 -637 -602 355 52 -9 -168 83 13 -825 693 87 291 -812 -427 788 93 -284 -219 350 -2 200
1424 200 -22 430 437 -1319 -43 791 218 -222 949 424 42 -636 -321 -404 -617 223 -210 511 108 -162
1444 -162 -309 187 296 -289 -931 -168 -452 -249 -256 -350 -263 18 -186 -321 359 -12 -208 -198 -129 185 352 -108
1466 -108 -44 -943 504 -762 -13 -208 -925 341 -153 -119 124 11 -349 -978 -170 268 97 949 -97
1485 -97 106 206 305 32 -603 -324 -388 333 -162 587 -86 587 232 371 -779 313 -74 -628 -503 381
1505 381 229 -1501 -195 -15 -238 265 -875 606 592 -1079 6 183 -307 -1259 -769 1611 473 -1062
$$ packed form
1364e75J129q27O24q86J24Jp5N81q75J151l98n74K45Q76M45j846M79J318o41r58
1384f82M19P96r91k94J93N23K21q78j18N10K1Q80j220J822o53q06k52Q46J71j145
1404f37L5R57l03o1j59K51p0q38J518o06K04j103L85J215o95l77O5N69l52K02
1424B00k22M52Pj756J276Q34n73m40J171n25l82o78L15q3k13Q40m33P21m03k70
1444a62j47M96J09n85o42P63k84K03pr4Q7K81k04j35O80l71j96J0O9L14J67m60
1466a08O4q99J447j266P49j95p17J266m94L4K43j13l60o29Q08M38j71Q52j046
1485i7K03J00R9k73o35K79o4P21m95P49o73O73l55J39j150J092l87n54J25Q84
1505C81j52j730J306J80k23N03j140J481j4j671J085J77m90r52M90K380j138j535
$$ plain form
1523 -1062 98 -493 474 -769 -731 443 359 -284 -20 519 1519 35 732 -429 -161 257 7 -502
1541 -502 354 714 -126 366 440 661 326 615 751 -270 -722 1109 -544 -333 91 362 -185 -433 537
1560 537 1415 -485 -598 -286 290 410 -334 -1395 55 99 -275 -493 181 669 -333 -498 -965 1068 299
1579 299 -343 -681 249 553 -691 -604 -577 203 78 369 -437 -470 247 21 -310 -161 293 -179 -769 176 257
1600 257 663 29 -525 788 1213 -691 -1234 -263 1117 98 -1049 -466 253 802 -329 -623 1259 790
1618 790 -205 -1116 -364 341 725 -691 32 -254 185 290 290 276 913 155 -531 -794 86 728 -293 -1050
1638 -1050 33 913 -365 -2075 -67 678 646 -1558 -571 807 1661 -1164 165 636 966 359 -1723
1655 -1723 -389 556 562 -828 -339 1238 -45 -789 -647 -520 1024 -343 -1274 39 639 -484 338 -981
$$ packed form
1523a062J160n91R67j243L8J174q4o43K64N39J000j484O97j161K68M18k50n09
1541e02Q56L60q40M92P4K21l35K89J36j021m52J831j653K11M24K71n47k48R70
1560E37Q78j900j13L12N76J20p44j061J450M4l74k18O74M88j002j65m67K033p69
1579B99o42l38R30L04j244Q7K7P80j25K91q06l3P17k26l31J49M54m72n90R45Q1
1600B57M06o34n54J313M25j904n43R71J380j019j147N83P19N49j131k94J882m69
1618G90r95r11P52P05L84j416P23k86M39J05%j4O37p58o86k63Q80O42j021p57
1638a050J083Q80j278j710K008P45l2k204R87J378Q54k825J329M71L30o07k082
1655a723J334R45Oj390M89J577j283p44J42J27J544j367r31J313O00j123Q22j319
$$ plain form
1673 -981 94 1450 731 -1831 -54 805 1010 -1245 -180 1021 917 -611 -1044 294 859 329 -872
1690 -872 833 373 252 -872 -390 368 327 -945 -57 573 1418 -304 -1623 670 1181 394 -867 -1063
1708 -1063 -121 386 -1097 -2087 -61 485 190 -1899 -913 178 1310 -1199 -1063 661 1461 -749 -857
1725 -857 -733 681 798 -1291 -632 1245 1067 -1116 -1419 -439 1012 -806 -846 -814 1215 149 -2230 -804
1743 -804 1526 422 -1479 -876 1091 867 444 -757 37 1117 777 -1167 -834 -23 526 -515 -1012
1760 -1012 599 918 355 -1351 -226 583 1538 -1444 -504 419 1032 34 -2061 -203 628 463 -931
1777 -931 -830 702 1030 231 -1672 672 2395 565 -2022 -356 840 378 -1969 -184 1070 919
1793 919 -1364 -1623 63 826 -157 -621 -977 865 192 -561 -1114 789 2355 -546 -1067 -471 785 775
$$ packed form
1673i81J075J356p19k562J777Q59K05k255J065J201j04j528m33J338N65n30j201
1690h72J705m60j21j124M82P58m1j272Q88O30Q45j722j319K293N11p87j261j96
1708a063R42N07j483r90K026N46k95k089R86J091J132k509J36J724Q00k210j08
1725h57J24J414J17k089O59J877j78k183l03R80J451j818m0L2K029j066k379J426
1743h04K330j104j901O03J967k24m23j201P94J080l40j944L33Q11N49j041m97
1760a012J611L19n63j706J125Q09R55k982R40R23O13r98k095J858Q31j65j394
1777i31J01J532L28p99j903K344J723j830k587J666J196m62k347J785J254j51
1793I19k283k59J686P63r83m64l56J842o73p53n53J903J566k901n21N96J256j0
$$ plain form
1811 775 -416 -1344 -199 954 -740 -1827 -803 897 230 -820 -958 1803 388 -1270 -1006 596
1827 596 1612 -331 -1582 -21 2176 191 -1580 245 1504 505 -1085 -2141 766 1465 -719 -569
1843 -569 -461 1494 75 -916 73 516 1422 -520 -1644 87 1845 -1123 -1835 -313 1607 516 -865
1860 -865 -958 1234 878 -2026 -1451 449 1158 -742 -1474 -682 849 836 -691 -1085 1126 1150 -1269 -1414
1878 -1414 -40 1561 -282 -698 -1552 1476 1099 -2166 -424 726 2214 78 -3188 399 1164 -612
1894 -612 -409 -1366 1416 733 -842 -1205 -104 1527 -678 -573 -351 497 -200 -2303 -1458 950 1171 -555
1912 -555 -1194 -489 2227 879 -1409 -975 1594 423 -895 -778 799 1362 -457 -412 -150 1376 143
1929 143 -802 -633 818 1659 -436 -1896 1253 1619 -172 -1039 -385 752 400 -1369 -805 570 1372
$$ packed form
1811G75j191r28J145J153j694j087J024J700o67j050j38K761j415j658K64J602
1827E96J016j943j251J561K197j985j771J825J259r99j590j056K907O99k184J50
1843e69J08J955j419r91R89M43R06j942j124J731J758k968p12J522J920j091j381
1860h65r3K192l56k904N75J900P09j900p32P92J531j3j527l94K211K4k419j45
1878a414J374J601j843m16q54L028l77l265J742J150J488k136l266L587P65j776
1894f12K03r57K782o83j575l63J101J631k205J05K22Q48o97k103Q45K408K21j726
1912e55o39P05K716j348k288M34K569j171j318J17J577N63j819M5K62J526j233
1929A43r45J69J451Q41k095j460L149L66j791q67O54J137l52j769N64J375Q02
$$ plain form
1946 1372 -579 -1261 521 1297 -468 -1033 -1599 1218 231 -667 -1385 986 2105 -230 -1923 820 1481
1963 1481 -249 -2052 -681 356 19 -759 -2518 -573 757 137 -1490 214 894 750 -429 -732
1979 -732 556 795 -891 -1291 558 1076 862 -2242 -987 738 255 -982 -1879 1164 330 -655 -1000
1996 -1000 431 1519 647 -1336 -222 2001 1195 -1957 -1934 494 1504 -363 -1719 -836 2065 544
2012 544 -1443 -1011 783 549 -842 -883 981 731 96 -1151 227 1314 616 -655 -383 1550 1274
2029 1274 -2 -1095 649 1671 293 -1641 302 1185 183 -533 -757 537 1721 -561 -1787 603
2045 603 1221 592 -1687 -394 1694 1170 -691 -1329 589 1119 -171 -1458 264 1768 698 -1054
2061 -1054 -725 339 760 -405 -947 -84 1173 622 -1331 -756 1022 174 -1518 -484 594 1538 -630
$$ packed form
1946A372j951o82J782P76j765n65n66K817r87q98p18K371J119k335j693K743O61
1963A481j730j803J371J037l37p78j759J945J330o20j627J704O80j44j179l03
1979g32J288K39j686m00J849N18k14l104J255J725m83j237q97L043q34r85l45
1996a000J431J088q72j983J114K223q06l152K3K428J010j867j356Q83K901j521
2012E44j987M32J794k34j391m1J864k50o35j247J378J087o98j271K72J933k76
2029A274j276j093J744J022j378j934J943Q83j002p16k24J294J184k282j226K390
2045F03O18o29k279J293K088n24j861o38J918N30j290j287J722J504j070j752
2061a054L29J064M21j165n42Q63J257n51j953N75J778q48j692J034J078R44k168
$$ plain form
2078 -630 -541 477 1392 821 -1236 -556 1707 857 -864 -1165 1315 956 -701 -1077 -145 1603 -35 -182
2096 -182 -491 1032 645 -638 -1671 135 1586 621 -906 -907 1443 872 -909 -1968 690 1076 -812
2113 -812 -318 -178 231 17 -710 -356 401 614 -1001 -1391 775 1886 -872 -955 -155 1174 1380 -823
2131 -823 -457 217 365 -52 -882 180 1119 215 -1581 -356 672 -412 -1395 -865 1092 837 -452 -1386
2149 -1386 561 535 -1332 -1240 -529 -311 -680 -905 -204 553 789 -21 -1226 127 1505 -658 -1157 -388
2167 -388 287 984 -607 -1151 607 1500 -234 -1097 652 431 951 -1390 -369 1156 987 -818 -1077
2184 -1077 172 736 60 -1009 -505 754 578 -368 -371 901 -127 -1092 -500 1033 702 -241 -13 23 1272
2203 1272 974 -493 -347 1980 235 -718 -560 -522 581 133 -688 -263 648 1097 -56 -1028 812 1028
$$ packed form
2078f30Q9J018R15n71k057O80K263q50j721l01K480l59j657l76R32J748j638j47
2096a82l09J523l87j283j033J806J451r65j527jK350n71j781j059K658L86j888
2113h12M94J40M09k14p27L54P57K13j615l90K166J111k758q3Q00J329K06k203
2131h23L66O74J48m17q30J062R39r04j796J225J028j084r83N30J957k55j289r34
2149a386J947k6j867R2P11K18l69k25P01P57K36q10j205J353J378k163m99P69
2167c88O75O97j591n44J758Q93j734q63J749k21N20k341J021J525j69j805k59
2184a077J249N64o76j069N04J259j76r46lJ272j028r65N92J533l31r43K28L6J249
2203A272k98j467J46K327j745r53J58L8J103m48q21M25R11M49j153r72J840K16
$$ plain form
2221 1028 -335 -951 -428 418 750 -972 -1262 618 -92 -1076 -1421 -8 1450 192 -765 -726 1255 878
2239 878 -400 -205 254 528 855 -627 107 431 193 -1159 -106 163 304 -1635 -649 -52 411 92
2257 92 -792 -171 398 152 -754 -215 77 784 -327 -887 487 30 336 -376 -392 801 -88 -673 -413 369
2277 369 305 -534 -183 -25 578 115 -585 -624 328 40 -511 -125 187 502 -256 -133 -125 373 186 -510 -230
2298 -230 284 588 -135 -699 128 609 -237 -633 -8 405 359 -609 -510 71 312 -247 -515 -424 598 155 -328
2319 -328 -269 562 103 -496 -397 178 628 -363 -223 220 470 86 -196 -49 336 585 -142 -94 458 441 7
2340 7 -300 93 632 81 -515 -15 486 221 -504 -536 120 515 33 -499 19 279 507 -481 -501 690 405
2361 405 -173 -709 129 411 34 -375 -50 230 204 -221 -305 198 156 -162 -190 -177 333 1 -215 -220 -19 722
$$ packed form
2221A028j363o16N23Q46L32j722k90J880p10r84l45J413J458j258r57L9J981l77
2239H78j278J95M59K74L27j482P34L24k38j352J053K69J41j939R86N97M63l19
2257I2q84O21N69k46r06N39K92P07j111n60J374m57L06p12j6J193q89n85K60P82
2277C69o4q39L51J58O03m63p00l9R52k88n51L86L12L15p58J23QM98j87o96K80
2298b30N14L04p23n64Q27M81q46l96O25M13m6r68R9N81K41n59k68R1J022m43m83
2319c28N9Q31m59n99R9N75M50r91J40M43K50l84k82J47L85K49p27M8N52j7m34
2340Gl07L93N39n51n96N00N01k65p25l2O56L95m82n32N18K60K28r88k0J191k85
2361D05n78n36Q38K82l77m09L25K80k6m25q4N03m2l18k8J3N10l32k16nK01P41
$$ plain form
2383 722 -219 -171 -110 116 201 -215 -275 113 184 -219 -250 225 107 48 -583 62 243 78 -186 -58 332 151
2405 151 -239 -307 -59 120 25 -406 304 -26 81 -362 32 -212 53 -138 -188 -184 371 91 -454 -181 189 188
2427 188 -135 -14 155 -167 224 102 134 121 146 -344 -235 321 -155 45 103 514 199 -237 -102 -199 384 271
2449 271 -67 61 153 -74 -394 -111 -162 82 -265 -119 50 118 -47 91 -142 293 119 -18 -36 92 -53
2470 -53 -96 -33 1 -33 -172 13 7 142 -126 79 -99 -236 51 -15 33 9 -104 87 14 266 172 18 -184 -143
2494 -143 292 263 -132 -33 -24 321 43 -110 -69 219 -251 35 142 461 -221 136 268 -101 219 -303 -158 117
2516 117 54 -227 12 -290 -367 198 -36 -301 -157 120 191 -214 -149 95 191 246 -490 86 237 321 -32 -58 -45
2539 -45 -31 -62 184 227 2 -126 -370 -11 -27 -11 -9 -139 -309 -11 170 -24 69 458 -273 -176 -3 0 -185 -109
$$ packed form
2383G22r41M8O1K26Q5m16o0L88P1m03l1M75j18n9o31O45J81j65k64J28L90j81
2405A51l90o8K48J79r5m31P10l30J07m43L94k44K65j91n0MN55k80n45K73L70j
2427A88l23J21J69l22L91j22L2j3K5m90J09N56m76K00N8M11l15m36J35r7N83j13
2449B71l38J28R2k27l20K83n1K44l47J46J69O8j65J38k33M35j74j37j8J28j45
2470e3m3O3L4l4j39J85oJ35k68K05j78j37K87o6M8k4j13J91p3K52r4j54k02M1
2494a43M35k9l95R9RL45k78j53M1K88m70K86J07L19o82L57J32l69L20n22J45K75
2516A17o3k81K39l02p7N65k34k65J44K77P1m05O5K44R6N5p36N76J51Q4l53k6J3
2539d5J4l1K46M3k25j28k44L59j6J6Kj30j70K98J81j94R3L89p31R7J73Lj85P6
$$ plain form
2563 -109 -3 62 -280 248 232 23 65 -49 -56 200 -89 26 178 -195 -70 55 93 -54 -189 -123 -26 152 35
2586 35 61 -36 -398 -62 113 -21 -341 6 -81 -110 -58 -49 304 181 339 219 76 64 -236 -157 -106 48 258 -26
2610 -26 50 -58 94 -17 110 -63 -1 -197 -152 -322 -263 -6 -74 -332 -283 -332 -43 -69 226 -45 24 -670 -382
2633 -382 90 411 -86 45 48 -253 225 -356 143 40 92 -70 140 -197 72 -116 -23 -75 -143 13 -213 -60
2655 -60 194 -146 33 -66 -235 119 -26 162 -376 -325 2 -211 -286 -29 -20 -193 169 26 -57 208 -109 -24 -31
2678 -31 236 64 -59 -201 -83 0 63 -212 51 280 75 21 -97 298 -394 58 -194 -173 157 -28 84 -302
2700 -302 -110 -14 54 280 57 -184 305 282 24 4 200 37 125 38 -136 79 61 360 92 398 105 -64
2722 -64 -14 146 53 93 -263 -202 92 -184 -117 90 -160 46 184 -289 -88 -304 138 -79 -34 -18 -2 -231 -126
$$ packed form
2563a09J06O5l42N28j6k09M2j14pK56k89J15J52l73J25J25L8j47j35O6R7J78j17
2586C5K6r7l62L36J75j34l20L47q7k9N2RL53j23J58j20j43j2l00P9N1J54K10k84
2610b6P6j08J52j11J27j73O2j96M5j70N9K57o8k58M9m9K89k6K95k71O9o94K88
2633c82M72L21m97J31Ll01M78n81M99j03N2j62K10l37K69j88R3n2o8J56k26J53
2655f0K54l40J79r9j69L54j45J88n38N1L27k13p5K57Rj73L62j43q3K65l17Q5p
2678c1K67j72j23j42J18Q3O3k75K63K29k05n4j18L95o92M52k52K1L30j85J12l86
2700c02J92R6O8K26k23k41M89k3k58k0J96j63Q8q7j74K15j8K99k68L06k93j69
2722f4N0J60r3M0l56O1K94k76O7K07k50K06J38m73K01k16M42k17M5J6J6k29J05
$$ plain form
2745 -126 -40 384 365 182 177 198 -192 -37 167 -48 130 -231 84 -54 21 142 -141 -189 318 -202 -379 -187
2767 -187 -324 -101 -278 143 371 136 -108 179 22 -79 41 220 247 38 -392 12 -84 -113 -200 46 227
2788 227 -209 -40 -174 -141 79 -72 62 64 183 -275 -106 -49 76 -108 -458 -193 117 244 291 130 -172 -49
2810 -49 -5 -479 -73 -101 133 -5 -541 208 65 -273 299 210 39 -102 26 -104 -173 18 168 -338 -188 113
2832 113 493 187 -229 -213 -71 -312 -13 -223 278 157 -320 -27 141 -104 63 -104 128 39 32 -236 190
2853 190 212 28 13 118 186 8 -103 -256 270 -86 70 79 98 168 -86 65 -164 -33 -46 86 -329 -119 229
2876 229 116 280 -148 48 231 -116 -103 18 131 198 -4 -39 81 135 25 8 -90 319 -242 -203 -79 220
2898 220 41 -97 182 -11 -160 28 5 354 105 73 10 -185 424 -193 231 167 151 287 -182 140 76 275
$$ packed form
2745a26Q6M24j9j83nK1l90J55K04k15J78l61L15j38P5J21k83m8N07n20j77J92
2767a87j37K23j77M21K28k35k44K87j57j01J20J79K7k09m30M04r6k9q7K46J81
2788B27m36J69j34L3K20j51J34KJ19m58J69N7J25j84l50K65L10J27M7j61l02J23
2810d9M4m74M06k8K34j38n36P49j43l38N72q9j71j41J28j30o9J91J50n06J50L01
2832A13L80l06m16J6J42k41K99k10N01j21m77K93J68k45J67j67K32q9pk68M26
2853A90K2j84j5J05O8j78j11j53N26l56J56RJ9P0k54J51k29J31j3J32m15K10L48
2876B29j13J64m28J96J83l47J3J21J13O7k02l5J20N4j10j7r8M09n61L9J24K99
2898B20j79j38K79j93j49J88k3L49k49l2o3j95O09o17M24o4j6J36m69L22o4J99
$$ plain form
2920 275 55 56 -48 213 148 81 68 4 -56 121 79 -8 -17 54 38 3 36 -37 -74 -50 -98 104 117 -52 87 367 35
2947 35 17 69 -85 156 -90 131 188 -67 229 -210 -14 -12 -80 -17 -134 -99 172 85 160 8 -356 -105 243 -51
2971 -51 -246 -241 -294 351 75 418 79 732 283 -314 -294 272 159 -646 -147 701 941 32 243 32 226 312
2993 312 13 -674 -272 -228 135 1047 282 138 -55 -65 -609 -85 -488 54 -163 605 516 -128 238 -480 -370
3014 -370 46 231 177 -275 6 316 7 234 -47 206 283 307 -142 69 -220 310 -287 -316 128 3 -129
3035 -129 9 -9 142 -322 163 360 96 85 -112 -161 -155 84 -81 -59 -47 87 97 179 -221 -173 163 452 -58
3058 -58 120 -151 -22 -301 -330 -148 -51 51 -111 206 211 75 147 216 -261 223 -233 -152 28 24 12 109 177 16
3082 16 51 15 -126 -48 238 59 -46 59 -112 78 -65 106 -172 -182 295 -44 102 52 -301 -42 -98 -167 199
$$ packed form
2920B75k20Jj04K61o5o7j3o4o0J77m2q7rP1j6l5L3p3l7K4m8K02J3j69J39K80l32
2947C5j8N2j54K41k46K21N7k55K96m39J96Ko8O3j17L5K71q7P5j52l64K51L48k94
2971e1j95Nn3O45k76L43l39O53m49n97K0N66j13q05M99Q48K40r09K11k11J94Q6
2993C12k99o87M02M4L63R12p65j44j93j0n44N24m03N42k17P68q9o44L66p18J10
3014c70M16J85n4m52K81L10l09K27k81K53P7K4m49K11k89N30n97k9M44j25j32
3035a29J38j8J51m64M85J97k64j1j97m9OK39j65K2J2J34J0Q2m00M8L36K89n10
3058e8J78k71J29k79k9J82R7J02j62L17Nj36P2O9m77M84m56Q1J80mj2R7O8j61
3082A6L5l6j41P8K86j79j05J05j71J90j43J71k78j0M77l39J46n0l53K59n6o9L66
$$ plain form
3105 199 -144 -161 -114 305 69 -64 304 96 -10 213 -76 -24 72 150 -40 39 -93 -410 -27 -5 189 -40
3127 -40 -204 -24 -390 39 -48 55 99 -217 215 154 -135 -195 35 -399 153 287 -134 -256 30 93 -33 -69
3149 -69 179 95 175 9 35 -21 -45 -66 6 96 -18 13 -360 -230 -74 316 -104 -127 -139 -17 116 81 95 -17 -182
3174 -182 190 65 83 32 -35 275 -131 77 -78 -36 95 124 -91 -24 138 -134 -85 -238 64 -36 245 -134
3196 -134 -208 440 28 -149 410 118 180 -60 96 75 -11 221 153 -202 -199 -24 28 11 34 241 -61 -30 -3 66
3220 66 -62 129 -335 226 -165 271 181 194 -128 217 -77 -46 -43 -27 4 156 -78 -22 286 159 8 -24 230
3243 230 -161 -155 140 -278 375 306 90 124 -128 -385 -3 -49 68 82 -10 102 -127 127 145 -67 104 101 121 -78
3267 -78 -203 105 -187 110 19 -264 -32 397 31 164 164 14 12 -336 42 -17 333 -266 316 -253 52 26 315
$$ packed form
3105A99l43j7M7M19k36j33L68k08j06K23k89N2R6P8j90P9j32l17L83K2J94k29
3127d0j64J80l66M29q7J03M4l16M32o1k89o0K30m34N52J34m21j22K86O3j26l6
3149f9K48q4Q0j66K6n6k4k1P2R0j14L1l73J30J56L90m20k3j2J22J33l5J4j12j65
3174a82L72j25J8n1o7L10m06K08j55M2J31K9k15O7J62k72M9j53L02j00K81l79
3196a34p4O48m12j77N59k92O2k40J56k1q6K32o8l55LJ75N2j7K3K07l02L1K7O9
3220F6j28J91m64N61l91M36r0J3l22L45k94L1LJ6L1J52k34N6L08j27j51l2K54
3243B30l91OK95m18O53o9k16L4k52k57L82m6J17J4r2J12k29K54J8k12J71lK0j99
3267g8j25L08k92K97r1k83K32M29l66J33%j50kl48L78n9L50n99N82n69L05k6K89
$$ plain form
3290 315 123 260 -154 205 -83 151 130 -192 62 253 -25 208 150 -87 47 368 309 11 -19 -177 58
3311 58 81 376 93 154 -167 182 81 -236 -95 72 184 299 96 -157 172 107 -73 -141 239 -102 17 516
3333 516 -67 -11 -83 261 174 -118 -93 -229 66 194 22 19 464 149 -74 41 274 -69 -39 -132 -131 -64 148 106
3357 106 167 317 -152 -40 -128 166 -225 -153 115 -203 -73 104 14 -346 -177 140 120 -113 -46 296 -186 318
3379 318 -140 -128 56 176 25 -47 62 -220 250 -63 -135 524 101 -8 -78 -121 30 242 -46 41 -292 -89
3401 -89 -22 107 84 -258 -174 -177 189 372 -293 -217 -211 -193 -60 -95 -10 -93 -114 185 -60 -251 -129 -223 37 -127 241
3426 241 -47 36 -106 169 113 13 -111 -125 105 344 112 -237 -390 96 119 -62 229 -9 -237 61 -251
3447 -251 57 202 171 -14 18 -312 -60 -183 -126 -52 91 253 153 39 46 324 -93 -37 134 -67 66 -44
$$ packed form
3290C15j92J37m14L59k88K34k1l22K54J91k78K33n8k37J34L21n9k98l0j58K35
3311E8K3K95k83O1l21L49j01l17J41J67J12J15k03k53L29o5j80o8L80l41J19M99
3333E16n83N6p2L44q7k92K5j36K95J28j72lM45l15k23J15K33l43L0r3JO7K12m2
3357A06O1J50m69J12q8K94l91P2K68l18J30J77r0l60J69L17k0k33O7L42m82N04
3379C18m58J2J84J20j51p2J09k82M70l13p2O59m23j09p0m3J51K12k88Q7l33K03
3401h9O7J29k3l42Q4lL66J83o65P6OJ8J33l5Q5q3k1K99k45j91J22r4K60j64L68
3426B41k88Q3j42K75n6j00j24j4K30K39k32l49j53M86K3j81K91k38k28K98l12
3447b51L08J45l1j85L2l30K52j23N7P4J43J62j00j14PK78m17N6J71k01J33j10
$$ plain form
3469 -44 -75 -322 212 34 98 -205 44 250 -85 499 -90 27 -91 163 439 -173 -216 324 -16 83 -67 -49
3491 -49 -49 -148 83 -342 460 156 -465 102 49 334 93 -83 -361 53 -20 -285 -56 -167 212 -146 51 -41
3513 -41 -48 44 78 85 -70 69 -312 -110 115 -64 -171 206 79 -149 -24 -318 -251 -123 30 44 -100 240 432
3536 432 287 -140 148 78 -187 121 223 100 -141 129 -96 106 16 -99 -110 -142 -94 98 294 208 213 -91 -55
3559 -55 220 102 191 161 -4 -62 111 -148 -204 -17 -86 376 310 -46 -234 -117 91 -35 -172 173 137 -11 -124
3582 -124 89 3 34 -102 193 63 51 327 -314 366 398 -152 -224 190 191 79 -90 -53 -236 174 170 -98 87
3605 87 611 30 -222 357 481 -247 -332 245 -75 247 -370 397 346 246 157 -474 -202 -276 64 -37 -35 97
3627 97 126 455 -275 -480 281 541 4 -141 548 -108 12 11 511 364 -202 69 -66 254 539 -21 -26 -44
$$ packed form
3469d4l1k47N34j78O4l03K49K06l35N84n89J17j18K54K76o12m3N40l40R9j50J8
3491d9%r9K31m25Q02l04o21N67n3K85k41j76k78M14p3k65K29j11L79l58J97r2
3513d1pR2L4Pj55J39l81K02K25j79j07L77j27k28J25k94O7J28J53J4j44L40J92
3536D32j45m27K88p0k65L08J02j23k41K70k25K02r0j15j1l2M8J92J96q6Nl04L6
3559e5K75j18Q9l0j65n8J73k59n6J87o9M62o6l56j88J17K08j26j37L45l6j48j13
3582a24K13q6L1j36K95j30j2K76o41O80L2n50p2M14Jj12j69L7j83M10mk68J85
3605H7N24n81k52N79J24p28q5N77l20L22o17P67n1j00q9o31K72p4L40j01KJ32
3627I7K9L29p30k05P61K60n37j45O89o56J20jN00j47n66K71j35L20K85n60nj8
$$ plain form
3649 -44 -83 -122 335 69 211 -41 -128 -148 68 -213 -279 344 -341 -36 -83 -549 -39 73 208 -337 -107 138
3671 138 242 188 43 40 -24 184 -182 158 85 141 -273 150 285 242 -201 -269 467 49 -154 -145 -83 248 13 -83
3695 -83 -202 420 158 -203 -163 -216 88 -188 -198 -143 517 174 14 -376 28 346 -102 -95 -291 72 -163 -85 -20
3718 -20 118 175 -191 70 224 356 -262 -301 -180 197 55 -154 -192 287 21 -105 -233 -53 257 -16 -258
3739 -258 181 571 142 -430 -187 415 262 -20 112 222 130 79 -38 58 405 223 -120 -346 -254 94 -48
3760 -48 -57 13 97 180 -232 -201 -194 392 -193 -108 62 158 13 -418 6 -60 -74 26 -307 44 210 -141 -110 -123 335
3785 335 -103 -349 -407 738 1 -171 14 33 123 -114 -277 152 470 -51 -175 -330 184 300 -358 -368 558
3806 558 -70 -35 140 85 168 56 9 -207 123 -126 -253 -268 270 90 26 -219 -82 389 -231 -169 14 138
$$ packed form
3649d4l9l9M57k66J42k52q7k0K16k81o6O23o85L05m7m66N10J12J35n45K30K45
3671A38J04n4j45lo4K08l66L40p3N6m14M23J35m3m43o8P36m18k03RO2L31k35r6
3695h3j19O22k62l61M0n3L04k76j0N5O60l43j60l90M04L18m48Pj96L63k35P8O5
3718b0J38N7l66K61J54J32o18l9J21L77j42k09l8M79k66j26j28J80L10k73k42
3739b58M39L90m29n72K43O02j53k82J32J10r2n1j17R6L47j82l43k26R2L48j42
3760d8rP0Q4Q3m12L1PN86n85Q5J70R6j45m31M24o6j4J00l33L51J66l51L1j3M58
3785C35m38k46n8J145p37j72J85J9R0k37j63M29L18n21j24j55N14J16o58j0R26
3806E58o28L5J75n5Q3j12m7k16L30k49j27j5N38j80o4k45J37M71o20O2J83J24
$$ plain form
3828 138 -13 -191 -332 188 496 157 -351 -136 327 134 -46 -445 100 440 304 -177 -25 383 -20 -136
3848 -136 50 140 197 114 37 94 35 -121 -162 215 609 -107 -489 -83 56 185 169 -152 77 283 -68 79 -8
3871 -8 510 -107 -114 86 262 215 35 -137 -363 -2 -242 31 -228 229 113 -399 -70 125 232 242 81 -125
3893 -125 240 127 -153 85 117 172 -83 -468 58 137 308 -311 -231 399 82 -147 -150 387 164 14 -236 21
3915 21 363 56 -326 30 4 25 -306 12 -145 215 -262 -147 259 369 227 -201 -279 45 6 -278 -67 329
3937 329 375 -94 5 338 -36 159 -185 106 207 240 179 -241 30 457 51 -281 -2 494 155 -6 24 -309
3959 -309 245 -370 -283 175 483 137 -306 -97 268 182 -122 11 498 -181 -47 -417 -30 -10 207 -74 -9
3980 -9 57 -85 -386 -205 56 208 289 -386 37 183 -245 -298 -64 105 404 -124 -31 -52 115 273 -360 191
$$ packed form
3828A38j51j78j41N20L08l39n08K15M63j93j80l99N45L40j36m81J52M08m03j16
3848a36J86R0N7q3p7N7n9j56m1L77L94p16l82M06J39J29j6l21K29K06l51J47q7
3871hN18o17pK00J76m7j80j72k26L61k40K73k59M57j16n12L29J95J07J0j61k06
3893a25L65j13k80K38L2N5k55l85N26P9J71o19Q0O30l17k29lN37k23j50k50K57
3915B1L42l07l82L56k6K1l31L18j57L60m77J15M06J10j42m28p8L24l9k84K11L96
3937C29M6m69R9L33l74J95l44K91J01L3o1m20K71M27m06l32K79M96l39j61L0l33
3959c09N54o15Q7M58L08l46m43K09L65q6l04J33M87o79J34l70L87K0K17k81O5
3980iO6j42l01J81K61J52Q1o75M23J46m28n3K34J69K99n28R3k1J67J58o33N51
$$ plain form
4002 191 456 -448 131 -80 82 -101 9 -363 -225 -127 9 -176 -296 258 178 4 -250 78 -200 -10 -349
4023 -349 99 239 -77 119 90 139 226 -175 -131 -25 348 -51 -435 118 149 -173 60 121 193 104 -109 -154 -169
4046 -169 172 8 -140 -11 231 86 -377 -366 19 166 -42 -197 214 296 -21 -124 -14 455 164 -257 -311
4067 -311 -223 20 85 -383 -233 199 183 153 -9 -41 418 -203 -245 -112 336 230 -227 167 170 219 -96 -353 -61
4090 -61 -184 -109 -333 -136 334 -196 -124 -43 -339 113 -91 -64 176 138 126 -300 -107 429 17 -375 57 174
4112 174 147 -261 -88 288 30 41 -175 69 30 428 -84 200 162 167 -155 -237 68 103 -242 -279 -122 -35 -16 -217
4136 -217 -82 -74 38 194 -606 224 -111 -204 -203 -114 95 261 13 -255 -60 182 95 -134 -195 -102 47 -206 -73
4159 -73 97 -127 -227 73 -202 74 173 -348 -257 99 1 -288 -69 99 -5 -170 -245 100 119 118 -127 65 393
$$ packed form
4002A91K65r04N79k11J62j83J10l72J38R8J36j85j20N54q0j74k54L28k78J90l39
4023c49M48J40l16J96k9M9Q7m01M4J06L73l99l84N53L1l22K33O1P2q9k13m5j5
4046a69L41j64j48J29K42j45m63J1L85J47k08j55M11Q2l17j03J10M69k91m21n4
4067c11Q8K43O5m68J50M32j6l0j62l2M59o21m2J33M48j06m57L94LM9l15k57K92
4090f1j23P5k24J97M70n30P2Q1k96M52k04K7K40l8j2m26J93N36m12l92M32J17
4112A74k7m08J73L76k58J1k16K44l9L98n12K84l8Nl22q2L05L5l45l7J57Q7J9k01
4136b17J35QJ12J56q00Q30l35r3JQ9K09J66k48k68J95K42q7k29o1R3J49k53J33
4159g3J70k24j00L00k75K76R9n21R1L56r8k89K19J68j04j65p5L45J9jk45J92L28
$$ plain form
4182 393 63 65 -32 126 290 162 107 -50 247 77 -125 188 153 392 -35 67 -101 -95 125 -114 79 245
4204 245 306 -121 -269 0 -131 -230 -272 -41 12 215 -125 -68 -1 -39 447 -23 -102 32 -129 -202 -202 -70 -83 -231
4228 -231 -112 -61 68 99 -162 -55 443 -112 -17 130 229 121 -181 -31 260 149 28 -11 -237 124 143 -163
4250 -163 -151 244 -37 14 -138 -531 -98 18 -58 -203 -128 30 -393 -14 4 323 -265 -206 131 78 274 -170
4272 -170 -87 -160 356 137 -114 233 58 -69 302 235 89 25 130 18 310 -49 -19 -74 155 -12 52 65 -41
4295 -41 381 86 -38 -36 -106 10 98 137 -134 113 -240 -166 126 12 253 174 239 -61 -143 -222 -14 96 -36 -201
4319 -201 -67 -190 24 -7 -143 214 104 67 245 -232 131 292 -86 -239 -261 112 126 158 103 -185 -34 -26 82
4342 82 59 148 -62 -157 -55 151 -160 -2 -94 -83 -61 173 -262 -325 -30 -184 -345 -89 -174 90 108 -203 305
$$ packed form
4182C93l30Kr7J58J64j28n5j57K97j70k02L13l5K39m27J02j68OK20k39J93J66
4204B45O1m27j48K69j31r9m2K31N3K03l40N7O7l8M86m70p9J34j61p3%J32j3j48
4228b31J19N1J29L1k61J07M98n55R5J47R9j08l02J50K91j11j21l9k26L61J9l06
4250a63J2L95k81N1j52l93M33J16p6j45P5J58m23L79J8L19n88N9L37n3J96m44
4272a70Q3p3N16k19k51L47j75j27L71o7j46o4J05j12K92l59L0n5K29j67O4J3j06
4295d1M22k95j24Kp0J16Q8L9k71K47l53P4K92j14K41p9O5l00q2p9K08J10j32j65
4319b01J34j23K14l1j36L57j10l7J78m77L63J61l78j53k2L73J4L2n5k88J51QJ08
4342H2k3Q9k10r5J02K06l11J58r2J1K2K34m35o3K95j54j61K56q5K64J8l11N08
$$ plain form
4365 305 33 28 -69 114 97 36 -161 -312 56 242 -342 -131 -19 65 -218 37 -8 -104 -43 -10 -334 5 -73 124
4389 124 127 56 169 77 7 -292 -8 174 -3 22 -158 -2 -137 212 -20 129 152 299 25 104 -88 88 -119
4412 -119 -143 143 88 -55 -163 -125 20 -165 46 59 -22 -45 -146 -302 300 -78 -183 217 269 174 -194 53 -164
4435 -164 145 394 23 42 269 -43 31 93 275 -54 -19 -6 106 -1 -147 -186 -213 -211 -70 -177 32 -28 306
4458 306 -298 -224 60 -44 -25 291 53 -75 217 -126 212 157 -47 42 -91 207 -104 -145 -71 192 -324 -85
4480 -85 -122 58 128 210 -327 1 -73 -303 -71 -93 55 13 -161 94 24 146 -218 133 164 -269 51 10 496
4503 496 134 413 -133 232 251 32 -416 -371 -90 40 -15 51 73 -185 86 -27 390 -295 -196 242 -136 -3
4525 -3 205 66 -410 169 128 44 159 200 -89 -328 168 -289 112 173 3 127 2 -18 282 30 99 162 135
$$ packed form
4365C05k72nr7J83j7o1j97j51L68J86n84K11J12Q4k83K55m5r6O1L3l24L39p8J97
4389A24Lp1J13r2p0k99K84J82j77K5j80J56j35L49k32J49K3J47k74P9j92J76k07
4412a19k4K86n5j43j08L8J45j85K11J3q1k3j01j56O02l78j05M00N2r5l68K47k17
4435a64L09K49l71J9K27l12P4O2J82l29L5J3J12j07j46l9k7KJ41j07K09o0L34
4458C06o04P4K84j04J9L16k38j28K92l43L38n5k04Q9j33K98l11m1P4K63n16K39
4480h5l7J80P0Q2n37L28p4k30K32k2J48m2j74K55p0J22l64L51L1m33L20m1M86
4503D96l62K79n46L65J9k19m48M5K81J30n5O6K2k58K71j13M17o85R9M38l78J33
4525cK08j39m76N79m1q4J15M1k89k39M96m57M01O1j70J24j25k0L00k52O9O3k7
$$ plain form
4548 135 -195 103 -118 -58 2 87 -157 94 -155 182 320 48 65 48 -155 32 18 381 -153 250 59 157
4570 157 65 123 613 -65 -153 -212 75 -71 -71 -22 -259 -31 -20 264 -117 79 -8 -185 -210 -240 -169 127 -317 -206
4594 -206 54 232 -157 -215 192 -122 179 1 -60 298 -390 42 -22 -82 -190 0 62 356 16 -234 -304 -99
4616 -99 -157 -218 -73 76 -61 -23 329 398 37 362 -205 -225 102 59 56 -277 76 294 318 -134 -170 36 -159 62
4640 62 10 -78 18 -31 -73 -68 -156 -197 -435 -326 65 -59 484 -200 -25 -110 -405 -54 -181 -215 294 16 -132 -87
4664 -87 70 104 -11 -56 -259 -103 201 173 5 -17 139 199 183 289 -335 -109 -82 -51 309 -79 193 -77 -107
4687 -107 233 -12 -317 -228 117 -136 31 -112 -111 131 -19 5 195 351 331 84 -67 -11 224 60 -80 -139
4709 -139 -353 250 -183 109 -192 -35 -225 138 -81 -10 94 -58 -136 -84 52 -10 168 241 181 -117 284 197
$$ packed form
4548A35l30K98k21O0O0Q5k44K51k49L37J38k72J7j7k03J87j4L63n34M03j91R8
4570A57r2N8M90o78q8n9K87j46%M9k37K28J1K84l81J96q7j77k5l0P1K96m44J11
4594b06K60J78l89n8M07l14L01j78o1L58o88M32o4o0j08J90O2K94l40k50p0K05
4616i9n8o1J45J49j37L8L52O9l61L25n67k0L27m3ll33L53K18K4m52l6K06j95K21
4640F2n2q8R6m9m2Nq8m1k38J09L91j24N43o84J75q5k95L51j27l4N09k78j48M5
4664h7J57L4j15m5k03J56L04k8j68k2J56O0j6J06o24K26K7L1L60l88K72k70l0
4687a07L40k45l05Q9L45k53J67j43JK42j50K4J90J56k0k47j51N6K35j64j40n9
4709a39k14O03m33K92l01J57j90L63k19P1J04j52p8N2J36o2J78P3o0k98M01q7
$$ plain form
4731 197 166 11 -61 -194 203 -82 -211 156 -76 31 75 210 111 -8 -221 -108 -31 -159 -172 128 135 -34 277
4754 277 -21 282 177 0 161 477 70 30 -59 -14 406 34 304 30 117 117 -178 -136 -199 -110 -232 -81 -35
4777 -35 -120 -198 -12 -146 444 -274 74 -141 -89 123 -124 -289 -114 500 52 443 -317 18 -173 321 -9
4798 -9 -179 324 142 -357 -279 -250 479 -300 576 53 -419 303 369 802 28 -6 223 184 158 224 49 -1278 536
4821 536 -247 -1166 -162 -83 -558 151 1262 623 73 -244 -449 132 -65 -462 145 461 524 -1271 -47
4840 -47 -344 -472 -49 -293 -270 1260 -586 -263 -93 571 8 -26 358 591 46 -499 244 -526 636 -489
4860 -489 152 -218 133 -451 46 -463 225 133 -160 -293 35 393 -1 31 209 -25 -439 14 262 102 -87
4881 -87 17 104 -316 153 5 38 -164 254 -264 -90 44 215 -120 87 -167 -124 227 -74 100 -323 -184
$$ packed form
4731A97l1j55p2j33L97k85j29L67k32J07M4J35r9j19k13J13P7j28j3L00Pj69L11
4754B77k98L03j05j77J61L16m07m0q9M5M20l72K70k74Q7%k95M2o3Q9j22J51M6
4777c5q5p8J86j34N90p18L48k15N2K12k47j65J75O14m48L91p60L35j91M94l30
4798ij70N03j82m99P8K9P29p79Q76n23m72P22O6M33p74l4K29l9k6O6j75j327J814
4821E36p83r19J004P9m75P09J111o39n50l17k05N81j97l97O07L16O3j795J224
4840d7k97j28M23k44K3J530j846L23J70O64n63l4L84K33n45n45P43p70J162j125
4860d89O41l70L51n84M97n09O88r2k93j33L28L58l94L2J78k34m14M53K48j60j89
4881h7J04Q7m20M69j48L3k02M18n18J74J34J71l35K07k54M3L51l01J74m23J39
$$ plain form
4902 -184 12 86 76 234 -107 56 2 -63 -41 110 68 -25 -4 -102 -63 -347 -22 -188 85 189 -3 -4 19 1 -348
4927 -348 329 132 -33 114 -63 76 -336 106 -219 34 53 -19 66 -15 90 -103 42 -222 257 125 145 141
4949 141 162 78 -236 -165 -125 123 150 -133 -129 -163 160 26 -2 -114 -33 -19 183 -268 -30 -113 241 -201 109 -47
4973 -47 -290 -4 -128 404 158 -272 -178 221 95 96 -253 6 1 -174 241 177 422 8 13 -351 -92 -90 -184 155
4997 155 20 -3 66 -179 -90 225 276 111 4 41 38 -4 -65 -90 -57 54 -157 71 -90 82 40 -11 123 -122
5021 -122 -78 -39 14 251 225 -348 -1 -158 -62 14 284 130 61 -118 -41 341 -181 -83 103 24 218 90 93 9
5045 9 13 59 81 -29 -50 -97 68 130 119 -48 -54 19 -140 139 151 43 -387 129 -8 -120 -46 -261 -198 70 -105
5070 -105 -267 -258 -200 -50 163 122 -584 -17 -225 -97 -26 -208 176 -201 100 289 76 1 85 165 -13 93 -114
$$ packed form
4902a84J96P4j0J58l41J63n4o5K2J51m2r3K1r8L9k84L25j66K73J04j92jK3j8l49
4927c48O77j97j65J47j77J39m12M42l25K53J9p2Q5q1J05j93J45k64M79j32K0m
4949A41K1q4l14P1M0K48K7k83Ml4L23j34k8j12Q1J4K02m51K38q3L54m42L10j56
4973d7k43K86j24N32k46m30R4L99j26Jl49K59nj75M15o4K45m14Nl64K59Kr4L39
4997A55j35k3O9k45Q9L15N1j65j07L7lm2o1k5L3J11k11K28j61J72m2n1J34k45
5021a22M4L9N3K37k6n73L47j57R6P6K70j54o9j79P7L82n22R8J86p9J94j28Lq4
5045IMM6K2j10k1m7J65O2j1j67oP3j59K79J2j08m30N16j37j12P4k15O3K68j75
5070a05j62RN8J50K13m1p06N67k08J28P1j82L84l77L01J89k13p5Q4Q0j78J06k07
$$ plain form
5093 -114 -104 411 173 138 179 50 98 33 215 -121 212 107 -63 -128 100 0 149 1 456 -94 37 164
5115 164 -29 -80 77 235 106 -5 127 -28 -81 120 142 -184 -100 198 -196 -116 -46 175 263 -96 40 232
5137 232 -120 -14 228 -19 223 67 -243 -102 187 -119 539 -127 -76 122 162 52 272 -56 106 78 126
5158 126 9 36 177 92 -38 20 72 92 98 -130 24 72 -201 -255 -255 -181 -174 -253 102 -231 -67 58 208 195 -175
5183 -175 127 -22 208 174 -247 -69 -74 408 53 118 -138 148 -45 6 -195 64 -69 332 -109 179 54 82
5205 82 94 200 -140 112 478 -1 181 -188 186 -209 -149 136 59 18 -116 28 -95 -320 -16 118 56 -187
5227 -187 -280 -26 -67 192 128 166 154 266 -19 127 -195 -94 173 -120 121 188 -237 -184 -60 -303 155 -46
5249 -46 308 130 221 62 -5 165 251 -44 -181 25 -159 177 66 -201 -116 -185 96 391 -108 390 -163 -185
$$ packed form
5093a14J0N15k38l5M1j29M8o5J82l36L33j05j70o5K28j00J49j48M55n50J31J27
5115A64j93n1J57J58j29j11J32j55n3K01K2l26Q4K98l94Q0P0K21Q8l59J36J92
5137B32l52J06K42k47K42j56l10J41K89l06O58o66N1J98M0j10K20l28J62k8M8
5158A26j17K7J41q5j30N8N2K0Ok28J54M8k73n4%P4Pp9L55l33J64J25J50j3l70
5183a75L02j49K30l4m21J78nM82l55O5k56K86j93N1k01K59j33M01m41K88j25K8
5205H2J2J06l40K52L66m79J82l69L74l95O0K85p7m1j34J44j23k25L04J34o2k43
5227a87r3K54m1K59o4L8j2J12k85J46l22J01K67k93K41O7m25N3J24k43M58k01
5249d6L54j78R1j59o7J70Q6k95j37K06j84L36j11k67Q5o9K81K95m99M98n53k2
$$ plain form
5271 -185 -24 269 133 121 -210 -128 74 -166 6 93 6 -34 -82 163 -169 160 -13 -67 137 -310 133 95 -219
5294 -219 -89 229 -8 -38 60 -90 -397 117 34 -313 -348 201 -187 144 -22 112 498 137 -132 61 66 -44
5316 -44 64 -158 86 271 236 71 410 -106 248 -17 150 -304 185 105 -1 -314 46 217 -54 -12 86 -91
5338 -91 163 54 37 52 155 118 -147 -60 22 -255 44 -118 -23 -52 -219 168 79 -197 -60 281 -160 230 73
5361 73 -64 -95 31 160 -96 -79 105 -238 -124 37 -45 260 151 -424 -287 -195 -88 83 -207 140 -64 -88
5383 -88 40 -45 -113 26 -216 -277 -6 57 5 -39 92 188 -100 186 286 -64 -196 230 81 86 -279 -170 212
5406 212 302 -124 -102 1 -58 -161 -122 236 -11 -150 -91 -110 -308 81 -135 43 242 67 -248 282 -62 122
5428 122 219 215 -71 -258 -158 -3 191 -118 -223 -4 35 95 261 185 197 -162 -98 139 139 82 -10 74 -75 345
$$ packed form
5271a85J61K93j36j2l31Q2K02k40J72Q7q7m0m8K45l32L29j73n4K04m47M43l8l14
5294b19J30L18k37l0R8j50l07N14q3l47l5N49l88L31j66J34L86l61k69J93Nj10
5316d4J08k22K44J85l5j65L39n16L54k65J67m54M89q0j06l13L60J71k71M2R8j77
5338i1K54j09j7J5J03l7k65Q7Q2k77K99j62R5k9j67L87q9k76J37L41m41L90j57
5361G3j37l1J26J29k56J7J84l43J14J61q2L05j09n75J37R2J07J71k90L47k04k4
5383h8J28q5o8J39k42o1K71O3n2m4J31R6k88K86J00l50j32M26j49Nl65J09L82
5406B12R0m26K2J03n9j03L9L58k47j39N9j9j98L89k16J78J99j75l15N30l44J84
5428A22R7mk86j87J00J55J94l09j05K19L9O0J66p6J2l59O4K37%n7r2Q4j49M20
$$ plain form
5452 345 101 42 -129 157 54 -207 203 29 -42 -136 -3 -197 -149 -228 -87 178 -31 147 -269 -79 67 38
5474 38 214 134 -54 37 -446 0 239 -75 -119 -150 -136 143 138 -61 -180 -38 -121 33 -340 -130 -258 -7 91
5497 91 -71 -83 122 -79 -31 -71 60 -156 -112 214 42 445 -135 198 158 113 -305 -30 145 298 190 -12
5519 -12 19 129 140 -77 -46 53 38 185 371 -259 -323 -81 170 101 -193 106 -178 4 -9 -284 128 229 -88
5542 -88 -1 -84 84 -169 72 -138 47 225 7 -115 -45 169 -145 446 164 192 129 -5 -159 -290 35 -47
5564 -47 140 51 6 -165 167 211 314 -197 55 93 -128 58 90 81 -192 -371 -41 -337 192 -105 106 94 -39
5587 -39 279 98 -101 -355 -10 -46 -3 -90 58 -144 -59 143 348 -25 131 100 -284 -154 -196 -34 -283 135
5609 135 -200 74 -5 107 287 284 51 -324 -241 157 19 106 -9 -215 -24 215 33 -211 182 300 142 13
$$ packed form
5452C45k44n9j71K86j03k61M10j74p1r4J33j94M8p9J41K65k09J78m16J90J46k9
5474C8J76q0j88R1m83M46K39l14m4l1J4K79nj99j19J42q3J54l73K10j28K51R8
5497I1j62j2K05k01M8m0J31k16M4L26j72M03n80L33m0m5m18K75J75J53j08k02
5519a2L1J10J1k17L1R9j5J47J86o30o4K42K51o9k94K99k84J82j3k75M12J01l17
5542h8Q7q3J68k53K41k10J85J78k18j22P0K14l14N91k82K8o3j34j54j31L25q2
5564d7J87q9m5j71L32M4J03n11K52L8k21J86L2rk73j79L30k96N29k97K11j2j33
5587c9L18j81j99k54L45l6M3q7J48k02Q5K02K05l73J56l1l84J30m2J62k49M18
5609A35l35K74p9J12J80lk33l75Q3L98j38Q7j15k06J91K39j82k44L93J18j58j29
$$ plain form
5631 13 430 -38 84 -31 -207 -9 -171 -183 -394 199 104 640 120 -157 -209 99 -82 19 -201 88 101 -223
5653 -223 119 -60 142 116 111 -48 -189 -73 -249 -165 212 -136 -61 141 176 164 -211 66 -351 22 -149 130
5675 130 78 -99 24 189 -42 -231 39 -164 -83 10 -34 46 -160 139 -10 -120 152 44 -23 54 -246 -258 42
5698 42 7 -104 -135 -150 310 -95 79 127 -64 -145 193 -87 -144 95 -60 -109 -225 301 -207 111 -138 -412 -107
5721 -107 3 -82 -20 141 29 -77 117 132 162 -148 50 -127 44 -267 301 -65 33 203 -20 -64 121 164
5743 164 209 71 180 -289 -79 -76 30 72 27 166 -132 -225 -233 -32 -121 -121 207 -112 59 -160 -138 113 -200 -14
5767 -14 182 18 93 -179 132 -98 -315 -109 -49 -267 -244 -97 -90 171 -363 -462 118 21 95 1 170 77 156 -244
5791 -244 -285 100 -4 109 164 45 -453 334 75 -81 6 332 166 304 -214 -311 97 -2 -36 5 -146 99
$$ packed form
5631A3M17m68J22j15j76J98j62j2k11N93r5N36n20k77n2L08j81J01k20K89J3l24
5653b23L42j79K02k6nj59j41J16j76Q4L77l48P5K02L5j2l75K77m17L73j71K79
5675A30n2j77J23J65k31j89K70k03Q1R3m4Q0k06K99j49j10K72j08o7P7l00j2L00
5698D2l5j11l1j5M60m05J74M8j91q1L38k80n7K39j55m9j16N26n08L18k49k74L05
5721a07J10q5O2J61j12j06J94J5L0l10J98j77J71l11N68l66R8J70k23m4J85M3
5743A64M5j38J09m69K10LJ06M2m5J39k98r3qK01q9%L28l19J71k19K2K51l13J86
5767a4J96j64P5k72L11k30k17K06O0k18K3J47PK61n34r9N80r7P4r4J69r3P9m00
5791b44m1L85j04J13N5j19m98P87k59j56Q7L26j66J38n18r7M08r9l4M1j51K45
$$ plain form
5813 99 -102 -69 -133 -262 -61 -60 -218 -98 -176 -177 112 -8 -249 -274 81 124 -60 -239 115 -72 81 -204 -382
5836 -382 -199 15 -90 43 91 -71 247 199 -61 193 347 -14 -68 -81 27 -453 0 34 -276 -4 180 133
5858 133 43 96 -57 14 -224 -208 269 -59 -350 29 181 156 109 -381 357 118 -17 -14 -216 -109 16 -114 187
5881 187 -106 44 -426 -278 -74 93 184 -375 170 16 54 -78 130 71 -357 336 -275 -48 158 161 -189 250
5903 250 -259 -224 112 -145 -224 103 202 124 113 -59 -73 193 -327 67 268 -183 -71 105 167 403 2 90 39
5926 39 128 113 56 248 -42 -97 -137 123 55 -190 21 -27 58 43 -83 -28 -118 -272 236 359 136 179 -168 61
5950 61 41 -75 16 106 -107 13 -161 -485 -96 -74 97 143 -151 -70 260 -79 151 -69 33 188 -101 -103 -314
5973 -314 -119 178 94 -125 34 -8 -94 -98 -173 340 -318 -129 -338 71 326 -244 149 147 -125 109 -149 -89 253
$$ packed form
5813I9k01L3o4j29K01Jj58J20p8jK89j20k41k5L55M3j84j79L54j87J53k85j78
5836c82J83K14j05J33M8j62L18m8k60K54J54l61n4j3J08m80M53L4l10K72J84m7
5858A33r0N3j53P1k38J6M77l28k91L79J52k5m7m90P38k39j35Lk02J07J25j30L01
5881A87k93J50m70J48K04J67R1n59N45j54L8j32K08n9m28O93o11K27K06Ll50M39
5903B50n09L5L36k57p9L27R9p8j1j72j4K66n20L94K01m51J12J76O2K36m01Q8n1
5926C9Q9j5n7J92k90n5m0K60o8k45K11m8Q5j5j26N5r0j54N08J23k23M3l47K29
5950F1k0j16R1R0k13J20j74l24L89K2J71M6k94Q1L30l39K30k20J02J55k89kk11
5973c14J95K97q4k19J59m2q6mp5N13o58J89k09M09K55n70L93kk72K34k58O0L42
$$ plain form
5996 253 -158 5 243 -214 -94 -77 -101 121 115 388 -81 -104 28 -44 93 74 208 114 -56 -103 -97 -98 -8 169 -9
6021 -9 -9 -556 109 -5 141 -48 91 157 -63 -19 -340 95 -206 84 28 -76 -198 23 -64 -144 -367 -233 -208
6044 -208 51 -80 46 -482 -8 -55 125 429 -83 54 -121 127 20 204 -24 170 99 140 -176 81 355
6065 355 66 -117 -241 7 -209 -176 -151 -131 112 -229 -136 25 -88 -370 -16 59 380 37 179 29 -326 145
6087 145 -95 251 -243 -25 191 -70 -35 -153 -119 -55 -170 159 -272 43 86 240 -47 208 -37 -245 -121
6108 -121 -174 276 -66 50 -24 75 -87 207 257 -21 93 -264 4 17 90 -154 58 -96 -151 -18 -151 208
6130 208 18 -17 31 -173 -175 -104 -59 221 298 130 -507 -229 -375 -3 -81 -129 29 -366 131 198 -168 -63 -101 87
6154 87 4 330 313 -26 74 91 -142 158 46 140 -382 191 212 28 353 -132 -177 -69 194 -1 -73 -22 -150
$$ packed form
5996B53m11J63K38m57J20J7k4K22oK73m69k3J32p2J37j9J34r4j70m7OjR0J77j78
6021i%n47O65j14J46j89J39O6k20M4l21M35l01K90n6j04j22K21q7q0k23J34K5
6044b08K59j31J26n28M74m7J80L04n12J37j75K48j07J84k28J94p1M1l16K57K74
6065C55k89j83j24K48k16L3K5K0K43l41R3J61j13k82L54P5L21l43J42j50l55M71
6087A45k40L46m94K18K16k61L5j18L4O4j15L29m31L15M3J54k87K55k45k08J24
6108a21n3M50l42J16p4R9j62K94N0k78J14l57K68J3P3k44K12j54n5J33j33L59
6130B08j90l5M8k04kP1M5K80P7j68o37K78j46L72p8m8J58l95M97O7l66J05l8J88
6154H7q3L26j7l39J00J7k33L00j12R4n22N73K1j84L25m85m5J08K63j95p2N1j28
$$ plain form
6177 -150 74 -31 213 -40 8 17 44 70 -109 189 -106 161 -24 -148 -39 -12 67 -241 126 17 39 9 -203
6200 -203 213 360 116 159 -183 -130 -107 27 155 -89 7 77 -94 -277 322 324 -114 133 -83 134 16 -251
6222 -251 151 189 -37 -17 33 223 24 -5 198 458 161 27 156 40 -187 -104 151 302 0 -100 127 -28
6244 -28 369 -6 120 -183 158 -21 35 228 117 1 142 -78 -36 280 56 -199 73 216 454 -184 -57
6265 -57 -38 -189 -64 -70 149 -229 76 -62 -182 -26 17 -329 -126 49 -41 168 214 -201 -31 335 8 89 54
6288 54 46 -32 211 26 30 -375 150 -210 -112 -113 -135 72 -99 2 -204 47 -28 77 -128 227 28 -273 197 -61
6312 -61 -157 -21 151 -140 -28 129 -9 -363 93 -59 159 91 -64 84 -69 -185 -260 -97 223 60 45 51
6334 51 -177 12 96 169 -41 299 -171 135 129 -70 28 41 233 57 -279 -116 303 282 -41 -173 36 228 -190
$$ packed form
6177a50K24j05K44k53M8RK7K6j79K98k95K67j85j24J09K7P9l08L67j09K2l0k12
6200b03M16J47k44M3l42N3K3J34J28k44R6P0j71j83N99Km38K47k16K17j18k67
6222b51M02L8k26K0N0J90j99k9K03K60k97j34J29j16k27Q3K55J51l02j00K27j55
6244b8L97l75J26l03L41j79N6J93j11j16J41k20M2L16k24k55K72J43K38o38J27
6265e7J9j51J25oK19l78L05j38j20J56M3l46K03J75r0K09M6m15J70L66l27Q1l5
6288E4qp8K43j85Mm05N25l60R8jk2K07j71J01k06K51p5J05k05L55j99l01M70k58
6312f1r6J36J72k91J12J57j38l54M56j52K18o8j55J48j53j16p5J63L20j63j5O
6334E1k28J89Q4P3k10L40m70L06oj99R8J3J92j76l36J63M19k1l23j32K09J92m18
$$ plain form
6357 -190 -97 156 158 -24 -303 -26 -93 205 59 329 -272 268 195 36 145 -202 -138 3 98 -171 21 -224
6379 -224 258 -91 211 -243 -27 89 -109 37 -56 -166 158 -298 -114 -102 -204 -270 -319 -90 196 -41 -267
6400 -267 226 247 5 -366 221 116 -211 77 -92 -8 -7 -78 179 -167 189 -85 258 -133 144 -74 -215 -66
6422 -66 142 -125 -48 -106 14 174 -196 16 187 -48 -60 -55 5 -219 -99 168 -83 160 -44 215 195 -259 -142
6445 -142 117 55 -255 397 167 25 -134 -7 -40 -64 -186 -83 -183 -196 -42 95 -87 -260 -52 -135 228 30
6467 30 -70 45 425 32 -35 94 30 113 -47 174 -328 -205 -29 -305 -77 -194 -107 147 140 -421 -193 162
6489 162 -2 103 235 -40 287 -255 -216 -263 18 -276 -127 261 -95 336 107 163 -52 35 -68 -59 -320 -297
6511 -297 -173 -204 104 -57 -125 -182 -91 14 73 20 -179 -46 95 1 -106 34 30 130 -15 19 10 83 -185 -208 170
$$ packed form
6357a90R3K53Kj82k79K77o7K98j46K70o01N40p3j59J09l47O4J41R5k69J92k45
6379b24M82l49L02m54K16J16j98J46r3j10L24m56J84J2j02o6m9K29K86k37k26
6400b67M93K1k42l71N87j05l27K88j69Q4Jp1K57l46L56k74L43l91K77k18j41J49
6422f6K08k67P7n8J20J60l70K12J71k35j2NO0k24J20K67k51K43k04K59k0m54J17
6445a42K59o2l10O52k30j42j59J27l3k4j22J03j00j3J54J37j82j73K08q3L63j98
6467C0j00J15L80l93o7J29o4Q3j60K21n02J23J76k76K28j17Q7K54pn61K28L55
6489A62j64J05J32k75L27n42L9m7K81k94J49L88l56M31k29N6k15Q7j03Rk61K3
6511b97J24l1L08j61o8n7R1J05N9n3j99J33J41r4j07J40mJ00j45L4rP3k68k3L78
$$ plain form
6536 170 -62 -6 113 92 238 124 48 -69 219 119 -215 -146 -153 214 9 -139 -24 -256 -197 77 37 -72 -41
6559 -41 10 159 -4 -86 -93 -24 98 -187 -24 286 -129 -192 -24 -1 157 -13 -50 -75 -38 19 113 -362 145 -155
6583 -155 104 180 -324 -73 280 -25 245 -41 108 -264 -5 62 40 196 180 32 72 -283 -130 150 15 99
6605 99 148 -31 438 317 24 -237 -170 94 91 13 -183 242 233 18 -17 123 127 -14 -187 43 69 -304 183 -134
6629 -134 -234 31 -29 140 -98 -222 -28 44 61 -97 -9 230 57 -131 243 67 242 78 -306 215 178 68
6651 68 -19 -131 -114 -81 -189 253 -6 99 -61 -149 -160 -36 144 491 215 -71 368 142 -155 139 6 -346
6673 -346 -77 -184 174 116 191 127 10 348 61 -281 79 35 153 104 255 25 -45 225 233 -72 -72 -39 15 -50
6697 -50 32 229 -169 -170 -82 -275 -73 -253 -2 136 -26 71 23 202 -21 -303 109 130 -348 -54 57 -8 175
$$ packed form
6536A70k32N6J19k1J46j14p6j17K88j00l34O9pL67k05j48J15k32N9K74m0j09L1
6559d1N1J49j63q2pO9J22k85J63L10m15o3J68K3J58j70l7k5L7N7R4m75N07l00
6583a55K59P6n04K51L53l05K70k86J49l72K59O7k2J56j6j48M0l55J53K80j35Q4
6605I9M9j79M69j21k93k61O7K64lp8j96M25rk15l5J40Mj41j73K30K6l73M87l17
6629a34j00K65o0J69k38j24J94P2J7j58Q8K39j73j88L74j76J75j64l84N21l7j10
6651F8q7j12J7L3j08M42k59J05j60q8j1J24J80L47k76k86M39k26k97K94j33l52
6673c46K69j07L58n8P5o4j17L38k87l42L60m4J18m9J51k30p0K70Ql05%L3N4o5
6697e0Q2J97l98jQ8j93K02j80K51J38j62R7m8J79k23k82M12K1m78K94J11o5J83
$$ plain form
6720 175 213 -78 -375 30 341 -44 -20 -59 -160 13 -132 -225 87 -28 169 -171 -72 -278 -238 179 -21 154
6742 154 -138 -161 -174 -101 71 107 208 362 150 -52 1 -276 -131 -288 100 137 64 130 92 152 285 157 106 171
6766 171 127 308 -28 277 173 69 -33 -123 -171 -29 -81 130 -239 10 -24 -179 183 -293 35 123 192 400
6788 400 117 124 -22 -148 -17 -40 -259 99 -183 243 -40 -74 -53 70 -126 124 11 45 183 105 -135 303
6810 303 31 -46 -115 178 -413 42 139 175 -47 241 -65 -139 -115 -33 -24 54 -366 -114 113 103 -22 33 96 -121
6834 -121 99 365 207 386 75 -311 130 -19 -214 -230 -195 120 196 58 60 96 -185 63 -140 -207 62 -77
6856 -77 -177 93 153 19 -270 -231 183 -217 -128 -67 -136 -223 -124 4 91 271 -2 224 -116 -32 -273 87 162 116
6880 116 142 -372 -70 220 -264 -294 19 259 241 -211 -250 160 -291 -211 88 5 265 73 166 413 -50 261
$$ packed form
6720A75L8k91k97M05L11l85K4l9j01J73j45r3L12j15J97l40R9k06M0M17k00J75
6742A54k92k3j3P3J72L6J01J54k12k02N3k77J45j57L88L7p3O6l8O0J33j28n1O5
6766A71m4J81l36L05j04j04j02r0m8J42n2K11l69K49l4j55L62m76L28Q8O9K08
6788D00k83Pj46j26J31k3k19L58k82M26k83l4K1J23j96K50j13L4J38p8k40M38
6810C03k72p7o9K93n91M55R7L6k22K88l06p4K4Q2RP8m20K52K27j0j25N5O3k17
6834a21K20K66j58J79l11l86M41j49j95j6L5L15P6j38KL6k81K48k03o7K69j39
6856g7j00K70O0j34k89L9M14m00Q9O1o9q7R9J28Q7J80k73K26l40Q4k41L60P5m6
6880A16K6n14L02K90m84l0L13K40j8m52l9M10m51Q0K99q3K60j92R3K47m63L11
$$ plain form
6902 261 290 -56 35 136 -21 263 -300 117 244 135 338 60 75 -352 -291 93 -48 -50 152 15 -47 162
6924 162 328 -249 -193 9 -185 -254 72 -240 -262 170 218 190 -59 -79 -206 209 -59 302 111 -48 111 173
6946 173 149 -414 249 -169 11 302 -369 133 47 -181 58 -1 116 -7 -12 190 -36 13 115 49 46 -188 -176
6969 -176 -42 -85 7 -104 -103 290 -156 -67 -4 205 -35 -5 -60 -61 90 95 -88 -31 -165 258 88 140 -87 50 95
6994 95 -41 -67 92 -160 -290 -99 -72 8 141 -305 -28 -65 339 74 -54 198 5 -219 156 62 -74 23
7016 23 126 54 338 -39 184 -387 -13 37 245 346 81 -37 16 89 -141 -66 -64 238 -213 143 177 -417 252
7039 252 71 107 -86 243 66 -191 -42 -128 -23 14 140 -341 81 -369 298 93 -450 246 -190 -179 -40
7060 -40 4 138 -87 12 -92 -20 97 -279 20 -102 -234 -78 82 232 -29 -75 348 -110 55 -8 -91 -139 -202
$$ packed form
6902B61K9l46R1J01j57K84n63M17J27j09K03k78J5m27O1L84j41kK02j37o2K09
6924A62J66n77N6K02j94o9L26l12k2M32M8k8k49k0j27M15k68L61j91j59J59O2
6946A73k4n63O63m18J80K91o71N02q6k28K39n9J17j23nK02k26M9J02o6lk34J2
6969a76J34m3R2j11JL93m46Q9O3K09k40L0n5jJ51Nj83N7j34M23j70N2k27J37M5
6994I5j36k6J59k52j30J91K7Q0J33m46K77l7M04k65j28K52j93k24L75r4j36R7
7016B3J03p2K84l77K23n71L74N0K08J01k65j18N3P3k30P5KL02m51L56L4n94O69
7039B52j81L6j93L29j77k57J49q6J05L7J26m81M22m50O67k05n43O96m36J1J39
7060d0M4J34k25R9j04P2J17l76K99j22j32J56J60J50k61m6M23m58J65o3q3m8o3
$$ plain form
7083 -202 -58 -140 154 -79 -97 -207 -285 75 344 -110 -187 291 174 -440 -319 2 -6 -93 347 -133 -7 1 -64
7106 -64 152 148 153 10 -313 8 8 -53 51 58 -80 261 263 -128 201 -106 19 -161 92 32 -6 -167 -277 171 165
7131 165 -114 153 79 143 -255 130 34 -115 400 152 -17 9 203 147 221 -21 -30 80 437 -78 180 -164 304
7154 304 -286 -168 79 -50 -59 -151 -264 -331 -204 174 247 -24 -19 -124 -33 -224 -112 121 191 4 -110 59 -267
7177 -267 -121 -28 226 -96 -150 -198 -301 28 -91 194 201 -204 58 -281 -107 -114 200 162 -5 -207 -216 490 26
7200 26 44 -316 -4 40 32 39 -484 85 -90 -187 -429 -57 103 135 6 -303 -106 -190 -115 75 187 -81 187 100
7224 100 -388 -17 174 -110 -291 -2 -216 11 -162 166 98 -274 -229 144 -116 486 -25 -242 44 -263 13
7245 13 -184 116 72 -31 -198 75 65 -422 -108 -188 97 225 47 -228 -28 133 -147 113 -208 181 -179
$$ packed form
7083b02J44q2K94k33j8j10p8L60K69m54p7M78j17o14J21L21qq7M40m80J26Qo5
7106f4K16mNj43l23L21%o1J04Pj38L41Kl91L29l07J25j80K53o0l8j61j10M48o
7131A65k79K67p4O4l98L85r6j49N15k48j69K6J94n6P4k42rJ10L57n15K58l44M68
7154C04n90J18K47j29rr2j13o7J27L78P3k71Nj05R1j91J12K33P0j87j14J69l26
7177b67J46R3K54l22n4m8j03L29j19K85Pm05K62l39J74pL14l8j67k02rP06m64
7200B6J8l60L12M4qPn23N69j75r7k42L72J60L2j29l09J97q4P5J90J12k68K68q7
7224A00m88L71J91k84j81K89k14K27j73L28o8l72M5L73k60O02n11k17K86l07K76
7245A3j97L00m4j03j67K73j0m87L14q0K85J28j78k75K00J61k80K60l21L89l60
$$ plain form
7266 -179 60 -178 -14 50 99 -98 -143 -286 128 45 -21 -253 243 124 109 -101 -166 188 21 141 -188 -48
7288 -48 23 143 141 -496 -51 -42 -172 335 -58 13 -138 116 227 227 0 -215 16 145 -129 94 -362 5 -310
7311 -310 -302 121 130 -162 -248 46 152 171 33 -79 -73 -74 -52 42 46 52 -108 -216 115 61 10 -23 -262 -15 -55 174 82
7338 82 275 134 142 186 -382 -229 341 41 141 101 165 124 -178 -141 8 25 -300 15 -148 291 -24 3 130
7361 130 -4 -67 246 35 -232 -136 -211 21 -312 287 220 -118 42 46 -13 69 271 -326 -13 -19 -2 -53 203 59
7385 59 -491 -43 -102 -60 1 169 134 -42 6 -132 233 -189 402 10 106 219 -617 9 130 -60 -105 449 37
7408 37 -319 -31 100 13 -176 -84 82 -84 -207 227 215 481 333 306 114 147 -69 109 -187 -145 486 268
7430 268 400 433 -94 168 42 -50 87 256 -445 159 188 428 47 -217 131 85 269 14 49 162 327 96
$$ packed form
7266a79K39k38J64O4M9j97m5j43M14q3o6k32M96j19j5k10o5L54j67J20l29J40
7288d8P1J20ko37M45Rj30N07l93P1j51K54J11%k27k15K31J29k74K23m56L67l15
7311c10QM23Rk92q6K94J06J9j38j12OjK2R4MOj60j08L31n4n1l3k39K47m0K29r2
7338H2J93j41QM4n68J53N70l00J00m0O4m1l02L7J49J7l25L15j63M39l15K7J27
7361A30j34o3L13k11k67R6p5K32l33N99o7l38J60Mn9Q2K02n97L13oJ7n1K56j44
7385E9n50M48n9M2O1J68l5j76M8j38L65m22N91l92R6J13q36O26J21j90m5N54m12
7408C7l56K88J31q7j89R2J66j66j23M34j2K66j48k7j92L3k16J78k96M2O31k18
7430B68J32L3n27K62j26r2J37J69p01O04K9K40l81k64L48m6J84k55L5J13J65k31
$$ plain form
7452 96 42 -14 -81 155 118 -304 -20 515 17 -326 -175 -36 211 409 151 -123 -31 -241 225 -279 10 -186
7474 -186 -189 166 480 52 -221 -27 172 151 -180 131 -555 131 -68 -197 -326 -172 129 64 157 237 -420 -52
7496 -52 -142 32 -65 -433 -185 -57 249 -105 43 -191 -176 -149 -308 111 46 -142 151 -24 -415 -309 70 324
7518 324 194 63 -55 -25 -42 3 -101 39 -302 -43 35 -89 55 -266 -117 -36 274 46 115 211 31 243
7540 243 247 31 -177 296 -176 -153 -97 -66 -156 -129 67 83 -152 -89 29 478 -85 -363 126 8 -218 -295 -130
7563 -130 -234 -267 127 49 -304 138 -173 182 430 32 -206 80 -145 -57 217 200 179 924 -170 -384 -99
7584 -99 -4 -776 302 -54 -51 631 -837 -77 -908 373 -647 -75 318 -182 -326 -262 -293 -164 -79 289 25
7605 25 151 -142 -65 158 51 -170 40 -112 19 -204 50 -361 -63 3 -50 43 -206 88 166 229 67 -80
$$ packed form
7452I6n4n6o7K36l7m22K84N35m98l43J51J39K47J98k58k74R2k10M66n04K89j96
7474a86lL55L14m28k73J94J99k1l31L11o86O86j99j29j29J54L01o5R3Q0o57L68
7496e2r0J74r7l68K48J28L06l54J48k34J5K7j59M19o5j88K93j75l91J06L79K54
7518C24j30j31j18L0j7M5j04J40l41K59P8j24J44l21J49Q1L10k28O9R6j80K12
7540B43Mk16k08M73m72K3N6L1r0K7J96J6k35O3J18M49n63k78M89j18k26p7J65
7563a30j04l3L94p8l53M42l11L55K48l98k38K86k25Q8K74j7k1P45j094k14K85
7584i9R5p72J078l56LO82j468P60q31J281j020N72L93n00j44O4l1J29Q5L68k64
7605B5J26k93P7K23j07k21K10j52J31k23K54m11K98O6n3R3k49K94P8O3j62j47
$$ plain form
7627 -80 222 -93 -49 354 352 -354 -134 -473 544 611 508 506 352 1115 -121 -221 -190 -155 -1 135 -73 123
7649 123 -267 788 40 -47 129 534 88 -1033 -297 587 948 363 -315 1520 -123 176 -109 615 -20
7668 -20 282 170 -494 474 -515 -98 587 90 -298 72 143 84 -326 47 -274 -238 258 -42 -224 13 109 98
7690 98 -66 37 -274 -162 131 180 138 -58 -66 382 -562 276 32 152 -159 -234 -102 -52 -99 -171 59 22 68 90
7714 90 -149 365 234 116 72 -24 -65 -188 52 118 253 -84 -32 -43 -261 1 121 -5 144 62 113 -14 -332
7737 -332 -12 128 -51 54 191 -6 -53 -131 245 398 -6 179 54 5 289 -112 -224 -239 -66 110 -235
7758 -235 34 -52 115 -129 -58 -7 -361 -41 -120 336 -150 17 282 -426 66 171 -319 -100 128 -348 39
7779 39 364 -215 -134 -169 112 276 328 -123 188 140 -94 210 -25 -7 -53 -24 64 154 221 41 63 36 -124 -105 -47
$$ packed form
7627h0L02l15M4M03kp06K20l39J017O7j03kj54P63j236j00L1L5J54J36k08J96
7649A23l90J055p48q7J76M05m46j121P36Q84L61n85o78J835j643K99k85P24o35
7668b0L02j12o64R68r89M17O85m97l88L70P1n9m10L73l21L6M96l00j82K37R6j1
7690I8j64J03l11J12K93M9m2j96qM48r44Q38k44J20l11p5J32N0m7p2K30l7M6K2
7714I0k39N14j31j18m4r6m1j23K40O6J35l37N2j1k18K62J20j26J49q2N1j27l18
7737c32L20J40j79J05J37j97m7p8L76J53m04J85j25m9K84m01j12j5J73J76l45
7758b35K69q6J67k44P1N1l54L20p9M56m86J67K65p08M92J05m90K19K28m76L87
7779C9L25n79Q1l5K81J64N2m51L11m8k34L04k35J8m6K9Q8R0O7j80K2k7j60J9N8
$$ plain form
7804 -47 138 -42 16 -224 -131 -52 -92 442 8 29 135 -106 379 14 -7 113 -134 -102 -36 -241 37 -188 -6
7827 -6 32 70 -350 43 47 -113 213 -251 -115 -248 35 26 -27 -171 -136 -354 -327 -193 -248 273 -145 180 -123 309
7851 309 -68 -28 -67 195 30 -28 9 -20 99 -166 84 -253 -265 219 -173 -229 147 -92 -148 -105 37 73 354
7874 354 -8 120 -302 -326 -154 52 251 -23 -298 -21 -160 298 -147 -230 -115 226 313 291 12 112 56 206
7896 206 129 25 17 117 9 -6 212 -143 273 -5 -190 130 -107 386 -313 409 57 111 62 366 -115 116
7918 116 -235 151 486 -294 56 394 524 -272 592 -166 112 92 -277 1 375 162 -348 -252 573 -147 423
7939 423 -352 -186 -56 -5 446 681 194 -240 -1070 -85 23 67 -316 356 -301 61 410 299 77 -381 -13
7960 -13 -216 -225 1209 -291 -87 469 725 -149 131 49 166 -140 184 1001 541 32 -698 -624 531 -331 141
$$ packed form
7804d7J85j80N8k40R3P9m0N34m34K1J06k41M85l65k1J20k47L2O6k05K78k25J82
7827fL8L8m20L93Mj60L26m64J36j33K83rn3j44L5k18K7J34n5N21m18L25l03M32
7851C09l77M0l9K62j65n8L7k9J19k65K50l37j2M84l92n6L76k39n6M3J42L6K81
7874C54l62J28m22k4J72K06J99k74k75K77j39M58m45q3J15L41Q7k2k79J00n6J50
7896B06p7j04qJ00j08j5K18l55M16k78j85L20k37M93o99P22l52N4m9L04m81K31
7918A16l51L86L35p80L50L38J30p96Q64p58K78k0l69K78L74k13n10R6Q25p20N70
7939D23p75J66J30N1M51K35m87m34q30R85J08M4l83O72o57L62L49j11k22m58L68
7960a3k03rJ434j500K04N56K56q74K80q2J17l06L24Q17m60n09p30P4J155q62M72
$$ plain form
7981 141 300 290 -276 -145 14 195 66 -36 269 517 347 -406 -447 482 637 -11 37 -460 89 84 -130 247
8003 247 103 -688 -227 -151 -573 -162 226 314 233 60 -50 99 684 696 751 -412 572 -426 -48 461 238
8024 238 31 -53 183 -223 367 -3 -38 -69 711 251 579 -797 117 -32 488 47 249 -31 -3 199 64
8045 64 -486 253 -348 194 -316 67 367 803 -58 209 46 -120 -393 -285 384 302 -20 -295 -482 -137 -8
8066 -8 -219 710 390 -48 -301 227 362 -297 404 -450 237 886 -43 -457 680 231 338 199 52 -472
8086 -472 -459 545 62 34 -264 26 -62 290 -162 -122 30 -90 -59 -64 196 1 -59 136 -462 -192 139 -110
8108 -110 133 -68 111 93 -153 171 -30 -61 -91 -70 -146 59 55 -60 -2 -50 110 20 -281 -84 -78 -353 240 10
8132 10 54 7 204 63 -236 -138 308 42 122 54 -57 204 -268 -32 -127 -175 201 224 -52 165 -27 78 38
$$ packed form
7981A41J59j0n66J31J59J81j29j02L05K48j70p53m1R29J55o48M8m97N49nk14L77
8003B47j44p91M61P6m22M11L88Q8q1j73j10J49N85J2N5j163R84r98L78N09k23
8024B38k07q4K36m06N90l70l5l1P80m60L28j376R14j49N20m41K02k80K8K02j35
8045F4n50P39o01N42n10L83L00M36q61K67j63j66k73J08O69q2l22k75j87L45J29
8066hk11R29l20m38k53N28J35o59P01q54O87O49r29m14J137m49J07j39j47n24
8086d72J3J004m83k8k98K90q8L52m52M0J52j20L1nK60j95o0J95n98K70L31k49
8108a10K43k01J79j8k46L24k01l1l0K1p6K05mj15N8m8J60r0l01J97Ok75N93k30
8132A0M4m7J97j41k99R8M46k66Q0o8j11K61m72K36r5m8L76K3k76K17j92J05m0
$$ plain form
8155 38 125 -52 21 38 283 178 49 21 329 198 45 -386 -160 -103 20 -230 -391 104 -113 67 -191 -276
8177 -276 -23 -25 67 -10 -257 289 100 137 149 130 95 -313 271 -150
$$ packed form
8155C8Q7j77P3J7K45j05j29k8L08j31j53m31K26N7J23k50j61M95k17J80k58q5
8177b76K53kR2p7k47N46j89L7J2j9l5m08N84m21
8191a50
$$ Imaginary data points
##PAGE= N=2
##DATA TABLE= (X++(I..I)), XYDATA
$$ plain form
0 0 0 0 0 0 8 -4 8 -8 16 -16 16 -24 32 -40 48 -56 65 -80 96 -112 129 -152 176 -201 232 -265 303 -343
28 -343 390 -439 495 -556 622 -696 777 -865 963 -1070 1187 -1316 1458 -1612 1784 -1977
44 -1977 2191 -2431 2702 -3008 3364 -3775 4261 -4849 5569 -6484 7678 -9321 11734 -15629
58 -15629 22965 -41647 189722 284331 -151872 -80426 111060 -56 -209482 -25705 159888
69 159888 37791 -118668 -8685 64348 -13334 -26692 67359 25622 -65165 -16491 59465
80 59465 -15404 -51733 52554 78791 -61975 -99806 28788 72426 -28690 -43569 49839
91 49839 57766 -35018 -57521 7398 43939 15734 -18618 -21594 3695 14539 -14594 -31974 17165
104 17165 57893 7162 -52528 -17889 36822 12597 -26722 -1030 27434 735 -28379 -15741
$$ packed form
0@%%%%Qj2J2j6K4l2L2m0N6p2Q8j04J21j45J76k08K41k81L28l77M33m97N68o46
28c43P33q29R34j051J178j318J473j642J828k033K257k503K774l070L396l761
44a977M168m622N133n710O372p139Q036r110J0418j2053J4162j6999K1055k7363
58a5629L8594o4612K31369R4609m36203P1446J91486j11116k09426J83777J85593
69A59888j22097j56459J09983P3033p7682j3358R4051m1737r0787M8674P5956
80E9465p4869l6329J04287K6237j40766l7831J28594M3638j01116j4879R3408
91D9839P927r2784k2503O4919L6541k8205l4352k976K5289J0844k9133j7380M9139
104A7165M0728n0731n9690L4639N4711k4225l9319K5692K8464k6699k9114J2638
$$ plain form
116 -15741 5899 16184 20660 827 -26654 -8873 27503 4117 -36448 -38 50820 3786
128 3786 -61344 -18146 50792 15691 -42136 -6358 41503 4011 -38235 -8261 25141 8553
140 8553 -6579 -1059 -8192 -11360 10515 11102 -17679 -7924 31797 12463 -42126 -22744 42348
153 42348 28326 -36425 -25681 35845 21815 -39479 -26249 36022 31193 -25295 -28683 14723
165 14723 20088 -10379 -14593 7448 13462 -831 -10571 -8066 2335 11366 6495 -9068 -11015 6921
179 6921 13306 -5760 -18742 2559 24677 4181 -27599 -11831 26850 16502 -25299 -18257 26011
192 26011 23067 -24299 -27885 18957 29789 -12260 -28148 7805 24202 -4997 -22107 1525
204 1525 19579 3191 -13210 -7731 5008 9087 2618 -7310 -7859 7532 12257 -7238 -17554 4894
$$ packed form
116a5741K1640J0285M476j9833k7481J7781L6376k3386m0565L6410N0858m7034
128C786o5130M3198O8938l5101n7827L5778M7861l7492m2246K9974L3402j6588
140H553j5132N520p133l168K1875N87k8781R755L9721j9334n4589J9382O5092
153D2348j4022o4751J0744O1526j4030o1294J3230O2271m829n6488l388M3406
165A4723N365l0467m214K2041O014j4293r740K505J0401R031m871j5563j947J7936
179F921O385j9066j2982K1301K2118k0496l1780J5768L8681j0348m1801P042M4268
192B6011k944m7366l586M6842J0832m2049j5888L5953J6397k9199j7110K3632
204A525J8054j6388j6401N479J2739M079o469r928n49J5391M725j9495j0316K2448
$$ plain form
218 4894 21366 -702 -22302 -3462 21466 6695 -19224 -9036 17029 13345 -12905 -15938 8089
231 8089 17234 -2226 -16570 -2140 15427 6278 -14438 -10898 11813 14372 -7786 -16308 3602
244 3602 16418 461 -16046 -3431 15092 6605 -13159 -9768 8967 11944 -4933 -12779 1017
257 1017 12436 2703 -11447 -5669 9786 8328 -7446 -10134 4172 11261 -411 -10327 -2964 9392
271 9392 6638 -7872 -10238 5136 12812 -2679 -13882 -74 15102 3787 -15243 -6836 15056
284 15056 9722 -13280 -12385 10961 12741 -8985 -13216 6259 12128 -4399 -11181 1199 9137 1309
298 1309 -6391 -3218 3518 4454 -344 -4714 -2504 4328 4252 -4427 -7027 2877 9039 -1330 -10353 -1051
314 -1051 11105 3056 -11515 -5097 11017 7138 -9445 -8671 7879 10299 -5859 -10583 3497 10940
$$ packed form
218D894J6472k2068k1600J8840K4928j4771k5919J0188K6065l684k6250l033K4027
231H089R145j9460j4344J4430J7567r149k0716L540K2711K559k2158q522J9910
244C602J2816j5957j6507J2615J8523q487j9764L391J8735K977j6877p846J3796
257A017J1419r733j4150N778J5455j458j5774k688J4306P089j1672r916P363J2356
271I392k754j4510k366J5374P676j5491j1203J3808J5176j1315j9030Q407K1892
284A5056n334k3002Q95K3346J780k1726m231J9475N869j6527o782J2380P938p828
298A309p700L173O736R36m798m370K210O832p6q679k600R904O162j0369r023R302
314a051J2156q049j4571O418J6114l879j6583P74J6550K420j6158m724J4080P443
$$ plain form
328 10940 -1061 -11236 -1506 9777 3525 -8309 -4792 6669 5738 -4757 -6804 2557 6732 225
342 225 -6110 -2149 5447 4029 -3989 -5128 1788 6326 -111 -6494 -1564 6664 3645 -5597 -5098 4493
358 4493 7219 -2221 -7892 577 8159 1450 -8144 -3245 7747 5407 -6255 -6800 5012 8032 -2710
373 -2710 -8407 1091 9291 999 -7954 -2257 7509 3281 -6229 -3936 4404 5415 -3545 -5172 1032
388 1032 5303 955 -3719 -1827 3861 3638 -1674 -3306 65 3709 1620 -3561 -3238 3189 4727 -2351
404 -2351 -6089 1391 6884 -100 -6932 -1267 6992 2636 -6554 -3836 6275 4748 -5330 -5520 4397
419 4397 6177 -3135 -6112 1946 5582 -1224 -4796 -154 3816 750 -2916 -1316 2120 1596 -803
434 -803 -1967 -430 909 1429 -190 -2667 -729 2900 1392 -3242 -2159 3021 3180 -2885 -3710 2291
$$ packed form
328A0940j2001j0175R730J1283o252j1834L517J1461r31j0495k047R361M175o507
342B25o335L961P596j418q018j139O916M538o437o383M930Q228l019r242M99R591
358D493K726r440n671Q469P582o709r594M899J0992k340j1662n45J1812L020j0742
373b710n697R498Q200q292q953N697R766m228r510K293Q340J011q960j627O204
388A032M271m348m674J892N688k23n312j632L371L644k089n181L23O427J538p078
404b351l738P480N493o984o832N665Q259m356r190K718J0111j527j0078j90R917
419D397J780r312k977Q058L636o806l572M642L970l066l666J600L436n24k399
434h03j164J537J339N20j619k477J938L629j508m634J083N180J59o065q25O001
$$ plain form
450 2291 4356 -1425 -4813 801 4877 -23 -4489 -563 4750 1275 -4325 -1720 3708 2453 -3072
465 -3072 -2773 2357 2465 -1833 -2432 955 1805 -536 -1520 175 878 93 -877 -957 -17 329 784 -365
483 -365 -965 -216 1500 470 -1673 -749 1678 1020 -2245 -1566 1846 1819 -2222 -2535 1499 2291 -1142 -2537
501 -2537 489 2831 -494 -3094 486 3261 -344 -2698 -158 2419 383 -1532 -3 1371 -43
516 -43 -930 -73 823 33 -514 -32 421 -604 -537 904 193 -1591 -584 1643 477 -1745 -524 1549
534 1549 169 -2094 -458 2307 1237 -1887 -1137 1945 1589 -1152 -1672 1340 1569 -1293 -1749 1616
550 1616 1542 -665 -2094 312 1414 119 -748 404 1103 -524 159 -60 386 -361 -212 438 149 -278
568 -278 755 1177 149 -1429 103 1538 376 -1530 -83 1072 252 -1833 -772 1804 1172 -1731
$$ packed form
450B291K065n781l388N614M076m900m466L926N313l475n600K605N428j255n525
465c072K99N130J08m298n99L387Q50k341r84J695P03p85r70q0R40L46M55j149
483c65o00P49J716j030k143R24K427o58l265O79L412k7m041l13M034P92l433j395
501b537L026K342l325k600L580K775l605k354K540K577k036j915J529J374j414
516d3q87Q57Q96p90n47M82M53j025O7J441p11j784J007K227j166k222J221K073
534A549j380k263J636K765j070l124P50L082l56k741n20L012K29k862m56L365
550A616p4k207j429K406J102j295q67J152O99j627O83k19M46p47J49O50k89m27
568b78J033M22j028j578J532J435j162j906J447J155q20k085J061K576o32k903
$$ plain form
584 -1731 -1197 1890 1963 -1062 -1868 1097 1320 -1266 -1418 1525 1195 -977 -1541 784 1191 -423 -1080 536
602 536 336 -649 -423 1158 230 -1580 248 1014 -150 -1150 -21 2111 -1122 -1666 569 2119 -439
619 -439 -1768 351 1430 674 -2565 -663 1207 -515 -1455 632 1534 -261 -1084 -819 1571 -23 -940
636 -940 -497 598 181 -1739 355 582 -261 -496 -15 1132 -618 -918 878 648 -827 -1328 615 2003
654 2003 765 -1113 194 1359 -1338 -1320 1345 1375 -1646 -1512 704 1933 -148 -1515 -208 970
670 970 -83 -1405 -362 458 -10 -1092 123 338 -59 -332 290 447 139 -482 0 1233 -931 -361
688 -361 131 197 -214 -1391 553 958 -608 -1738 447 1678 -534 -1611 726 1579 -191 -1962 456
705 456 807 -805 -1008 1221 1035 -716 -951 541 1363 -249 -632 1179 844 -862 34 1118 1203 53
$$ packed form
584a731N34L087P3l025q06K965K23k586j52K943l30k172n64K325M07j614o57J616
602E36k00r85K26J581r28j810J828P66j164j000J129K132l233n44K235J550k558
619d39j329K119J079p56l239J902J870j722r40K087R02j795q23K65K390j594r17
636i40M43J095m17j920K094K27q43k35M81J147j750l00J796k30j475n01J943J388
654B003j238j878J307J165k697J8K665L0l021J34K216J229k081j367J307J178
670I70j053j322J043Q20m68j082J215K15l97k73O22J57l08o21M82J233k164N70
688c61M92O6m11j177J944M05j566j130K185J231k212j077K337Q53j770j771K418
705D56L51j612k03K229j86j751k35J492Q22j612l83J811l35j706Q96J084Q5j150
$$ plain form
723 53 54 1032 76 -273 198 983 433 -761 471 681 42 -560 -918 1439 678 -1659 -291 1070 456
742 456 -1133 -271 883 256 -1000 -736 718 364 -989 -443 584 1033 -373 -214 221 417 -407 -682
760 -682 109 278 -107 -147 470 76 -694 263 121 -844 -52 755 429 -82 -458 338 592 240 -1057 416
780 416 100 -604 -1294 1060 1113 400 -811 -77 702 236 -1150 -217 365 -67 -990 -631 1347 485 -753
799 -753 -811 801 562 -880 -210 237 -633 -1021 -544 83 315 -1166 49 1104 201 -621 621 647 -355
818 -355 -806 219 1195 -432 -1132 340 494 -672 -1118 581 633 -265 -1303 838 1514 -126 -606 -323
836 -323 755 -358 -1004 730 628 -570 -246 -86 135 -270 494 -62 127 -411 -280 904 472 -511 -7
855 -7 440 -40 -437 -532 162 469 -216 -780 -47 450 -575 -162 57 650 -755 -754 381 122 -415 -221 340
$$ packed form
723E3JR78r56l49M71P85n50j194J232K10o39o02l58K357p61k337J368J361o14
742D56j589Q62J154o27j256K64J454l54j353N46J027M49j406J59M35J96q24k75
760f82P91J69l85m0O17l94p70R57j42r65P92Q07l26n11l76P96K54l52j297J473
780D16l16p04o90K354N3p13j211P34P79m66j386R33N82m32r23L59J978q62j238
799g53n8J612k39j442O70M47q70l88M77O27K32j481J215J055r03q22J242K6j002
818c55m51J025R76j627p00J472J54j166m46J699N2q98j038K141O76j640m80K83
836c23J078j113o46J734j02j198L24J60K21m05P64n56J89n38J31J184m32r83N04
855gM47m80l97r5O94L07o85n64P33M97j025M13K19N93j405JJ135k59n37J94N61
$$ plain form
876 340 416 -1226 -227 -405 -18 -529 -366 421 300 -455 28 25 -25 -1493 -34 850 169 -11 -196 528 443
897 443 -786 -685 57 520 -459 -1045 589 470 -681 -744 118 316 -938 -345 798 630 -226 -1330 674
916 674 1282 -1217 -644 661 524 -370 -991 188 579 -211 205 558 14 -224 273 771 -512 -1097 673
935 673 792 81 -581 304 1505 -261 -965 459 -70 -49 -1491 -68 1176 62 -1566 -582 605 252
953 252 -1706 -719 630 981 -895 144 715 70 -44 -611 120 845 25 -606 -114 133 546 201 216
972 216 -507 196 95 -25 -263 -529 815 24 -577 26 639 785 -622 -207 183 415 -290 -810 893
991 893 896 -836 -782 279 813 -558 -1390 -189 178 510 -690 -517 986 554 -271 -887 977 1151 -86
1010 -86 -676 -114 395 216 271 284 -433 -305 956 -304 218 954 614 -144 -920 -377 627 181 -792 -549
$$ packed form
876C40P6j642R99j78L87n11J63P87j21p55M83ln0j468J459Q84o81j80j85P24q5
897D43j229J01P42M63r79n86J634j19j151o3Q62J98j254N93J143j68q56j104K004
916F74O08k499N73J305j37q94o21J179L91p90M16L53n44k38M97M98j283n85J770
935F73J19p11o62Q85J201j766p04J424n29K1j442J423J244j114j628R84J187l53
953B52j958R87J349L51j876J039N71o45j14n67P31P25q20o31M92K47M13l45J5
972B16p23P03j01j20k38k66J344p91o01O03O13J46j407M15L90K32p05n20J703
991H93Lj732N4J061N34j371q32J201L67L32j200J73J503m32q25o16J864J74j237
1010h6n90N62N09j79N5J3p17J28J261j260N22P36l40p58p76N43J004m46r73K43
$$ plain form
1030 -549 540 490 -837 -869 513 -77 -588 -790 -101 1078 -174 -858 -615 -214 -184 -1047 676 451 92
1049 92 -640 -459 -27 -50 -21 -519 -342 553 -61 -392 445 99 692 213 -322 420 375 222 -724 601 461
1070 461 409 -358 -652 608 1415 -371 -936 103 726 66 71 -146 1428 1016 -1177 -272 715 442 -472
1089 -472 -846 -305 429 -179 257 807 -32 -764 -1183 -342 40 1044 94 -403 -550 90 102 -210 -199 76
1109 76 449 -104 26 201 248 -467 -512 -291 821 232 -474 -941 329 1324 -126 -32 80 871 73 -873
1129 -873 -113 476 353 -447 -778 634 44 11 -860 -92 761 43 -268 -266 377 -919 -153 -177 -1062 -271 568
1150 568 -654 -554 -314 809 98 -541 -503 -185 463 -1056 148 874 758 -47 -896 -261 272 -825 -919
1169 -919 849 900 -648 -471 720 463 -372 -929 -82 599 187 -716 -129 99 340 -687 -134 -350 -206
$$ packed form
1030e49J089n0j327l2J382n90n11k02O89J179j252o84K43M01L0q63J723k25l59
1049I2p32J81M32k3K9m98J77Q95o14l31Q37l46N93m79n35P42m5j53r46J325j40
1070D61n2p67k94J260Q07j786n65J039O23o60Nk17J574m12k193R05R87k73r14
1089d72l74N41P34o08M36N50q39p32m19Q41L82J004r50m97j47O40J2l12J1K75
1109G6L73n53J30J75M7p15m5K21J112n89p06m67J270R95j450R4J12P91p98r46
1129h73P60N89j23q00l31J412n90l3q71P68Q53p18l11KO43j296P66k4q85P91Q39
1150E68j222J00K40J123p11o39L8L18O48j519J204P26j16q05q49O35N33j097r4
1169i19J768N1j548J77J191k57q35n57Q47O81m12r03N87K28K41j027N53k16J44
$$ plain form
1188 -206 -542 685 -190 651 -239 592 -409 -612 967 742 342 -1156 311 333 -735 -34 340 606
1206 606 -381 -165 79 640 492 -352 -95 228 1311 17 -1021 167 -489 -423 -92 -431 991 -387
1224 -387 458 176 79 -61 257 50 516 27 -161 409 492 526 -224 -319 -184 160 572 96 -666 85 117 -112
1246 -112 -553 -154 481 134 -827 -770 -86 428 55 -716 12 962 962 -577 30 289 105 -690 -993 516
1266 516 214 -324 -56 603 1107 -138 -360 240 -237 164 308 75 508 742 258 476 558 -12 292 -209
1286 -209 -376 -317 1251 -157 64 277 523 -214 -557 -613 702 805 114 133 14 521 -421 -1028 -32 506
1306 506 -94 -1505 89 635 704 371 414 268 -22 -481 183 953 -31 70 -171 295 801 453 364 -451
1326 -451 187 -151 436 591 -381 182 -41 -241 -139 159 407 -79 -486 542 547 -237 -112 -79 337 -87 -817
$$ packed form
1188b06l36J227q75Q41q90Q31j001k03J579k25m00j498J467K2j068P01L74K66
1206F06r87K16K44N61j48q44K57L23J083j294j038J188o56O6L31l39J422j378
1224c87Q45k82r7j40L18k07M66m89j88N70Q3L4p50r5J35L44M12m76p62P51L2k29
1246a12m41L99O35l47r61N7O84N14l73p71P28R50%j539O07K59j84p95l03J509
1266E16l02n38K68O59N04j245k22O00m77M01J44k33M33K34m84K18Q2n70L04n01
1286b09j67N9J568j408K21K13K46p37l43n6J315J03o91J9j19N07r42o07R96N38
1306E06o00j411J594N46O9l33M3j46k90m59O64P70r84J01k41M66N06l48q9q15
1326d51O38l38N87J55r72N63k23k00J02K98K48m86m07J028Np84J25L3M16m24p30
$$ plain form
1347 -817 -344 402 228 -962 -650 804 -215 -118 170 -276 -49 4 -248 92 28 92 -184 -342 -598 454
1367 454 -231 -108 -535 -151 -359 514 96 -521 569 680 685 -154 -93 645 85 -689 -350 417 -48 -786 -564
1388 -564 -84 343 500 -437 15 -524 -1280 -893 663 364 -489 -20 -510 162 198 -134 55 7 -185 -45
1408 -45 571 -1046 -367 212 -59 -292 -362 -243 706 608 -948 580 723 -73 383 -330 -40 27 201 576
1428 576 613 -713 -1084 52 767 586 -58 -836 -1203 548 138 794 -669 -267 -237 -641 -766 72 229
1447 229 -200 -563 -6 108 497 503 -1215 -559 365 173 427 -214 457 302 -514 89 483 316 28 506
1467 506 -116 -269 88 -300 -77 -620 -416 -437 -610 427 -440 -916 -303 469 -355 -189 -23 215 75 -82
1487 -82 -241 431 207 -94 -669 -579 7 845 -477 -285 -319 359 368 -123 224 -245 102 591 63 -723 248
$$ packed form
1347h17M73P46j74j190L12J454j019R7K88m46K27N3k52L40o4O4k76j58k56J052
1367D54o85J23m27L84k08Q73m18o17J090J11Nq39O1P38n60p74L39P67m65p38K22
1388e64M80M27J57r37M52n39p56L87J556k99q53M69m90O72L6l32J89m8j92J40
1408d5O16j617O79N79k71k33p0J19R49r8j556J528J43p96M56p13K90O7J74L75
1428E76L7j326l71J136P15j81o44p78l67J751m10O56j463M02L0m04j25Q38J57
1447B29m29l63N57J14L89Oj718O56R24j92K54o41O71j55q16O03L94j67k88M78
1467E06o22j53L57l88K23n43K04k1j73J037q67m76O13P72q24J66J66K38j40j57
1487h2j59O72k24l01n75R0N86Q38j322J92l4O78Rm91L47m69L47M89n28p86R71
$$ plain form
1508 248 956 -606 55 1180 -372 -1068 -613 969 -102 -1590 -811 514 199 -929 -835 112 322 -242
1526 -242 -849 91 840 -1426 -1311 0 -595 298 -526 -64 -812 -400 -59 88 620 -1679 867 791 488
1545 488 -369 873 297 -122 -594 736 -107 -232 514 -95 -19 210 -399 46 1033 428 -320 -851 647
1564 647 346 -610 -963 236 674 643 -620 290 137 1054 -276 170 869 121 -103 -1001 740 -517 133
1583 133 -640 -398 -488 427 598 -242 -229 -471 -145 -1187 367 900 373 -131 -626 -283 -471 614 -611
1602 -611 544 158 -402 -1651 -836 1082 7 -307 -300 409 418 -613 -658 100 -659 -843 -1226 -281 651 807
1622 807 329 -899 169 -22 -1036 427 -12 223 648 -344 -901 -12 -242 86 181 538 521 -894 -1497
1641 -1497 523 873 459 -542 -904 491 1018 -411 -586 119 479 265 -903 271 816 -3 -657 -960
$$ packed form
1508B48P08j562O61J125j552o96M55J582j071j488P79J325l15j128R4R47K10n64
1526b42o07R40P49k266J15J311n95Q93q24M62p48M12L41J47N32k299K546p6l03
1545D88q57J242n76m19m72J330q43j25P46o09P6K29o09M45R87o05p48n31J498
1564F47l01r56l53J199M38l1j263R10j53R17j330M46O99p48k24q98J741j257O50
1583A33p73K42r0R15J71q40J3k42L26j042J554N33n27n04m95L43j88J085j225
1602f11J155l86n60j249Q15J918j075l14PP09Rj031m5P58p59j84l83R45R32J56
1622H07m78j228J068j91j014J463m39K35M25r92n57Q89k30L28R5L57j7j415o03
1641a497K020L50m14j001l62J395N27j429j75P05L60k14j168J174N45q19o54l03
$$ plain form
1659 -960 0 11 -1263 -274 371 435 -424 -1520 -319 730 484 -128 -977 1091 711 516 -533 262 544
1678 544 0 -556 -308 991 377 -507 -1531 -279 1816 -494 -821 -643 993 935 -1311 -651 999 782
1696 782 -1250 -527 555 1390 -19 -1654 370 810 -137 -1365 40 1208 832 -382 -990 662 996
1713 996 -900 -845 157 517 838 -241 -744 1401 405 -903 -484 -758 2368 407 -926 -1396 974
1730 974 829 -559 -1357 -864 1758 -716 -2035 360 1687 497 -377 -329 1243 1184 -807 -1002 947
1747 947 1615 -471 -748 267 695 -765 -555 -40 993 587 -1423 -1147 -132 982 -187 -1364 -532
1764 -532 758 1332 -303 -1300 768 1607 -295 -1162 -493 1631 1270 -540 -1972 859 1560 -586 -1006
1781 -1006 -677 1094 -327 -1204 -245 1176 415 -1176 -430 1465 1295 -992 -945 81 1207 836 -880
$$ packed form
1659i60R60J1j274R89O45O4q59j096J201J049k46o12q49K068l80j95j049P95K82
1678E44n44n56K48J299o14q84j024J252K095k310l27J78J636n8k246O60J650k17
1696G82k032P23J082Q35j409j635K024M40r47j228J405J168l76j214o08J652L34
1713I96j896N5J002L60L21j079n03K145r96j308M19k74L126j961j333m70K370
1730I74j45j388p98M93K622k474j319K395J327j190q74M8J572n9j991j95J949
1747I47O68k086k77J015M28j460K10N15J033m06k010K76J015J114j169j177Q32
1764e32J290N74j635r97K068Q39j902q67O69K124l61j810j432K831P01k146m20
1781a006L29J771j421q77R59J421p61j591P46J895j70k287M7J026J126l71j716
$$ plain form
1798 -880 466 150 426 -1674 -1341 276 1165 -9 -1025 30 1114 522 -1387 -1566 146 1553 -630
1815 -630 -1170 913 1631 558 -758 -611 1049 216 -536 -1201 795 1203 -1171 -534 114 873 -387 -1034
1833 -1034 585 1526 648 -668 -309 761 910 -346 -717 107 441 257 -1437 -505 240 631 -1082 -650
1851 -650 58 1476 -229 -1305 -963 1251 688 -1503 -692 830 2133 -513 -667 505 1070 240 -1849
1868 -1849 -294 1485 1255 -1390 -763 1701 1715 23 -1374 -23 1927 72 -1313 -207 -205 750 -517
1885 -517 604 1120 649 -56 -983 -339 1102 14 -679 -648 1290 893 -1149 -914 1064 1734 530 -1411
1903 -1411 372 1552 1486 -656 -1876 951 1823 -383 -1880 1111 1541 -633 -1832 -201 1766 1539
1919 1539 -1572 -1126 1311 1271 -1962 -2004 -440 1190 460 37 -169 723 318 -416 -391 240 1359 119
$$ packed form
1798h80J346l16K76k100L33J617Q89j174j016J055J084n92j909j79J712J407k183
1815f30n40K083P18j073j316J47J660q33p52o65J996M08k374O37O48P59j260o47
1833a034J619R41q78j316L59J070J49j256l71Q24L34j84j694R32P45L91j713M32
1851f50P08J418j705j076L42K214n63k191Q11J522J303k646j54J172N65q30k089
1868a849J555J779k30k645O27K464J4j692j397J351J950j855j385J106KR55j267
1885e17J121N16m71p05r27O44J441j088o93L1J938l97k042K35J978O70j204j941
1903a411J783J180o6k142j220K827Q72k206j497K991M30k174j199J631J967k27
1919A539l111M46K437m0l233m2J564J630p30m23k06Q92m05p34K5O31J119j240
$$ plain form
1937 119 -1723 -576 1130 1625 -482 -1387 1753 916 -1667 -943 990 647 895 -1879 -76 2206 -185
1954 -185 -1185 -1129 727 1497 -1058 -1181 -280 1006 -746 -1552 147 1209 664 -883 -1166 1044 1482
1971 1482 -670 -1358 -302 463 610 -1573 -854 1370 554 -888 -739 705 271 243 -1070 132 2110
1988 2110 536 -376 -1299 264 1907 -990 -1868 -340 882 -472 -872 -633 1240 1285 -1001 -818 425
2005 425 429 -76 -1595 -653 1484 -366 -1017 -379 1658 -8 -1057 -619 1151 1168 -440 -1044 453 2093
2023 2093 87 -1819 -775 -81 1968 -864 -1135 413 1148 -71 -1804 -255 837 628 -1823 -1030
2039 -1030 559 929 -1224 -1346 142 1579 341 -1595 -416 1005 1146 -791 -806 914 1741 -700
2055 -700 -1735 -234 1341 734 -1136 -282 1237 539 -1483 -486 230 1277 -196 -1012 -307 1313 707
$$ packed form
1937A19j842J147J706M95k107r05L140q37k583P24J933l43K48k774J803K282k391
1954a85j000N6J856P70k555j23R01J286j752q06J699J062n45j547k83K210M38
1971A482k152o88J056P65J47k183P19K224q16j442J49J444m34k8j313J202J978
1988B110j574r12r23J563J643k897q78J528J222j354m00K39J873M5k286J83J243
2005D25Mn05j519R42K137j850o51O38K037j666j049M38J770J7j608o04J497J640
2023B093k006j906J044O94K049k832k71J548P35j219j733J549J092k09k451P93
2039a030J589L70k153j22J488J437j238j936J179J421J41j937j5J720Q27k441
2055g00j035J501J575o07j870Q54J519o98k022R97P16J047j473q16P05J620o06
$$ plain form
2072 707 -1384 -1246 681 1299 -253 -882 274 839 -332 -1520 94 1087 161 -1047 -993 800 1064
2089 1064 -1066 -1708 173 1164 -297 -1634 -1272 660 922 -633 93 360 1060 -14 -895 -764 913
2106 913 190 -596 -784 710 101 -1389 -773 611 1743 32 -800 -614 1229 889 -1245 -137 907
2123 907 1245 -319 -1036 -169 819 937 -1546 -70 -184 605 -1113 -1190 1063 687 237 -766 39 586
2141 586 179 -998 -664 429 753 -1290 -142 968 471 -644 -1045 309 528 -203 -745 -1324 513
2158 513 1016 259 -490 544 418 690 -1402 -721 398 343 -550 -261 1566 392 -53 -1011 505 1126
2176 1126 -1063 -668 -530 558 1238 -501 -222 -522 1203 -434 -1179 -53 968 231 129 -587 366
2193 366 580 288 -1182 -112 389 -494 153 -490 1418 554 -433 -149 -657 -154 152 -947 337 843
$$ packed form
2072G07k091J38J927O18j552o29J156N65j171j188J614R93r26j208N4J793K64
2089A064k130o42J881R91j461j337L62J932K62j555P26K67P00j074q81J31J677
2106I13p23p86j88J494o09j490O16J384J132j711q32J86J843l40k134J108J044
2123I07L38j564p17Q67R88J18k483J476j14P89j718p7K253l76m50j003Q05N47
2141E86m07j177L34J093L24k043J148J110m97j115m01J354K19p31n42n79J837
2158E13N03p57p49J034j26K72k092O81J119n5q93K89J827j174m45r58J516O21
2176A126k189L95J38J088O80j739K79l00J725j637p45J126J021p37j02p16R53
2193C66K14k92j470J070N01q83O47o43J908q64r87K84n08N03L06j099J284N06
$$ plain form
2211 843 134 -945 -172 748 162 -1099 -303 -247 689 -562 -810 330 2040 286 -1624 203 802 772
2229 772 326 -599 -66 566 181 -26 -335 730 -60 -835 -707 34 645 388 -273 58 1045 551 -304 -960
2249 -960 514 724 -337 -698 264 487 -435 -48 -288 552 -80 -1297 -786 912 491 -595 -182 390
2267 390 277 19 -548 82 532 -185 -410 -382 422 588 -138 -556 -71 385 -341 -394 67 425 590 -352 -662
2288 -662 264 420 -203 -516 -337 343 136 -312 -381 435 355 -205 -247 301 388 -105 -788 26 781 -1 -623
2309 -623 -497 420 288 -778 -291 300 207 124 -391 255 296 188 -129 -289 265 119 -318 -476 239 494 -28
2330 -28 -552 -228 230 -146 -351 -508 205 256 14 -456 156 536 -152 -602 -203 385 488 -248 -437 -27 321
2351 321 122 -734 83 128 56 -163 -493 400 231 -38 -229 117 475 -251 78 40 218 49 -294 -172 243
$$ packed form
2211H43p09j079P73R20n86j261P96N6R36j251k48J140J710j754j910J827N99l0
2229G72m46r25N33O32l85k07l09J065p90p75J28P41O11k57o61L31R87m94q55o56
2249i60J474K10j061l61R62K23r22L87k40Q40o32j217N11J698m21j086M13N72
2267C90j13k58n67O30M50p17k25K8Q04J66p26m18M85M56p26n3M61L58J65r42l10
2288f62R26J56o23l13J79O80k07m48o9Q16q0n60m2N48Q7m93o83Q14P55p82o22
2309f23J26R17j32j066M87N91r3q3n15O46M1j08l17j60N54j46m37j58P15K55n22
2330b8n24L24M58l76k05j57P13N1k42m70O12L80o88m50L99N88J03p36j89M10L48
2351C21j99q56Q17M5p2k19l30Q93j69k69j91L46L58p26L29l8J78j69l43J22M15
$$ plain form
2372 243 537 238 -18 312 300 -260 -455 -154 8 39 -31 -624 49 122 -141 -191 -293 161 260 -90 -490 30
2394 30 191 -19 -305 -111 311 -68 -388 -15 548 213 -358 -195 125 177 49 -97 -114 402 -244 -341 205
2415 205 238 -58 69 -7 119 97 173 -412 40 320 59 -28 -17 236 222 -218 -221 467 278 -5 -241 127 361
2438 361 143 -33 -105 26 58 33 -65 210 143 -35 -112 281 224 -50 -118 17 52 112 -191 126 -16 -215 162
2461 162 46 -155 -21 186 -283 -196 113 158 110 -471 144 107 1 -128 -110 416 301 73 -182 157 471 -41
2483 -41 -241 -193 -47 51 -361 -56 22 -7 -162 -103 82 235 -77 -37 65 406 -161 -99 -163 85 -35 128 -206
2506 -206 148 -56 34 120 124 -80 -392 228 14 -255 42 -137 -150 24 29 131 163 -303 259 38 -157 70 107
2529 107 -87 114 -318 -108 -99 -72 153 -82 197 299 -254 -58 103 -173 329 -143 245 -218 189 -289 -26
$$ packed form
2372B43K94k99k56L30j2n60j95L01J62L1p0n93O73P3k63n0j02M54R9l50m00N20
2394C0J61k10k86J94M22l79l20L73N63l35n71J63L20N2j28j46j7N16o46r7N46
2415B05L3k96J27p6J26k2P6n85M52K80k61q7J1K53j4m40lO88j89k83k36L68K34
2438C61k18j76p2J31L2k5r8K75o7j78p7L93n7k74o8J35L5O0l03L17j42j99L77
2461A62j16k01J34K07m69Q7L09M5m8n81O15l7j06j29J8N26j15k28k55L39L14n12
2483d1k00M8J46R8m12L05P8k9j55N9J85J53l12M0J02L41n67O2o4K48j20J63l34
2506b06L54k04R0Q6Mk04l12O20k14k69K97j79j3J74NJ02L2m66N62k21j95K27L7
2529A07j94K01m32K10RK7K25k35K79J02n53J96J61k76N02m72L88m63M07m78K63
$$ plain form
2550 -26 40 110 18 24 -140 -57 14 174 72 74 166 -93 -108 83 -9 -53 31 -50 371 267 86 -5 163 -57 -5 -177
2576 -177 -337 -246 8 -93 -213 -39 113 303 17 -246 26 -79 -133 248 -62 -140 191 151 15 -81 -247 -242
2598 -242 108 177 -232 77 40 128 -22 181 205 96 -55 117 -68 -131 47 -85 118 60 -198 37 -372 121
2620 121 38 -477 -10 181 78 19 -148 -55 -47 8 77 -88 -160 220 -317 -257 57 -48 41 166 -289 95 276
2643 276 209 152 164 -38 220 87 328 149 -38 71 -479 124 -32 -312 118 -129 -134 61 356 -161 94 -136
2665 -136 78 108 86 204 33 -308 73 -153 2 -64 -209 -55 -161 120 -116 -12 -51 132 234 -241 -328 -32
2687 -32 135 11 -43 -71 214 -117 -471 -189 195 293 -258 -135 -258 181 191 377 -119 13 -126 318 -52 -313
2709 -313 -27 -175 351 511 242 -111 202 77 448 -518 -240 25 189 -149 66 238 234 74 29 -67 133
$$ packed form
2550b6O6P0r2Oj64Q3P1J60j02KR2k59j5J91r2m4Q4q1M21j04j81r1J68k20N2j72
2576a77j60R1K54j01j20J74J52J90k86k63K72j05n4L81l10p8L31m0j36r6j66N
2598b42L50O9m09L09l7Q8j50K03K4j09j51J72j85o3J78j32K03n8k58K35m09M93
2620A21q3n15M67J91j03n9j67R3QN5O9j65p2L80n37O0L14j05Q9J25m55L84J81
2643B76o7n7J2k02K58j33K41j79j87J09n50O03j56k80M30k47nJ95K95n17K55k30
2665a36K14L0k2J18j71l41L81k26J55o6j45J54j06K81k36J04l9J83J02m75q7K96
2687c2J67j24n4k8K85l31l54K82L84R8n51J23j23M39J0J86m96J32j39M44l70k61
2709c13K86j48N26J60k69l53L13j25L71r66K78K65J64l38K15J72mj60m5r6K00
$$ plain form
2730 133 334 247 -72 258 282 -122 126 88 -269 -53 62 -152 39 126 -9 -310 -241 -33 38 -118 -64 -232
2752 -232 188 81 235 239 134 -118 85 -213 26 58 -258 122 -338 -145 -171 -307 51 -182 -15 -142 -17
2773 -17 111 133 259 -143 -132 265 -121 -7 159 58 245 -8 -195 252 194 -42 -65 285 199 124 41 108 91
2796 91 132 -95 256 27 228 -3 -378 319 63 -78 -214 28 -20 -280 -520 -80 -52 -113 -116 -183 3 -177 -109
2819 -109 -10 78 48 -54 -195 11 216 223 -355 142 77 279 -18 -130 0 202 91 119 -172 130 304 70
2841 70 91 -22 138 372 -112 120 69 273 -70 -53 -61 135 -54 -75 -96 83 -111 66 -336 -209 208 306 -133
2864 -133 31 246 -61 -39 -162 -131 -11 -30 -216 -139 268 99 -88 162 66 -306 48 -240 -160 -44 421 43
2886 43 170 333 141 -2 33 73 125 -122 87 85 30 32 -64 -118 -16 222 121 138 29 -34 16 35 254 74 -32
$$ packed form
2730A33K01q7l19L30K4m04K48l8l57K16J15k14J91Q7j35l01O9K08P1j56N4j68
2752b32M20j07J54Mj05k52K03k98K39L2l16L80m60J93k6j36L58k33J67j27J25
2773a7J28K2J26m02J1L97l86J14J66j01J87k53j87M47n8k36k3L50q6p5q3O7j7
2796I1M1k27L51k29K01k31l75O97k56j41j36K42m8k60k40M40K8o1lo7J86j80O8
2819a09R9Q8l0j02j41K06K05Pn78M97o5K02k97j12J30K02j11K8k91L02J74k34
2841G0K1j13J60K34m84K32n1K04l43J7qJ96j89k1k1J79j94J77m02J27M17R8m39
2864a33J64K15l07K2j23L1J20j9j86P7M07j69j87K50r6l72L54k88Q0J16M65l78
2886D3J27J63j92j43L5M0N2k47K09kn5Kr6n4J02K38j01J7j09o3N0J9K19j80j06
$$ plain form
2911 -32 -303 -219 195 36 171 -129 -25 -101 -205 -182 -292 236 17 -155 -137 -79 114 243 -238 -32 376 -30
2933 -30 -285 -271 29 117 -329 257 151 25 -233 -18 198 -277 11 -55 -112 148 91 0 -150 1 113 -73
2955 -73 -69 -196 341 77 -227 -266 297 43 -244 -129 508 285 -147 204 17 -132 355 137 -130 -74 173 266
2977 266 338 806 52 -239 342 411 -623 -110 -605 -82 902 824 -325 -1028 401 1013 186 -1021 221
2996 221 41 1469 -121 599 83 515 -188 -206 -612 16 953 65 -694 629 515 132 -150 595 -41
3015 -41 363 210 91 701 273 -263 43 -260 -244 -508 37 293 -93 612 -623 -133 508 321 -508 -151
3035 -151 -445 171 -582 279 -70 326 50 -101 -78 172 213 -60 180 238 199 129 -529 -90 -145 57 -434 -216
3057 -216 464 -141 -436 -97 -517 93 -408 -417 -103 -372 -253 167 -177 -351 79 -71 -25 -157 320 -85 24
$$ packed form
2911c2k71Q4M14j59J35l00J04p6j04K3j10N28k19j72J8N8J93J29m81K06M08m06
2933c0k55J4L00Q8m46N86j06j26k58K15K16m75K88o6n7K60n7r1j50J51J12j86
2955g3Mj27N37k64l04l9N63k54k87J15O37k23m32L51j87j49M87k18k67N6K47R3
2977B66P2M68p54k91N81O9j034N13m95N23R84p8j149p03J429O12q27j207J242
2996B21j80J428j590P20n16M32p03j8m06O28R37q88p59J323j14l83k82P45o36
3015d1M04j53j19O10m28n36L06l03J6k64N45K56l86P05j235M90O41j87q29L57
3035a51k94O16p53Q61l49L96k76j51K3K50M1k73K40N8l9p0o58M39n5K02m91K18
3057b16O80o05k95L39m20O10n01rL14k69J19M20l44j74M30j50M6j32M77m05J09
$$ plain form
3078 24 -47 293 3 35 -7 195 289 -199 82 16 -99 377 -100 -1 -368 61 -114 -142 48 154 72 -158 -210
3101 -210 159 308 15 176 281 119 -262 129 -170 -46 301 -86 -133 311 -85 19 -156 -153 56 -146 86
3122 86 -96 285 -174 -57 59 -84 26 -40 -7 183 -190 379 309 105 -25 57 219 -2 18 -121 -104 150
3144 150 -4 -180 45 129 -233 -156 337 87 -141 -188 -86 -43 197 -261 104 -121 -110 -52 83 239 235 71 -52
3167 -52 25 3 -210 -317 210 95 -307 -82 397 -211 -287 66 -100 312 -229 -19 153 -170 152 -140 -105 -60
3189 -60 -206 45 -56 7 72 96 -136 54 168 -47 49 -35 -66 395 1 84 -108 -88 204 -181 95 -47 84
3212 84 -111 217 -9 57 -9 -35 156 280 341 407 -97 44 -150 -57 135 260 -109 -150 21 100 -35 -69 59
3235 59 -52 -116 58 -36 -255 -282 85 -171 18 -31 -162 -11 122 78 -14 -100 -50 -39 73 233 -494 88 182 -59
$$ packed form
3078B4p1L40k90L2m2K02R4m88K81o6j15M76m77R9l67M29j75k8J90J06q2k30n2
3101b10L69J49k93J61J05j62l81L91k99J24L47l87m7M44l96J04j75LK09k02K32
3122H6j82L81m59J17J16j43J10o6L3J90l73N69p0k04j30Q2J62k21K0j39J7K54
3144A50j54j76K25Q4l62P7M93k50k28m7J02M3K40m58L65k25J1N8J35J56mj64j23
3167e2P7k2k13j07N27j15m02K25M79o08p6L53j66M12n41K10J72l23L22k92L5M5
3189f0j46K51j01O3O5K4k32J90J14k15R6q4l1M61l94Q3j92K0K92l85K76j42J31
3212H4j95L28k26O6o6k6J91J24O1O6n04J41j94R3J92J25l69m1J71P9j35l4J28
3235E9j11o4J74r4k19k7L67k56J89m9j31J51J33m4r2q6N0J1J12J60p27N82R4k41
$$ [...]
8191g
##END NTUPLES=NMR FID
##END=
