##TITLE=1H_E3e-H-1
 CDCl3
 8 sc, 
 28.11.2024
##JCAMPDX= 6.0         $$ Bruker NMR JCAMP-DX V2.0
##DATA TYPE= NMR FID
##DATA CLASS= NTUPLES
##ORIGIN= UXNMR, Bruker Analytische Messtechnik GmbH
##OWNER= root
$$ XWIN-NMR		Version 3.5
$$ Thu Nov 28 14:15:13 2024 Russian Standard Time (UT+4h)  she@DPX200
##.OBSERVE FREQUENCY= 200.1315
##.OBSERVE NUCLEUS= ^1H
##.DELAY= (6, 6)
##.ACQUISITION MODE= SIMULTANEOUS
##.ACQUISITION SCHEME= undefined
##.AVERAGES= 8
##.DIGITISER RES= 18
##SPECTROMETER/DATA SYSTEM= spect
##.PULSE SEQUENCE= zg30
##.SOLVENT NAME= CD3CN
##.SHIFT REFERENCE= (INTERNAL, CD3CN, 0, 15.7039)
##AUDIT TRAIL= $$ (NUMBER, WHEN, WHO, WHERE, WHAT)
$$ ##TITLE= Audit trail, XWIN-NMR		Version 3.5
$$ ##JCAMPDX= 5.01
$$ ##ORIGIN= Bruker BioSpin GmbH
$$ ##OWNER= she
$$ F:/spectra/data/she/nmr/H-F/1/audita.txt
$$ ##AUDIT TRAIL=  $$ (NUMBER, WHEN, WHO, WHERE, WHAT)
(   1,<2024-11-28 14:14:11.39 +0400>,<she>,<DPX200>,
      <created by zg, POWCHK disabled, PULCHK disabled
       configuration hash MD5:
       00 E9 B6 7A A2 85 ED C7 34 08 36 98 17 FE 4E 26
       data hash MD5: 16K
       19 5C C6 1D 5C A9 A2 8F 8E A0 4B EA 84 FD CC 4F>)
$$ ##END=
$$ 
$$ hash MD5
$$ BD 95 F2 14 76 AF 3D B2 F5 83 FE 19 63 B8 83 9A
##$RELAX= 
##$RELAX= 
##$RELAX= 
##$RELAX= 
##$RELAX= 
##$RELAX= 
$$ Bruker specific parameters
$$ --------------------------
##$DU= <F:/spectra>
##$EXPNO= 1
##$NAME= <H-F>
##$PROCNO= 1
##$TYPE= <nmr>
##$USER= <she>
##$AMP= (0..31)
100 100 100 100 100 100 100 100 100 100 100 100 100 100 100 100 100 100 
100 100 100 100 100 100 100 100 100 100 100 100 100 100 
##$AQSEQ= 0
##$AQ_mod= 1
##$AUNM= <au_zg>
##$AUTOPOS= <>
##$BF1= 200.13
##$BF2= 200.13
##$BF3= 200.13
##$BF4= 200.13
##$BF5= 200.13
##$BF6= 200.13
##$BF7= 200.13
##$BF8= 200.13
##$BYTORDA= 1
##$CFDGTYP= 0
##$CFRGTYP= 5
##$CHEMSTR= <none>
##$CNST= (0..31)
1 1 145 1 1 1 1 1 1 1 1 1 1 1 1 1 1 1 1 1 1 1 1 1 1 1 1 1 1 1 1 1 
##$CPDPRG= <>
##$CPDPRG1= <>
##$CPDPRG2= <>
##$CPDPRG3= <>
##$CPDPRG4= <mlev>
##$CPDPRG5= <mlev>
##$CPDPRG6= <mlev>
##$CPDPRG7= <mlev>
##$CPDPRG8= <mlev>
##$CPDPRGB= <>
##$CPDPRGT= <>
##$D= (0..31)
0 1.2 0 0 0 0 0 0 0 0.06 0 0.03 0 0 0 0 0.0002 0 0 0 0 0 0 0 0 0 0 0 0 
0 0 0 
##$DATE= 1732788850
##$DBL= (0..7)
120 120 120 120 120 120 120 120 
##$DBP= (0..7)
150 150 150 150 150 150 150 150 
##$DBP07= 0
##$DBPNAM0= <>
##$DBPNAM1= <>
##$DBPNAM2= <>
##$DBPNAM3= <>
##$DBPNAM4= <>
##$DBPNAM5= <>
##$DBPNAM6= <>
##$DBPNAM7= <>
##$DBPOAL= (0..7)
0.5 0.5 0.5 0.5 0.5 0.5 0.5 0.5 
##$DBPOFFS= (0..7)
0 0 0 0 0 0 0 0 
##$DE= 6
##$DECBNUC= <off>
##$DECIM= 24
##$DECNUC= <off>
##$DECSTAT= 4
##$DIGMOD= 1
##$DIGTYP= 9
##$DL= (0..7)
0 120 120 120 120 120 120 120 
##$DP= (0..7)
150 150 150 150 150 150 150 150 
##$DP07= 0
##$DPNAME0= <>
##$DPNAME1= <>
##$DPNAME2= <>
##$DPNAME3= <>
##$DPNAME4= <>
##$DPNAME5= <>
##$DPNAME6= <>
##$DPNAME7= <>
##$DPOAL= (0..7)
0.5 0.5 0.5 0.5 0.5 0.5 0.5 0.5 
##$DPOFFS= (0..7)
0 0 0 0 0 0 0 0 
##$DQDMODE= 0
##$DR= 18
##$DS= 0
##$DSLIST= <SSSSSSSSSSSSSSS>
$$ [...]
##$SUBNAM2= <"">
##$SUBNAM3= <"">
##$SUBNAM4= <"">
##$SUBNAM5= <"">
##$SUBNAM6= <"">
##$SUBNAM7= <"">
##$SUBNAM8= <"">
##$SUBNAM9= <"">
##$SW= 24.0689530833862
##$SWIBOX= (0..15)
0 0 2 0 0 0 0 0 0 0 0 0 0 0 0 0 
##$SW_h= 4816.95568400771
##$TD= 16384
##$TD0= 1
##$TE= 0
##$TE2= 300
##$TE3= 300
##$TEG= 300
##$TL= (0..7)
0 120 120 120 120 120 120 120 
##$TP= (0..7)
150 150 150 150 150 150 150 150 
##$TP07= 0
##$TPNAME0= <>
##$TPNAME1= <>
##$TPNAME2= <>
##$TPNAME3= <>
##$TPNAME4= <>
##$TPNAME5= <>
##$TPNAME6= <>
##$TPNAME7= <>
##$TPOAL= (0..7)
0.5 0.5 0.5 0.5 0.5 0.5 0.5 0.5 
##$TPOFFS= (0..7)
0 0 0 0 0 0 0 0 
##$TUNHIN= 0
##$TUNHOUT= 0
##$TUNXOUT= 0
##$USERA1= <user>
##$USERA2= <user>
##$USERA3= <user>
##$USERA4= <user>
##$USERA5= <user>
##$V9= 5
##$VALIST= <valist>
##$VCLIST= <CCCCCCCCCCCCCCC>
##$VD= 0
##$VDLIST= <DDDDDDDDDDDDDDD>
##$VPLIST= <PPPPPPPPPPPPPPP>
##$VTLIST= <TTTTTTTTTTTTTTT>
##$WBST= 1024
##$WBSW= 4
##$XGAIN= (0..3)
0 0 0 0 
##$XL= 0
##$YL= 0
##$YMAX_a= 459285
##$YMIN_a= -371469
##$ZGOPTNS= <>
##$ZL1= 120
##$ZL2= 120
##$ZL3= 120
##$ZL4= 120
##$ABSF1= 10
##$ABSF2= 0
##$ABSG= 5
##$ABSL= 3
##$ALPHA= 0
##$AQORDER= 0
##$ASSFAC= 0
##$ASSFACI= 0
##$ASSFACX= 0
##$ASSWID= 0
##$AUNMP= <proc_1d>
##$AZFE= 0.1
##$AZFW= 0.1
##$BCFW= 1
##$BC_mod= 2
##$BYTORDP= 1
##$COROFFS= 0
##$CY= 11.3945322036743
##$DATMOD= 1
##$DC= 2
##$DFILT= <>
##$DTYPP= 0
##$F1P= 15.6554695791079
##$F2P= 12.8336369535428
##$FCOR= 0.5
##$FTSIZE= 0
##$FT_mod= 4
##$GAMMA= 1
##$GB= 0.15
##$INTBC= 1
##$INTSCL= 1
##$ISEN= 128
##$LB= 0.24
##$LEV0= 0
##$LPBIN= 0
##$MAXI= 10000
##$MC2= 0
##$MEAN= 0
##$ME_mod= 0
##$MI= 1.114404
##$NCOEF= 0
##$NC_proc= 0
##$NLEV= 6
##$NOISF1= 3.799351
##$NOISF2= 2.8
##$NSP= 1
##$NTH_PI= 0
##$NZP= 0
##$OFFSET= 15.70392
##$PC= 1
##$PHC0= -26738.86
##$PHC1= 37.58745
##$PH_mod= 1
##$PKNL= yes
##$PPARMOD= 0
##$PSCAL= 0
##$PSIGN= 0
##$REVERSE= no
##$SF= 200.130013532006
##$SI= 16384
##$SIGF1= 3
##$SIGF2= 2
##$SINO= 400
##$SIOLD= 16384
##$SREGLST= <1H.CDCl3>
##$SSB= 0
##$STSI= 0
##$STSR= 0
##$SW_p= 3612.71676300578
##$SYMM= 0
##$S_DEV= 0
##$TDeff= 0
##$TDoff= 0
##$TI= <>
##$TILT= no
##$TM1= 0
##$TM2= 0
##$TOPLEV= 0
##$USERP1= <user>
##$USERP2= <user>
##$USERP3= <user>
##$USERP4= <user>
##$USERP5= <user>
##$WDW= 1
##$XDIM= 8192
##$YMAX_p= 0
##$YMIN_p= 0
$$ End of Bruker specific parameters
$$ ---------------------------------
##NTUPLES= NMR FID
##VAR_NAME=  TIME,          FID/REAL,        FID/IMAG
##SYMBOL=    X,             R,               I
##VAR_TYPE=  INDEPENDENT,   DEPENDENT,       DEPENDENT
##VAR_FORM=  AFFN,          ASDF,            ASDF
##VAR_DIM=   8192,          8192,            8192
##UNITS=     SECONDS,       ARBITRARY UNITS, ARBITRARY UNITS
##FACTOR=    0.0002076,     1,               1
##FIRST=     0,             0,               0
##LAST=      1.7004516,     0,               0
##MIN=       0,             -371469,         0
##MAX=       1.7004516,     459285,          0
$$ Real data points
##PAGE= N=1
##DATA TABLE= (X++(R..R)), XYDATA
0 0 0 0 0 0 0 8 0 8 -8 8 -13 11 -16 24 -24 32 -39 47 -56 64 -75 91 -105 122 -138 160 -185 209 -236 269
30 269 -304 344 -384 429 -482 538 -598 667 -738 819 -909 1005 -1112 1231 -1363 1511 -1677
47 -1677 1864 -2075 2319 -2603 2937 -3339 3832 -4452 5261 -6358 7939 -10396 14654 -35872
61 -35872 408616 400395 -97573 -34378 85618 -222467 -371469 82899 341350 89243 -60331
72 -60331 62089 -70745 -289413 -97795 219375 145167 -19274 40586 13680 -203632 -157351
83 -157351 129952 157448 -40598 -21842 99456 -15940 -171381 -64664 94611 75388 18165
94 18165 29589 -7320 -74599 -52514 10938 26927 39287 49527 -2090 -49819 -17015 6926
106 6926 -29086 -11868 63379 52485 -25973 -32531 -4236 -31026 -23250 50135 44112 -31755 -7503
119 -7503 50040 -29494 -103565 6366 104103 13017 -54148 28890 35949 -85267 -74107 72586
131 72586 81794 -29255 -25600 34902 -23929 -79605 8848 76709 10198 -23952 28227 498
143 498 -80710 -28867 77718 41168 -39528 1371 42023 -38216 -76292 23235 80587 8226
155 8226 -38213 3806 11409 -33560 -21896 33990 32938 -5924 -7542 2155 -19738 -23887 16123
168 16123 33235 2485 -13897 933 -1775 -21276 -5903 28060 20631 -17576 -21551 11148 17458
181 17458 -16064 -23305 15966 32532 -5534 -30534 -2817 19307 -464 -11918 6920 10109
193 10109 -9859 -9511 9842 6692 -8932 -4460 6263 -335 -2808 8394 2239 -16611 -4705
206 -4705 21808 6483 -25847 -7841 29276 12431 -26836 -17181 17437 13919 -8010 -4346 6476
219 6476 -1826 -10938 -1074 10153 4961 -4105 -4173 -364 630 -361 -2044 -2219 3335 8952 655 -14002
235 -14002 -10463 9442 15265 -1588 -13331 -2347 10117 1768 -11037 -3589 12236 5880 -10123
248 -10123 -5259 7958 1052 -9957 1044 12780 1638 -10977 -5149 4489 3925 1116 224 -3837
262 -3837 -3037 5592 4801 -7787 -7187 9755 10286 -9215 -10954 8455 9412 -8715 -6912 9972 6299
277 6299 -10189 -5203 9016 4529 -6439 -3595 4091 2740 -1019 -442 -1541 -1838 2910 4240 -3336
292 -3336 -6128 3405 6893 -3328 -7181 3573 7328 -3259 -6947 3091 7288 -1892 -6532 -482
306 -482 5530 2025 -3578 -2362 3449 3250 -2424 -3439 1961 3847 -599 -3373 -725 2398 1165 -1676
322 -1676 -1624 1612 2321 -1489 -3399 -385 3693 2725 -3159 -5033 2166 6249 -1031 -6111 347 5698
338 5698 81 -5130 -330 3782 -112 -3130 -624 2755 848 -2920 -2416 1980 3070 -1031 -3211
353 -3211 -1102 2766 2783 -2045 -4379 759 4942 450 -4943 -1722 3585 2163 -2427 -1328 1458 785
369 785 -1060 -1165 798 1183 -1230 -2126 567 3115 275 -2891 -1834 1791 3302 -464 -3492 -920
385 -920 3524 1897 -2884 -2517 1928 2568 -858 -2088 484 1679 -20 -1380 515 1466 -597 -1868
401 -1868 425 2282 480 -2086 -1141 1066 1965 93 -1935 -1330 1756 2071 -521 -1674 -164 1532
417 1532 420 -1392 -718 1800 938 -1399 -1071 1544 618 -1417 -848 1561 1051 -1215 -1268 619 1832
434 1832 70 -1635 -697 986 1049 -560 -886 52 364 157 -222 -704 -51 296 -338 -631 511 531 -327
453 -327 -484 160 1042 448 -786 -806 996 804 -861 -1069 918 852 -489 -1057 385 739 -122 -915 -361
472 -361 661 566 -970 -449 464 818 -320 -499 190 543 439 -573 -900 282 1175 -279 -571 119 516
491 516 -327 -360 62 349 -118 -679 -721 289 379 -182 -719 173 822 -93 -840 -912 367 694 -301 -992 -82
512 -82 899 -97 -1144 -228 417 14 -278 68 338 53 -397 -126 494 218 -578 -644 8 259 129 -123 -476
533 -476 -632 554 582 -229 -766 315 374 171 -407 138 287 140 -283 143 311 -195 -485 395 747 -716
553 -716 -821 550 705 93 -255 -98 194 209 495 109 129 -470 233 800 69 -557 -238 414 -29 -67 147
574 147 225 -189 -46 347 107 -82 -115 -312 -153 192 62 -47 186 77 149 -137 190 -146 650 551 -231 -660
596 -660 364 280 134 -315 -393 18 272 106 -18 -119 88 -22 -141 141 -73 -203 23 -361 -27 396 121
617 121 -525 -26 581 -243 -291 80 43 -31 -172 -259 151 234 254 -197 -73 51 -237 52 224 -86 -304 -172
639 -172 7 -326 322 230 -787 -496 332 309 -98 36 5 -187 -140 -403 -283 569 -422 -420 174 150 -127 7
661 7 -1 122 -135 -122 73 -299 -237 210 27 -96 -95 113 330 -230 -564 191 391 -119 -253 388 318 -343 104
684 104 517 -129 -579 -340 117 435 -25 -330 134 459 45 -395 72 269 120 27 61 -388 407 233 237 -101
706 -101 209 178 -35 5 326 124 -264 -61 -208 185 -49 -359 -480 -14 470 -165 7 81 21 117 281 -226
728 -226 151 402 -212 -522 282 561 -175 23 -181 489 295 225 34 74 457 -114 -264 446 224 -370 -216
749 -216 303 -69 -77 244 -227 -85 340 135 -179 -297 -178 377 -188 -499 94 188 419 -433 -202 163 -18
770 -18 -585 -174 70 -170 133 -413 -214 150 187 -240 8 38 360 204 -327 -382 45 244 129 -336 -161 105
792 105 24 -76 111 39 140 -249 -428 178 41 -248 128 255 435 -249 -108 328 340 -154 -198 67 99 202
814 202 -69 -76 156 -34 -326 122 190 -18 235 -46 130 72 539 389 -103 72 227 89 -101 -318 49 262
836 262 -141 -230 -14 314 -170 312 -188 375 267 -112 -339 -92 85 201 77 42 197 117 -37 146 308
857 308 -223 -83 28 -243 10 -71 -78 28 87 394 96 -454 -195 190 -260 -286 -59 141 359 -16 -329 340
879 340 -17 -90 -5 120 76 -192 -4 300 427 -2 -60 -95 35 44 72 -43 270 22 -200 -273 -280 33 -21 1 -131
904 -131 205 -119 80 -382 -125 -142 -46 -114 -283 177 -293 -303 -244 405 351 -112 -179 60 -32 53 -171 -237 319 484
928 484 150 -338 134 101 23 -92 85 -30 420 50 -173 108 165 238 -615 -103 105 -124 -45 -620 214 199
950 199 -258 -444 110 139 5 -116 -247 209 184 -198 -438 177 474 -17 162 -126 357 371 -326 105 -51
971 -51 2 -75 -244 67 176 -206 -79 -302 191 59 -176 73 -67 143 220 -151 -401 174 75 -260 31 166
993 166 161 -143 -31 -167 238 -232 -360 4 270 2 -231 82 -123 104 -389 -17 269 224 6 34 -134 299
1015 299 -91 -118 -142 148 458 16 -265 16 359 -157 -164 -76 104 347 -4 -103 58 91 178 -129 -36 365 -246
1038 -246 -408 -72 43 96 -269 -446 112 22 -104 -645 -30 12 134 -344 178 323 -218 -122 -111 61 256 -99
1060 -99 -32 -209 386 30 -146 -173 425 -45 -357 -151 -65 37 -160 -302 -103 208 -259 51 -72 65 92 -16
1082 -16 -365 -87 209 274 -310 -282 52 110 -336 -278 295 273 -191 -198 114 35 133 -241 111 223 49 142 -325 203
1106 203 62 170 17 109 416 -4 -199 -196 136 197 17 -142 -98 61 204 -128 -289 155 37 -56 -329 2
1128 2 -214 -40 -118 108 21 36 -256 42 139 211 321 -70 -167 -46 114 315 -24 87 198 -14 -490 21 59
1151 59 -264 55 -88 118 77 44 -378 150 5 -232 -258 393 397 -21 -205 65 -248 -234 212 -55 -23 71 60
1174 60 -3 -98 9 146 -437 45 -186 -12 158 -28 -64 -67 133 -21 -112 20 -112 -80 -196 70 123 115 111 -33
1198 -33 -26 -6 186 -55 -44 92 23 12 154 -187 -234 42 -116 342 218 -39 -182 161 257 35 -16 -21 -92 -45 -75
1223 -75 -128 -111 159 -211 39 -264 50 -172 -83 68 216 29 121 -117 -9 6 125 -98 266 -228 -224 -87 -229
1246 -229 89 -95 -63 -167 148 232 288 -180 -9 -207 -183 -123 67 -156 109 268 -318 60 -62 121 -99 51
1268 51 -218 -134 2 -275 -132 3 -114 -251 -209 199 47 -316 -88 109 87 -34 83 -119 -327 272 -178
1289 -178 -121 23 215 -126 -308 169 -99 19 23 -238 33 212 -258 -223 108 -48 -113 59 -172 200 71 173
1311 173 -288 121 -62 -122 -365 303 -8 -269 -18 217 -146 225 -214 -6 -50 -281 128 56 -125 -99 96
1332 96 107 -135 -180 -6 280 137 11 12 -103 -7 -70 221 46 16 -48 -177 -3 -216 40 -16 -79 62 -4 138
1356 138 18 -211 6 -56 -214 358 139 -30 -30 241 8 202 -72 186 112 39 139 -391 169 346 61 -133
1378 -133 232 122 -203 51 -55 300 292 -66 -150 228 35 138 326 -28 391 229 79 42 -226 -145 41 34
1400 34 378 -75 -120 -70 116 -347 151 -42 229 223 131 -192 51 -166 -15 78 386 -18 -39 95 -39 155 -164
1423 -164 194 150 -138 31 -130 -111 141 5 108 -100 215 -59 -276 -74 129 -78 114 394 102 62 103
1444 103 6 95 151 -65 -52 -144 119 -296 265 150 -126 -155 -162 191 -58 -187 42 207 -186 -228 55 74 112 269
1468 269 -190 -175 238 -67 57 -135 -358 -289 -168 33 -46 273 46 86 -35 28 -267 -208 -172 -127 -118 -32 -48 213
1492 213 -15 41 132 122 139 134 13 306 84 225 51 -133 89 187 -257 73 121 -81 37 -28 -335 -26 99
1515 99 -189 -30 -160 -76 -57 233 35 303 -186 128 99 210 227 -63 204 3 -222 -305 -102 94 130 36 -145
1538 -145 -313 -152 -493 276 95 115 105 200 -81 -201 -38 -163 -40 130 8 64 2 -16 50 163 -277 -68
1560 -68 165 -311 -38 34 89 -95 -164 -167 -55 -209 122 21 -23 -27 34 77 400 -56 -25 19 98 -245 -54 -229 -137
1585 -137 -63 94 124 -14 -261 -96 8 220 -97 -143 82 45 -36 -44 107 -54 -144 166 -55 -87 -19 -141 -14
1608 -14 -76 45 -110 267 -206 311 -54 -158 538 155 -3 58 263 -31 183 -107 -323 101 -120 -56 320
1629 320 91 173 234 60 -59 23 76 82 90 -92 -188 13 -130 -112 1 -41 -226 -316 110 46 -172 -341 -226 -46
1653 -46 123 19 -152 239 404 -7 -68 -27 -198 -164 109 15 83 184 181 82 -222 -232 -29 275 192 78 300 122
1677 122 -234 -165 70 -47 -62 -82 322 159 -224 -105 -93 119 -388 228 67 -147 -27 -174 -34 -139 246
1698 246 268 43 262 90 93 -184 89 -128 57 -134 -265 56 -220 196 -40 -228 295 15 -5 229 -223
1719 -223 -108 -170 120 -16 104 -240 -157 258 128 173 38 -312 60 28 -83 32 164 297 80 -100 -23 -521
1741 -521 51 -66 -63 101 -23 204 141 130 3 -184 184 -168 350 396 79 196 57 -149 21 182 255 -220
1763 -220 46 -26 9 -16 1 48 -68 -40 317 -66 -14 101 -30 65 -405 -79 271 -167 -92 -153 -68 -30 26 -411
1787 -411 -22 -40 -119 -91 -73 -167 33 -40 162 -98 32 -54 -60 91 -187 -53 -61 -289 212 159 -101 166 -133 148
1811 148 111 78 293 53 -70 -1 -2 347 154 -203 -183 -228 -59 56 75 104 -109 -79 -76 -243 -356 56 79 -102
1835 -102 310 249 163 -108 -128 87 35 100 -135 -52 306 13 -91 19 189 248 -56 -136 180 188 -229 -255 116 251
1859 251 -94 -40 309 -296 -129 205 -292 99 138 -388 65 -156 29 94 53 115 22 -59 -73 -401 5 -44 -19
1882 -19 249 -55 179 185 50 -54 15 161 148 83 -93 53 108 -154 -260 52 206 -151 -81 100 -105 -401 -133
1905 -133 -225 -94 -105 80 -246 120 -79 -156 -198 34 144 -219 -103 104 82 1 -170 -291 197 210 66 136 -238
1928 -238 187 388 -96 -229 -18 340 162 333 228 -11 -96 -375 -65 275 333 -93 82 113 -23 -106 -158 142
1950 142 354 132 -211 -201 82 13 107 -244 -27 128 69 110 121 185 65 -285 -116 70 280 -299 -135 185
1972 185 -43 -119 -156 17 306 308 -136 -109 -196 118 -33 -213 223 -151 83 -253 37 -181 -304 -63 -253 161
1994 161 -1 -210 260 84 82 -74 3 -147 -8 153 37 -62 19 269 118 -25 -152 453 -123 10 -108 129
2016 129 168 -101 29 233 39 113 -146 185 155 -80 -176 182 91 375 203 -12 118 80 29 -357 -184 -180 41
2039 41 24 -343 -71 162 -245 -88 183 -135 7 2 -44 189 -12 -30 -163 -322 -99 -105 27 -212 142 -126 -139
2062 -139 10 -102 423 23 -67 220 126 -26 -107 -28 -242 134 28 -168 63 -145 -80 164 308 125 -195 -114
2084 -114 -24 10 164 151 -60 82 94 -100 -152 11 204 31 46 -226 427 122 -52 -56 -68 84 53 81 108 -189
2108 -189 279 16 -1 244 396 10 -460 408 -94 -305 -22 -600 118 -404 -113 -76 -377 -31 111 293 -573
2129 -573 -586 152 -96 -119 -349 30 -251 165 5 -223 -93 4 -176 167 122 -31 194 133 -47 -98 -8 78 -110
2152 -110 210 -202 15 -10 33 -29 -70 -87 -58 225 -337 32 254 292 -178 123 -303 361 208 11 -363 220
2174 220 -52 307 67 195 3 -212 4 128 45 -174 31 -109 47 3 36 185 53 436 233 42 -43
2195 -43 -14 -178 53 -204 54 -222 28 304 -196 352 174 -30 -57 -109 -168 33 -41 -37 -320 37 23 -147 -103
2218 -103 -207 -33 263 46 -43 -191 281 166 82 -145 -38 197 -36 213 -90 339 230 -153 129 254 75
2239 75 -25 160 184 -166 67 -179 -105 -6 37 98 -69 -109 94 -1 -292 20 252 -18 -149 -91 47 -69 39
2262 39 154 -75 25 -91 161 -133 72 51 135 186 -151 67 -179 8 -61 258 291 146 120 -276 -65 -53 48
2285 48 -172 72 161 -76 -100 72 -135 196 -52 -105 72 15 -224 -117 -140 -104 263 -385 161 155 1 -191 127
2308 127 139 -222 184 -277 15 -133 3 57 -172 -188 180 -442 -146 96 320 176 151 81 93 234 334 208
2330 208 233 70 -178 -144 167 -122 145 -30 73 185 -90 46 -124 -105 46 -39 -118 -281 72 -281 -211 -397
2352 -397 20 -4 -106 -85 241 -22 97 -270 25 2 40 -48 505 -13 -76 -352 -116 259 201 -4 -261 -171 15
2375 15 -249 -162 -110 -99 -106 -178 -28 -63 -123 -114 -251 175 -119 -71 -53 32 407 134 -54 218 -24 -316 -235 -269 67
2400 67 89 -155 -22 -201 -186 298 270 351 -324 -187 -120 26 -42 510 126 51 300 -13 -258 -9 -154 113 -92
2423 -92 115 -71 151 178 -207 -323 195 25 -40 402 169 -248 139 157 -87 -52 27 59 -250 38 108 178 -249
2446 -249 -13 163 -156 72 -46 -115 205 13 -9 -50 -9 -15 22 -91 -123 -77 -57 20 202 54 44 54 275 71
2470 71 -35 -464 102 9 -57 -232 105 29 -139 50 -73 -169 -51 -99 -13 92 107 138 17 70 -273 -67 -124 159
2494 159 -107 39 297 73 192 236 47 139 127 90 -185 -171 14 -76 -79 -297 -19 -379 -86 -212 -114 330 153
2517 153 -46 119 -139 3 -105 52 -202 -7 23 247 180 -246 -140 31 -248 160 78 -83 48 142 2
2538 2 -116 124 120 383 -14 132 -100 -79 133 -45 -76 -31 -9 -169 186 71 -25 -86 -104 62 -186 230 288 -10
2562 -10 -58 -351 -15 -159 -129 -42 -144 -140 62 -97 -92 -181 258 162 -187 175 -129 77 34 13 165 -26 -72 -162 27
2587 27 -272 83 -113 -224 161 14 233 55 -49 164 -83 138 -105 151 -282 149 78 164 -228 105 -96
2608 -96 59 229 -119 -282 -109 213 -97 95 22 -80 64 52 -6 -391 87 141 -498 36 249 -97 16 -175
2630 -175 80 5 -223 -152 5 -75 1 11 182 24 257 -126 -28 326 -181 -151 218 -96 -199 -59 67 -119
2652 -119 45 37 -110 -198 81 -100 202 -210 -92 21 -57 75 121 18 -122 -369 259 26 220 53 121 -177
2674 -177 -132 89 -153 200 -66 160 220 -11 228 194 -95 20 76 359 32 255 -47 -47 141 -135 86 145
2696 145 150 -158 1 89 25 78 413 -26 117 -29 127 -108 -52 76 -140 77 -205 -23 67 220 -54 100
2718 100 -35 89 143 -114 -179 -41 316 -127 -144 112 12 -276 69 159 56 119 -98 -122 235 170 -216 21
2740 21 -6 116 -67 -145 33 -5 -314 -234 106 189 141 -90 -131 29 155 -29 -11 112 -150 122 105 -88 150
2763 150 -88 -126 -212 141 -208 233 -135 -136 56 -1 -114 -91 -30 -50 -117 208 -363 -49 -110 -61 87 310 -79 -166
2787 -166 5 -515 98 -333 25 -124 295 63 400 -172 -21 65 170 -100 -115 13 -266 190 9 -146 159
2808 159 403 157 -18 -110 176 135 50 -182 -185 -168 212 33 67 -190 151 127 -123 156 178 271 -145 -223 -88 -62
2832 -62 109 -183 120 -347 -61 -309 321 85 -208 2 94 -7 -346 140 171 34 -45 128 9 54 41 0
2854 0 -123 -179 -178 -252 271 86 -300 179 193 166 -27 -66 -285 86 186 -184 60 87 -91 -177 -90 7 -41 -62 -59 128
2880 128 240 155 64 -173 95 -250 -189 -235 -30 -113 112 64 -4 -181 172 98 -275 -290 -345 217 206 -308 12 -119
2904 -119 37 27 158 185 -61 -164 212 189 -173 229 231 -96 -230 -335 45 33 385 59 -7 45 64 189 -15
2927 -15 262 67 172 116 79 -138 1 162 -111 330 -20 -47 129 -70 -38 97 -292 155 -215 -40 -466 -157
2949 -157 287 -138 139 86 -1 344 3 204 -122 -82 18 192 268 72 -98 140 79 89 127 212 52 35 201
2972 201 -338 261 -5 -153 128 -102 52 166 115 141 141 10 -126 14 -159 49 -80 -45 159 477 -152 -168
2994 -168 -75 65 91 186 42 352 258 134 -162 8 50 55 152 -545 -90 190 70 158 -95 -24 22 -49 5 304
3018 304 98 -58 29 18 -66 -56 -178 -52 -158 13 -166 199 -88 5 -28 130 42 -239 78 18 58 355 -83
3041 -83 -35 -119 61 134 -101 -237 -203 185 -226 -172 5 112 12 -119 -276 -58 -161 -260 -266 -207 -131 141 -56 -183
3065 -183 -89 -168 -109 -133 -113 -330 -10 -88 -148 -16 -11 117 170 198 -260 -76 -88 26 -37 129 105 182 128 36 328 178
3091 178 -76 -35 75 -212 144 -137 -195 -135 -189 -119 -89 -39 -16 92 -63 -160 197 -163 -245 121 132 -68 162 -54
3115 -54 -308 415 97 -23 -489 -39 69 -146 -203 -52 43 -70 -122 -203 -19 137 50 -440 106 66 101 -236 20
3138 20 7 366 209 -70 4 -67 14 144 -44 -65 202 73 96 104 189 247 -24 -16 -54 -212 87 -113 -50 -12 -146
3163 -146 -17 121 43 -129 194 195 320 -155 -61 146 -8 -166 -208 -313 -147 -63 -283 -169 -24 296 -167 -21
3185 -21 -315 282 -167 68 361 -8 24 19 33 -182 407 35 102 -301 118 -47 75 -117 267 -94 18 -15
3207 -15 -125 -328 -271 -76 42 73 50 -230 43 -9 -71 17 57 129 46 -149 246 103 -127 15 -79 -72 45 146
3231 146 17 -229 7 135 110 -9 83 -140 23 192 324 -145 -279 -24 76 -113 -46 -261 134 110 -264
3252 -264 98 368 67 23 -5 166 45 184 -91 -174 71 241 107 -84 -89 108 256 -97 131 168 -217 -9
3274 -9 76 -78 -173 39 -135 -146 -46 66 119 262 185 3 125 -141 -70 35 -13 -84 257 -267 -194 56 -30 -308
3298 -308 124 -131 82 64 -104 127 84 176 -73 116 -214 144 33 -127 62 60 39 -50 104 -169 91 -143
3320 -143 -37 161 349 -56 -52 -120 -86 97 284 -71 58 119 -12 4 -2 412 88 -14 -29 -178 144 -285 -383
3343 -383 194 185 -391 -35 260 -61 14 182 -85 -293 159 38 -197 235 -163 51 -110 -171 -173 62 -128 -256
3365 -256 -240 -97 106 46 -17 -229 -193 -89 -24 -288 -131 51 -227 -110 129 -3 53 -102 272 190 -89 189
3387 189 -43 206 43 59 34 49 62 -29 114 -366 -96 -54 -96 -107 -63 146 -197 -102 -199 166 -342 -19 130 80
3411 80 -394 275 47 -68 -6 -224 -217 -350 -179 157 -34 -188 225 283 87 -36 217 179 -147 -70 -150 136 -150
3434 -150 174 99 -275 63 36 68 42 71 32 35 -246 -152 44 -50 -59 -94 -215 -191 288 177 93 -142 26 327 -81
3459 -81 -78 -5 338 -103 16 -91 -113 -204 -149 -124 110 -20 -97 -175 -87 77 66 -26 70 130 -21 237 -184 -169 -289
3484 -289 -7 -60 16 -50 99 -166 148 59 -52 332 -127 40 11 174 10 -344 -78 -48 49 -207 42 -269
3506 -269 -172 -38 14 -242 130 -108 273 107 -73 -354 -212 -202 29 -130 -482 0 244 -374 18 2 218
3527 218 94 22 -67 46 211 112 63 -176 137 84 70 75 -143 65 -168 308 -1 46 104 -355 39 17 -88 -82
3551 -82 185 -128 2 -153 -110 35 -201 258 118 -15 -76 82 -43 55 -2 -82 -11 -53 29 -150 287 -40 133
3574 133 -4 -169 65 -54 -114 -65 -163 -211 5 21 -24 -196 308 95 -296 -37 19 197 91 72 -158 157 -339
3597 -339 -49 -196 23 -50 -52 574 -110 193 -22 -160 -214 -390 64 -14 143 -14 -263 -160 -143 241 182 -401
3619 -401 -53 526 -199 164 316 -22 306 -400 -135 216 -75 29 -328 79 54 213 -106 -142 -55 317 -106
3640 -106 18 70 -36 -33 234 309 121 11 6 140 126 -69 46 267 116 95 458 -179 -22 -392 -56 -94 -238
3663 -238 -266 -272 -144 -182 112 32 -1 198 -128 211 27 188 64 -21 -15 11 -48 -30 -27 194 122 -137 119 49 -286
3688 -286 18 135 -88 149 164 -172 -382 56 80 169 7 -43 -115 -131 77 -152 49 12 -267 180 111 -368 68
3711 68 31 -87 139 -71 -146 141 -134 62 352 1 299 327 -258 -104 327 101 325 134 46 72 225 158
3733 158 27 -40 209 -158 121 20 212 333 96 -182 123 188 161 6 38 142 176 -266 -129 113 339 183
3755 183 -5 -37 -92 -123 -149 57 -466 -150 62 -26 139 -173 -78 94 147 -162 -71 -332 40 -75 294 87 -77
3778 -77 62 -360 62 4 155 -136 87 -110 32 145 151 -270 221 -266 53 -69 32 -32 -54 -68 48 -40 349
3801 349 -155 -298 24 -171 89 185 25 166 54 -146 109 -95 -112 -30 78 197 -259 -146 -113 81 -484
3822 -484 42 -122 236 116 1 196 350 16 -30 100 342 163 -48 -4 -171 49 -252 -88 -8 -68 -190
3843 -190 -79 173 262 152 41 -441 195 -171 -53 -22 67 36 274 -87 -8 -162 35 -59 -93 -12 195 4 -192
3866 -192 141 88 405 -43 292 -22 123 -21 -270 99 -3 112 280 174 -192 -136 172 5 96 124 -135
3887 -135 -203 -150 -139 281 242 -26 -95 9 -95 -137 104 -83 173 -26 97 132 -15 -150 -238 53 -64 232 -211
3910 -211 -50 55 529 45 -80 -116 -45 42 -24 69 -16 -593 -44 -79 -93 29 176 44 -168 -180 165 -40 -113
3933 -113 390 -285 90 -77 162 181 -120 -124 -173 -107 -40 253 274 148 182 15 237 218 -246 2 -52 122 -244
3956 -244 169 122 46 -35 -110 279 21 -63 53 59 135 147 152 171 33 274 -169 133 -263 222 -200 -265 -163 37
3980 37 -63 -51 50 -22 -1 187 16 -120 -94 -159 98 218 -39 -268 238 94 20 93 171 -13 -195 110 290
4003 290 172 6 -263 -180 -217 -209 37 -57 -186 -33 192 -178 -46 -365 -154 -49 331 143 -295 62 82 405
4025 405 28 232 -12 21 -206 -305 -176 -207 -222 176 -6 84 -64 -8 100 -39 16 -50 -43 -10 -29 -306 53 38
4049 38 -5 -18 -235 198 -299 41 170 62 -29 94 120 116 491 243 192 -55 159 -9 -9 -47 -16 -176 88 45
4073 45 127 101 -208 203 -39 -189 -65 37 138 -139 32 206 167 -52 -65 260 80 34 24 -140 -187 64 86
4096 86 -75 -32 285 -102 -148 -156 238 106 151 -152 -160 65 -46 36 89 -137 -38 13 -180 44 8 122 167 -43 -163
4121 -163 19 -133 215 24 -125 -103 -303 -217 76 -134 -248 39 -15 201 -202 204 117 76 -239 -51 190 -31
4143 -31 11 0 -325 61 -109 -59 54 -132 -56 -305 15 -140 72 121 -102 -94 -9 -110 -49 -25 -261 169 -47 119
4167 119 -192 -37 -9 -161 125 170 24 220 -154 -127 -49 -25 -155 -204 91 -86 -135 70 -171 114 -151 87
4189 87 -190 227 -11 -197 22 -67 -362 -108 -95 -152 -113 165 -324 231 242 10 502 144 -108 140 77 -130
4211 -130 -2 -147 -122 -12 -94 -100 198 25 -195 -136 -171 -201 241 -271 -7 158 68 400 29 -50 -79 203 57
4234 57 -264 -15 -7 -190 -218 89 12 16 10 -27 -97 120 -75 76 -8 -134 119 292 -329 -222 427 -7 -76 -184
4258 -184 -209 10 -59 -53 -125 4 -43 142 35 253 -89 97 -3 -19 38 -172 185 -54 4 266 26 -176 -295
4281 -295 145 213 22 193 53 -169 -107 -69 281 124 -194 83 33 232 30 -34 130 63 150 70 -42 -49 -92 -19
4305 -19 231 10 -131 359 -42 -121 154 62 -154 73 -144 8 -119 -174 124 -72 105 209 67 53 -102 -288
4327 -288 -102 -49 -226 179 93 -32 -41 1 -27 -249 -266 20 -21 249 203 35 54 -44 -375 326 -109 136 -399 136
4351 136 161 73 135 139 208 -83 -188 338 351 -320 141 -403 284 59 2 -138 -337 -320 -102 -99 -29 -332 17 -251
4375 -251 46 -78 -68 -144 -233 -3 -134 95 -12 -73 -32 33 47 -37 102 50 108 67 39 -135 -4 -223 -112 192
4399 192 -159 -31 -27 213 44 -53 103 187 151 43 347 196 40 2 -205 249 -52 58 -20 -231 -364 63
4421 63 13 -198 -12 -67 15 36 16 233 143 -201 -159 58 -27 241 -10 -238 42 -301 -158 88 -128 62 -122
4444 -122 -14 178 112 -28 -101 84 -130 -60 123 -87 15 -19 -37 106 337 -72 68 444 55 58 -230 1
4466 1 -180 238 -115 275 24 157 -359 -289 120 129 -44 109 -19 2 169 37 126 -220 -14 -25 451 -115 -116
4489 -116 265 -14 -37 -38 -40 -33 4 171 -309 134 33 46 129 180 160 325 -10 -383 -138 -169 55 -79 153 351
4513 351 -138 133 143 88 161 -112 214 96 36 45 -217 -79 70 222 77 -22 -298 120 184 140 82 -106 57
4536 57 44 -14 312 256 -48 -63 3 -397 -84 82 73 196 -286 6 299 -244 -157 -114 242 149 90 -215 -96 -91 -14
4561 -14 -100 -23 -26 163 75 -128 234 59 -201 -215 200 -56 -114 -148 37 400 91 -39 -40 -39 273 50 351 -161
4585 -161 212 -284 261 70 106 -46 126 105 -256 -68 161 -47 63 -53 -124 -140 -157 -38 390 202 147 280
4607 280 -27 217 -122 -179 88 116 185 23 3 71 -1 117 -226 54 -15 356 -303 205 -64 -172 61 118 -46
4630 -46 -478 1 4 82 210 -3 189 -129 1 32 264 20 -212 -44 25 87 99 -31 -144 -118 -9 -135 -88
4653 -88 44 -10 198 189 322 -102 260 -169 128 -121 -36 -347 63 21 26 205 114 201 111 -8 159 132 32 -302
4677 -302 -59 69 105 -14 97 16 2 241 -258 -80 -250 74 -77 45 -206 181 -209 461 -5 26 283
4698 283 284 141 91 166 -395 -139 112 -35 2 63 177 203 181 190 94 -59 -33 -137 -283 -72 102 131 -24 12 113
4723 113 -234 -50 64 160 350 211 -483 219 -241 -77 -261 89 -238 83 219 24 17 -26 -73 3 17 154
4745 154 -118 -157 170 -134 -12 -21 215 -310 -130 157 4 72 77 93 -155 -41 -66 -49 -11 153 191 173 -12 -686
4769 -686 -92 -28 -164 -40 -142 -78 51 -4 -141 -101 108 201 178 239 -255 9 249 -38 -43 -120 2 73 132 60
4793 60 383 153 -23 -75 -6 -127 127 69 18 -22 -33 -15 98 -12 -90 138 79 -100 65 -12 -81 215 -40 -133
4817 -133 47 -6 -8 -238 -60 -147 -164 -131 -144 -174 -8 62 -29 339 -111 -177 195 -5 93 -270 352 -60 -69 -367 -119
4842 -119 86 -92 69 43 -290 328 363 120 46 -60 98 127 2 212 -67 281 13 -98 243 186 -48 -68
4864 -68 165 -113 39 11 244 38 245 145 -38 -28 86 165 -4 123 -223 -38 26 -214 -15 175 102 308
4886 308 16 48 129 192 -249 162 24 200 -27 -162 -50 63 -186 169 118 -111 46 23 -23 22 -144 21
4908 21 114 108 387 23 374 -14 267 -161 19 32 282 -16 146 1 104 98 -116 -279 134 195 201 3 -29 87
4932 87 -55 -186 -203 -327 194 279 -225 137 115 -155 -264 -21 162 418 -197 -165 -325 212 96 -136 161 65
4954 65 -50 61 32 14 -121 12 -8 -436 13 6 82 156 -583 124 12 -108 188 404 -253 192 18 -99 -4
4977 -4 -71 73 117 -281 86 279 119 -121 -237 285 47 152 66 -110 -17 229 -24 78 157 276 132 103 -153
5000 -153 -8 -335 21 90 14 32 145 7 -170 -20 254 -136 125 -84 172 101 58 -40 -139 40 -105 41
5022 41 -78 12 61 -25 -23 0 -84 -214 -106 91 -95 59 -72 -87 132 -236 154 136 -143 -50 9 -64 0 -181 -153
5047 -153 53 -250 -306 -193 64 -91 109 47 -321 -229 174 44 -61 150 185 -65 -1 -160 609 -162 -22 -217
5069 -217 -132 -84 92 167 -126 227 -212 -84 27 44 -285 199 219 -87 -392 168 48 -137 -131 113 -124 -360
5091 -360 -40 111 306 214 -233 -124 -164 79 -137 27 111 -207 392 44 278 -283 -129 193 161 -270 -250 77
5113 77 70 -200 66 -124 174 84 -218 142 114 -96 41 195 2 -15 -5 328 215 -32 26 -165 156 -187 -5
5136 -5 -108 111 57 -1 78 105 54 148 68 223 -121 142 10 155 144 -53 103 113 -247 -47 75 -26 150 456
5160 456 109 -220 -326 172 106 478 147 -120 -320 -26 -129 244 -172 -195 66 210 -211 -239 141 125 111 -97
5182 -97 40 29 62 285 -29 -133 -14 97 64 32 -158 -198 28 222 2 -91 -10 -66 122 16 8 -36 69 324
5206 324 9 117 -127 61 -112 -282 -18 292 -282 -192 79 291 -43 146 -191 -171 131 305 -48 -30 -210
5227 -210 -79 12 255 -99 -71 279 -143 68 294 407 45 55 25 31 -148 168 -335 122 -140 30 -142 -210
5249 -210 -62 2 218 -166 -272 -55 -113 119 -130 -110 138 -128 262 -288 174 29 99 -59 -101 -102 145 16
5271 16 -88 38 220 -51 65 221 262 32 -12 102 31 -21 -233 94 99 -165 -136 66 -319 -195 -145 125 -119
5294 -119 138 17 -5 100 -25 -188 -94 -112 -267 110 -206 -390 214 347 -56 62 96 196 -157 91 16 -383
5316 -383 235 156 8 24 466 40 -47 90 49 -400 22 -396 -163 153 -151 -176 -290 -78 122 -177 125 238
5338 238 111 -239 92 107 -299 63 108 70 113 25 -152 153 15 94 -167 189 170 -192 138 -49 -124 -285 298
5361 298 293 -119 -239 -16 -36 214 65 56 -61 65 -70 103 -208 -134 195 -66 -307 167 58 58 -261 212 195
5384 195 246 -214 -13 268 -312 97 -233 57 69 242 -46 -207 96 157 -82 223 22 88 -59 207 -355
5405 -355 -22 -452 -59 -37 -191 147 100 -99 68 -82 103 182 335 96 192 -150 63 160 13 196 -111 -22
5427 -22 122 -93 134 -39 247 -285 47 189 15 4 -241 245 62 -45 -220 229 199 -206 85 -120 96
5448 96 -122 183 -46 -146 176 -17 93 74 -63 22 111 99 146 294 -65 -31 -63 126 -57 -55 130 145 481 47
5472 47 206 32 218 19 165 -40 -69 104 281 265 117 10 195 89 87 -222 17 -109 70 325 63 36
5494 36 -37 -29 -355 31 15 71 76 -72 -279 -60 -359 74 115 17 43 -311 180 -118 96 33 -21 35 135 169 64
5519 64 -114 48 -191 -205 73 142 -11 321 144 5 119 70 -13 -93 -69 183 27 -166 303 101 164 -52 -2
5542 -2 195 95 -40 132 -158 64 -108 -41 -53 -115 83 -8 -229 -49 229 -87 9 -221 -192 -188 64 172 193 -128
5566 -128 175 26 251 -83 8 127 91 -18 -264 103 -9 -43 -226 165 4 -63 -171 5 17 -6 299 -208
5588 -208 28 111 -156 -216 205 -115 -105 59 -86 -176 -168 -22 -40 78 58 0 38 -36 -181 55 -99 76 -23 -15 120
5613 120 -143 -193 248 -54 -47 56 -105 -237 -34 -101 -23 15 -124 -116 -91 -15 191 88 -126 -276 -281 -136 390 -110
5637 -110 -407 4 183 -229 -94 -183 115 -55 -226 53 113 13 -164 -106 -246 74 -64 -188 -61 188 55
5658 55 -180 -17 -62 34 -15 -54 165 73 194 -208 -224 -77 -367 48 -272 45 -1 115 82 115 123 -12 92 181
5682 181 -77 -98 -10 53 244 36 48 -24 110 -135 331 340 135 -190 -219 -154 -272 54 46 27 -125 149 65 14 123
5707 123 41 -81 -52 101 -246 146 145 60 228 37 145 330 -43 195 -106 75 278 -227 167 -165 97 28
5729 28 -191 223 40 189 -188 -118 -32 -90 89 127 182 207 118 122 101 -23 -27 -35 117 -1 -67 -55 141 -10 23 -378
5755 -378 23 -8 -198 -30 -29 -264 -378 66 18 -210 251 -46 -232 -99 257 90 -250 -354 102 283 -32
5776 -32 -61 30 280 -361 -10 76 106 375 17 211 276 -52 -36 -94 -270 -43 -257 237 -25 109 70 4 -131
5799 -131 -58 151 -246 180 371 -2 15 -95 151 276 -23 84 153 -216 -274 -182 -10 155 89 -38 -230 194
5821 194 220 122 68 86 8 -253 78 -31 233 92 37 -127 145 49 92 68 -124 0 38 57 -48 59 6 -75
5845 -75 -76 -366 -411 -59 116 -21 287 -397 -112 39 -91 -208 -290 -105 -10 256 184 -47 50 -143 49 263 221
5868 221 102 -13 127 33 -210 124 218 68 158 14 -117 -399 95 319 4 91 243 -26 147 38 3 -24
5890 -24 165 -36 -166 -292 266 -122 215 -123 -158 42 275 -27 140 201 -275 77 141 55 -208 -11 86 -230
5912 -230 106 57 240 142 164 -44 -190 -136 -192 -69 -62 -61 -108 -210 -311 -112 -18 -79 -8 -221 -8 21 191 -9 139
5937 139 165 -110 144 62 52 184 -129 41 -11 59 -149 -188 93 119 -106 -132 -125 -130 143 131 -1 -219 -271 33 42
5962 42 525 98 -172 -34 75 -22 -141 201 219 -83 39 30 37 224 -49 -71 215 -306 -4 -81 -148 -13 123
5985 123 77 -324 -156 -109 88 122 224 187 104 -95 -85 26 -12 125 60 -133 -171 296 49 -166 -74 118 293
6008 293 -152 -107 -33 33 -76 -332 -418 68 -270 -36 48 -87 -40 -114 -44 139 215 250 -65 46 7 147 -43 185
6032 185 -238 -275 -93 112 108 72 201 266 256 88 184 -61 -76 -305 -108 -15 266 -126 -24 -60 364 337 -126 274
6056 274 67 -273 -6 -29 -257 -305 158 -289 12 -176 36 61 -129 235 -159 348 0 36 182 -108 84
6077 84 55 198 292 140 46 -229 5 -105 -269 13 42 81 114 -18 180 414 -58 -110 -270 -3 -136 -63 29
6100 29 -195 129 -170 182 43 -104 -183 -73 102 171 214 -32 0 142 -137 23 224 -185 121 63 -253 -96
6122 -96 220 -242 116 -126 -149 -138 -196 148 200 53 -136 -196 -207 -125 -195 66 -224 36 161 -180 15 -13 -41 -140
6146 -140 -189 -55 -40 -24 -108 310 221 -203 47 -21 50 -167 -77 337 150 66 -142 71 -50 423 84 96 -106
6169 -106 -380 128 51 57 196 265 124 -232 -2 110 12 -132 55 149 -161 229 31 228 -11 -116 -59 -190
6191 -190 246 85 -18 278 442 -120 9 -198 12 93 -258 -167 -84 -113 49 107 -96 36 167 161 -6 -51 -226
6214 -226 231 -24 -146 -69 47 32 26 -100 -111 177 30 -2 -92 -186 -51 131 222 25 -145 95 -2 12 382 -1
6238 -1 -11 -59 72 -23 297 -249 -104 103 211 248 -150 -115 -34 -66 241 17 67 80 -17 95 224 76 -39 -40 -125
6263 -125 11 -58 -140 -152 19 12 12 -204 208 39 -15 -80 208 -242 14 -2 98 14 390 -94 130 56 -231 130
6287 130 114 177 -336 -27 -264 -238 -45 -129 -22 118 131 -50 -31 142 80 -216 260 170 -60 -19 -26 228 150 38
6311 38 211 12 -274 80 -147 58 273 21 -65 -284 179 -47 -53 263 156 129 -100 -138 -148 -133 -29 122 -62
6334 -62 11 -96 384 28 -196 -63 -116 31 276 300 -381 -24 303 269 -135 75 -465 -36 -45 -208 -57 296
6356 296 -151 107 3 -108 -121 -362 55 -30 37 -37 45 30 -109 194 -76 -110 96 133 45 -187 170 225 13
6379 13 -66 -206 -326 129 237 -11 -191 -274 83 220 -50 -211 59 -102 -169 75 107 228 -10 42 46 193 31
6402 31 -251 237 -76 18 383 199 -301 -69 167 5 -162 -60 81 -201 115 -154 -270 -40 -127 -314 -363
6423 -363 -119 24 153 128 -126 103 181 19 -44 -81 -23 -47 107 -198 -89 26 -115 176 -103 -89 209 290 -387
6446 -387 -161 128 -86 -17 -50 281 -53 99 -167 95 255 211 90 -87 154 209 43 -53 -13 41 226 189 126
6469 126 -21 -454 115 12 331 -146 159 3 -40 12 -309 -143 83 -124 214 123 -46 -143 -258 212 118 339
6491 339 -162 -92 223 114 -75 -179 -147 33 351 -224 -140 293 -40 -41 78 -10 -126 17 -136 -95 70 -237
6513 -237 240 -123 -95 96 173 -2 -147 21 -10 61 14 66 -6 175 44 87 -89 207 95 97 90 25 -170 -126 -144
6538 -144 -47 138 -273 170 185 213 -159 -104 70 -140 85 115 -137 4 -250 -77 -208 -62 -9 -181 -73 -35
6560 -35 169 194 -134 0 33 145 -31 29 -71 -204 112 12 176 231 -139 448 -204 152 -47 29 -13 -196
6582 -196 346 103 141 -90 70 62 -167 97 63 -307 -53 -149 99 112 223 -94 -112 110 -52 164 246 -14 -448
6605 -448 -231 -203 -7 -108 197 -89 -207 -20 51 105 -139 -60 346 -152 32 110 -140 65 -41 -298 -347 251
6627 251 127 76 99 -46 -48 -62 -147 -173 -250 7 155 85 66 323 176 109 27 -232 -63 4 318 -304 -112 8
6651 8 73 -104 -87 -14 199 -74 148 73 -9 171 78 73 55 -69 2 -196 -59 131 119 -75 -122 -142 -247 32 62
6676 62 -12 -131 -29 52 126 36 83 360 -20 116 42 -134 -81 109 54 75 -264 -72 -329 333 -56 20 23 -281
6700 -281 -260 19 148 -28 -142 141 -33 -229 -253 -161 313 -215 106 58 163 43 -299 31 367 344 17 -246
6722 -246 -150 77 -64 -111 238 60 177 107 104 129 -281 -100 151 -44 201 -100 -128 -151 -156 -51 86 -111 162
6745 162 41 174 -131 -105 179 -344 59 111 107 -289 71 -200 16 -70 68 38 -148 -271 98 245 47 22
6767 22 -200 193 154 -100 187 202 -193 326 80 168 70 -26 93 244 -189 -153 29 279 269 185 -320 63 46
6790 46 -334 -55 281 135 12 26 155 52 -19 116 -224 22 37 -148 -204 228 -160 -163 -106 38 52 -127 -273
6813 -273 121 -70 -170 187 193 282 -36 73 225 -26 117 -152 -34 78 -279 21 125 48 49 -71 221 330
6835 330 -100 78 92 90 -129 98 -90 86 -166 34 -477 -275 -102 20 25 123 9 -19 156 -413 54 67 71
6858 71 130 136 -127 61 -201 216 221 -75 139 263 118 344 -543 13 150 28 179 -88 -54 37 96 -335 211
6881 211 -142 -89 -24 -73 -54 152 -148 -201 -355 318 152 -42 264 113 199 -161 -9 72 -219 -327 71 -18 -368
6904 -368 63 32 110 -97 -231 -4 162 61 122 -65 27 171 -469 -74 201 80 183 95 -114 283 149 325
6926 325 365 -59 232 -75 42 326 -201 167 75 -134 -49 252 -228 111 198 10 -42 -86 15 -47 -61 -226 117
6949 117 -13 65 98 -88 -127 -31 -125 119 190 -12 -264 -320 -48 320 -108 79 -87 -71 -33 -42 67 -46 -56 -13
6973 -13 -92 -269 -97 227 -295 12 210 176 68 -42 -300 -86 -158 -75 -209 13 -141 -159 129 -62 56 -4
6995 -4 -231 -264 -162 -161 172 -72 27 53 193 118 174 -39 14 189 -331 -65 17 -118 197 -194 122 237 199 33
7019 33 -74 -35 -300 106 296 49 32 151 170 379 -122 160 -358 240 4 -173 325 -331 132 250 142
7040 142 14 -257 -236 166 -51 -16 21 -89 146 -101 227 116 -28 -78 -45 -44 151 58 -37 30 245 121 -197
7063 -197 29 59 -194 -95 -177 51 -127 -75 -135 174 -372 -25 -95 176 -211 -91 -6 46 -208 46 -43 -213 144
7086 144 168 46 -112 -255 136 441 -155 87 -231 222 24 -1 -8 -59 -41 20 185 309 -94 40 -214 110
7108 110 -178 144 13 280 355 214 -184 33 -374 -16 -329 -342 -40 -9 169 -263 135 227 43 -3 -247 -37
7130 -37 -134 59 218 66 -22 35 86 -196 5 -40 -13 315 69 351 -274 -413 191 -137 87 -116 -50 124 -188
7153 -188 193 -178 24 60 -16 270 -124 152 9 -438 -210 84 56 -125 38 -149 -319 -41 335 -81 -200
7174 -200 8 -238 269 98 128 -118 254 -409 -90 -487 61 155 103 -2 4 154 -8 -266 60 70 98 -82
7196 -82 179 105 186 299 -12 -235 -44 -94 88 72 -62 -167 -412 370 -239 328 -69 -152 65 -8 -159 -24
7218 -24 -55 -63 140 -14 38 -55 -176 -134 87 -172 -144 -358 -40 213 -61 186 -22 74 -159 100 138 -12 -180
7241 -180 29 -264 6 2 -159 -233 87 252 19 -19 -122 -57 -221 -180 -117 -33 -108 94 -37 -216 -72 -139 -3
7264 -3 -23 446 504 -141 -73 -155 122 -55 216 -23 -42 -56 235 225 -116 -83 127 304 24 -346 112 64 -163 35
7288 35 -96 162 253 127 81 -392 69 -157 157 84 -22 -341 -142 271 -277 -215 -140 178 28 -246 -241 185 218
7311 218 -166 22 252 -78 -76 -36 190 21 -103 -18 82 156 -329 -246 -247 -71 269 179 -73 -29 -50 88 -66 -81
7335 -81 -122 -317 -115 -156 -188 -195 -54 -7 -154 -40 47 236 -215 157 145 -131 -101 -31 125 -3 -272 -434 132 -217
7359 -217 66 -253 31 -96 -22 399 -3 26 -71 -240 -107 -136 68 269 169 113 -135 4 238 289 -110 -181
7381 -181 24 78 262 178 417 153 64 -102 -21 -186 -37 251 -47 328 31 17 89 -6 285 -375 -216 111
7403 111 -25 -214 124 11 -128 17 149 14 -13 147 -96 30 299 337 121 -71 -67 -78 83 -236 99 -59
7425 -59 134 86 -68 -140 -105 176 236 -39 98 60 109 -243 -119 190 2 -124 13 508 -213 94 135 -33 -79
7448 -79 -49 18 4 121 66 133 6 -60 -281 -84 -78 -451 -25 268 -4 -79 -15 1 -211 -114 150 65 15 144 -5
7473 -5 -296 -173 148 -313 -85 215 -37 -143 177 -312 -34 -323 -323 227 28 -292 -178 190 -439 74 85 -18
7495 -18 168 9 178 105 -65 -187 152 -95 337 97 -170 63 176 -38 -101 284 -65 -36 50 -69 93 -189
7517 -189 112 349 5 -73 49 101 -191 116 53 207 82 -83 238 -5 129 184 186 130 32 -158 -50 -25 -67
7540 -67 235 -28 -6 117 -69 -131 -178 -120 -11 136 -183 151 -289 -196 -159 54 110 0 -90 244 70 304 -311
7563 -311 -223 -131 85 -69 -46 146 185 -133 -114 76 -79 98 83 119 -159 -251 -315 366 193 45 314 -131 -139 123
7587 123 -11 33 -92 43 -86 64 -127 111 -178 -12 -18 84 -3 17 138 -141 -184 -57 32 191 -137 -319
7609 -319 142 296 239 -181 47 17 119 -380 -221 -7 -53 5 58 36 8 -332 126 -9 -336 -79 93 154 -179
7632 -179 -17 -80 -1 -136 206 -157 -205 142 -211 45 22 -113 320 -87 -109 78 -113 121 467 16 -80 234
7654 234 -114 -56 -184 143 60 -103 35 -10 -134 -69 -15 -205 21 -25 -30 -38 -68 -62 -90 -68 -61 -440 -208 -23 95 10
7680 10 -426 83 -25 -141 -84 134 234 435 158 -57 67 195 -25 168 153 106 9 302 52 153 -49 204
7702 204 115 166 42 -63 -59 142 196 -116 238 190 -98 172 144 15 71 99 -177 -29 27 -290 -181 54 -267
7725 -267 -56 -111 -223 38 -252 -290 157 72 -285 55 -301 -155 140 106 205 120 318 -99 317 -234 -113 35
7747 35 118 131 39 56 -80 -217 46 -409 19 -11 -151 84 -93 -31 -42 -70 64 30 96 -159 -198 -254 -15 161
7771 161 77 -5 123 39 -115 -91 -137 -33 -1 -67 -151 29 134 -160 -276 313 -254 68 -99 0 -436 -317 219
7794 219 -111 0 21 120 -46 430 33 99 -105 -278 4 -97 107 -151 -307 -121 142 -87 -19 -4 -241 -30
7816 -30 21 119 -115 -62 86 -81 423 -90 -95 550 -44 -344 322 -124 53 1 -60 -294 -114 -286 -22 -111 29
7839 29 60 -171 -41 -6 137 -60 108 103 480 108 24 -11 -85 -34 477 -85 62 317 107 -126 69 110 -253
7862 -253 188 197 -154 -96 -81 8 381 83 169 -261 -29 -29 39 289 -143 365 206 -63 -67 196 40 -53 -95 157
7886 157 41 -205 -89 -271 162 23 69 -70 114 -22 -19 50 -60 -14 -221 -161 -270 146 -32 33 359 -235
7908 -235 318 61 143 -113 -53 44 197 -24 100 -169 -30 -213 -21 161 150 46 140 -83 40 166 -172 -402
7930 -402 393 -35 -6 243 -264 30 50 128 70 108 196 -389 79 59 239 -17 180 -69 -175 -90 -256 -195 -296
7953 -296 220 31 -119 -193 -173 75 -148 140 -95 -288 -90 -193 -269 -31 -105 -12 -117 -43 -236 -72 -18 -147
7975 -147 -15 -64 43 26 -262 -223 139 -23 162 -77 -8 -99 134 125 239 -140 3 -70 139 43 -34 242 143 -254
7999 -254 195 84 -60 88 256 -126 -129 385 -14 83 -338 272 -83 112 -91 251 -42 369 65 328 -85
8020 -85 105 -6 -150 -133 -335 20 190 -3 -176 -96 -26 -179 146 419 334 38 11 -327 -505 250 341 -208
8042 -208 73 224 -50 143 332 124 -59 190 133 404 97 26 116 -137 91 212 -70 -212 -153 30 -90
8063 -90 286 -77 -189 -73 74 -229 -171 -95 159 183 -267 214 -48 -184 120 28 35 19 -9 50 -2 108 -13 -89
8087 -89 -208 143 352 246 -104 -33 79 -119 162 -61 -278 -24 153 -78 -209 469 -64 -87 -24 18 188 254
8109 254 -170 311 -354 -267 -178 346 -103 -431 102 -80 -164 -257 59 -173 231 -224 -152 -123 73 -264 -185 -95 -39
8132 -39 354 -55 1 -176 -65 17 90 69 -76 -254 134 248 57 -36 -143 222 75 -142 -9 -35 184 -107
8154 -107 91 40 169 -103 158 -127 -126 30 -112 -8 -278 124 58 -219 -465 33 143 -92 -85 -231 -61 -178
8176 -178 -225 50 39 59 90 -247 -618 8 -256 -34 -412 190 -232 379 -215
8191b15
$$ Imaginary data points
##PAGE= N=2
##DATA TABLE= (X++(I..I)), XYDATA
0 0 0 0 0 -8 8 -8 8 -16 20 -24 32 -40 50 -64 72 -88 106 -128 152 -176 209 -244 281 -328 374 -429 489
27 489 -554 629 -711 800 -900 1006 -1126 1257 -1400 1557 -1731 1919 -2127 2355 -2608 2887
43 2887 -3198 3543 -3930 4368 -4866 5441 -6108 6897 -7845 9013 -10489 12422 -15081
56 -15081 18984 -25283 37151 -67316 303013 459285 -272387 -216260 15839 -121896 -243155
67 -243155 206280 403070 44393 -214104 -44616 -54687 -192826 -3321 297073 151500
77 151500 -108330 -75850 -16024 -152447 -86962 184364 184489 -73794 -92938 50337 -20192
88 -20192 -152926 -21807 147856 87949 -31444 -28942 -31026 -69171 -28610 50465 52671 25245
100 25245 13756 -26824 -61036 -15509 27339 168 619 55723 35530 -49727 -51227 4951 1293
113 1293 -3619 49621 41464 -39760 -30885 34114 -16226 -76943 24261 113720 9601 -80566
125 -80566 832 36322 -62570 -52714 87897 86401 -49155 -59692 22566 -7077 -59196 22330
137 22330 86399 5382 -52683 1657 3534 -59260 -12162 86790 41350 -58358 -25100 33259
149 33259 -25574 -59163 36099 85428 -4766 -61917 -7959 19138 -20256 -13015 39641 31260
161 31260 -20084 -23528 127 -8462 -11558 21937 33235 -5625 -25651 -3663 3581 -10465 721
174 721 28246 14534 -23597 -22787 13147 19136 -12596 -18748 17338 28932 -11656 -33190 714
187 714 25405 2350 -15038 4007 10686 -9143 -9981 9839 8455 -9161 -5203 7771 2136 -4511
201 -4511 4307 2385 -12197 -3486 19745 5770 -23600 -6759 27943 9761 -29005 -14954 22747
214 22747 16919 -11777 -9294 6198 389 -8587 1423 11786 3713 -7326 -5560 1666 2393 11
228 11 -825 156 3241 5121 -2369 -12156 -5265 12711 13962 -5190 -14679 -1332 11401 2420 -10804
243 -10804 -2377 11919 4692 -11729 -6297 8228 2820 -8413 748 11363 161 -12459 -3625
256 -3625 7870 4996 -1377 -2083 -2868 -1925 4670 4009 -6671 -6045 8450 8628 -9897 -11213 8712
271 8712 10235 -8332 -8177 9318 6442 -10406 -5760 9727 5236 -8050 -4090 5365 3146 -2294
285 -2294 -1795 -221 -379 2693 3036 -2986 -5030 3219 6398 -3195 -7063 3084 7399 -3483 -7145
300 -7145 3300 7251 -2450 -6919 619 6350 1602 -4746 -2452 3648 3077 -2964 -3432 2560 4236
315 4236 -1488 -3615 0 2686 780 -1793 -1078 1969 1905 -1558 -3078 562 3976 2011 -3578 -3921
331 -3921 3002 5365 -1314 -6128 627 6185 328 -5165 -423 4412 481 -3168 -238 3077 359
346 359 -3053 -1378 2551 3025 -1096 -3092 -208 3032 1874 -2094 -3504 1808 4699 -205 -4963 -1086
362 -1086 4316 1950 -2776 -1920 1446 1415 -1043 -1167 898 1330 -1267 -1698 907 2251 -548 -2670 -1248
379 -1248 2428 2397 -1167 -3674 -147 3828 1353 -3231 -2194 2416 2333 -1626 -2518 347 1896 -437
395 -437 -1454 144 1179 -163 -1966 372 1933 -222 -2280 -816 1688 1488 -805 -2231 -632 2048
411 2048 1689 -825 -2149 -21 1916 390 -1502 -715 1293 777 -1240 -856 1364 1066 -1471 -1068 1373
428 1373 1013 -1117 -1115 858 1258 -497 -1756 -3 1611 1200 -833 -973 716 857 95 -174 -229 152
446 152 398 -465 -668 542 876 -549 -723 239 792 220 -524 -642 622 1027 -656 -1130 942 1055 -853
465 -853 -814 521 1445 -112 -578 -154 877 221 -263 -393 673 666 -593 -498 425 771 175 -420 -516 756
485 756 1087 72 -508 255 543 52 -376 338 210 97 -51 -322 538 564 -316 -647 123 797 -82 -811
505 -811 -237 215 657 -334 -1172 -195 821 432 -864 -326 672 -169 -309 100 293 -525 -283 -174 478 56
525 56 -621 -399 183 445 -315 26 -622 -453 529 677 -694 -304 471 533 -154 -437 -166 310 315 -640 18
546 18 534 -86 -459 355 422 -340 -194 286 411 -360 -451 218 158 -179 17 -216 -213 -178 -117 668 116 -719 -670
569 -670 612 464 -165 -394 232 -2 214 360 246 -152 260 142 -150 -67 -287 32 139 55 -41 -9 -68 -356
591 -356 246 209 -223 -415 195 558 99 -220 -73 221 299 -134 -148 -30 102 101 -389 125 195 135 124 -170 -248
614 -248 107 88 -439 59 254 -266 -100 83 150 -7 -194 -16 -178 -37 -227 -222 227 54 -12 -50 -11 -176 156
637 156 251 207 -516 343 260 -373 -401 250 283 -250 -433 -37 645 -303 -125 -118 165 -451 -357 89 213 -226 -587
660 -587 44 94 -302 -238 118 -147 -18 13 -11 148 -285 102 -170 -240 -286 237 543 163 -545 -128 114 157 -98
683 -98 469 64 -237 -198 568 244 -158 -223 -219 82 -82 -108 169 291 79 -85 -144 90 309 199 -153 -327 168
706 168 46 -333 -154 320 213 -174 -58 -161 309 165 -169 -53 36 124 -272 -240 229 217 382 -368 -100 -43
728 -43 345 -77 30 226 -23 -166 -311 -71 120 590 -85 -62 635 128 -68 123 367 164 -145 -26 232
749 232 -5 78 -113 -111 -211 188 341 116 74 350 39 -72 -136 247 96 149 -229 -48 664 72 -456 154
771 154 718 -95 -103 -375 101 230 -5 -43 -26 180 517 -190 -299 -171 49 399 287 -272 179 204 -21 -190
793 -190 252 479 -10 -240 -315 247 37 -163 -147 71 38 -240 -274 25 233 -327 -118 -111 80 152 -306 -361 -261
816 -261 -194 -113 -277 -306 24 -193 -53 -207 -64 200 -66 124 -199 65 41 -150 117 60 219 -331 -190 -166
838 -166 -186 -281 -147 78 489 17 -176 -16 247 -24 85 151 216 316 -20 -253 223 107 119 -4 -117 111
860 111 16 -73 -9 199 117 243 82 46 424 65 -381 -148 -76 165 60 14 -157 -27 373 -120 81 24 175
883 175 -125 -52 314 -268 60 -144 -288 46 240 88 38 296 230 -150 -136 132 139 -173 -300 71 168 -36 -226
906 -226 -212 164 -76 116 -234 -151 -182 189 -78 -105 511 406 -147 -411 287 438 231 -391 -289 157 362 -336
928 -336 -396 -111 387 -10 -66 46 45 32 -91 -35 10 269 -34 -157 -346 184 -163 -163 340 -55 195 116 -625 -158
952 -158 342 152 -386 5 79 -52 -47 277 203 112 63 -237 41 169 -118 -309 -9 245 500 -229 -41 -351
974 -351 54 -218 -505 96 310 5 -244 -260 231 0 -264 -88 30 101 428 -115 113 367 -49 -376 -18
995 -18 -97 -5 0 -243 -18 141 31 -433 -401 370 -321 -275 146 31 391 -99 31 -139 288 -54 -98 -201 467
1018 467 -41 -118 192 -81 246 61 -237 -113 -58 48 -154 -328 136 192 203 155 -367 -31 72 -551 93 430
1040 430 -3 -349 -128 471 320 -533 -181 -114 345 -133 -319 61 32 -311 83 61 135 -91 -305 -222 197 6
1062 6 201 -103 144 463 84 -309 -101 210 -164 -175 76 173 92 -128 -28 -282 84 359 -99 -109 253 7
1084 7 -11 -232 -206 -3 168 -319 -244 242 276 101 -38 36 419 197 -165 -25 -50 420 -198 -236 215 109 344
1107 344 -201 -176 -22 48 -284 -181 267 152 -55 -142 -86 2 -248 -210 -111 193 323 150 192 105 -66 -116 -213 -406
1131 -406 382 -54 -213 -195 -180 229 -134 -9 24 50 -208 -551 -53 42 55 -142 -196 -132 147 120 -179 -60 166
1154 166 241 -138 -217 119 170 -32 396 -204 -164 -155 -281 -105 243 37 -58 300 -15 78 -150 275 79 149 34
1177 34 59 -55 141 185 -265 100 31 -72 290 167 -126 -29 -272 204 269 34 89 -501 -4 -24 -345 -131 148
1200 148 -202 17 293 12 52 -120 132 58 -296 49 -133 139 -94 127 208 191 -140 -38 -114 70 147 72
1222 72 149 111 35 205 -259 -90 224 -37 254 -151 37 -212 -234 147 135 -45 125 -47 5 -174 -157 -137 107
1245 107 153 226 123 158 -22 254 -7 -45 17 45 175 337 8 121 34 -126 -308 -85 200 -84 -46 254 1
1268 1 206 -155 115 56 65 -198 -90 57 227 33 -348 292 89 76 131 85 230 -169 -15 -5 -134 117 248
1291 248 93 286 258 -45 -59 -20 281 -29 -180 -68 252 7 -158 191 -186 -304 83 -77 44 -35 304
1312 304 373 116 229 25 -134 72 -39 160 -37 107 316 173 70 166 -132 9 -53 241 15 -226 -151
1333 -151 274 -157 352 106 -91 208 279 3 -177 -168 33 -107 -5 256 -100 -73 14 -167 34 -209 -106 34
1355 34 -135 -158 109 -17 363 -452 3 226 -73 77 38 -86 -200 230 317 101 9 22 -72 -86 -52 211 -218
1378 -218 15 61 -123 1 -281 74 189 281 -12 111 56 103 -28 -130 114 58 130 25 -39 -51 178 -38 151
1401 151 69 173 91 -129 53 -11 70 173 -116 -37 188 166 -62 -121 25 240 -152 -244 17 -90 151 218 -193
1424 -193 -248 -35 158 -198 -390 107 30 -76 -158 8 63 442 175 -209 204 312 42 24 -158 119 -130 78
1446 78 -22 -574 114 -86 39 284 169 168 -139 18 -190 -316 52 -15 237 -232 -68 142 57 549 36 48
1468 48 222 82 -21 -32 91 156 0 -25 287 185 389 -159 -26 -33 38 58 -175 11 -140 14 -403 -221 -108
1491 -108 -123 -126 -92 331 51 92 -34 -223 29 -113 -193 109 44 255 -97 21 -252 141 38 -53 -139 -40 -40 227
1515 227 -417 -219 -146 -190 81 163 -42 -24 -25 -183 26 -139 -348 198 51 101 191 136 -100 193 410 136 144 -62
1539 -62 -305 -59 -135 -77 147 -112 -24 -172 420 198 88 -387 -109 -59 -91 -227 -170 -63 -11 -137 261 39 86
1562 86 179 -319 348 142 -55 -90 -128 33 65 -70 -6 250 -134 21 206 236 -83 -211 18 -246 -39 72
1584 72 -138 -12 109 146 210 -128 -429 319 -275 -241 -48 158 202 116 117 -10 259 -420 -40 -164 -9 -133 -171
1607 -171 -211 -372 102 130 14 102 195 -243 166 31 -60 25 84 47 -33 -61 -52 143 -187 -256 31 189 267 125 -2
1632 -2 -34 127 2 84 -97 -14 -59 388 -201 -149 -16 259 373 37 273 -239 -349 165 -83 154 -170 -221 290
1655 290 34 -48 242 -136 -42 195 98 -169 74 -49 -52 -42 -221 321 121 -339 27 -22 -172 -201 74 -170 352
1678 352 137 -229 -229 76 14 187 142 -311 202 161 95 -108 -204 133 61 -266 131 -13 14 -311 -22 459 179
1701 179 -291 -11 -76 177 -108 -100 173 -216 -358 -81 169 132 -28 64 -163 38 266 -90 -11 -316 410 -331
1723 -331 113 -1 16 150 -14 38 33 356 78 38 -212 -6 387 -62 109 92 181 -23 -54 63 -121 115 -23
1746 -23 -140 -67 -82 -31 -133 -290 -34 -194 -194 373 103 126 -46 -23 -6 -27 -185 -302 -96 14 -28 -304 129 -155
1770 -155 -301 -47 -131 -4 149 37 -103 -207 -17 -287 -393 -182 254 -87 -273 142 -256 113 32 77 -255
1791 -255 193 164 -203 -139 -85 198 121 -123 -74 33 15 -211 -164 190 37 -85 -22 53 -21 -190 -76 33 217
1814 217 -65 -200 33 483 81 -18 40 46 -267 -238 -130 237 -108 -225 -308 125 -7 104 72 -49 78 -66
1836 -66 -170 -291 -219 -124 25 -84 -294 237 41 -302 -22 214 -179 -93 143 -100 102 -62 203 335 -71
1857 -71 -190 -156 132 -237 33 -457 -246 119 -28 -481 -204 -170 -43 343 -3 183 82 134 -61 -53 79 29
1879 29 130 -56 -56 -281 -370 80 -428 -167 32 248 -25 -182 -52 17 -32 86 9 -82 113 -283 -559 233 0
1902 0 -225 -238 24 418 -250 -298 98 -72 8 18 -167 343 170 181 -4 47 -79 404 106 -11 1 112 -125
1925 -125 -248 -191 290 67 -118 119 -92 -84 -13 -122 58 -186 121 -265 112 -70 -260 125 164 276 34 33
1947 33 -59 132 81 1 -200 191 276 -33 -214 -118 379 -198 -404 -115 124 217 118 239 103 202 58 79 -47
1970 -47 -8 96 -106 87 -310 -76 -149 4 208 69 338 189 23 65 -17 175 -4 -45 -148 10 -285 -275
1992 -275 177 58 38 -160 -334 126 4 -97 62 -112 -42 33 145 22 -178 -260 -79 131 52 40 103 29 323
2015 323 183 -43 439 -58 -294 -45 215 181 23 231 -182 -299 227 26 191 -59 31 -50 42 13 -361 143
2037 143 49 -103 -264 -65 -176 208 -36 161 95 282 -139 -18 24 224 -245 181 123 -372 99 47 298 317
2059 317 314 -281 -191 -72 105 41 -25 -191 25 -341 114 151 187 -211 -154 5 -16 127 -246 59 132 8 62 20
2083 20 -21 -92 36 -410 -63 77 343 293 -119 203 -79 5 -95 96 -76 39 -129 -105 239 137 139 67 96
2106 96 127 -38 -179 337 -214 377 -147 -223 453 -79 214 -474 -55 341 -205 -15 -35 18 -62 -681 -229 -1115
2128 -1115 375 138 -141 259 -436 50 291 299 158 52 253 218 -90 87 218 144 180 -80 -95 185 19
2149 19 316 246 -39 52 -388 225 245 -67 -4 -158 171 -12 -169 -131 233 411 4 -283 143 207 -167 -2
2171 -2 -75 -26 -54 -120 245 287 -333 61 154 159 -40 -156 -23 262 -146 22 13 354 338 187 -13 -9 139 25 31 -89
2197 -89 71 39 348 38 167 15 320 -51 -516 -38 -6 238 -12 100 301 120 -297 -294 126 316 311 247 -19
2220 -19 12 -90 84 -58 318 281 -62 76 -103 -78 40 114 -322 64 44 -49 -15 183 161 134 -342 -253 -161 110
2244 110 113 -143 -4 21 113 -192 -48 132 -183 -37 -45 49 174 326 -76 23 222 -257 -148 -217 60 117 179 40
2268 40 -47 16 -88 15 -15 134 145 55 -241 -77 215 -4 -122 -142 -375 195 72 12 102 12 -148 -16 -32 73
2292 73 -47 -203 119 -31 31 186 24 272 -6 85 172 34 -166 46 -210 53 -103 74 226 102 -68
2313 -68 -122 -79 140 76 -6 72 -153 110 -103 -38 -95 172 -66 196 103 125 -23 -283 148 -436 -21 -208 -156 -173
2337 -173 -93 214 -32 -145 150 -37 -27 -194 -74 91 173 175 206 -238 145 27 106 -86 -105 67 234 47 -310
2360 -310 150 -208 142 136 -126 -160 359 -21 63 156 -4 127 37 280 212 -137 280 226 -317 -242 55 -436 228
2383 228 -69 -86 127 155 143 -42 -419 -236 -256 9 241 142 -9 -92 -70 25 237 17 -158 -89 -262 474 -114
2406 -114 -344 -154 39 -332 -107 135 -190 -33 -179 -30 311 239 -64 -55 104 -59 -499 163 114 95 -237 72
2428 72 -31 -98 115 154 220 269 -69 37 -160 151 232 -337 349 -167 -192 17 -30 160 -271 -343 204 -154 111
2451 111 -160 -256 -5 -310 212 86 117 66 -26 245 69 134 113 76 -79 -435 -97 148 71 -116 72 -327 61
2474 61 -69 -5 45 -50 44 -103 -368 81 469 78 -35 285 59 98 -13 -294 345 17 133 351 -187 -48
2496 -48 303 161 154 -24 4 -309 -201 261 -223 56 105 -85 72 -34 253 23 -112 -2 -187 -116 258 167
2518 167 123 147 -188 -127 116 -66 -274 -25 158 207 -41 -20 144 -9 7 72 -302 103 165 -109 38 20 -45
2541 -45 -312 101 -56 384 97 253 139 -55 -110 217 267 147 -50 220 49 -4 -256 -216 -11 -181 -31 -315
2563 -315 123 -2 139 5 -16 -103 -280 -279 133 -56 -121 111 13 -269 -68 109 259 95 -85 126 -245 -48
2585 -48 11 -340 -234 100 223 83 -115 -77 -40 -56 -130 355 -96 -49 -168 -77 -38 -159 -40 -226 134 124 292
2608 292 -126 -225 308 173 2 154 -158 -36 -12 -220 209 -31 310 -64 129 -224 43 167 54 -67 190
2629 190 233 -169 -73 -201 8 39 164 66 120 268 18 107 -157 -144 284 207 128 -117 -160 -95 -122 -53 10 87 68
2654 68 -225 -19 33 -246 5 313 -66 21 -22 -47 11 219 -19 139 177 -241 44 -130 79 301 -216 -160 -108
2677 -108 105 -229 155 139 -145 212 4 226 228 142 219 -1 -110 180 -116 -144 -9 -152 105 447 -121 -81
2699 -81 187 -44 -9 92 -132 -67 -246 205 174 128 217 21 -67 326 -185 -243 171 88 477 -201 13 16 -58 84
2723 84 -41 -100 -18 -8 173 129 393 178 -41 54 -255 -63 -14 -143 50 -146 -168 25 -183 95 -192 273 48
2746 48 -215 -324 42 -65 -251 250 118 67 -59 -9 100 -95 -46 320 -55 -41 -61 -29 -52 112 7 -126 30
2769 30 -176 -388 195 274 -161 -194 180 55 167 -87 -9 111 172 -404 -66 -328 -212 250 -459 160 -29 81
2791 81 -136 254 364 313 150 -234 -223 -105 126 330 370 -23 197 463 -143 -120 -79 104 161 218 -103 -68 -106
2814 -106 43 -59 221 -54 -233 -15 -119 116 414 -127 -119 -266 -81 -11 -344 149 59 127 65 37 -11 147 -236
2837 -236 37 29 -151 -84 -34 128 251 -32 113 -154 -125 110 -58 -29 -237 -425 -117 138 19 108 -57 269
2859 269 -249 -149 193 90 223 83 100 -122 14 -157 170 -101 -290 15 361 -489 120 72 100 -38 8
2880 8 177 130 544 -176 -113 -98 -24 -181 275 127 -21 -40 33 -106 39 266 148 43 -8 83 -290 324 0
2903 0 170 215 -396 172 130 -53 34 55 10 71 421 86 171 24 -253 -102 -177 18 138 379 -338 100 210
2926 210 8 23 354 50 -4 379 -104 -25 195 -63 -161 -116 -80 250 -16 -48 -67 147 59 153 195 -250 -87 396
2950 396 32 386 -58 7 -44 48 241 39 -232 -241 -226 205 258 -209 -150 -278 -71 -276 -166 -205 86 -86 -76
2973 -76 -91 -55 -6 -35 40 -10 34 89 181 -56 101 95 327 -155 209 -9 152 44 72 -73 253 -200 -154 164 -6
2998 -6 78 -101 37 135 -54 74 -52 -365 166 125 365 164 200 -111 -326 -121 118 97 -98 17 96 132 42
3021 42 213 202 35 42 5 -48 21 -7 -128 198 -292 66 -47 -185 -138 9 -174 -108 -220 -280 94 91 59 -77 98
3046 98 190 -67 -200 -266 -29 8 -217 -135 -64 145 -47 64 85 73 101 -71 -109 -2 -164 223 -115 -94 -152 -296
3070 -296 -21 157 294 -299 6 -32 -16 -28 77 233 176 -103 -65 -167 88 99 21 -7 -24 429 168 -227 -424
3093 -424 27 9 285 -4 32 -24 -219 -94 56 -447 219 148 127 276 187 -48 36 36 -56 79 -24 169 -79
3116 -79 250 9 89 168 -412 -121 -61 -180 193 -63 -9 189 20 -22 97 -224 102 -14 -295 -63 114 312
3138 312 94 -114 -202 -367 -245 -190 179 -264 -116 -140 117 131 51 369 -184 81 -79 180 34 -371 -128 79
3160 79 -165 -61 -186 -8 -62 -229 179 59 295 -105 -131 5 164 10 -350 63 -83 76 -470 121 186
3181 186 223 43 -332 -88 -231 -74 -135 124 142 521 -250 346 -42 113 51 -129 43 -144 -189 155 41 -32
3203 -32 -49 41 228 -13 135 221 129 -103 -113 2 -51 -151 271 -132 -241 29 245 -199 -241 101 -196 -30 -102
3226 -102 -248 446 -11 123 -148 -153 129 -9 -144 -157 16 65 214 96 297 58 -132 150 101 85 166 -208
3248 -208 49 -15 -299 163 19 2 -136 113 85 -12 -255 -205 -37 -64 91 96 -183 -131 -217 207 -54 -301 -40
3271 -40 -100 113 53 -146 28 -50 -14 218 311 -147 210 -102 363 -214 247 206 167 146 42 96 44 -76 -125 159
3295 159 -274 124 -87 95 186 -109 -226 67 -100 94 141 -81 50 -6 19 -21 -61 51 60 182 78 -83 23
3318 23 -271 28 104 -81 275 269 -266 49 -142 167 496 0 243 277 11 -273 -197 -278 -97 -147 377 82 -122
3341 -122 1 -27 121 -55 89 132 -76 194 165 -134 6 -276 191 15 10 -61 -45 49 141 36 17 180 -223
3364 -223 111 72 356 -177 30 -146 -234 202 -80 107 263 -306 42 -22 -89 66 110 35 313 -181 -9 137
3386 137 76 273 135 -32 185 171 39 245 -105 -208 -219 3 -3 -96 -72 229 -237 85 -304 -90 254 168 22
3409 22 19 238 160 3 98 -155 -40 42 115 118 -151 -3 -276 -256 -57 -65 237 -94 -82 -172 18 -39 94 268 -265
3434 -265 -158 15 66 201 -136 -213 319 -61 -250 22 154 -142 -147 35 -34 -1 -236 202 21 -219 -56 -130
3456 -130 364 50 41 107 177 -121 -585 -51 -216 215 542 -278 -165 339 282 -160 170 -37 -71 -24 -77 -95 85
3479 85 -63 -272 -209 -14 211 -32 -20 63 -298 176 194 237 -107 -148 99 -35 115 63 -117 415 54 -4 105
3502 105 -55 71 118 -186 -69 -97 -70 -73 53 13 -197 -254 -35 -9 -160 323 99 109 -276 -14 -203 -222 -97
3525 -97 -151 -116 3 90 -73 -221 119 148 -50 147 57 -245 -38 -149 152 15 -100 -45 -76 -108 193 256 -197
3548 -197 -81 5 -1 -94 -160 136 -27 89 -169 23 194 -151 -76 28 69 -94 -52 -43 28 164 218 81 -276 161
3572 161 148 198 50 -178 -196 0 73 -40 -55 32 309 89 81 21 388 33 415 -66 247 99 -163 175 -245
3595 -245 41 21 187 -428 44 200 -43 148 -19 119 109 -138 191 -59 -206 -233 14 -82 61 -80 297
3616 297 9 -109 -124 -74 5 -26 211 275 -79 -69 216 -130 -126 -21 -21 246 287 -189 -218 12 -106 8 -35 54 -21
3641 -21 -99 -263 72 -110 -35 73 163 -177 28 -332 283 24 28 121 14 32 -184 119 319 -168 196 97 418
3664 418 -90 142 75 55 97 -109 169 -58 151 -75 -85 -94 -116 -314 -179 -111 93 154 -163 189 246 162 -187 227
3688 227 -356 -175 202 -13 96 -270 -18 -118 -457 -44 -105 -35 -56 -159 -141 -10 -96 122 17 -9 21 315
3710 315 -48 -86 -36 -166 39 -196 -223 -254 -417 -253 -5 -65 -124 -140 48 18 122 81 117 -142 -285 30 86 95
3734 95 63 -103 98 100 -12 280 80 -127 -89 40 -78 46 153 -101 10 75 -215 94 93 -134 29 17 -108
3757 -108 -145 60 51 -202 -101 -76 -73 96 -60 -123 53 274 67 68 321 -173 180 72 46 530 80 68 148 -175
3781 -175 245 180 -273 -184 -137 -167 -237 158 -287 107 4 -45 -60 23 397 192 45 -1 50 45 335 -50 -20 -45 11
3806 11 89 -190 -89 -173 48 -100 26 4 -93 -159 191 -297 -39 -107 234 298 -160 -155 -35 -235 -226 -178 125 70 -61
3831 -61 83 -123 -125 -41 188 289 -116 123 -187 -177 155 -113 25 -106 487 116 177 116 190 -44 -17 37 -26 126
3855 126 48 36 116 81 -44 -422 11 81 -42 -294 181 -68 19 -10 234 -31 -240 169 211 338 266 -127 45
3878 45 3 -231 -150 -410 239 -82 43 9 -36 -201 180 309 -35 142 -135 67 -54 -165 -134 155 -251 251
3900 251 -170 -371 -21 -24 9 -115 -253 -274 -61 -88 -189 50 -109 -131 207 198 -184 74 154 124 -139 173 -18
3923 -18 -18 -106 -215 11 -72 -10 -14 -16 -126 -383 -206 366 -414 -50 329 65 -230 -2 -176 -15 -120 -22 43 -39
3947 -39 106 40 116 3 263 -250 -317 -7 7 -82 238 172 -34 64 -220 -73 136 -238 293 115 -4 122 284
3970 284 -47 112 -85 -200 -216 -173 190 59 -170 -216 -144 -131 80 36 115 -89 433 -62 49 128 -132 124 -208
3993 -208 190 162 -98 32 -166 -139 110 -330 -89 -169 245 -56 218 -129 31 180 96 -72 90 -72 -21 30
4015 30 160 76 -127 -105 -97 273 -274 -254 45 -347 88 -59 116 -78 -69 89 103 173 299 -181 -127 -54 164 44
4039 44 329 -153 116 -82 104 -21 -135 -174 -180 51 289 -110 -336 -101 161 55 -137 -155 -46 113 28 -261
4061 -261 110 145 363 195 -112 50 193 7 -29 -23 130 -86 290 -16 -208 -175 -22 -224 169 17 -106 -3
4083 -3 40 19 230 -159 -17 333 53 -10 52 -219 120 65 -232 30 -60 157 77 462 289 -337 61 -85 255
4106 255 -20 76 -32 14 -307 -87 202 -175 153 175 273 -61 23 -283 -318 251 -94 -249 121 156 -98 -297
4128 -297 57 -184 99 167 322 197 63 -218 -256 -14 -8 90 -44 45 -68 222 -238 217 -170 174 -19 -196
4150 -196 -242 8 -82 -121 -360 12 0 -73 -186 96 -2 -250 154 -118 103 152 -29 15 -61 165 157 15 286 18
4174 18 -115 -83 72 277 -156 -18 106 -134 52 -176 257 183 44 108 38 182 88 4 -211 -102 33 213
4196 213 90 140 2 -208 162 435 -324 42 71 -187 67 -422 -151 329 82 185 -15 245 285 99 49
4217 49 3 161 343 -120 192 -133 99 148 6 -40 124 42 60 17 -82 -53 133 84 21 -247 109 82 209 -115
4241 -115 488 -63 -112 188 202 297 11 154 17 -125 -92 136 -40 -195 -245 138 224 175 -118 12 -204 7
4263 7 -152 -268 -24 9 -112 58 116 -316 218 -234 -80 -3 -139 352 -3 70 -284 -187 335 352 26 360 213
4286 213 -58 -36 -19 208 151 273 -1 75 89 -123 -34 193 -287 48 218 283 57 -139 -214 5 -159 -25 65
4309 65 -186 68 -101 192 174 -92 56 2 -113 -120 69 -123 57 3 -12 157 262 98 105 90 -95 -236 -36
4332 -36 228 32 172 -203 -223 313 222 331 211 355 -50 -64 -15 -54 186 134 -128 -82 -296 -103 -29 127 -93
4355 -93 94 326 -544 -199 219 118 -84 -64 -315 -79 52 67 71 0 21 19 -111 70 -213 263 251 116 64 -31
4379 -31 144 -242 198 6 133 -106 80 -237 128 28 128 -282 51 -243 -68 -195 -194 109 161 38 -60 -347
4401 -347 47 118 -159 13 -372 -8 154 286 327 -171 -56 108 -43 -79 -163 -138 156 -15 -65 39 50 262
4423 262 160 15 32 207 -155 39 94 -113 185 -31 -33 -95 47 -460 -29 138 -9 83 -164 -57 -17 -16 112
4446 112 220 108 -108 -63 164 -110 206 -157 48 5 186 -76 -16 356 132 24 -72 -399 -101 62 -356
4467 -356 48 47 -88 260 63 149 138 -132 -180 -127 81 92 -142 -40 -52 -43 331 -157 -100 90 237 74 -123 -5
4491 -5 -100 210 -209 49 124 119 22 -389 -123 42 89 110 -36 -187 53 -134 -165 331 -323 23 -124 331 -41
4514 -41 -83 52 16 206 72 -437 132 -172 90 115 138 201 -149 148 -117 -364 33 77 -95 -121 -90 -22 -220
4537 -220 -62 216 -184 201 -38 -405 -58 -8 48 -394 -154 -141 -64 -271 153 8 -98 194 -130 17 39 143
4559 143 24 1 -173 338 -155 -56 -281 57 -34 -183 139 -252 -147 262 64 182 -192 -55 45 -345 -32
4580 -32 -105 -33 -215 -12 -136 -98 -169 300 332 7 -202 91 -137 -9 237 -48 47 -52 84 4 -99 72 69 78
4604 78 143 190 -6 -204 -68 44 -54 -99 126 242 -120 -48 204 -137 110 -254 77 33 -436 -37 -52 -7 134
4627 134 156 160 -259 107 -65 -33 61 -10 180 131 -102 -108 253 235 -356 34 -156 130 -26 -99 -254 2 -121 -15
4651 -15 -274 -332 -44 371 -164 183 -101 179 214 -268 4 21 -161 215 258 -120 282 -119 70 -1 -57 18 -253
4674 -253 60 167 -94 -177 257 -403 -172 13 -18 83 -74 -347 -184 -140 231 -130 37 147 -89 -135 249
4695 249 262 -117 64 8 -94 31 -82 207 150 88 -268 -28 -78 -39 -134 -18 -13 3 -366 280 -221 -241 199 -61
4719 -61 -284 124 536 -68 128 105 -167 30 -207 104 -80 -5 -338 -120 256 147 -38 72 -55 38 -243
4740 -243 51 -10 -196 356 -124 -11 -40 85 22 179 361 -24 58 -281 33 136 -37 -67 -9 -49 130 33 -352
4763 -352 -119 83 -289 -133 21 43 -114 -149 52 43 -134 -86 -204 169 132 38 -167 353 113 -91 162 -176
4785 -176 448 -236 228 64 -82 -54 -204 120 159 168 -117 110 279 -246 178 -316 -3 88 -30 146 183 72
4807 72 -108 -6 74 35 -137 -18 149 -63 -123 132 -77 262 -76 32 24 376 -54 -196 -159 -181 -75 -306 -113
4830 -113 19 127 -40 141 -224 118 178 -24 -316 -52 -25 -74 -116 23 65 -264 -98 302 -76 -332 60 11
4852 11 190 24 -33 -48 96 292 -109 83 157 28 -115 71 89 -165 -295 -212 9 3 -4 -203 -282 48 385 30
4876 30 30 347 -263 -56 -14 350 -210 0 -137 -85 -116 -79 193 -342 -162 279 -107 -107 70 -88 -334 73 -78
4899 -78 -22 185 77 76 -98 179 33 30 13 -215 479 -6 -143 -225 -56 157 83 136 -182 23 -53 39 204 133
4923 133 -263 -128 -26 156 22 176 427 331 -76 -64 -121 146 211 5 221 233 -42 -32 -112 61 -84 227
4945 227 -33 -111 44 -273 117 153 71 -74 -107 103 -129 313 -47 13 -7 -176 -50 12 300 26 -73 -69 -152 -9
4969 -9 -237 -42 -231 -286 -17 -51 174 0 197 317 -7 249 173 -130 162 -68 165 -47 61 109 -36 117
4991 117 223 75 -39 193 -274 106 10 -105 -70 -156 114 -238 -32 265 107 78 -16 -416 -32 -97 221 94
5013 94 -36 -295 393 -240 125 -134 133 -138 157 -52 -32 223 -172 349 -86 -53 -291 150 127 80 18 -161
5035 -161 74 362 97 34 175 96 -120 -76 102 -213 110 23 58 220 -192 -68 217 195 -34 280 -68 276
5057 276 -123 -170 201 169 166 60 -271 -323 83 -288 -393 145 -41 -45 -224 -5 -77 125 119 50 76 -184 -73 80
5081 80 305 -146 -145 -150 354 229 -124 -76 178 -64 127 109 139 -288 102 -394 -117 354 -183 87 160 -160 19
5104 19 -164 -165 30 -52 -206 194 -49 81 46 -117 -190 -25 200 301 -76 -6 312 77 -138 86 74 -47 215
5127 215 -109 -120 124 -69 58 28 9 0 -204 -126 -140 -40 -127 97 -389 177 -364 245 -165 -129 21 -382 162
5150 162 130 123 107 -155 319 27 76 287 304 -186 -27 -294 -350 195 39 90 -154 181 334 -57 12 392 -155
5173 -155 -32 141 -120 -251 158 134 -16 32 264 -26 -173 40 121 233 -209 209 -203 5 109 22 227
5194 227 -19 -13 -112 -22 217 -151 -149 409 -111 374 255 -199 259 2 44 178 -42 166 133 217 -258 -287 76
5217 76 38 -207 -159 -76 133 -173 131 -10 -249 286 -134 -237 109 -171 36 317 -210 65 -169 13 212
5238 212 57 109 77 -413 76 103 27 209 147 -183 17 196 -32 80 -40 -21 102 211 -228 167 -177 -312
5260 -312 -8 -57 -53 -148 41 111 -216 -48 110 -17 1 -57 -181 158 8 -193 47 72 -140 132 110 -53 98
5283 98 140 -24 123 172 -14 232 335 -75 -83 -173 -71 -58 -87 42 -23 -157 -250 -108 -116 -52 -186 -241 139 208 -185
5308 -185 85 17 -68 -82 -279 -68 -1 -361 24 -124 200 65 48 -115 52 220 190 -206 -160 -64 -103 20 104
5331 104 287 14 55 10 94 -280 -224 178 -107 -43 248 -43 -179 -62 -198 -35 44 -156 290 312 155 -273
5353 -273 -12 -228 5 24 194 -55 58 80 153 203 -136 78 -93 -10 -254 -56 -23 222 70 -82 284 321
5375 321 290 127 606 14 -28 101 -170 22 74 -134 33 131 24 173 -88 -200 -78 72 -247 -123 -11
5396 -11 10 -274 25 -138 -24 -55 4 190 137 101 -151 -37 -35 161 -37 592 44 289 -2 45 56 -5 25 212
5420 212 -92 -158 157 -134 116 -173 -2 -178 60 55 280 -418 165 69 -40 -149 -62 144 107 -348 3 43
5442 43 -158 -13 144 86 1 16 62 42 291 -30 19 -219 105 -12 29 162 -51 -335 214 -130 117 -102 -52
5465 -52 59 -104 -293 313 184 -44 -210 -346 -199 189 -232 156 33 -128 -38 64 5 118 129 -84 -28 37
5487 37 -45 210 222 64 -182 -61 -40 29 0 12 68 -167 171 -52 -119 98 114 -190 70 -246 19 125 -10
5510 -10 -106 -86 -443 -53 43 -86 94 56 7 -144 -433 -158 28 136 2 120 280 113 199 -134 -52 -85 -73
5533 -73 -326 13 72 -39 -27 247 235 -521 37 94 163 -78 118 94 64 61 39 21 -14 2 -235 -46 320 -175 22
5558 22 -204 226 23 -109 -53 25 159 -29 165 160 7 -95 264 -104 -161 0 2 119 -195 16 270 12 -26
5581 -26 -120 175 39 51 192 83 -194 -138 116 -2 -275 -148 67 -95 197 285 378 35 -190 -368 146 182
5603 182 143 58 284 535 10 -90 -101 -157 -40 1 242 -61 -90 -26 8 171 -391 -239 178 -103 -107 154 -298
5626 -298 99 -47 17 96 -246 6 -47 54 -341 -10 1 95 -103 71 -60 105 -261 -114 -5 -94 7 -133
5648 -133 40 -321 583 -312 4 -104 -9 -23 -15 -57 -170 186 225 -10 437 -267 16 294 -153 -60 21 -84 22
5671 22 86 -195 251 -135 136 159 -125 32 76 -23 -255 123 -148 151 -199 -33 -5 34 -81 -122 -29 -289 106
5694 106 197 -119 392 96 -434 110 -155 -303 -134 151 -89 18 236 42 -328 126 -89 -175 171 -125 -203
5715 -203 -327 -19 38 39 40 -18 225 233 6 -63 -88 91 -11 24 -214 -142 216 -205 56 117 42 -184 224 110 14
5740 14 150 71 31 227 -42 41 -177 -58 248 285 78 -139 -90 -91 -245 -138 135 -353 -550 -151 -40 106 -247
5763 -247 -229 105 38 35 358 94 -103 34 -81 -188 54 41 -86 46 -290 -420 -153 -162 -352 20 247 -363
5785 -363 139 132 216 55 83 -34 262 252 204 -69 60 -93 56 -117 -135 4 -280 -194 -30 71 -28 -14 -60 -98
5809 -98 -15 -13 140 -159 138 39 -234 141 -160 189 122 125 -325 216 -7 -52 244 125 107 151 156 -115 55 0 404
5834 404 485 470 -24 -83 -186 -25 48 -291 117 -56 -448 -6 -18 73 79 -131 -86 23 -182 -100 85 112 -16 161
5858 161 -117 -318 1 -288 74 -146 267 60 59 44 -55 181 96 -229 60 47 22 -104 -82 124 -58 53 29
5881 29 99 -183 70 -100 21 68 -161 202 145 134 307 208 -254 -199 -277 -76 77 85 -227 314 208 61 28 68
5905 68 -133 185 -182 30 266 181 241 78 142 -153 -127 52 -393 -32 107 -164 138 355 174 -30 53 -103
5927 -103 -142 42 150 -38 -4 24 85 -50 199 160 -60 184 280 -230 -33 29 25 247 -172 210 51 88 -53
5950 -53 34 -58 347 357 -176 46 255 131 -75 -64 235 124 52 -23 64 -50 -91 74 10 194 -252 156 224 -71
5974 -71 66 359 320 37 -41 -73 -12 422 228 -56 145 -51 -18 182 146 -152 -189 -317 -272 -1 409 25 -33
5997 -33 8 -129 -93 58 -144 94 -243 248 -11 114 10 -55 34 106 -190 -31 51 159 216 62 23 82 19 66
6021 66 48 -336 -150 -52 -175 -193 -112 -26 -148 -318 -73 -55 -28 -238 31 -58 51 184 158 -450 -3 213 187 170
6045 170 130 159 -388 -327 -223 253 135 -89 11 200 186 -271 -41 119 163 -363 224 -280 -360 415 27 -150
6067 -150 -14 31 162 60 58 -84 112 -98 -179 -29 -24 -115 -41 0 -258 296 -18 306 -94 -209 -379 -91 -140
6090 -140 -319 150 -135 88 60 -176 2 24 3 119 128 -130 261 -99 -27 -208 116 -99 151 194 -357 -134
6112 -134 5 -191 -8 215 24 -9 118 -23 -31 260 -20 98 -165 -5 120 -20 113 29 -211 10 -118
6133 -118 -63 248 -257 331 -85 55 227 83 27 -51 -151 -171 210 127 -142 -468 47 -55 -292 89 312 -200
6155 -200 -71 -194 127 -39 52 120 219 -169 -311 300 61 -226 120 -170 -293 120 158 -9 185 -236 -161 -281
6177 -281 77 88 78 313 66 -187 -50 -58 -129 295 -130 102 -11 91 -273 124 -160 78 -44 94 393 -127
6199 -127 151 97 -35 366 258 15 322 -57 293 126 -181 81 96 -19 -356 -132 102 2 -115 142 -205
6220 -205 45 39 105 -71 -174 179 217 -243 -33 -209 124 109 45 -114 404 382 109 285 -65 -87 -88 233 243 172
6244 172 74 78 -38 129 -114 -45 114 59 139 -301 -199 86 -188 -29 -53 -24 73 -329 -138 -229 198 -287 336
6267 336 260 -27 131 119 -115 -92 -212 79 202 -168 109 -96 114 -185 -18 312 -79 -233 -39 -123 -160 156
6289 156 40 -159 58 -40 81 136 229 -244 -309 67 129 52 120 264 6 -24 -29 125 -215 -116 10 -87 188 -30
6313 -30 -188 -53 104 60 170 244 89 -86 -210 -152 -105 -116 -164 214 -14 -39 -5 132 26 241 108 111 87 6
6337 6 -153 31 281 -75 57 27 -248 3 168 -127 189 -57 -144 61 371 228 -346 -8 3 189 217 3
6359 3 50 193 179 45 154 -127 -345 231 -69 -215 -242 -275 297 8 122 -96 -241 203 -115 -296 -184 8
6381 8 -116 61 11 -124 -97 197 184 17 213 -60 -281 92 -303 -86 98 -225 -250 198 -103 -248 177 -257
6403 -257 5 -227 39 -165 -223 -77 -8 33 324 -166 100 -3 -122 -25 186 -118 316 -56 -124 181 -465 23
6425 23 4 -269 -92 26 91 12 59 -131 -91 -66 -60 -208 168 84 -26 -94 -96 66 -318 -164 455 -57 -25 -40 396
6450 396 47 95 -83 -81 -60 10 79 -230 -90 -173 99 -93 110 34 -73 -148 214 -233 212 177 180 -15 -52 -41 -69
6475 -69 3 -75 -133 -395 -234 82 -110 -58 -102 106 69 10 33 327 201 106 213 -111 47 -77 -57 -47 26 -15 381
6500 381 150 -82 -96 268 217 -178 125 -112 -190 -34 72 -159 -58 -201 94 64 51 -76 -106 187 28 -179
6522 -179 105 -8 -26 -270 -386 -120 -132 -66 -74 163 -309 -35 -158 146 12 385 -117 50 -256 -152 291 -112
6544 -112 383 -75 169 -190 8 -125 -15 -178 -284 81 171 -174 30 220 34 74 119 -104 -51 -528 154
6565 154 83 -209 -217 39 155 -41 40 -74 -172 129 9 74 -242 -349 95 -59 -61 -52 -121 15 -55 92 -157 19
6589 19 -201 164 -207 -8 -124 -132 -16 39 -96 52 14 63 -31 -370 -16 -142 21 223 57 -5 -81 -239 8
6612 8 -21 -218 -88 282 117 -127 54 -85 -323 175 92 -336 9 222 142 29 -99 -83 -48 405 -147 -258
6634 -258 -218 -487 -13 -164 -282 58 -46 -8 -14 -200 -25 158 76 138 -72 -73 -133 12 56 -65 165 -357 -74
6657 -74 -170 116 172 62 68 50 167 95 43 250 -162 -71 -269 -7 21 328 104 -421 68 -418 -272 -259 74 314
6681 314 -104 -96 190 -91 318 153 -30 -37 -208 -148 204 181 -101 -223 46 167 131 -295 25 -177 126 205 -240
6704 -240 114 132 -60 101 -36 125 109 -188 15 162 87 18 -106 -11 146 -93 -395 -348 -550 -199 -171 3
6726 3 7 -178 57 33 189 -133 64 163 361 -37 -18 147 -202 39 99 23 -5 70 -79 -327 -36 13 122 217
6750 217 -306 20 8 -86 -319 248 47 -304 180 -87 339 204 -119 15 200 4 -124 -151 -31 -67 -26 -157
6772 -157 -100 -179 75 89 -56 382 78 497 253 -22 100 -83 -191 380 199 -118 205 -49 -167 66 -96
6793 -96 -87 -103 56 25 109 217 -68 -43 -30 -64 -127 159 172 91 285 145 32 -28 99 -100 -142 -41 -141 230 -151
6818 -151 50 24 79 -161 -128 210 -400 -160 -107 99 218 109 192 -3 -287 -271 -44 2 -214 319 191 413
6840 413 -51 62 -127 107 129 57 137 31 -140 83 87 -141 -36 -341 310 146 -1 346 -195 -80 -343 88
6862 88 6 160 46 114 -236 72 -6 31 -17 -89 246 -196 -122 -57 412 229 60 3 144 0 291 0 255
6885 255 251 -401 -81 254 49 206 -16 -257 -117 -18 -222 -51 -232 -30 -82 -275 -151 145 -31 -123 -22 13
6907 13 137 -75 210 52 158 258 51 -57 209 86 133 -93 -179 189 -41 366 -144 7 1 -86 123 -63
6929 -63 104 259 -374 -215 98 32 107 30 -131 -70 -277 -13 -25 -107 230 -302 -188 -93 -182 114 -277 -185 -80
6952 -80 95 354 -97 -1 -23 -154 -54 30 205 -94 52 58 -258 257 161 -231 112 -1 104 16 393 -254 30
6975 30 120 -8 258 88 147 -155 107 -185 134 -384 -469 287 -99 92 -51 121 373 -148 252 -30 82
6996 82 -233 -236 -9 88 288 -117 -184 -83 26 -48 244 7 2 -80 -373 181 95 102 -47 -166 -4 -127 -61 -57 256
7021 256 294 -259 -39 -30 67 124 90 -141 143 68 58 -80 119 -31 256 -75 90 26 -262 55 -43 -126 -335 29
7045 29 281 -161 268 89 -14 233 -300 -16 -137 74 -166 -227 409 89 246 -224 172 -271 -83 299 161
7066 161 221 -111 -209 -38 -38 107 166 53 15 -25 -27 43 -185 104 62 36 -10 29 -59 -114 -282 -189 165 59 -18 251
7092 251 103 7 60 -139 -85 -108 -236 -110 313 330 -295 224 -214 35 220 -46 15 90 165 -11 298 -267 378
7115 378 -51 177 0 -248 295 111 -186 -44 149 34 -178 -394 285 -69 -31 70 175 108 -43 133 177
7136 177 -239 -140 110 -81 -219 63 -409 206 36 50 -178 -26 96 -378 -103 80 51 198 -266 7 -246
7157 -246 -58 157 -76 -111 69 -196 278 165 133 -343 306 -76 -133 338 256 -285 -148 10 87 90 155 -79 -49
7180 -49 265 -50 -198 -2 436 -300 185 290 419 91 139 -11 -119 -108 -46 454 -100 62 -33 -152 -134 -4
7202 -4 378 -51 -47 14 405 -86 115 0 12 -143 135 95 61 54 174 103 -141 119 97 182 -420 348 -238 105
7226 105 -102 -225 148 -222 59 112 -111 -58 138 -21 36 -61 -65 -278 41 91 -88 -99 64 218 -295 -233 -85
7249 -85 -213 -85 -399 -31 13 126 -243 178 182 -34 -140 -186 192 -61 100 273 -155 -101 48 -124 -38 -475
7271 -475 522 -204 348 146 206 175 -165 -43 -74 153 37 -288 76 -46 218 -85 -215 153 118 43 -329 358
7293 358 157 368 -81 8 164 -96 88 56 133 63 -106 165 297 -133 -141 119 -313 -227 415 -241 54 -234
7315 -234 301 140 -65 53 94 -91 -202 -95 -221 -42 -52 -68 283 -343 -45 39 -19 259 24 111 132 -215
7337 -215 9 -86 348 -3 -200 -71 -145 15 -26 -34 46 193 -227 -240 71 157 42 58 151 249 26 -27 -357 16
7361 16 -110 122 -75 -131 -237 155 194 299 100 -57 112 -228 146 186 115 -30 -63 -316 314 187 -84 96
7383 96 421 4 -223 57 237 -162 200 178 -137 -119 -129 -62 -225 87 62 130 -193 -38 27 308 251 221 233 -261
7407 -261 40 -58 96 46 -64 -81 -246 -44 -38 206 181 -13 -135 -380 87 -145 167 -135 225 273 62 136 -54
7430 -54 333 80 135 -178 -88 94 -10 434 12 97 -236 47 -7 58 232 128 83 85 77 -11 -175 126 -56 -41
7454 -41 -194 272 -272 -76 127 -294 -4 208 -57 68 -80 -73 33 -57 -341 -22 120 -33 -233 7 -185
7475 -185 26 -23 -78 65 53 17 -252 -2 23 -42 -396 9 -62 254 181 -40 192 -25 -127 -273 -7 235 273
7498 273 -125 54 295 197 20 148 -82 149 -52 -91 113 -61 -182 35 -38 -18 158 130 123 152 -25 33 86
7521 86 33 136 141 16 -46 -124 94 -191 115 -34 -82 41 125 -213 -86 -194 -97 60 192 -40 -2 -392 35
7544 35 434 -155 43 63 56 -16 -11 139 -16 -57 -122 256 276 41 -238 -164 131 -198 18 11 54 -24 -38 -174 97
7569 97 -112 -213 -304 -80 -73 -68 1 8 143 8 68 -289 22 -76 -58 -111 221 -37 20 231 -319 -274 12 -127 -377
7594 -377 321 -131 -79 -62 108 91 -425 -40 -82 -134 -10 -313 -21 111 234 -92 1 328 99 39 -41 -75 -71 -78
7618 -78 69 141 -155 104 38 216 203 -48 -381 -291 174 -89 40 136 144 2 -87 255 -4 -161 -86 7 -152 -8
7642 -8 -123 172 -10 -59 24 -35 35 151 257 125 -16 -103 -250 -108 -22 -68 406 114 -11 44 271 -23 -116 -186
7666 -186 -372 -96 -300 -58 19 -328 -6 -172 -392 -108 -60 -157 -24 -163 -285 -120 79 -284 -299 -249 8 31
7688 31 101 134 79 25 -289 125 -99 -388 179 134 -178 52 -267 186 208 -63 94 177 -2 -34 9 -179 96
7711 96 132 309 -10 -74 195 80 -43 168 -150 18 -14 -107 70 184 -275 74 211 66 28 -189 194 74
7733 74 79 217 -214 -414 -38 0 148 307 -87 52 -132 154 -148 -115 -66 -179 -48 -81 146 -308 -112 56
7755 56 -102 13 37 -80 177 -196 42 49 138 86 -90 -89 -21 147 154 120 146 -40 -191 111 106 -255 -135 156 31
7780 31 159 39 151 109 108 26 313 24 38 -235 263 -74 -144 -127 -269 194 227 -47 -78 -119 341 -5 66 246
7804 246 -67 150 -353 -160 -120 -252 45 -74 343 179 60 -141 192 -316 83 -167 -115 -152 277 206 -48
7825 -48 16 359 -45 -232 -20 -129 -109 -251 83 -256 -132 -145 -269 70 -75 28 152 17 48 -21 30 -181
7847 -181 -135 -200 65 -285 65 21 -10 -125 -50 -7 -25 -30 48 187 242 -173 -157 -176 150 235 117 -114 91 9 35
7872 35 -169 103 159 130 340 -35 75 167 -205 -88 325 -114 -236 -204 -32 186 -92 -92 -92 -409 9 -78 289
7895 289 217 257 23 121 -49 148 25 -187 -69 48 -35 -184 267 -496 210 81 -190 -176 -137 222 17 93
7917 93 -311 -217 -196 102 63 -128 62 90 234 1 -73 39 -106 -53 36 78 8 -64 20 -110 139 128 47 34 129
7942 129 60 -45 26 -181 354 152 90 32 288 196 -270 -531 260 111 -142 -275 89 32 26 3 111 -18 136
7965 136 192 -372 170 -24 161 -234 -18 385 202 -10 -56 102 47 -88 -153 -96 -21 -302 -1 279 -112 81
7987 81 28 -219 -77 179 55 -1 -70 7 130 162 314 -224 -286 -171 169 -41 -71 9 373 -25 287 159 -282
8010 -282 386 -29 -11 -23 241 -435 25 -61 -78 -57 -64 288 -57 103 -123 -202 -91 -312 582 -187 137 -4 48
8033 48 107 -150 69 -142 -376 -135 -44 245 41 -153 67 -71 -360 -136 -136 -97 -61 239 -188 4 28 -109 83
8056 83 113 -47 107 -14 -56 -18 -56 137 108 -24 20 -293 219 -139 -214 -171 135 -98 -139 -180 76 -130 54 -318
8080 -318 -135 249 95 83 88 -119 53 -142 -155 63 66 -123 217 -129 315 188 -91 131 -1 -84 -18 -27 272
8103 272 264 108 202 -68 -27 -49 51 36 93 50 -193 185 3 42 42 -7 -212 31 138 126 24 25 6 -67 252 -30
8129 -30 57 180 5 -171 -158 -197 55 97 -18 224 -33 -120 -188 -21 -169 61 54 -325 368 -5 -41 23 32 9 -114
8154 -114 51 65 32 -228 -84 -25 53 -91 -231 84 394 -36 -228 359 40 -9 51 26 175 83 -272 19 98
8177 98 242 -20 51 -67 -64 164 -113 75 -51 113 -194 180 120 110
8191A10
##END NTUPLES=NMR FID
##END=
