##TITLE=1H_E3e-4
 CDCl3
 8 sc, 
 14.6.2023
##JCAMPDX= 6.0         $$ Bruker NMR JCAMP-DX V2.0
##DATA TYPE= NMR FID
##DATA CLASS= NTUPLES
##ORIGIN= UXNMR, Bruker Analytische Messtechnik GmbH
##OWNER= root
$$ XWIN-NMR		Version 3.5
$$ Wed Jun 14 11:24:39 2023 Russian Standard Time (UT+4h)  she@DPX200
##.OBSERVE FREQUENCY= 200.13135
##.OBSERVE NUCLEUS= ^1H
##.DELAY= (6, 6)
##.ACQUISITION MODE= SIMULTANEOUS
##.ACQUISITION SCHEME= undefined
##.AVERAGES= 8
##.DIGITISER RES= 18
##SPECTROMETER/DATA SYSTEM= spect
##.PULSE SEQUENCE= zg30
##.SOLVENT NAME= CDCl3
##.SHIFT REFERENCE= (INTERNAL, CDCl3, 0, 15.7039)
##AUDIT TRAIL= $$ (NUMBER, WHEN, WHO, WHERE, WHAT)
$$ ##TITLE= Audit trail, XWIN-NMR		Version 3.5
$$ ##JCAMPDX= 5.01
$$ ##ORIGIN= Bruker BioSpin GmbH
$$ ##OWNER= she
$$ F:/spectra/data/she/nmr/H-F/1/audita.txt
$$ ##AUDIT TRAIL=  $$ (NUMBER, WHEN, WHO, WHERE, WHAT)
(   1,<2023-06-14 11:23:31.03 +0400>,<she>,<DPX200>,
      <created by zg, POWCHK disabled, PULCHK disabled
       configuration hash MD5:
       00 E9 B6 7A A2 85 ED C7 34 08 36 98 17 FE 4E 26
       data hash MD5: 16K
       ED A7 B9 55 B8 39 66 5F F8 98 CD 83 59 2E 1C EB>)
$$ ##END=
$$ 
$$ hash MD5
$$ 76 2C 7E 96 2A 13 41 13 9D 60 14 6E 11 4C B3 B0
##$RELAX= 
##$RELAX= 
##$RELAX= 
##$RELAX= 
##$RELAX= 
##$RELAX= 
$$ Bruker specific parameters
$$ --------------------------
##$DU= <F:/spectra>
##$EXPNO= 1
##$NAME= <H-F>
##$PROCNO= 1
##$TYPE= <nmr>
##$USER= <she>
##$AMP= (0..31)
100 100 100 100 100 100 100 100 100 100 100 100 100 100 100 100 100 100 
100 100 100 100 100 100 100 100 100 100 100 100 100 100 
##$AQSEQ= 0
##$AQ_mod= 1
##$AUNM= <au_zg>
##$AUTOPOS= <>
##$BF1= 200.13
##$BF2= 200.13
##$BF3= 200.13
##$BF4= 200.13
##$BF5= 200.13
##$BF6= 200.13
##$BF7= 200.13
##$BF8= 200.13
##$BYTORDA= 1
##$CFDGTYP= 0
##$CFRGTYP= 5
##$CHEMSTR= <none>
##$CNST= (0..31)
1 1 145 1 1 1 1 1 1 1 1 1 1 1 1 1 1 1 1 1 1 1 1 1 1 1 1 1 1 1 1 1 
##$CPDPRG= <>
##$CPDPRG1= <>
##$CPDPRG2= <>
##$CPDPRG3= <>
##$CPDPRG4= <mlev>
##$CPDPRG5= <mlev>
##$CPDPRG6= <mlev>
##$CPDPRG7= <mlev>
##$CPDPRG8= <mlev>
##$CPDPRGB= <>
##$CPDPRGT= <>
##$D= (0..31)
0 1.2 0 0 0 0 0 0 0 0.06 0 0.03 0 0 0 0 0.0002 0 0 0 0 0 0 0 0 0 0 0 0 
0 0 0 
##$DATE= 1686727410
##$DBL= (0..7)
120 120 120 120 120 120 120 120 
##$DBP= (0..7)
150 150 150 150 150 150 150 150 
##$DBP07= 0
##$DBPNAM0= <>
##$DBPNAM1= <>
##$DBPNAM2= <>
##$DBPNAM3= <>
##$DBPNAM4= <>
##$DBPNAM5= <>
##$DBPNAM6= <>
##$DBPNAM7= <>
##$DBPOAL= (0..7)
0.5 0.5 0.5 0.5 0.5 0.5 0.5 0.5 
##$DBPOFFS= (0..7)
0 0 0 0 0 0 0 0 
##$DE= 6
##$DECBNUC= <off>
##$DECIM= 32
##$DECNUC= <off>
##$DECSTAT= 4
##$DIGMOD= 1
##$DIGTYP= 9
##$DL= (0..7)
0 120 120 120 120 120 120 120 
##$DP= (0..7)
150 150 150 150 150 150 150 150 
##$DP07= 0
##$DPNAME0= <>
##$DPNAME1= <>
##$DPNAME2= <>
##$DPNAME3= <>
##$DPNAME4= <>
##$DPNAME5= <>
##$DPNAME6= <>
##$DPNAME7= <>
##$DPOAL= (0..7)
0.5 0.5 0.5 0.5 0.5 0.5 0.5 0.5 
##$DPOFFS= (0..7)
0 0 0 0 0 0 0 0 
##$DQDMODE= 0
##$DR= 18
##$DS= 0
##$DSLIST= <SSSSSSSSSSSSSSS>
$$ [...]
##$SUBNAM2= <"">
##$SUBNAM3= <"">
##$SUBNAM4= <"">
##$SUBNAM5= <"">
##$SUBNAM6= <"">
##$SUBNAM7= <"">
##$SUBNAM8= <"">
##$SUBNAM9= <"">
##$SW= 18.05172834244
##$SWIBOX= (0..15)
0 0 2 0 0 0 0 0 0 0 0 0 0 0 0 0 
##$SW_h= 3612.71676300578
##$TD= 16384
##$TD0= 1
##$TE= 0
##$TE2= 300
##$TE3= 300
##$TEG= 300
##$TL= (0..7)
0 120 120 120 120 120 120 120 
##$TP= (0..7)
150 150 150 150 150 150 150 150 
##$TP07= 0
##$TPNAME0= <>
##$TPNAME1= <>
##$TPNAME2= <>
##$TPNAME3= <>
##$TPNAME4= <>
##$TPNAME5= <>
##$TPNAME6= <>
##$TPNAME7= <>
##$TPOAL= (0..7)
0.5 0.5 0.5 0.5 0.5 0.5 0.5 0.5 
##$TPOFFS= (0..7)
0 0 0 0 0 0 0 0 
##$TUNHIN= 0
##$TUNHOUT= 0
##$TUNXOUT= 0
##$USERA1= <user>
##$USERA2= <user>
##$USERA3= <user>
##$USERA4= <user>
##$USERA5= <user>
##$V9= 5
##$VALIST= <valist>
##$VCLIST= <CCCCCCCCCCCCCCC>
##$VD= 0
##$VDLIST= <DDDDDDDDDDDDDDD>
##$VPLIST= <PPPPPPPPPPPPPPP>
##$VTLIST= <TTTTTTTTTTTTTTT>
##$WBST= 1024
##$WBSW= 4
##$XGAIN= (0..3)
0 0 0 0 
##$XL= 0
##$YL= 0
##$YMAX_a= 81124
##$YMIN_a= -65768
##$ZGOPTNS= <>
##$ZL1= 120
##$ZL2= 120
##$ZL3= 120
##$ZL4= 120
##$ABSF1= 10
##$ABSF2= 0
##$ABSG= 5
##$ABSL= 3
##$ALPHA= 0
##$AQORDER= 0
##$ASSFAC= 0
##$ASSFACI= 0
##$ASSFACX= 0
##$ASSWID= 0
##$AUNMP= <proc_1d>
##$AZFE= 0.1
##$AZFW= 0.1
##$BCFW= 1
##$BC_mod= 2
##$BYTORDP= 1
##$COROFFS= 0
##$CY= 11.3945322036743
##$DATMOD= 1
##$DC= 2
##$DFILT= <>
##$DTYPP= 0
##$F1P= 15.7292609196834
##$F2P= 12.9074282941183
##$FCOR= 0.5
##$FTSIZE= 0
##$FT_mod= 4
##$GAMMA= 1
##$GB= 0.15
##$INTBC= 1
##$INTSCL= 1
##$ISEN= 128
##$LB= 0.24
##$LEV0= 0
##$LPBIN= 0
##$MAXI= 10000
##$MC2= 0
##$MEAN= 0
##$ME_mod= 0
##$MI= 1.114404
##$NCOEF= 0
##$NC_proc= 0
##$NLEV= 6
##$NOISF1= 3.799351
##$NOISF2= 2.8
##$NSP= 1
##$NTH_PI= 0
##$NZP= 0
##$OFFSET= 15.70392
##$PC= 1
##$PHC0= -20341.17
##$PHC1= 6.652722
##$PH_mod= 1
##$PKNL= yes
##$PPARMOD= 0
##$PSCAL= 0
##$PSIGN= 0
##$REVERSE= no
##$SF= 200.130013532006
##$SI= 16384
##$SIGF1= 3
##$SIGF2= 2
##$SINO= 400
##$SIOLD= 16384
##$SREGLST= <1H.CDCl3>
##$SSB= 0
##$STSI= 0
##$STSR= 0
##$SW_p= 3612.71676300578
##$SYMM= 0
##$S_DEV= 0
##$TDeff= 0
##$TDoff= 0
##$TI= <>
##$TILT= no
##$TM1= 0
##$TM2= 0
##$TOPLEV= 0
##$USERP1= <user>
##$USERP2= <user>
##$USERP3= <user>
##$USERP4= <user>
##$USERP5= <user>
##$WDW= 1
##$XDIM= 8192
##$YMAX_p= 0
##$YMIN_p= 0
$$ End of Bruker specific parameters
$$ ---------------------------------
##NTUPLES= NMR FID
##VAR_NAME=  TIME,          FID/REAL,        FID/IMAG
##SYMBOL=    X,             R,               I
##VAR_TYPE=  INDEPENDENT,   DEPENDENT,       DEPENDENT
##VAR_FORM=  AFFN,          ASDF,            ASDF
##VAR_DIM=   8192,          8192,            8192
##UNITS=     SECONDS,       ARBITRARY UNITS, ARBITRARY UNITS
##FACTOR=    0.0002768,     1,               1
##FIRST=     0,             0,               0
##LAST=      2.2672688,     0,               0
##MIN=       0,             -65768,          0
##MAX=       2.2672688,     81124,           0
$$ Real data points
##PAGE= N=1
##DATA TABLE= (X++(R..R)), XYDATA
0 0 0 0 0 0 0 0 0 0 0 0 0 0 0 0 0 -8 8 -8 8 -8 10 -16 16 -16 24 -24 32 -40 40 -48 56 -64 72 -80 91 -104 116
37 116 -128 144 -160 181 -200 224 -248 272 -301 332 -365 403 -444 490 -539 594 -653 724 -801
56 -801 889 -991 1109 -1247 1414 -1619 1875 -2211 2669 -3332 4387 -6304 10933 -45124 -23048
71 -23048 59696 -13121 24578 22871 -65768 -21878 60995 8966 5651 10955 -47850 -20005 40908
84 40908 -311 -7091 6852 -30851 -8393 41041 2181 -15091 7820 -5774 -729 22272 -5262
97 -5262 -23352 -7063 5333 16004 7458 -18058 -13334 -608 10565 30002 6479 -32176 -14423
110 -14423 5684 8951 26279 1881 -38466 -13113 12425 10244 25891 2655 -39930 -8617
122 -8617 21631 5471 14418 4180 -36634 -10326 27448 5380 -185 3202 -22808 -7733 25183
135 25183 4983 -9221 420 -11088 -3332 21772 2925 -16474 60 1525 -2006 14400 3687
148 3687 -21742 -6208 13529 3890 2500 2657 -15994 -9731 18539 13147 -5122 -4441 -10563 -9093
162 -9093 15959 14436 -9850 -9289 -5506 -5591 14768 15854 -10434 -10098 761 -2457 9205 12746 -10917
177 -10917 -12550 2832 784 4007 7838 -7235 -8397 5302 4464 2388 2269 -5915 -3867 4566 2049
192 2049 -493 -2411 -5820 1051 5788 733 2 -2626 -4916 5087 6419 -2660 -963 -2912 -6734
207 -6734 5896 7281 -5483 -1437 184 -6102 5902 8910 -6497 -2577 2878 -5596 2894 8097
221 8097 -6845 -3603 4958 -4342 241 7716 -5049 -3699 6184 -3068 -2484 6570 -2864 -4069 5492
236 5492 -1811 -3841 5287 -544 -3597 4053 -1082 -4006 4257 1078 -3190 2173 -733 -3170 3732
251 3732 1909 -2905 330 -616 -1724 3430 1452 -3204 -649 -82 -133 3279 436 -3722 -725 908
267 908 975 2728 -877 -4224 -96 2383 1782 1916 -2139 -4740 649 3746 1741 309 -3348 -4764
283 -4764 1838 5473 1837 -1239 -3753 -3597 3028 5910 474 -3678 -4439 -2466 3868 5704 -760 -4672
299 -4672 -2868 672 5203 4883 -2300 -5837 -2200 2234 4533 1963 -4705 -5980 156 5065 4923 516
315 516 -5014 -4408 2457 6243 2953 -3245 -6845 -3608 3636 6083 1244 -4589 -5426 -151 6312 6331
331 6331 -532 -6188 -4746 1444 5822 3543 -3611 -7389 -2911 4461 6794 2349 -4488 -6126 182
346 182 6646 5451 -1252 -6839 -5984 1690 7234 3440 -3915 -6489 -2724 4786 8056 1802 -5852 -5952
362 -5952 -379 5577 5949 -1580 -7794 -4598 2613 6512 4293 -3175 -7267 -1916 5397 6414 1232
377 1232 -5668 -6742 187 6316 4969 -1369 -6760 -4891 3133 7228 3234 -3500 -6905 -2740 5228
392 5228 6504 536 -5035 -6112 -411 7090 5285 -2602 -5810 -4062 1684 7617 3359 -5449 -5574
407 -5574 -1015 3596 7429 1613 -7785 -4921 2204 4060 4993 -281 -8930 -4354 5060 4841 2664 -1127
423 -1127 -7489 -2618 6909 4614 -505 -2664 -6177 -1803 6887 3537 -3246 -3050 -2723 703 6868 2876
439 2876 -4739 -3406 78 2188 4377 83 -6413 -3829 2549 4317 2789 -1449 -5430 -2422 4645
454 4645 6039 636 -4356 -5069 -1761 4177 5894 -828 -6027 -3229 914 4259 5661 -757 -6446
469 -6446 -1832 2546 2281 2880 -1096 -6233 -1165 4027 1333 508 -243 -3637 25 4610 440 -2293
485 -2293 -586 -1502 273 3853 -270 -4476 -806 1858 1381 2571 84 -5006 -1877 4227 2621 -71
501 -71 -547 -4316 -3137 5068 4269 -2098 -1174 -2140 -3676 4480 5714 -3429 -2336 438 -3598 2204 6351
518 6351 -3397 -3576 2668 -2336 -622 5783 -2002 -4118 3641 -554 -2808 3985 -256 -3579 3483
533 3483 841 -3822 1609 855 -2214 2727 1449 -3634 -598 1065 -110 2135 1078 -2432 -1881 -50
549 -50 1731 2141 -361 -1296 -1694 -1808 2492 3106 -1591 -646 -277 -3114 1891 4016 -2211 -494 1179
566 1179 -4026 616 4642 -2374 -457 2864 -4471 -1164 5235 -1940 -1027 4122 -4066 -3137 5158 -875
582 -875 -1715 4515 -2895 -4419 4424 342 -2185 4074 -1334 -4835 3021 1365 -2187 2944 271 -4019
598 -4019 1190 1664 -1491 1391 1100 -2166 -541 677 -242 388 936 256 -1169 -1238 827 395 -93 2139
616 2139 -661 -3626 985 1461 -1219 2853 931 -5219 135 3083 -1519 2234 2298 -5602 -1253 4021
632 4021 -1236 961 3061 -4878 -2364 4432 -450 -484 3043 -3207 -2930 3755 316 -1539 2173 -1322
648 -1322 -2466 2451 594 -1765 1187 232 -1257 985 174 -1417 376 1110 262 -174 -780 -768 58
665 58 1259 1542 -880 -2044 -177 232 912 2376 -918 -3165 370 1001 258 2483 -541 -3999 406
682 406 1954 -393 1686 109 -3928 275 2887 -554 530 672 -3097 -57 3122 -695 -925 812
698 812 -1741 -374 2683 -376 -1736 710 -17 -184 1604 -313 -1936 246 968 90 334 -478 -1562
715 -1562 52 1713 691 -628 -680 -706 -23 1622 1014 -1347 -1261 12 223 1182 1049 -1477 -1439 788
733 788 707 552 749 -1333 -1567 1113 1112 -235 -42 -935 -1054 1247 1303 -575 -662 -501 -276 1284 1033 -973
753 -973 -1130 -131 421 1046 593 -1011 -1233 147 1119 845 -121 -930 -919 179 1272 650 -754 -910 -376
772 -376 320 1159 406 -1130 -751 209 443 891 160 -1356 -615 799 597 421 -123 -1325 -431 1165 657
791 657 -26 -352 -1133 -189 1355 577 -467 -475 -706 28 1171 335 -686 -497 -313 282 863 -82 -749 -169
811 -169 114 354 527 -380 -732 135 468 368 71 -723 -585 458 660 312 -164 -858 -464 703 744 167
831 167 -404 -942 -311 783 659 59 -467 -878 -112 885 514 -129 -425 -648 77 818 220 -315 -300 -373 224
852 224 686 -83 -426 -75 -58 269 468 -332 -483 111 144 206 187 -480 -398 281 275 124 -46 -473 -202 358 286
875 286 94 -257 -462 94 364 105 149 -257 -533 341 473 -140 110 -163 -576 441 540 -372 57 -15 -656
896 -656 453 618 -623 -35 291 -661 273 711 -725 -153 620 -569 -39 763 -649 -330 864 -325
914 -325 -407 681 -337 -460 835 -40 -627 418 -9 -412 548 144 -568 166 176 -307 213 197 -338 -13
934 -13 184 -187 -107 181 57 -117 -4 24 -250 0 500 -3 -427 119 -43 -274 657 363 -824 -129 348
955 348 -368 470 737 -958 -573 697 -183 29 961 -741 -1099 843 281 -400 841 -293 -1362 737
973 737 776 -759 465 295 -1352 457 1222 -1044 -185 998 -927 -140 1403 -989 -971 1403 -45
990 -45 -702 1035 -663 -1481 1401 921 -946 316 -350 -1546 1138 1634 -863 -444 -116 -1237 714
1007 714 1932 -480 -1061 -115 -653 323 1676 8 -1240 -296 -12 161 977 260 -997 -468 415 204
1025 204 56 182 -371 -433 617 395 -803 -210 462 -166 493 613 -1414 -875 1323 456 -71 680 -1357
1044 -1357 -1654 1709 1440 -639 186 -829 -1922 1470 2188 -897 -522 -229 -1764 935 2619 -932
1060 -932 -1312 461 -1112 46 2593 -521 -2084 758 47 -647 1835 85 -2253 668 1111 -946
1076 -946 716 446 -1969 457 1884 -988 -535 654 -1218 172 2177 -714 -1667 454 -75 141
1092 141 1721 -385 -2097 -92 816 585 993 -472 -1837 -349 1084 1060 484 -800 -1426 -287 1031
1109 1031 1219 123 -1062 -876 -118 709 1324 -123 -1464 -154 374 -71 1070 150 -1869 187 1317
1126 1317 -688 178 597 -1672 155 1994 -900 -828 799 -1152 129 2391 -997 -1743 1009 -448
1142 -448 -141 2477 -747 -2524 980 458 -435 1994 -341 -2730 682 1152 -517 1251 18 -2451
1158 -2451 362 1520 -482 438 229 -1769 104 1505 -300 -246 177 -894 106 1104 -143 -516 -106
1175 -106 -184 389 567 -274 -487 -261 137 745 169 -565 -322 -249 246 949 -115 -893 -38 -42 125 1002 -204
1196 -204 -1185 216 329 -155 815 -31 -1311 276 766 -368 359 190 -1154 148 1013 -399 -104 359
1214 359 -836 -47 1089 -333 -526 431 -404 -261 931 -115 -797 353 68 -352 603 90 -795 193
1232 193 401 -307 254 192 -665 71 559 -236 -75 210 -435 -46 551 -130 -273 172 -195 -99 407 -64 -301
1253 -301 107 -49 -96 236 -47 -204 133 -17 -98 135 -45 -57 179 -60 -114 89 -46 24 220 -172 -168 165
1275 165 -53 33 248 -265 -238 281 -20 -36 241 -321 -315 399 75 -166 215 -282 -367 486 194 -287 101 -204
1297 -204 -333 525 273 -388 -3 -110 -245 533 289 -512 -117 37 -131 479 206 -601 -185 183 26 383
1317 383 58 -663 -151 344 149 248 -103 -669 -62 485 204 92 -226 -602 82 569 179 -44 -321 -481
1337 -481 227 571 76 -220 -362 -309 348 497 -83 -322 -347 -110 504 386 -297 -393 -235 83 593 266 -488
1358 -488 -442 -81 288 616 90 -660 -415 124 428 559 -100 -746 -323 294 509 389 -314 -726 -133 434
1378 434 450 172 -450 -626 73 528 347 -107 -576 -378 328 527 227 -282 -679 -161 613 445 23 -383
1398 -383 -704 28 827 351 -190 -405 -664 159 980 198 -433 -372 -510 216 990 32 -670 -247 -232 248 890
1419 890 -124 -832 -55 121 192 625 -231 -863 101 474 166 220 -340 -707 217 665 181 -133 -474 -474 366
1440 366 688 122 -409 -586 -197 491 593 69 -542 -655 88 666 374 -57 -529 -651 282 801 124 -244
1460 -244 -389 -576 379 953 -102 -547 -162 -323 300 940 -215 -820 -32 60 177 705 -223 -922 57 428
1480 428 108 357 -165 -845 83 710 60 -81 -114 -565 41 827 118 -466 -141 -174 -4 714 210 -724 -254
1501 -254 223 20 418 300 -792 -424 566 161 55 276 -596 -554 685 375 -292 102 -296 -529 633
1520 633 526 -497 -121 28 -332 437 557 -542 -354 249 -41 177 404 -421 -476 319 245 2 139 -222
1540 -222 -468 209 474 -70 -201 -58 -260 -14 540 78 -473 -32 93 -145 376 280 -593 -128 391 -213
1560 -213 91 442 -528 -310 615 -121 -275 497 -286 -505 647 67 -562 412 66 -573 477 269 -661
1579 -661 216 377 -520 197 416 -587 -10 539 -355 -106 456 -367 -219 535 -127 -321 356 -69 -340 337
1599 337 93 -356 157 151 -302 45 210 -204 -26 241 -146 -202 203 62 -137 154 42 -322 32 314 -104
1620 -104 -40 179 -275 -168 462 70 -300 154 -100 -325 440 302 -467 -43 155 -320 263 456 -516 -257
1640 -257 368 -170 24 479 -411 -462 484 91 -210 343 -208 -514 493 351 -380 84 4 -426 396 489 -446
1661 -446 -221 137 -207 243 490 -408 -446 204 89 147 336 -334 -540 185 363 107 60 -283 -451 162 514
1682 514 145 -198 -282 -258 163 537 155 -423 -320 33 199 401 128 -538 -374 287 321 164 34 -493 -370
1703 -370 464 415 -91 -124 -351 -296 554 502 -324 -317 -150 -119 509 506 -452 -487 38 118 399 374 -519 -590 202 340
1727 340 265 154 -498 -571 309 532 133 -124 -448 -406 371 607 16 -364 -394 -160 423 577 -90 -539 -306
1748 -306 114 452 420 -199 -604 -219 342 459 187 -301 -548 -97 492 410 -64 -409 -398 65 542 324 -285
1769 -285 -469 -192 243 504 189 -420 -478 20 406 406 8 -463 -406 176 507 261 -194 -475 -285 320 551
1790 551 87 -389 -413 -107 376 515 -55 -516 -302 109 404 363 -194 -554 -153 302 375 195 -305 -516 13
1811 13 456 305 -14 -353 -397 160 510 183 -196 -367 -251 269 489 49 -316 -324 -82 357 396 -101 -394 -249
1833 -249 69 388 277 -226 -385 -123 193 386 138 -316 -326 28 273 311 -2 -400 -215 164 304 216 -137
1854 -137 -413 -86 283 247 88 -224 -367 30 337 170 -32 -245 -263 158 371 77 -134 -207 -154 206 334
1875 334 -29 -209 -144 -58 240 278 -116 -245 -91 27 227 191 -165 -248 -35 107 188 75 -178 -203 -5 153
1897 153 173 -26 -182 -88 44 138 108 -103 -182 23 72 81 99 -124 -155 124 89 -6 72 -116 -145 162 90 -89 59
1922 59 -69 -144 166 99 -134 39 7 -139 111 109 -148 13 58 -116 51 102 -93 3 79 -90 1 93 -33 3
1946 3 54 -63 -27 48 9 15 -12 -41 -28 -9 65 55 -106 -58 43 -9 75 102 -161 -103 153 5 13 139 -191 -170 257
1973 257 69 -91 99 -139 -199 295 127 -205 34 -57 -172 287 169 -283 -60 33 -98 211 179 -324 -155
1994 -155 138 16 138 127 -293 -208 195 152 50 33 -230 -191 203 259 -12 -148 -146 -96 178 291 -48 -293 -87
2017 -87 66 131 212 -80 -387 -58 256 113 74 -84 -384 -11 393 113 -111 -122 -283 0 488 135 -298 -138
2039 -138 -117 44 462 143 -409 -212 73 114 302 92 -440 -266 217 210 130 17 -363 -254 307 320 -46 -131
2061 -131 -216 -177 310 375 -182 -294 -46 -25 254 364 -260 -432 109 178 140 250 -265 -504 192 374 21 51
2083 51 -215 -458 237 518 -52 -178 -159 -296 231 566 -99 -375 -115 -77 213 463 -104 -477 -104 142 235
2104 235 283 -141 -458 -94 294 233 76 -171 -362 -89 355 258 -127 -231 -141 -5 296 251 -253 -312 54 126
2126 126 178 172 -300 -346 210 264 47 57 -265 -353 306 406 -108 -121 -161 -291 293 476 -189 -278 -57 -155 210 441
2150 441 -201 -395 22 20 135 329 -169 -399 59 181 54 157 -129 -339 104 279 5 -42 -80 -209 100
2171 100 317 -20 -201 -91 -36 110 250 -24 -304 -123 119 162 144 -49 -287 -145 206 194 8 -85 -222 -111
2193 -111 236 227 -85 -136 -102 -61 179 227 -131 -189 31 14 84 179 -124 -212 79 106 2 83 -77 -196 88 169 -45
2218 -45 -13 -24 -143 83 205 -76 -112 18 -59 51 197 -65 -172 38 29 26 130 -55 -187 15 98 4 63 -25
2242 -25 -159 10 126 -2 -10 -17 -90 -5 111 11 -65 -3 -24 7 75 18 -54 5 32 2 34 15 -41 -14 38 13 -15 11
2270 11 -7 -17 27 24 -30 -10 15 -22 -9 35 -23 -28 34 -7 -16 22 2 -22 38 12 -50 10 33 -18 21 13 -64 -9 56 7 -2 3 -57
2303 -57 -24 66 22 -35 -10 -25 -4 73 6 -79 -29 13 5 59 -3 -98 -28 45 36 24 -13 -92 -14 75 47 -3 -39 -81 -4 86 45
2334 45 -19 -53 -59 22 87 34 -53 -67 -31 36 78 -2 -59 -55 0 68 62 -22 -68 -34 36 82 33 -72 -69 6 61 83 4 -99 -62
2365 -62 40 67 50 -25 -115 -42 78 73 22 -41 -105 -11 108 49 -31 -62 -68 13 112 21 -49 -55 -32 42 110 19 -91 -41 -4 61
2395 61 83 -26 -105 -39 36 75 50 -29 -98 -32 61 58 7 -85 -81 8 69 56 -45 -79 -21 40 65 41 -54 -81 23 83 47 22
2425 22 -59 -89 52 97 10 -31 -62 -82 77 117 -38 -51 -28 -61 61 108 -49 -85 -8 -10 43 88 -31 -95 10 30 29 45
2453 45 -49 -85 20 60 16 -4 -56 -59 20 66 19 -55 -50 -9 17 55 17 -86 -47 54 33 20 22 -83 -60 103 52 -39 17
2482 17 -59 -62 112 68 -78 9 -6 -67 95 69 -98 -24 33 -58 43 77 -95 -54 61 -41 -17 76 -57 -59 77 0
2508 0 -44 33 -10 -39 58 23 -63 -9 29 1 30 52 -44 -55 54 45 -4 20 -21 -82 26 79 -22 -20 11 -73 -21 100 -14
2537 -14 -67 44 -38 -57 90 -5 -87 68 32 -90 54 53 -80 57 71 -97 -22 72 -54 14 106 -80 -70 72 -12
2562 -12 -10 108 -27 -120 23 40 -15 52 19 -110 -20 79 -7 0 39 -85 -48 80 15 -59 31 -7 -76 53 46 -83 13 67
2590 67 -66 -9 70 -70 -22 100 -43 -71 55 -37 -55 105 16 -100 25 1 -52 87 52 -105 -13 52 -37 27 77
2615 77 -63 -57 49 5 -10 76 -15 -90 27 22 -43 39 35 -79 -27 61 -35 -25 73 -37 -73 69 4 -57 84 27 -85 40
2643 40 33 -83 54 74 -86 5 62 -66 15 110 -65 -45 68 -38 -31 83 -29 -76 63 -10 -72 56 20 -61 27 18
2669 18 -63 12 51 -23 -19 22 -50 -25 63 22 -37 -1 -13 -42 44 51 -35 -43 15 -23 13 81 -21 -63 7 -3 -12 73 2 -108 14
2700 14 48 -28 38 21 -92 3 91 -25 2 36 -62 -5 103 -20 -72 23 -6 -9 85 -20 -113 9 35 -7 60 -11 -118
2727 -118 -15 77 22 5 -21 -101 -24 103 57 -18 -33 -57 -4 97 63 -49 -48 -37 7 79 52 -68 -78 -8 39 43 20 -64
2755 -64 -81 38 74 15 -30 -56 -57 58 98 -1 -72 -41 -11 68 105 -24 -103 -35 38 72 62 -37 -121 -21 98 74 26 -46
2783 -46 -110 1 116 59 -23 -68 -79 19 131 51 -74 -78 -41 33 106 24 -99 -73 15 66 89 1 -117 -54 62 82 47
2810 47 -31 -97 -36 79 81 10 -73 -79 4 115 63 -45 -96 -53 43 108 39 -71 -98 -19 82 97 -3 -91 -72 27 99 69
2838 69 -40 -97 -37 65 103 29 -79 -96 -9 83 84 14 -98 -82 40 84 53 -44 -108 -53 69 89 11 -62 -107 -15 109
2865 109 71 -18 -73 -71 15 110 62 -57 -85 -33 37 97 24 -89 -76 -4 52 71 -6 -98 -55 44 59 42 -46 -90 -30 77 62
2894 62 3 -62 -68 3 84 56 -26 -68 -43 28 77 45 -49 -64 -5 50 71 20 -55 -64 6 66 41 -23 -58 -44 28 67 12 -39 -53
2925 -53 -26 33 55 -6 -55 -31 16 30 35 -15 -68 -15 41 26 4 -10 -51 -11 58 20 -16 -21 -30 -2 56 12 -35 -7 7 -1 41 12
2957 12 -59 -10 12 -7 15 17 -26 -15 16 9 -4 20 -15 -20 17 1 -22 2 15 -13 7 13 -24 -6 39 -6 -15 11 -16 -22 41 2 -43
2990 -43 14 6 -12 51 24 -51 0 39 -10 12 25 -45 -17 55 -9 -24 20 -29 -15 51 0 -50 0 6 0 57 -1 -67 -22 38 11 17
3022 17 0 -68 -17 61 44 5 -10 -50 -29 65 68 -22 -54 -23 -23 54 69 -35 -78 -4 1 28 71 -34 -89 19 55 0 23 -27
3052 -27 -99 37 104 -27 -18 -5 -62 36 110 -39 -71 -7 -5 41 91 -38 -116 -3 51 42 75 -44 -141 -2 105 50 29 -39
3080 -39 -119 -15 114 54 -33 -41 -86 -7 122 59 -76 -58 -27 12 99 44 -85 -73 43 36 36 34 -90 -58 77 64 -26 -22 -74
3109 -74 -46 104 92 -68 -67 -37 -7 105 98 -84 -127 -4 42 86 76 -78 -141 13 99 70 31 -70 -129 18 124 44
3135 44 -29 -63 -85 12 143 21 -76 -40 -26 13 95 21 -118 -38 37 26 56 8 -132 -42 98 38 -9 -15 -113 -24 140 51
3163 51 -60 -32 -67 -11 142 60 -95 -72 -15 24 106 47 -109 -82 17 42 76 33 -108 -80 40 70 41 -4 -77 -61 56
3190 56 84 10 -40 -52 -24 47 90 -9 -85 -21 25 43 45 -26 -97 6 75 28 5 -19 -89 15 107 19 -28 -11 -54 17 111 13
3220 13 -78 -21 -7 10 90 16 -83 -25 18 20 52 13 -81 -26 50 16 16 3 -61 -23 51 22 -17 -1 -27 -13 55 23 -28 -13 -5 16
3252 16 48 23 -43 -36 28 37 18 17 -41 -37 33 44 1 -13 -42 -40 29 52 -2 -45 -21 -6 22 26 -28 -38 -4 9 13 13 -18 -23 7 24 11
3287 11 6 0 -23 14 33 3 -12 0 0 14 28 5 -22 -6 15 -1 10 -2 -32 4 26 5 -10 -13 -32 -7 29 6 -34 0 -7 1 28
3320 28 -4 -42 -8 1 -8 15 0 -42 -15 25 1 1 -3 -27 10 27 -2 -9 -5 0 10 25 1 -16 -4 -2 26 24 -5 -12 0 4 28 7 -19 -25
3356 -25 -11 19 20 -2 -28 -15 6 21 24 -5 -24 -21 13 27 13 -8 -37 1 27 17 8 -26 -29 8 37 13 -14 -24 -16 21 33 -3 -18
3389 -18 -22 -7 30 27 -15 -36 -17 5 22 20 -11 -29 -6 23 6 4 -31 -40 -1 24 18 -7 -30 -22 13 33 13 -25 -19 -19 5 30 10 -29 -19
3424 -19 -1 19 24 9 -31 -22 11 27 16 -12 -35 -18 32 14 -4 -10 -35 -13 33 29 -21 -42 -8 0 29 19 -18 -28 4 14 12 15 -16 -17
3458 -17 30 23 6 8 -19 -29 9 35 4 -18 -9 -20 13 43 -3 -30 -6 4 12 38 7 -39 -15 12 10 22 5 -44 -19 28 14 12 8 -32
3492 -32 -17 26 12 -21 7 0 -18 33 17 -9 -2 9 -18 2 26 -24 -14 17 0 -5 18 -14 -22 28 22 2 11 -8 -35 17 32 -11 -2 -10
3526 -10 -18 -5 36 -10 -28 -2 -27 -15 34 2 -34 -7 1 -12 23 19 -37 -19 22 4 10 17 -16 -24 21 4 -20 18 -2 -32 9 20 -21
3559 -21 11 13 -27 1 26 -14 -10 20 -18 -6 31 -17 -28 25 15 -8 22 0 -45 11 29 -18 11 7 -35 1 43 -6 -6 20 -22 -18 38
3592 38 18 -21 3 -13 -24 30 42 -30 4 8 -25 7 45 -11 -23 14 -8 -11 39 5 -42 14 9 -11 23 19 -29 10 30 -30 -4 26
3624 26 -21 -17 46 -15 -28 20 -11 -9 37 -1 -30 6 21 -12 18 16 -26 -7 24 1 3 16 -32 -19 25 27 -5 18 -21 -45 19 37 -1
3657 -1 -2 -6 -40 3 47 -5 -22 8 -15 -11 40 8 -47 1 -3 -19 30 24 -37 -4 14 -12 11 13 -38 -23 29 2 -6 14 -24 -21 43 16 -20
3692 -20 -10 -12 -11 41 34 -35 -34 7 5 36 42 -34 -50 16 28 32 27 -32 -58 3 45 11 11 -30 -57 16 56 13 -24 -15 -34 9 67 9 -34
3727 -34 -15 3 17 52 16 -52 -22 28 24 39 0 -52 -25 31 39 9 -26 -47 -16 63 50 -7 -46 -32 18 62 48 -37 -52 -3 23
3758 23 58 36 -43 -63 13 56 46 27 -51 -53 13 67 26 -5 -31 -48 20 77 20 -34 -32 -17 51 69 -4 -74 -33 -2 44 49 -23 -70
3790 -70 -27 31 48 37 -34 -75 1 58 48 8 -48 -51 8 61 42 -9 -58 -37 28 76 31 -46 -70 -16 55 68 10 -52 -56 12 67
3821 67 53 -13 -62 -46 33 65 26 -34 -56 -27 49 68 4 -55 -46 8 57 61 -17 -67 -28 24 59 43 -31 -71 -13 56 64 15 -47 -69
3853 -69 9 71 46 -15 -63 -44 18 76 25 -37 -58 -18 40 59 3 -52 -64 7 56 46 -12 -63 -32 25 59 24 -27 -61 -20 57
3883 57 56 -3 -48 -49 3 48 46 -11 -53 -35 17 54 30 -37 -54 -12 52 54 13 -36 -38 8 55 42 -10 -45 -34 26 41 20 -23 -47 -15
3916 -15 35 47 7 -44 -37 1 39 26 -10 -44 -29 23 24 26 -15 -42 -8 33 34 8 -16 -27 -2 46 42 -9 -23 -16 6 41 15 -34 -19
3949 -19 -9 0 40 26 -16 -18 8 19 21 5 -31 -17 5 21 9 3 -18 -15 15 18 9 -8 -14 -7 11 16 -5 -12 -12 10 5 15 12 -5 2 21 7 10
3987 10 5 -17 -6 16 3 6 15 -16 -19 10 9 0 10 -8 -27 9 12 -2 9 -14 -24 1 23 5 4 -7 -20 5 24 12 -12 -7 -15 5 33
4022 33 17 -20 -11 5 -4 24 13 -20 -19 -3 13 9 -4 -16 -19 18 35 4 -13 -36 -29 34 47 -12 -31 -19 -9 29 39 -19 -51 -12 9
4055 9 27 39 -23 -61 -20 35 31 16 -34 -56 -6 43 32 -15 -28 -56 11 61 24 -32 -40 -18 20 57 17 -57 -40 -3 39 49 3 -57
4087 -57 -50 33 47 28 -11 -67 -35 54 50 -10 -51 -51 -27 57 54 -38 -59 -37 -1 56 62 -37 -64 -9 33 45 27 -36 -65 5 46 26 -1
4120 -1 -45 -65 19 67 15 -30 -51 -44 31 74 1 -69 -37 -10 42 67 -6 -79 -31 28 41 45 -27 -85 -24 52 54 4 -44 -64 -14 74
4152 74 55 -27 -48 -43 4 80 52 -44 -64 -17 19 69 37 -55 -79 4 43 44 7 -59 -52 30 55 13 -32 -53 -41 40 68 -5 -48 -37
4184 -37 -12 48 71 -28 -66 -35 11 62 47 -30 -77 -23 52 46 24 -47 -73 -4 58 43 -2 -45 -39 5 73 35 -31 -46 -24 20 58
4215 58 22 -53 -39 4 30 52 8 -55 -45 19 43 30 -11 -53 -38 35 45 -6 -31 -38 -20 39 44 -22 -24 -29 1 46 33 -30 -53 -6
4247 -6 20 35 20 -35 -51 1 32 31 6 -34 -45 14 42 11 -17 -30 -28 20 29 10 -33 -22 -2 7 35 -8 -41 -16 6 16 19 -3 -30
4280 -30 -7 16 27 5 -10 -31 -2 23 21 -14 -18 -18 -3 24 10 -17 -15 -5 6 28 11 -13 -14 1 17 11 -2 -7 -6 14 11 -6 5 -14 -15
4315 -15 3 14 4 -5 1 -8 2 8 -9 -11 7 6 6 17 0 -9 -2 0 -1 2 9 1 -2 5 5 -4 -4 -6 -3 -5 -7 -4 14 1 -12 -1 -8 0 5 -6 -7 2 0 4 0 -11
4361 -11 -10 -18 4 5 -2 -5 -17 -4 11 13 -11 -16 -5 -4 12 0 -2 -18 -8 7 17 2 -19 -23 -2 21 8 -5 -23 -27 2 17 7 -15 -15 -14 10
4398 10 19 -2 -13 -29 -7 17 17 -11 -22 -23 4 22 13 -9 -30 1 25 13 -6 -12 -21 5 19 15 -10 -24 -15 12 24 13 -13 -33 -7 15
4432 15 21 11 -23 -24 0 21 14 -6 -29 -16 22 25 5 -19 -27 -11 23 30 -6 -23 -12 -5 27 27 -12 -37 -19 6 18 17 -12 -30 0 17 14
4467 14 12 -8 -27 8 28 19 -8 -31 -16 7 21 0 -22 -18 -7 11 31 -1 -29 -23 15 18 26 -9 -32 -16 6 20 5 -14 -21 -18 26 22 7
4502 7 -10 -26 -13 26 29 -12 -27 -14 4 17 11 -18 -25 9 5 14 6 -34 -22 4 20 -6 -5 -28 -11 19 16 0 -12 -25 -5 16 24 -9 -25
4537 -25 -11 -3 23 12 -8 -20 -12 14 16 7 -2 -18 -5 16 2 -7 4 -9 -5 21 7 -6 -10 -12 0 9 9 -18 -12 4 5 10 3 -19 -9 10 10 1 6
4576 6 -17 -18 19 16 -4 -9 -4 -11 14 17 -1 -7 10 -4 9 19 -2 -5 2 8 0 3 7 -1 -3 16 -12 6 -5 -13 -1 9 -7 -10 0 -11 -10 10 -8 -13
4616 -13 1 -1 -7 11 0 -16 0 -3 -8 8 3 -15 -2 13 -5 -13 7 -1 -13 12 0 -2 3 -3 -3 8 12 -16 -3 10 -11 -3 4 -8 -21 6 3 -4
4654 -4 13 0 -5 -4 2 -1 -2 3 -10 -5 8 -3 1 12 0 -6 21 9 -1 13 -3 -4 17 0 -15 -1 1 -6 3 12 -4 1 8 -12 4 10 -9 -5 5 -7
4694 -7 -4 12 1 -12 8 7 -3 5 5 -12 5 3 -1 3 11 -2 -6 25 12 -7 4 4 0 24 2 -8 2 8 0 -7 0 -11 -7 20 -2 -3 -3 -2 4 10 1 -3
4736 -3 8 7 1 10 5 -3 0 1 0 5 -8 -3 -6 9 1 -9 -5 3 -6 11 9 3 3 3 -13 9 10 -10 -8 0 7 1 9 0 -14 8 -5 5 17 -5 -3 3 10 2 -13 -5
4782 -5 -6 2 16 0 -7 1 10 -2 6 -10 -7 0 4 -2 6 -10 -3 8 5 7 -2 -5 -3 5 11 10 -11 -5 -1 10 19 12 -9 0 9 8 12 2 -9 -13 12 6 -1 -5 -21 0 13
4829 13 16 1 -1 -10 0 20 4 -11 -13 3 8 10 5 -14 -10 1 13 9 0 -5 -5 1 23 23 6 -4 -5 10 15 -2 -9 -2 2 13 13 -7 -20 -15 -1 14 16
4870 16 -8 -14 -5 7 18 1 -14 -27 -4 18 12 -5 -18 -12 2 16 6 -8 -20 2 -2 10 8 -12 -15 -9 10 13 1 -12 -19 -1 8 5 -2 -12 -14
4907 -14 6 8 2 -13 -20 -8 4 11 -7 -15 -11 3 13 17 4 -11 -10 2 5 2 -8 -14 -4 2 15 -2 -5 -9 8 10 4 -12 4 -8 5 3 5 -9 -10 -1
4947 -1 2 14 3 6 -7 1 10 0 3 -9 -9 4 4 5 -12 -3 -2 -1 -2 -3 -10 -2 7 -4 8 -12 1 7 13 5 0 -9 -5 -3 6 -9 -4 -5 -12 1 9 -3 -4 1 -7 2 -3
4994 -3 -1 -4 -3 -5 -2 10 -10 -4 2 -3 6 1 10 -9 1 -4 -15 -11 1 -16 12 15 -9 -3 -2 8 2 7 2 -9 13 6 -4 -1 3 -15 11 12 -7 -7 2 -1 -2 2 -9
5039 -9 -6 0 8 4 -6 -1 -11 -3 22 4 -5 2 -7 6 7 -1 -9 -18 5 4 0 3 -15 -9 8 7 8 -6 -6 -7 11 -10 0 10 -15 -2 12 10 0 -1 -7 -11 10
5082 10 2 -16 -19 4 -3 6 -4 -21 -21 4 13 9 -3 -22 -15 11 18 9 9 -15 -8 13 20 8 -10 -8 -7 14 17 -10 -21 -15 9 15 9 -9 -16 2 10 11 -1
5123 -1 -20 -17 1 25 12 -8 -23 -21 9 20 13 -10 0 -2 3 29 11 -17 -12 4 12 17 -3 -20 -5 11 24 7 -6 -30 -13 13 22 -1 -11
5158 -11 -12 -3 21 14 -13 -10 -1 13 26 10 -22 -14 -7 7 16 -3 -13 -20 1 20 4 2 -21 -21 6 14 -2 -14 -13 -13 6 22 -4 -11 -3 13 13 16 -8
5197 -8 -7 -5 6 20 5 -8 -25 -2 25 12 -2 -12 -23 1 25 6 -13 -18 -13 7 21 8 -12 -19 -4 5 4 1 -12 -17 -1 13 8 0 -15 -7 12
5234 12 15 0 -6 -9 -3 10 8 0 -8 0 8 15 13 -11 -15 0 8 7 6 -8 -18 -10 6 6 -11 -7 -24 -1 9 3 3 -10 -5 1 9 3 -7 -2 -1 -2 -1 4 -7 -2 3 8
5280 8 2 -3 -19 4 2 3 14 -1 6 -2 -3 6 0 1 -7 2 0 -4 -6 -16 -16 0 -2 -2 -12 -12 -10 -6 6 -2 -10 -13 -11 -4 -1 2 -10 1 -5 3 -5 3 -1 -3 -3 1 4 -7 6
5329 6 -4 -2 -6 -3 6 11 4 -6 -4 0 4 -2 -9 0 -10 0 -3 -8 -1 -14 -4 5 -7 0 -6 -12 -1 10 1 0 -3 -4 8 6 5 2 -3 2 11 1 5 -6 -6 1 -5 -7 -9 -3 -1
5378 -1 15 9 2 -11 0 0 6 8 -3 -23 -7 12 -5 6 -8 -7 -8 10 9 3 1 2 0 9 6 -6 -7 -2 3 12 3 -1 -8 8 16 2 2 -9 -3 -1 7 9 -1 -5 -8
5423 -8 6 5 5 -6 -15 -13 13 11 -10 -13 -14 5 1 7 -11 -26 -9 9 17 8 -8 -18 -3 13 17 1 -13 -22 8 9 17 1 -7 -8 3 18 8 -5 -18
5462 -18 -3 7 15 0 -14 -18 -5 4 7 -5 -16 -8 8 8 5 -12 -16 -10 19 7 0 -17 -19 -3 12 14 -2 -19 -5 16 19 16 -3 -13 -7 11 15 8 -15
5501 -15 -11 -4 8 16 2 -13 -13 1 16 13 -5 -13 -5 9 23 -1 -6 -8 -1 19 15 0 -13 -13 13 17 10 1 -10 -4 15 24 18 -8 -12 2 17 11 2 -11 -15
5542 -15 3 13 6 -4 -9 -3 11 9 19 -4 -12 2 11 21 8 -12 2 -2 -1 9 -5 -10 -6 -3 10 4 -17 -19 -6 6 15 0 -10 -11 -6 9 10 -5 -14
5581 -14 -13 11 5 -4 -4 -9 -9 10 10 -4 -7 -10 5 19 8 -5 -10 -4 11 6 -3 -19 -21 6 -3 12 2 -13 -18 7 10 7 -2 -12 -2 7 -3 1 -7 -11 -11 12
5623 12 5 4 8 0 1 8 9 -3 -10 -4 -12 10 3 4 -6 -4 -1 2 8 -6 -5 0 5 -4 -7 -4 2 3 6 -5 11 -5 -13 2 3 5 1 -3 -5 -8 7 -6 -9 -6 11 -7 4
5670 4 4 8 0 -8 4 1 3 2 -10 -2 6 -5 -3 -7 -2 -8 1 -8 -17 -1 -1 0 0 2 -4 2 4 -9 7 -7 2 2 -3 -10 -2 8 -4 -10 -3 9 8 3 5 -1 -6 3 5 4 -4 0 -2
5721 -2 4 3 1 -16 -8 -6 2 1 1 1 -5 -2 -2 -2 -10 -8 -11 12 10 1 -5 -13 -4 10 4 -3 -25 -4 -3 -10 6 -5 -2 -5 13 12 2 2 -9 -4 2 13 -7 -2 0 -6 3 4 0
5770 0 -7 3 3 1 0 -4 -4 6 15 4 -14 -7 -2 1 12 18 -11 -8 0 9 14 12 -11 -3 1 14 5 7 -9 -12 9 6 3 -2 -13 -17 15 16 6 -7 -12 11 15 2 -2
5815 -2 -8 -8 -7 -1 3 -9 -13 4 1 0 4 -9 -10 -3 15 19 -4 -12 -11 -1 4 0 -8 -8 -1 13 10 8 -9 -15 -1 3 3 -2 -13 -9 1 9 0 -4 -13 -1 -2 11 1 -8 -9
5862 -9 -7 11 6 1 -14 -8 0 -2 7 1 -4 -15 2 -1 -7 -11 -8 -10 10 3 0 -15 -15 11 8 9 -6 -1 0 -2 15 -1 -15 -18 3 6 7 -2 -10 -24 -5 -3 1 -13 -25
5907 -25 -6 -6 1 -1 -8 -14 -11 9 11 3 -4 -1 -4 9 15 -11 -4 -9 9 12 2 -2 -6 1 3 6 1 -10 -10 -8 3 3 2 -4 -11 -1 5 5 -4 -17 -6 -3 8 7 -11 -11 -5
5954 -5 -3 3 -5 -13 -9 -1 15 13 4 -5 -5 7 1 8 2 -7 -3 -1 14 7 -1 -3 0 12 11 -7 4 -7 3 9 -2 -6 2 7 5 -1 -1 -3 2 -6 -3 -11 1 -8 -9 2 -2 -9 -6 -7
6004 -7 -1 3 -6 0 -9 -2 -11 -3 4 -3 2 6 2 9 4 2 -5 6 -9 -6 -1 4 -7 -4 8 3 -6 -2 5 -10 1 2 5 -2 3 -3 2 -6 -6 12 -5 4 3 1 1 0 7 -7 -1 -2 3 -7
6056 -7 2 -2 -1 13 4 4 -4 8 4 -3 0 -3 2 -6 -1 -1 -9 -14 -1 -6 -14 2 1 -8 -8 -2 0 -9 -5 0 -1 -2 -2 -3 -6 -6 1 2 -4 -3 -4 0 -2 3 8 8 -2 -1 8 1 0 -1 -5 -4 0 5
6112 5 -8 -4 1 -8 2 0 0 -16 0 -5 2 0 -14 -2 0 6 4 -2 -8 4 0 -3 8 5 -6 3 6 -1 1 -1 -1 0 9 2 6 1 2 6 7 7 -7 -4 1 1 2 -2 -2 2 6 10 13
6163 13 3 -7 -11 -1 6 0 -9 -9 -1 -6 7 -1 1 -4 3 9 3 7 1 -9 -5 9 5 -1 -9 -3 -4 2 7 -3 -6 2 5 -3 -9 -8 -3 -2 -1 -6 0 5 -11 -2 -5 -1 -16 -6 10
6212 10 -3 -2 4 -2 -10 -2 1 6 -5 -8 3 3 5 2 -2 -3 2 7 0 1 -4 3 0 -1 1 -8 -11 2 0 -1 -4 -5 -1 13 11 2 3 -9 1 1 -4 5 -2 -3 -6 -8 -2 9 -11 -7 -1
6263 -1 -3 2 -2 -6 -1 -8 -3 4 -6 0 6 6 8 10 4 -8 -6 3 -1 -1 -5 -2 -1 10 0 3 3 -8 2 -5 -8 1 -9 -12 -6 2 -7 0 2 -3 -4 -4 0 -2 -1 -12 -3 -4 -4 -2 -1 -1 -8
6316 -8 0 -4 -7 -1 -6 0 0 -2 -3 -1 5 3 2 -10 -7 9 0 -3 -13 -17 -6 0 -10 -9 -3 -3 1 4 -6 -8 -5 7 -5 -9 9 -2 -20 -9 3 14 -5 -6 -5 5 -1
6361 -1 6 6 -2 3 2 5 -1 1 -5 0 1 13 -4 0 6 -3 0 2 -7 0 2 -5 3 -3 7 -4 -7 -2 -6 -6 3 3 -4 8 -3 -9 -5 9 7 -2 -6 4 4 8 2 10 -4 5 0 7 -1 5
6413 5 1 -10 -1 -2 -2 -4 -1 4 -5 5 2 3 2 13 3 1 6 -11 -1 -5 0 -7 -1 3 -7 11 12 3 5 0 5 -14 -3 -4 -10 8 -1 1 3 3 4 -2 -15 -1 -3 7 6
6460 6 -5 2 1 3 -7 15 -7 -16 -5 -1 -1 -3 3 -6 -8 10 -2 2 9 2 -6 -4 6 1 7 1 5 1 2 0 0 10 0 11 0 8 3 4 0 8 5 -2 -4 -8 11 0 -2
6507 -2 -5 -2 -4 -3 -6 -9 -7 -7 -1 -5 -8 -11 -2 8 7 7 6 -4 1 0 -5 -8 -1 -3 -4 7 3 2 11 0 1 0 7 8 -5 0 0 5 -9 -9 -3 9 2 -2 -1 -2 0 -2 4 -3 -2 1 5 0
6561 0 -2 -6 -1 2 8 2 1 -7 2 0 -1 16 -5 -4 -5 -1 5 -4 6 5 5 14 -8 10 -5 -5 -7 0 6 4 -11 4 -12 -5 3 5 -7 -4 -4 -7 -6 -3 -5 -12 4 8 0 0 5 -3
6611 -3 -4 -1 -9 2 2 11 9 2 -1 2 7 -1 17 -1 5 10 1 -2 -9 -2 -7 5 3 4 -1 1 2 -2 -8 0 -10 -4 -14 -1 -9 -1 -5 -7 -4 7 0 -8 -9 -15 1 0 4 -2 6 -4 3
6662 3 -5 6 1 4 3 6 6 -5 -2 -3 2 -3 3 -3 2 -1 -3 6 -5 0 -2 3 -1 -3 8 -7 -4 -2 8 1 -6 -8 -8 5 4 10 7 5 4 -14 9 0 -1 -6 -4 -2 3 -3 -5 10 3
6713 3 3 -2 0 5 4 -6 -3 -5 0 4 -7 -3 1 -11 -8 -6 -2 5 3 0 2 -1 -1 10 9 8 -1 5 1 4 -2 -5 -1 0 -7 0 -2 4 -6 -3 1 5 1 -2 2 2 -5 -2 0 1 -8 -4 -1 15 2
6768 2 -6 -3 -9 -13 0 -8 1 2 0 1 1 4 3 -1 -1 3 -5 -6 -13 -7 -6 4 -7 -5 -13 1 4 9 -2 -7 -4 -1 2 0 -12 -13 -7 7 12 3 3 -7 1 12 -8 -13 -10 -15 -12 -8 -1
6819 -1 -3 -9 -11 -3 1 9 3 -5 4 4 -3 6 -2 -11 5 -8 -4 0 -1 10 9 -1 2 -6 -10 -7 -1 0 7 -2 -14 -4 -1 -7 0 7 -12 -6 1 -4 -10 -9 -1 -1 0 -3 -12 -3 0 3 0 -5 -5 -2
6873 -2 2 10 8 2 -2 -10 18 4 0 -1 -2 -3 -1 3 -13 -8 0 10 9 19 -2 -18 -6 0 7 -8 -5 -6 -3 -4 7 -12 -8 -1 -1 -2 7 -6 -12 5 6 12 -2 -5 0 5 -8
6920 -8 10 -4 -2 -3 6 14 11 -9 -2 -3 1 9 5 -9 -12 -10 3 5 0 -7 -1 6 4 1 9 -3 -5 7 -2 10 -3 -5 2 11 -1 -7 -1 9 4 5 4 -8 -17 -5 7 2 7
6967 7 -5 9 1 11 9 6 -5 -7 5 12 4 0 3 -5 -5 4 -2 -2 -3 1 -10 -2 3 0 -6 4 -3 0 1 2 10 4 2 8 -2 0 -2 5 4 -12 4 1 10 4 0 6 1 10 6 6 -2
7018 -2 10 4 -2 -4 2 0 -2 -8 0 -4 -6 7 -6 -7 -5 -4 -4 -5 -7 3 8 9 10 2 8 7 6 2 -2 6 10 10 -4 3 10 -2 0 -1 -2 9 -6 -3 2 3 -9 1 -6 2 -3 4 -6
7069 -6 -3 -11 2 1 -3 -12 -12 2 -2 -9 -6 -10 2 -2 -2 -4 -5 3 0 1 4 1 4 4 -1 7 12 5 4 5 -5 0 4 -7 -4 3 -8 -5 -8 -5 3 4 -3 4 -12 -3 11 3 -3 -5 0 -5 -2
7122 -2 0 -8 -5 -7 -5 6 -7 -7 1 -5 6 -3 -9 -3 8 1 3 -4 -7 13 9 -6 -5 -10 -12 -8 2 12 6 -12 -10 -15 1 5 -15 -5 -3 -2 -7 -1 -6 -21 -16 3 0 2 -7
7169 -7 -10 -2 13 2 1 -8 -7 -1 4 9 4 -2 -1 4 13 3 -5 -5 -5 10 8 1 -9 -13 -1 2 2 -12 -9 -11 3 -7 -10 -4 -5 -5 7 3 -6 -16 -11 -6 8 -1 0 -3 0 1 14
7218 14 11 2 -9 -1 8 3 -13 -11 0 -7 -14 -5 -8 -18 0 -5 5 -3 -16 -7 -1 16 -6 0 -2 -5 10 8 -8 -21 -13 -7 -7 -5 -3 -12 -9 -1 1 7 -1 -11 -6 0 -1 2 -1
7265 -1 -5 -1 -6 8 7 -4 -10 3 18 -1 -1 -5 3 -8 -7 2 -11 -11 -2 -3 2 -9 -2 -11 -2 -1 -2 -14 -12 -9 -5 -8 -1 -5 -9 -3 10 11 -5 -2 0 -6 10 0 4 -2 -9 11
7313 11 0 2 -5 -9 7 0 -6 2 -8 -14 -11 -2 1 -7 -10 -2 -3 -2 -3 -17 -14 -8 -7 -8 -8 2 -10 -2 -4 -5 0 -11 1 5 0 -3 1 -7 -8 -4 -5 -2 1 -1 -2 7 -4 -2 7 8 -4
7364 -4 2 -8 5 1 -3 2 3 -3 -13 4 -9 8 -5 -12 -12 1 5 -4 -7 1 -3 -4 -4 4 7 5 11 -2 2 -4 -7 2 -6 1 -1 -15 -11 6 3 0 -8 6 2 0 0 0 1 7 2
7413 2 -13 1 0 -8 -8 -3 -4 -5 -3 -4 -3 -2 -4 -5 1 -6 12 3 -4 3 7 -1 0 -4 2 -2 -6 -2 -8 0 -4 -12 3 -2 1 9 0 -4 -9 3 4 4 -3 -9 -11 -8 -9 -3 0 -4 -2 -5 -2 -3 -4 -10
7469 -10 -3 -1 -5 4 -5 1 4 -7 -9 -3 -6 15 -4 5 0 -6 -1 -6 3 -7 -8 7 11 -3 7 -1 -16 -8 1 4 1 -3 -7 -1 10 5 5 -12 4 -2 -7 -2 -6 7 2 -10 3
7516 3 1 -3 -2 -9 -1 5 -4 -6 -5 0 20 11 -8 -1 9 10 9 17 -7 3 1 0 6 -5 -9 2 -12 2 -1 -11 -3 3 7 3 -3 -5 -5 -2 3 3 -11 -12 0 -8 7 -1 -3 -2
7564 -2 -9 -2 -3 -4 -6 -4 -4 -9 -7 -8 -8 7 3 7 -5 -2 1 -5 0 10 -5 -13 -14 -2 2 5 0 -7 -9 1 18 -3 -13 -10 3 -4 1 4 3 4 1 5 4 4 1 8 4 -1 -5 -3 5
7615 5 4 3 6 -5 -13 -17 4 7 -3 -4 -1 3 0 5 0 2 -6 3 2 1 -2 -7 -2 -9 3 -4 -2 -7 -2 2 -4 -3 2 -5 6 4 5 -1 6 -7 -2 3 2 -11 -11 7 -1 5 -4 -8 -16 -8 -5
7668 -5 -3 4 -3 -17 -6 0 -4 -3 -7 -13 -4 2 -9 -2 -4 -17 -4 -9 -7 -7 -13 -2 3 -3 -4 6 -5 -10 -9 -3 -12 -9 6 1 -2 -4 -12 -10 -9 -11 0 -13 -8 -8 -4 1 -5 -11 -7 -2
7718 -2 1 -5 1 -6 -1 -5 -1 2 0 5 7 -8 -5 3 -7 2 -4 -9 0 10 5 -4 -5 14 -1 7 1 -3 -2 1 -7 5 0 -1 -4 7 3 -11 -6 -5 6 0 2 -5 -3 2 0 -2 2 -1 -7 -7
7770 -7 0 0 2 5 1 -11 -8 3 -1 4 -12 -7 3 -6 4 2 -7 -3 -1 -1 2 5 0 -8 1 13 -3 -4 -13 -5 0 -5 -2 -5 -4 -7 0 -5 -1 -12 -7 -3 -3 -9 -8 -8 -2 0 4 -6 -2 -11
7822 -11 -5 3 1 -3 -1 6 -2 0 6 -1 4 -1 -1 -3 -9 -4 6 9 -5 5 -3 -14 3 1 4 -2 -10 -2 -7 -5 -4 -1 -6 -5 -5 -6 -12 -5 -18 6 -3 4 -2 8 -10 0 4 10 -6
7871 -6 1 -5 -1 -7 -5 -12 3 -8 -8 6 15 3 -2 7 -2 2 1 -4 -2 3 4 -6 2 -5 -14 -5 -4 -3 2 -7 7 7 0 4 6 2 -1 9 -12 5 2 0 7 2 8 10 7 2 5 3 0 -3
7923 -3 1 -1 -4 5 10 -7 -3 -1 2 3 -3 4 -8 0 5 2 -9 4 0 -9 -5 4 2 -1 -18 -8 -3 -7 1 10 -3 0 11 -2 -3 -1 -8 -11 6 1 -6 -6 -6 -6 1 2 0 -5 -5 2 4
7974 4 -11 -9 -1 -15 -12 -3 -14 -10 -3 -4 9 -3 -10 0 -3 10 -5 -3 -7 -6 1 7 11 -7 2 4 -9 -1 -4 -3 5 7 -3 -1 1 8 -1 6 -8 -6 0 -11 -4 -1 -2 -8 -13 -3
8022 -3 -4 -4 -5 -2 -6 -2 -3 -7 -6 1 1 1 10 10 -2 -5 4 8 0 0 -4 -6 10 -1 3 1 -3 -1 11 17 -2 -2 -3 5 2 -6 3 0 -12 -7 -4 -6 -6 2 -6 2 -4 0 -8 -4 5 -7 -4 -6
8076 -6 -13 -13 -1 -8 6 -2 -5 -5 3 -4 3 -8 -3 7 2 -2 4 -1 -5 6 -10 0 2 4 5 -13 -3 1 3 -7 0 -13 -9 -8 -15 0 -12 3 -8 -8 -10 -11 -15 -12 -17 1
8122 1 -4 -5 0 -2 -5 2 -2 0 -3 5 -10 -4 7 3 5 -2 -7 -4 6 1 -9 -9 -5 -2 -7 -10 -11 -4 -9 -9 -6 -8 -3 -12 -8 1 -10 0 -2 -4 -9 3 -12 -10 6 3 3 0 3 1 1 -3
8174 -3 -7 -3 -7 -5 -3 -1 1 -1 -10 1 -4 -5 2 -7 -4 -9 -9
8191i
$$ Imaginary data points
##PAGE= N=2
##DATA TABLE= (X++(I..I)), XYDATA
0 0 0 0 0 0 0 0 0 0 0 0 0 0 0 0 0 0 0 0 0 0 0 0 0 0 0 0 0 0 0 0 4 -4 8 -8 8 -8 8 -9 12 -12 15 -16 20 -20 21 -28 28 -29
48 -29 36 -37 41 -46 50 -56 59 -66 73 -78 85 -92 97 -102 105 -106 92 -56 -45 338 -1430 11518
70 11518 81124 6683 -16033 21539 -50435 -23374 71840 16467 -31172 8 -34037 -19945
82 -19945 49093 10602 -25924 5850 -12804 -7430 41918 7083 -29654 4057 3283 -6438 14466
95 14466 -4773 -26001 39 15205 12478 2561 -18378 -10666 11972 14079 16500 -2703 -35835
108 -35835 -12766 20997 12583 10896 -4174 -36768 -8353 29682 13955 8006 -3731 -37066 -6869
121 -6869 34460 8135 -3951 -1022 -29123 -8501 35662 9001 -14619 -939 -13182 -6320 26890
134 26890 7123 -18736 -2182 -1350 -2335 18268 3489 -21007 -1614 9553 -1339 6758 2580
147 2580 -19871 -5175 19431 5903 -5640 -758 -9960 -6162 19341 12580 -13289 -10318 -3538
160 -3538 -2741 14705 13072 -14416 -13274 2608 2549 11919 12521 -13887 -14722 5808 3870 4501 8217
175 8217 -11732 -14560 7363 7289 1179 4710 -5955 -8783 7286 7037 -1585 -999 -4992 -3958 5563
190 5563 2831 -3000 -2108 -2851 2073 6969 -1 -3117 -1484 -2778 4094 6307 -4692 -4620 -281 -3430
206 -3430 4776 8038 -6234 -4872 3404 -2450 3288 8612 -6915 -6618 5059 -1912 -93 7768 -5449
221 -5449 -6616 6631 -402 -2494 7027 -2901 -6451 6260 237 -4841 5496 -335 -6073 4668
235 4668 1157 -5198 4130 1753 -5078 2628 1349 -4503 3134 2776 -4234 737 1397 -2970 2630 2785
251 2785 -3780 -763 1312 -1216 2331 1750 -3764 -1063 1788 216 1898 297 -3945 -598 2579
266 2579 831 980 -1038 -3902 512 3733 939 -360 -2249 -3766 1581 4707 527 -1947 -2775 -2704
282 -2704 3113 5886 44 -3735 -3108 -1372 3720 5189 -1625 -5483 -2807 683 4752 4707 -2405 -5597
298 -5597 -1025 3057 4476 2226 -4427 -6246 -198 4227 3558 -175 -5061 -4200 3016 6446 2898 -2362
314 -2362 -5475 -2779 4031 5651 -66 -5560 -5644 -259 5947 5601 -1059 -5618 -3403 2734 6684 3563
330 3563 -4006 -7294 -2703 3926 5618 984 -5307 -5979 638 6925 5737 -920 -6111 -4647 2514
345 2514 6925 2657 -4713 -7108 -2792 4702 7451 1156 -5965 -5269 930 6491 6095 -1683 -7901 -4549
361 -4549 2805 6197 3348 -4104 -7691 -1633 5930 6363 1136 -5235 -6338 742 7029 4542 -2425
376 -2425 -6847 -4579 3202 7298 2681 -4217 -6429 -1891 5624 6877 65 -5972 -5670 346 6726
391 6726 5142 -2685 -6493 -3731 2512 7318 3181 -5433 -6249 -835 4144 6489 1008 -7225 -4937
406 -4937 2609 5176 4684 -1090 -8515 -3765 5493 4978 1510 -2458 -7731 -2201 7970 5346 -1184
421 -1184 -3259 -5645 -911 7955 3926 -4310 -4251 -3418 295 7281 3071 -5436 -3456 406 2204 5423
437 5423 1223 -6489 -3586 2453 2859 2233 -1306 -5991 -1998 5136 4711 383 -3078 -4429 -360 5614
453 5614 4543 -2410 -6077 -3489 1389 5185 4248 -2685 -6567 -1283 4095 4393 2745 -2791 -6920 -903
469 -903 4811 2232 135 -1929 -5109 -86 5793 1637 -1695 -711 -2279 91 4482 151 -3876 -646
485 -646 310 356 2860 -336 -4462 -151 3599 1331 388 -848 -4177 -1045 5064 2496 -2491 -1996 -2395
502 -2395 -1354 5288 4256 -3887 -3139 -25 -1305 3725 5319 -4325 -4646 2038 -674 1006 5606 -3040
518 -3040 -5636 3228 649 -1786 4613 -727 -5578 3015 1882 -3590 2656 1432 -4252 2066 2317
533 2317 -4127 579 2673 -2134 1119 1936 -3620 -943 2704 311 765 596 -2729 -1532 1398 1960
549 1960 1354 -1204 -2146 -720 -212 2311 2894 -2248 -2309 705 -1369 1177 4094 -2260 -2727 1818 -1998
566 -1998 -343 5001 -1561 -2963 2878 -2253 -2242 5588 -303 -3563 3346 -1749 -4085 5275 1366 -3851
582 -3851 3009 -739 -5070 4162 2714 -3700 2104 349 -5064 2510 3477 -2877 974 1251 -4008 590
598 590 3145 -1474 2 1338 -2135 -826 1581 195 75 643 -246 -1116 -881 1052 1101 -513 771
615 771 -342 -3262 840 2996 -1124 669 1153 -4511 -484 4726 -833 -532 2073 -4442 -2019 5440
631 5440 92 -1695 2399 -3312 -3021 5268 1140 -2686 1987 -1633 -3376 3909 1789 -2903 1095
646 1095 -14 -2661 2124 1647 -2294 420 977 -1474 428 738 -1318 245 1351 -165 -692 -633 -314
663 -314 604 1134 749 -1161 -2040 388 1424 669 1195 -993 -3117 712 2424 -21 788 -477 -3688
680 -3688 462 3362 -425 -162 269 -3180 67 3828 -437 -1305 670 -2106 -461 3431 -376 -2225
696 -2225 852 -495 -628 2511 29 -2364 678 922 -490 918 -114 -1950 324 1544 -116 -342
712 -342 -335 -1019 368 1825 362 -1285 -811 -59 385 1251 526 -1672 -1312 750 878 688 486 -1442 -1373
731 -1373 1263 1222 -116 15 -1076 -1311 1322 1459 -763 -625 -400 -565 1239 1309 -1011 -1069 37 183
749 183 968 703 -1289 -1209 455 850 701 99 -1128 -963 677 1318 431 -672 -992 -434 623 1240 299
768 299 -1114 -887 202 688 861 71 -1271 -675 739 670 349 -165 -1258 -467 1163 648 -238 -406 -992
787 -992 -184 1404 610 -659 -546 -614 101 1413 453 -1006 -579 -136 279 1070 198 -1025 -457 191 404
806 404 681 -183 -887 -59 462 250 206 -426 -713 270 630 85 -230 -596 -362 661 712 -93 -455 -644 -157
827 -157 889 692 -308 -650 -627 52 994 572 -415 -627 -516 197 1009 357 -565 -530 -317 241 834 93
847 93 -636 -292 -49 279 610 -146 -617 15 188 179 307 -336 -516 257 344 36 50 -373 -325 434 362 -90 -181
870 -181 -356 -101 460 244 -170 -285 -341 173 469 -1 -134 -208 -392 334 588 -273 -196 8 -375 338 660
891 660 -431 -261 227 -384 261 744 -574 -361 517 -370 -23 785 -562 -506 720 -255 -380 739 -359
910 -359 -638 832 -16 -729 564 29 -633 655 222 -804 270 341 -442 339 330 -612 46 411 -245 69
930 69 292 -297 -96 279 -91 -117 195 63 -170 -52 46 -114 -14 388 -15 -533 31 231 -207 372 358 -817
952 -817 -285 659 -97 69 606 -787 -731 937 260 -348 622 -425 -1135 876 804 -670 299 59 -1214
971 -1214 553 1195 -814 -180 591 -1010 68 1429 -803 -769 1131 -416 -633 1291 -460 -1285 1334
988 1334 508 -1185 590 40 -1366 1166 1323 -1349 -368 309 -1021 852 1762 -1146 -1185 360 -450
1005 -450 516 1776 -702 -1683 159 192 290 1334 -182 -1625 -179 655 312 621 68 -1071 -404 750
1023 750 398 -138 -3 -222 -338 490 426 -753 -335 706 28 -59 372 -1034 -821 1510 758 -827 46
1042 46 -729 -1275 1718 1748 -1317 -745 -120 -1137 1304 2331 -1298 -1530 362 -662 696 2483 -1005
1059 -1005 -2195 725 121 -198 2076 -299 -2594 653 1150 -759 1018 415 -2262 296 1837 -901
1075 -901 -216 770 -1479 -1 2095 -813 -1319 937 -351 -239 1857 -527 -2098 681 899 -146
1091 -146 1005 -337 -2125 218 1614 392 124 -633 -1603 116 1643 783 -312 -1066 -1106 315 1394
1108 1394 853 -466 -1288 -596 564 899 805 -404 -1549 -70 1043 71 374 160 -1621 -22 1757
1125 1757 -488 -645 734 -1013 -279 2013 -585 -1595 962 -154 -407 1960 -628 -2305 1151 766
1141 766 -642 1634 -349 -2789 995 1706 -753 892 49 -2640 603 2200 -650 88 286 -2095
1157 -2095 206 2227 -475 -578 380 -1282 -75 1821 -247 -954 252 -415 -45 1107 -178 -887
1173 -887 59 139 270 446 -399 -561 58 347 579 45 -741 -253 240 315 668 -175 -1027 45 505 105
1193 105 574 -167 -1233 213 851 -199 259 83 -1191 149 1146 -361 -227 303 -854 -22 1218
1210 1218 -290 -608 424 -413 -206 1090 -164 -878 429 64 -384 766 87 -958 259 471 -393
1227 -393 298 251 -783 68 664 -275 -60 290 -506 -58 699 -161 -337 266 -195 -137 553 -38 -440 170
1247 170 31 -138 357 17 -400 111 132 -127 162 24 -262 93 76 -144 94 32 -124 130 3 -162 112
1268 112 33 -48 159 -108 -196 217 76 -67 186 -156 -257 329 146 -177 150 -143 -324 403 212 -335 75
1289 75 -78 -337 408 289 -452 -76 44 -255 404 318 -522 -164 146 -133 371 297 -585 -215 318 5 265
1310 265 211 -593 -194 454 121 123 39 -595 -113 579 161 -56 -124 -521 26 654 137 -215 -258 -398 180 660
1332 660 39 -347 -278 -259 309 609 -88 -429 -231 -61 400 463 -235 -459 -150 101 469 277 -450 -429 31
1353 31 266 458 100 -609 -391 251 400 384 -106 -730 -282 440 481 252 -291 -731 -125 597 477 74 -440
1374 -440 -634 90 651 323 -150 -508 -441 288 633 150 -343 -527 -177 503 491 -83 -444 -512 51 716 334
1395 334 -336 -463 -393 242 886 187 -565 -410 -234 346 942 37 -786 -317 -24 327 852 -80 -925 -169
1415 -169 230 264 630 -210 -963 27 516 117 275 -246 -836 172 740 35 -145 -267 -518 333 775 -30
1435 -30 -440 -359 -180 491 661 -130 -590 -388 111 634 453 -255 -614 -394 345 756 175 -411 -508 -339 442
1456 442 814 -75 -618 -299 -187 411 848 -267 -842 -40 123 252 710 -278 -987 98 488 125 350
1475 350 -235 -899 168 755 30 -31 -149 -670 140 872 -9 -436 -111 -266 96 773 49 -694 -139 175
1495 175 98 492 129 -783 -257 529 171 117 146 -669 -400 737 342 -281 49 -370 -473 709 514 -553
1515 -553 -180 -25 -363 501 585 -634 -360 283 -111 234 494 -535 -495 443 172 -13 260 -326 -465 429
1535 429 418 -147 -47 -118 -320 254 505 -137 -374 -16 -28 29 414 46 -565 -94 297 -57 149 230 -552 -252
1557 -252 532 -36 -166 361 -333 -420 648 117 -486 346 2 -535 526 337 -654 208 354 -540 231 474
1577 474 -630 -28 575 -409 -88 510 -439 -223 636 -207 -352 448 -148 -368 497 39 -478 264 133 -383
1597 -383 231 237 -377 38 280 -263 -59 276 -141 -133 232 -69 -231 179 140 -177 48 106 -255 7 357 -61
1619 -61 -202 139 -114 -182 426 143 -400 39 122 -244 287 350 -504 -191 334 -146 55 436 -433 -418 473 46
1641 46 -194 346 -246 -531 480 291 -402 145 5 -468 392 483 -488 -136 220 -268 235 519 -446 -377 341
1662 341 30 74 396 -375 -502 363 300 -24 132 -280 -482 306 483 -44 -167 -235 -302 256 531 -14 -401
1683 -401 -253 -35 257 439 -4 -520 -273 258 316 213 -26 -501 -272 471 403 -55 -140 -354 -216 550 453
1704 453 -312 -304 -144 -84 508 443 -485 -459 90 116 365 355 -547 -560 283 344 215 147 -515 -545 400 527 37 -113
1728 -113 -434 -405 462 608 -93 -363 -333 -173 460 562 -193 -552 -231 116 460 419 -275 -622 -106 373 439
1749 439 194 -354 -555 -8 544 387 -92 -416 -387 134 584 283 -309 -467 -183 272 518 121 -475 -454 26
1770 26 386 382 -35 -523 -382 239 504 215 -224 -476 -233 380 529 47 -394 -392 -25 465 495 -99 -506 -264
1792 -264 180 453 357 -233 -568 -135 350 397 148 -328 -515 16 483 284 -72 -385 -406 165 531 150 -279
1813 -279 -380 -223 286 506 18 -389 -306 -21 367 423 -124 -447 -196 141 399 279 -242 -441 -63 252 367
1834 367 133 -340 -370 56 316 279 -20 -389 -253 210 332 154 -158 -402 -126 297 291 37 -233 -349 24
1855 24 376 190 -111 -267 -256 131 401 86 -211 -234 -129 217 360 -49 -280 -153 -22 238 293 -128 -302
1876 -302 -54 84 237 194 -199 -275 20 157 191 93 -216 -238 64 201 120 -15 -213 -158 94 180 78 -108 -206
1899 -206 -59 107 109 30 -135 -170 48 135 36 15 -108 -131 132 145 -57 8 -42 -111 162 147 -134 -1 24 -106 121
1924 121 149 -173 -28 80 -103 61 141 -144 -48 96 -88 -14 119 -94 -70 91 -70 -46 92 -30 -56 52
1946 52 -46 -40 54 23 -16 -16 -38 11 37 53 37 -84 -72 87 47 20 62 -138 -123 190 69 -78 81 -113 -162 250 121
1973 121 -206 23 -26 -167 247 182 -278 -57 78 -117 197 189 -325 -138 175 -25 99 142 -311 -174 256 84
1995 84 4 61 -241 -187 283 202 -77 -73 -162 -107 263 255 -104 -208 -71 35 202 232 -107 -308 -28 210 129 82 -105
2020 -105 -331 -4 345 93 -101 -126 -256 19 423 65 -304 -135 -101 53 429 64 -438 -147 106 113 329
2041 329 72 -479 -189 278 197 160 0 -409 -190 382 276 -35 -104 -270 -152 366 320 -203 -257 -91 -32 273
2063 273 307 -288 -387 65 148 149 207 -289 -451 185 330 25 35 -214 -426 260 504 -87 -173 -126 -278 255 552
2086 552 -142 -389 -42 -62 215 489 -176 -502 -16 168 197 313 -176 -530 -5 338 193 97 -202 -423 34
2107 34 408 186 -121 -237 -248 39 366 182 -259 -288 -18 124 236 147 -298 -318 167 249 72 17 -255 -292 282
2130 282 366 -83 -104 -148 -209 327 441 -216 -285 -26 -89 259 433 -253 -420 81 80 168 339 -229 -477 112 224
2153 224 47 166 -174 -426 114 312 -12 -17 -107 -283 113 343 -65 -169 -51 -95 111 302 -52 -278 -37
2174 -37 103 123 179 -64 -291 -52 233 153 19 -108 -231 -48 263 184 -110 -164 -138 -20 237 189 -174 -208 -25
2197 -25 23 150 165 -173 -233 73 106 38 94 -119 -220 114 168 -40 -10 -46 -156 91 218 -78 -98 15 -64 68
2221 68 201 -88 -171 52 29 31 156 -73 -199 66 116 -11 68 -42 -186 47 159 -10 -31 -32 -123 18 163 -21
2245 -21 -91 -14 -45 -3 102 -1 -96 -11 6 6 62 12 -70 -9 44 6 7 12 -32 -2 41 32 -17 14 13 -7 19 26 -26 -9 23 -5
2277 -5 -16 13 -13 -29 20 12 -37 -4 5 -27 12 7 -63 -17 29 -12 -13 12 -51 -10 68 6 -26 -4 -18 6 89 24 -57 -5 18 16 59
2310 59 15 -80 -36 55 31 20 -11 -83 -9 75 24 -21 -32 -71 -13 84 33 -48 -56 -53 13 89 24 -76 -48 -22 32 75 6 -79 -40
2341 -40 18 60 59 -24 -73 -30 37 75 42 -51 -81 -10 61 70 9 -86 -73 36 78 41 -29 -103 -38 81 75 13 -54 -92 -15 93
2371 93 60 -34 -68 -83 6 102 35 -76 -63 -28 37 99 4 -98 -37 17 51 86 -19 -111 -20 61 77 52 -29 -96 -8 81 72
2400 72 8 -55 -82 19 85 56 -39 -90 -50 37 74 14 -70 -89 -3 52 46 -9 -78 -82 41 103 1 -39 -59 -57 65 106 -21
2429 -21 -64 -31 -24 76 108 -43 -87 7 8 60 100 -49 -100 18 36 28 54 -52 -98 22 57 4 -8 -41 -77 27 62 -15
2457 -15 -45 -51 -26 37 60 -3 -70 -34 28 46 37 -4 -74 -32 77 38 -17 -17 -42 -39 97 61 -75 -6 1 -41 94 82 -110 -29
2487 -29 33 -37 45 72 -101 -48 83 -28 2 71 -82 -74 86 -2 -44 47 -32 -79 67 19 -72 17 7 -48 35 45 -83
2514 -83 -25 53 10 8 25 -30 -46 55 63 -6 -10 11 -35 29 103 -20 -64 37 -21 -18 97 -2 -101 30 23 -81 58 32 -117
2543 -117 14 52 -111 2 70 -89 1 84 -83 -50 93 -27 -13 88 -46 -82 85 43 -31 69 -17 -97 36 90
2567 90 -23 6 18 -95 -10 112 10 -51 16 -48 -56 76 45 -64 6 20 -76 44 67 -83 -35 63 -46 -38 76 -31
2593 -31 -52 90 -10 -87 61 20 -58 81 28 -114 21 62 -38 50 63 -101 -42 83 -11 3 60 -51 -78 80 40
2618 40 -30 42 -10 -81 12 65 -34 0 36 -68 -40 72 -19 -48 47 -24 -84 41 20 -75 35 39 -94 5 68 -67 12 96
2646 96 -80 -44 98 -25 -30 109 -26 -78 88 15 -43 77 27 -82 51 32 -70 44 36 -81 -7 33 -63 -17 56
2671 56 -43 -58 12 -44 -23 63 22 -67 -21 0 -11 36 51 -43 -48 25 17 8 64 -13 -83 28 59 -4 41 7 -83 -1 83 -24 -3
2702 -3 32 -76 -16 94 -23 -64 34 -32 -25 91 -10 -109 22 15 -19 59 -10 -121 -1 67 -7 15 -11 -98 0 109 20
2729 20 -28 -31 -58 9 118 40 -65 -51 -19 26 96 49 -65 -48 22 47 57 17 -77 -60 51 69 29 -21 -69 -58 49 83
2757 83 -19 -59 -57 -34 50 68 -55 -107 -36 29 55 44 -53 -115 -3 89 61 19 -55 -98 21 135 66 -28 -58 -69 44 139
2785 139 53 -81 -67 -11 52 113 14 -110 -75 8 56 79 -16 -122 -57 57 65 27 -50 -107 -47 77 62 -18 -69 -85 4 113
2813 113 73 -35 -76 -50 41 109 47 -79 -86 6 78 96 12 -92 -59 37 102 63 -45 -109 -43 65 91 22 -89 -99 1
2840 1 84 66 -23 -98 -78 32 91 46 -47 -117 -40 70 96 16 -66 -105 -11 97 64 -27 -80 -60 27 114 55 -44 -79 -17 70
2869 70 108 34 -81 -68 21 71 81 -7 -99 -53 48 63 28 -36 -96 -32 74 59 -11 -72 -68 -7 77 40 -33 -67 -43 33 83
2898 83 29 -66 -65 2 58 80 19 -61 -53 14 73 57 -4 -45 -25 56 90 32 -32 -46 -1 52 65 2 -70 -46 9 36 31 -16 -70 -31
2930 -31 24 38 -6 -27 -59 -21 48 21 -26 -23 -32 10 62 25 -41 -22 5 18 70 19 -36 -15 14 9 34 10 -48 -20 34 1 8 16 -42
2963 -42 -25 33 6 -6 1 -14 -27 19 9 -41 1 9 -11 -10 9 -25 -8 26 10 -39 -9 -5 -9 35 7 -56 0 34 -3 35 22 -47 5
2996 5 59 7 7 22 -33 -6 73 22 -39 19 -3 -11 42 6 -77 3 21 -3 24 -5 -74 -6 50 10 -12 -23 -55 -26 65 38 -44 -32
3028 -32 -35 -16 67 51 -43 -48 -2 18 57 60 -24 -71 29 57 22 36 -36 -82 36 87 -6 -16 -14 -67 29 84 -42 -80 -7 -20 17
3059 17 80 -48 -106 12 33 20 48 -58 -136 30 100 18 4 -56 -115 30 127 21 -46 -46 -71 25 136 50 -82 -51 -28
3086 -28 24 120 44 -108 -63 19 32 67 27 -110 -77 64 58 -19 -9 -86 -60 93 62 -58 -54 -35 -22 89 78 -102 -102 21
3114 21 46 85 64 -97 -122 41 94 57 28 -87 -117 66 145 38 -26 -69 -85 55 156 22 -77 -57 -35 34 123 8
3140 8 -123 -59 21 27 73 -6 -142 -39 80 31 4 -22 -104 -27 124 32 -58 -25 -78 4 144 51 -95 -46 2 26 130
3167 130 54 -130 -56 60 61 87 26 -115 -70 85 73 29 -7 -105 -59 82 87 -7 -44 -68 -43 68 80 -27 -76 -36 6
3194 6 44 47 -37 -83 -10 62 43 15 -25 -76 17 96 27 -30 -26 -45 35 105 22 -66 -19 1 39 92 15 -99 -25 39 13 57 12
3225 12 -101 -42 53 31 24 -13 -101 -35 64 25 -17 -15 -59 -23 70 19 -45 -22 -15 -8 55 26 -46 -18 21 31 33 12 -28 -29 50 35 17
3258 17 -3 -32 -19 52 44 -15 -24 -20 -6 34 36 -30 -52 -15 1 19 9 -28 -47 0 11 7 -2 -20 -29 4 17 -1 -10 -10 -3 7 27 7 -12
3293 -12 1 22 18 20 -3 -20 2 38 22 5 1 -14 5 43 12 -22 -14 -14 5 23 2 -27 -13 11 -5 13 -6 -51 -15 17 -4 0 -8 -31
3327 -31 11 27 1 -7 -5 -16 18 50 13 -6 8 7 15 33 4 -24 4 20 21 17 -15 -20 5 21 25 -1 -10 -29 6 24 3 -15 -33 -16 0
3362 0 10 8 -17 -36 -5 24 17 0 -27 -24 1 28 17 -10 -8 -17 25 37 7 -4 -2 8 31 45 1 -31 -3 14 26 26 -23 -22 -2 20 15
3397 15 8 -31 -32 7 30 7 -25 -34 -25 12 22 9 -24 -35 -10 14 35 5 -35 -23 5 29 27 2 -25 -14 23 36 33 3 -27 -12 41
3430 41 41 -1 -13 -34 -9 37 22 -19 -26 -10 4 31 15 -34 -26 -3 -2 17 3 -25 -31 3 5 10 -13 -13 -26 16 25 -2 -20 -10 -11 21 36
3465 36 -2 -16 -2 14 13 37 3 -30 0 23 19 24 -4 -36 -11 35 19 -1 -12 -36 -17 32 13 -16 -4 -28 -24 20 10 -33 -13 -7 -22
3498 -22 20 16 -36 -19 6 -8 3 31 -15 -23 26 7 0 24 0 -21 19 23 -11 -1 -1 -22 21 38 -8 -28 7 -18 4 35 -15 -44 -9
3531 -9 -6 -14 12 -1 -51 -17 5 -14 7 12 -46 -33 19 4 -5 22 -12 -15 34 22 -5 10 3 -21 18 29 -12 0 22 -12 1 29 -10 -14
3565 -14 19 -13 -13 25 2 -40 16 19 -17 5 -3 -35 7 34 -18 -23 1 -32 -3 36 -2 -30 8 -11 -14 48 25 -29 0 20 -20 40 37
3598 37 -21 -19 21 0 1 50 -5 -34 22 17 -17 22 -1 -52 -3 18 -30 -3 20 -42 -25 18 -29 -32 22 -26 -32 19 -22 -34 19 7 -26
3631 -26 20 4 -33 2 38 -3 5 19 -34 -10 53 10 8 17 -16 -10 38 33 -10 -2 -16 -37 5 44 -19 -34 -12 -24 -12 47 -8 -56 -10
3664 -10 -12 -18 23 9 -56 -13 20 -9 8 10 -44 -15 30 2 -11 17 -26 -17 46 19 -17 16 9 -11 55 34 -42 -8 10 -7 33 31 -36
3697 -36 -36 16 18 18 21 -58 -57 23 38 4 -1 -35 -49 24 47 0 -20 -26 -33 17 57 5 -35 -24 0 21 53 9 -41 -20 24 30 39 0 -45
3732 -45 -14 47 37 13 -18 -49 -12 67 29 -22 -39 -45 -3 56 38 -49 -55 -18 13 49 8 -51 -64 -2 43 35 6 -45 -64 30 63 32
3764 32 -12 -44 -38 54 94 13 -37 -26 -2 50 82 -6 -54 -24 13 58 55 -25 -70 -7 28 43 30 -41 -77 -7 44 39 -4 -43 -67 4
3796 4 70 25 -39 -70 -48 40 65 23 -62 -68 -7 58 74 3 -67 -45 22 67 58 -6 -71 -37 42 79 23 -37 -52 -9 51 73 -15 -78
3828 -78 -58 3 56 47 -24 -71 -35 20 51 33 -56 -79 -7 47 48 -4 -61 -51 19 87 47 -20 -57 -32 35 94 28 -47 -52 2 70 64
3860 64 13 -53 -49 32 66 54 -13 -71 -34 48 59 18 -43 -61 -25 42 50 -8 -44 -61 -6 43 33 -28 -67 -35 21 62 21 -29 -57
3891 -57 -8 45 57 20 -43 -38 27 50 47 -12 -40 -31 46 75 25 -27 -36 -5 37 65 2 -47 -41 8 41 27 -23 -55 -31 17 35 2 -23
3924 -23 -49 -25 31 39 -7 -32 -29 -11 37 32 -13 -30 -8 8 44 31 -17 -30 1 21 41 19 -29 -23 15 22 25 1 -32 -21 13 24 2
3957 2 -3 -41 -21 19 17 -10 -22 -22 -15 3 16 -17 -20 -9 -12 0 11 -4 -22 10 3 17 24 10 -6 7 21 11 11 16 -13 -4 13 23 4 18
3993 18 -2 -15 12 13 -9 6 -1 -17 0 11 -10 -13 -11 -22 -9 14 -4 -24 -16 -6 -3 27 0 -29 -7 -8 12 27 20 -17 -10 14 22 16 6 -11
4029 -11 0 28 44 21 8 -26 -11 45 39 -7 -25 -20 1 37 23 -28 -51 -13 9 23 19 -36 -53 -10 39 16 17 -30 -52 8 50 33
4061 33 -9 -23 -34 14 69 28 -12 -16 -17 28 68 21 -35 -22 16 35 50 8 -59 -29 37 40 21 -12 -64 -18 48 48 -7 -39 -53 -13
4093 -13 54 34 -40 -67 -37 -2 66 41 -51 -60 -15 33 59 29 -52 -69 19 65 40 5 -45 -50 32 77 23 -15 -40 -31 53 74 7 -47
4125 -47 -36 -4 43 67 -10 -83 -28 22 35 29 -33 -89 -17 55 36 -5 -50 -73 3 78 50 -31 -38 -32 15 99 50 -43 -62 -9 51 81
4157 81 35 -57 -41 20 59 61 12 -51 -42 38 65 23 -24 -54 -31 42 65 -6 -47 -47 -17 48 50 -23 -61 -33 6 44 35 -44 -68 -9 51
4190 51 36 23 -36 -60 12 74 38 -15 -44 -52 28 83 35 -44 -49 -15 35 71 19 -60 -45 5 24 48 2 -64 -35 21 35 27 -24 -69
4222 -69 -35 30 48 -10 -40 -47 -18 48 46 -23 -43 -19 14 54 45 -32 -41 5 23 38 28 -18 -33 24 43 33 11 -26 -29 25 39 16 -19
4255 -19 -29 -17 29 50 -2 -34 -31 -16 15 28 -13 -42 -23 -1 20 13 -20 -34 -12 21 20 -4 -12 -16 -4 37 24 -3 -8 -9 5 29 37 -7
4289 -7 -21 4 27 30 21 -13 -12 4 21 21 3 -26 -28 17 11 -1 -3 -25 -10 8 6 -9 -6 -12 -4 1 15 2 -10 -4 -3 15 20 -2 6 16 13 10 17 14 11
4330 11 11 17 20 -2 6 1 5 19 12 -4 10 0 -7 6 -3 -3 -3 -7 -14 -8 14 -8 -6 -10 -22 -5 3 -5 -4 -2 -1 8 13 18 -12 -11 8 1 9 20 2 5 9 16 20 0
4376 0 -1 5 13 19 19 -6 -19 -5 9 19 5 -13 -15 -4 11 8 -2 -37 -19 -6 8 -1 -18 -28 -14 4 11 7 -8 -22 -4 15 26 16 3 1
4412 1 12 31 22 -4 -12 -3 23 34 27 -7 -14 9 25 30 3 -36 -31 12 23 9 -9 -28 -14 12 23 9 -25 -34 -12 15 17 -8 -29 -25 8 31
4448 31 17 -6 -23 -5 16 21 15 -11 -19 7 41 24 22 -1 -10 16 38 29 12 -20 -9 19 30 20 -28 -20 -8 15 24 -6 -38 -25 3 13
4482 13 16 -8 -42 -14 17 22 8 -14 -25 0 17 25 0 -8 -14 15 25 11 6 -12 -2 22 39 25 -10 -12 17 29 12 14 -13 -24 20 20 11
4517 11 -16 -23 -12 17 19 -5 -14 -16 -12 2 24 -8 -20 -4 12 7 21 -7 -14 -4 18 25 17 0 -12 9 27 19 5 22 -7 24 28 13 3 3
4553 3 -1 -5 25 11 -26 -4 0 -2 9 -4 -26 -10 2 0 4 -8 -25 -3 14 4 5 -3 -8 -15 17 19 3 0 4 6 21 20 -4 -1 23 11 20 29 3 -2
4593 -2 23 18 5 14 0 -4 10 21 5 9 0 -8 -2 7 1 -17 6 -9 -18 5 -3 -19 -8 5 -8 3 1 -14 0 20 3 10 10 -3 11 23 11 9
4631 9 23 17 14 25 10 -1 15 17 -4 11 13 -8 -12 19 3 -5 6 -8 -5 0 2 -9 -2 2 -16 -11 -1 -8 -3 -2 -8 -1 11 -1 -1 14 -3 5 20 8
4671 8 9 14 10 9 20 15 7 21 19 5 11 10 -4 -1 14 0 -8 2 -9 -1 5 -5 -13 -5 -9 -22 -2 6 -7 -8 -2 -11 8 4 -1 -9 3 14 -13 11 2 -15 9
4714 9 17 5 8 6 -7 18 24 6 7 20 4 -1 12 0 -7 2 3 -3 -1 -2 -15 -4 10 -11 -2 -5 -11 -6 -7 -8 -15 3 -14 -23 -1 10 -12 -3 6 5 14 9 3 5
4758 5 11 7 16 22 4 1 7 6 5 7 0 -5 0 3 2 -2 -2 -11 0 7 -16 -13 -5 -10 -5 -2 -8 -17 -7 -9 -5 -2 -6 -20 0 3 -1 5 -5 1 13 16 7 -2 9 17 24 23 13 -2
4808 -2 5 9 18 10 11 2 -4 7 10 4 -7 -16 -9 0 9 -13 -14 -18 -14 1 8 -22 -17 -8 -3 2 -8 -20 -12 2 21 12 -4 -13 0 16 24 25 8 -5 1 7 22 15 3
4853 3 -8 11 31 16 -4 -19 -14 13 13 3 -14 -17 -11 0 16 -1 -7 -25 -20 -1 -6 -10 -8 -9 0 10 5 -6 -12 -9 9 27 14 -3 -15 9 25 23
4891 23 12 -11 0 8 13 11 -1 -10 -8 0 8 3 -6 -12 -14 5 7 -7 -13 -16 -23 2 4 -11 -24 -18 9 2 1 -3 -27 -2 16 6 5 -13 -10 4 12 4 3 -12 -1
4934 -1 6 18 8 -10 4 7 15 18 7 -11 -22 -7 6 9 -6 -17 -11 -10 -7 -8 -16 -4 -12 -2 -6 -15 -6 -18 -14 -5 7 -5 -15 9 4 7 8 -6 -6 4 11
4975 11 12 0 -12 8 10 14 -2 -8 5 -1 10 3 5 -1 -1 8 -2 8 -12 1 2 -11 -14 -9 -7 -7 -12 2 -15 -1 3 -8 -9 -6 -2 -5 10 -3 3 12 -2 2
5017 2 19 16 -1 6 6 7 18 8 -12 -6 3 7 -6 8 -8 -10 -8 -3 -8 -7 -13 -10 -2 -9 -1 -12 -9 -16 -6 -3 -8 -13 -7 -16 -2 11 4 -8 -4 -6 12 9 -9 -14 11
5062 11 18 8 7 2 -2 1 27 14 -11 -4 -15 4 4 -12 -24 -17 -3 -1 8 -7 -25 -18 -7 -3 -1 -12 -26 -15 8 16 -1 -8 -23 2 6 12 1 -13 -10
5101 -10 -3 17 21 -2 -6 -1 11 22 21 -8 2 11 15 7 -6 -8 -31 -1 22 0 -21 -23 -21 -6 10 3 -31 -22 -22 1 8 -10 -29 -9 -1 0 7 -8 -26
5140 -26 -1 15 13 -4 -10 -17 -1 24 17 10 -3 -6 8 23 18 -3 -7 -5 12 14 15 -20 -31 -5 7 17 -2 -22 -37 2 11 -1 -13 -16 -22 18 9 -11
5178 -11 -7 -17 -2 17 15 -4 -10 0 10 22 20 5 -15 5 15 23 20 -3 -4 0 30 23 3 -8 -18 -2 19 3 -19 -26 -28 -5 17 0 -17 -20
5214 -20 -7 6 6 -8 -28 -21 -8 2 -8 -22 -24 -3 14 12 10 -3 -5 15 11 24 11 -5 -6 9 17 23 -6 -11 1 11 8 0 -2 -14 -7 0 6 -9 -6
5253 -6 -28 -8 0 -16 -13 -12 -17 -3 5 -4 -17 -10 -7 1 16 8 -6 1 0 2 15 -1 -6 7 13 14 19 9 -10 0 2 17 12 -3 3 -3 -4 2 -8 -16 -8 -3 -14 -3
5297 -3 -20 -16 -6 -3 -3 -5 1 -9 -3 -4 -3 -15 -14 -9 1 3 7 5 11 9 13 10 9 4 14 9 12 9 11 10 14 6 0 -4 14 2 0 -7 -6 6 1 -12 -5 -10 -9 -6 -10 -11 -9 -18 -5
5348 -5 -3 1 2 -4 2 -1 -15 -3 5 -5 11 7 10 4 10 4 8 2 16 9 7 -4 3 9 12 7 -2 5 0 3 -6 -12 -22 -11 -6 3 -2 -12 -19 -18 -8 2 -3 2 -9 -3 -2 10
5396 10 -5 -16 -3 13 17 11 -5 16 16 12 17 -1 -2 -4 13 13 10 -5 -10 -8 6 7 -3 -15 -12 -9 10 5 2 -24 -5 -7 1 -6 -23 -22 -15 -11 0 4 -9 -13
5438 -13 -11 19 8 -1 -17 -12 16 27 20 8 -4 9 16 23 12 -8 -3 10 11 18 3 -10 -12 6 11 7 -12 -24 -28 -16 3 -12 -14 -33 -17 3 1 -3
5476 -3 -14 -27 -5 5 5 -11 -18 -15 -2 12 21 -14 -3 -3 11 14 20 -5 -6 4 31 13 6 -4 -13 9 10 0 -13 -15 -14 14 17 5 -23 -13 -14 4
5514 4 5 -6 -17 -21 -3 15 8 0 -27 -15 7 17 -2 -9 -17 -4 8 12 5 -4 2 9 28 13 4 -5 3 16 11 14 -12 -11 2 14 2 -4 -22 -14 -2 -1 6
5555 6 -25 -22 -21 -1 6 -6 -24 -16 -16 6 10 -3 -22 -13 -3 16 5 -6 -12 5 10 27 15 -9 5 3 17 9 7 -1 -1 5 15 14 8 -8 3 2 3 4 -19
5596 -19 -16 -11 -13 -3 -8 -17 -13 -1 -6 -19 -5 -25 -14 -8 -5 -1 -9 -4 -3 0 9 6 -3 0 10 7 16 6 -5 7 14 20 11 -1 -3 9 10 -11 -1 -4 -14 -2 -8 0
5640 0 -12 -21 -23 -9 -2 -8 -15 -13 -10 -8 0 1 -10 -5 -6 3 6 6 -4 5 3 11 13 17 -5 7 16 -6 2 -2 1 9 3 9 0 0 -2 -7 -1 1 -3 -7 -11 -23 -16 -6 -6 0 -10 -5 -2
5691 -2 -1 -13 -7 -1 -5 -7 -5 2 -11 -2 8 8 8 13 7 3 4 -1 10 9 7 12 4 5 11 -2 4 -13 5 -3 9 -4 -7 -10 -6 -15 -13 -16 -19 -15 -17 -6 0 -5 -8 -6 4 2 -14
5740 -14 -19 -8 1 13 11 3 0 4 4 10 -1 0 2 6 8 10 10 -1 2 9 8 10 14 -4 2 3 6 -4 -12 -22 -11 4 -7 -17 -17 -21 -8 -1 -9 -16 -19 -12 5 18 3
5785 3 -14 -10 -9 11 12 4 -8 -4 19 12 15 10 -5 -8 13 17 8 3 -1 8 5 3 1 -11 -6 1 4 -7 -12 -28 -6 -6 3 -3 -14 -15 -12 0 -1 -8 -4 -5 -7 18 7 0 -2
5832 -2 7 21 19 16 -5 3 16 8 22 3 -9 1 2 16 8 -3 -12 -6 4 1 -1 -5 -13 -12 10 -9 -10 -23 -8 -13 -9 3 -8 -15 -16 -10 7 2 -8 -12 -17 11
5874 11 15 9 -8 -5 12 18 21 8 3 5 15 13 15 -7 2 -7 20 10 -3 -14 -14 -2 -4 0 -6 -21 -22 -3 -5 -2 -19 -18 -13 -4 -10 -1 -11 -9 -3 9 2 1 -5 -3 -3
5919 -3 18 16 -4 -4 3 -1 16 18 2 1 9 19 10 -2 -8 -5 7 2 -1 -22 -12 -11 -10 -8 -12 -5 -27 -6 8 -7 -13 -4 -3 -4 -2 2 -9 -9 -1 9 15 0 -10 -2
5963 -2 11 7 4 7 7 9 9 10 9 -3 4 -8 3 8 4 -1 -4 -7 1 -1 5 -10 -13 0 0 -9 -13 -6 0 -4 -1 -3 -7 -11 2 6 1 -2 -4 4 6 10 2 4 12 1 10 10 8 10 6 -9
6015 -9 8 -4 -8 0 -4 -8 6 1 -5 -7 -6 -12 -7 -9 -1 -14 -4 -8 -8 -10 -7 -2 -7 -9 -4 -9 -4 -5 0 6 3 8 3 5 16 15 13 16 16 11 16 13 10 14 9 -1 1 3 -4 3 3 3 -7
6068 -7 -4 -5 -2 -8 -8 -17 -10 3 -19 -16 -6 -12 1 -4 3 -9 -1 -6 0 0 -1 -1 5 13 11 13 4 9 7 23 19 8 5 7 11 16 8 -7 3 -2 10 -2 -13 -3 -8 -6 -7 -9
6116 -9 -10 -11 -11 -4 -6 -5 -5 -8 -2 0 -2 -2 -5 -12 -6 -3 2 14 1 2 6 24 17 1 -3 11 6 16 11 10 0 -1 5 3 1 -9 -4 -7 -6 -18 -13 -20 -27 -2 -8 -6 -20 -1 -9
6165 -9 -4 1 -19 -5 -5 8 0 -5 -7 -3 -4 7 13 6 9 -5 14 19 8 11 4 11 3 4 5 1 2 11 4 10 13 -11 -7 -6 -2 -10 -5 -5 -13 -13 -10 -9 -8 -18 -8 -3 -2 -4 -7 -4 3
6216 3 12 2 0 -5 -8 12 14 23 14 14 8 11 12 19 19 2 3 9 2 -6 -3 7 -3 7 -3 -8 -20 -6 -9 -13 -6 -15 -19 -26 -13 -14 -2 -17 -3 -8 -2 9 3 6 0 3 0
6263 0 2 4 5 -7 12 8 8 -6 -4 13 10 4 4 -1 -1 -3 1 4 -4 -3 0 -3 -4 -6 2 1 -7 -7 -5 -12 -11 -2 -15 -6 -9 -15 -10 -6 -3 5 -2 1 1 -5 -5 23 -2 19 9 1 13
6314 13 9 -1 6 4 4 5 10 -3 3 -2 2 -3 1 -7 -9 2 1 3 -15 -17 -16 -13 -5 -4 -12 -11 7 11 4 -1 -3 3 -1 9 7 14 7 14 11 20 9 14 11 15 8 9 7 6 6 4 13 0
6366 0 -1 5 1 6 -10 -13 -6 -7 -7 -14 -7 -22 -8 -10 1 -3 -4 4 1 -1 -5 5 10 2 8 7 14 10 7 4 5 9 12 6 13 13 11 4 -5 -5 4 0 -1 4 8 -3 2 -7 -1 -6 -4 -3 -14 -16
6420 -16 -11 -11 0 -8 -10 -6 2 -3 -5 -7 -7 2 10 -4 -4 9 6 16 14 15 21 12 7 2 5 -1 4 5 3 4 -5 15 0 8 3 -7 -8 -10 1 -5 -14 -7 -8 -20 -11 -7 3 -7 -11
6469 -11 -1 -11 2 -11 0 0 7 5 12 -4 0 16 13 14 3 11 12 8 10 10 2 -2 -4 7 -2 -3 -3 4 -1 2 -7 -8 -9 -20 -9 -4 -11 -5 -12 -2 -16 -7 -9 -13 -1 4
6515 4 -1 -5 -2 -2 2 3 4 20 6 14 12 17 11 12 12 4 13 4 -6 -6 -3 4 1 -9 0 -6 0 -3 -12 -17 -18 -23 -8 -7 -24 -15 -10 -11 -14 -5 -4 -10 -2 0 -2 -7 -8 -4 2 11 2 7 10 7 15
6570 15 16 5 21 5 -1 8 7 7 -2 -2 -4 7 -2 -12 0 -5 -10 0 -17 -4 -12 -15 -14 -11 -13 -13 -13 -3 5 2 2 -10 5 12 8 5 7 1 8 9 9 9 9 2 14 16 14
6617 14 6 -4 6 -1 8 1 2 -1 -5 -4 -5 6 11 -1 -11 -5 -10 -10 -18 -9 -10 0 -10 -6 -7 -8 -1 9 -6 -2 5 2 13 14 14 14 3 15 5 5 17 6 6 9 18
6662 18 6 -1 7 -3 -4 -8 -3 10 -8 0 0 -3 -7 -9 -8 -6 -7 -12 -14 -9 2 -11 1 -6 -6 0 8 4 5 -2 2 8 -1 13 12 13 7 7 9 7 8 9 9 6 -4 2 -2 -1 -8 -3 -1
6713 -1 -1 -6 -7 -6 -16 -18 -16 -5 -5 -17 -15 -18 -8 -8 -11 -3 3 2 -9 7 -2 3 -4 5 1 8 0 2 10 8 6 8 1 4 -2 -2 2 -5 2 -5 -7 -1 4 -8 -17 -13 -13 -15 -14 -6 -11 -15 -2
6766 -2 -7 -8 -13 -11 -3 -2 1 -6 -5 15 3 5 13 2 -1 4 16 1 7 7 9 4 4 8 -9 4 4 14 6 4 -7 -5 6 0 -1 -1 -10 -12 -4 -7 -13 -10 -22 -8 -9 -8 -10 -18 -6
6815 -6 -4 6 -9 0 3 6 9 1 10 -1 1 1 21 12 10 6 1 9 16 12 5 -3 -4 9 13 -5 -10 -10 -12 -2 11 -11 -3 -9 -3 -11 -16 -13 -18 -6 -16 0 -13 -10 7 1 13
6862 13 5 3 -7 2 11 17 11 3 3 10 22 22 10 2 3 8 17 1 3 4 -3 0 16 -1 0 -12 -16 1 -16 -8 -4 -15 -20 -7 -11 -5 -16 5 -7 -3 -6 -9 -8 0 11
6907 11 6 6 -6 9 2 23 15 9 4 -1 16 18 4 10 -4 0 12 1 -1 -6 -2 -4 -2 -1 -10 -4 -15 -6 -1 -8 -14 -25 -10 -1 -8 5 -19 -15 -9 -4 10 -1 -12 1
6951 1 11 11 19 14 4 15 13 23 8 8 15 5 16 13 3 0 -4 -6 0 -4 -9 -14 -1 3 7 -8 -12 -18 -11 -14 -6 -8 -19 -11 -12 2 -5 -2 -2 17 2 13 13 3 3
6996 3 12 22 8 10 5 2 2 20 8 9 10 2 -2 8 14 -3 -2 4 2 -6 3 -8 -13 -3 -1 -7 -12 -17 -3 -15 -4 -13 -12 2 2 0 8 -2 -16 -4 12 6 9 -2
7040 -2 -5 10 9 11 6 10 -4 8 7 9 5 1 1 10 -8 -3 -11 -7 -5 0 -16 -21 -17 -9 -8 -14 -23 -12 -8 -12 -17 -6 -11 -5 -12 -2 -3 5 -6 6 3 2 9 -5 -5 11 5 9 1
7089 1 6 3 12 8 -1 -3 7 10 6 5 -7 -9 -9 -3 -6 -9 -9 -3 -3 -7 -2 -10 -23 -22 -12 -4 -13 -13 -14 -1 -2 1 17 -5 11 4 10 8 7 4 7 19 13 8 11 13 11 13 7 6 0 -5
7141 -5 1 4 -3 -9 -21 -3 -13 -6 -19 -9 -18 -4 -8 -12 -5 -14 -7 -5 9 1 -12 -3 -3 10 6 2 0 0 9 17 15 -2 6 2 19 13 8 4 3 4 14 18 14 -9 -7 -6 5
7188 5 3 -6 -19 -18 -1 -6 -4 -15 -17 -12 -4 -3 -18 -6 -6 -4 6 3 -10 -1 5 15 14 10 -8 6 3 19 19 -1 1 -2 6 13 7 -4 -1 -12 8 22 -6 -9 -25
7231 -25 -14 6 -8 -1 -18 -13 -4 -4 -15 -16 -15 -13 -6 -4 -17 -7 -8 -3 20 6 2 -3 -3 17 15 12 14 -7 3 15 20 15 -6 -2 9 8 2 0 -7 -8 6 -5 -6
7274 -6 -8 -9 -1 -2 8 -8 -20 -8 -3 1 3 -17 -13 -13 4 -1 -3 1 -4 9 7 16 2 8 -4 19 20 14 2 4 7 12 16 18 1 0 5 1 3 5 -7 -12 -10 -6 -9 -14 -5 -8
7322 -8 -16 -11 -8 -11 -20 -2 -6 -8 -9 -6 -14 -10 -1 -3 4 -6 -1 3 12 8 2 6 15 7 12 3 -1 5 14 5 9 2 5 4 -7 -8 -4 -16 -4 -4 -15 -9 -15 -1 -15 -18 -16 -5 -16 -20 -3
7373 -3 -3 6 -8 -6 -4 0 3 0 8 14 12 11 15 7 2 5 10 15 13 6 21 16 1 9 1 -2 3 4 -3 3 -7 -13 -3 -5 -2 -11 -10 -5 -10 -10 -20 -12 -17 -11 3 -10 -9 -9 14 3 12
7424 12 7 10 11 9 5 9 -5 -3 7 2 12 17 1 2 3 8 1 -7 0 -4 5 4 -4 -4 -8 -11 -15 -8 -6 -16 -20 -14 -9 -9 -11 -11 0 -4 3 5 5 0 6 10 13 7 5 19 3 12 21 3
7476 3 11 15 9 23 4 -2 2 7 12 4 3 -1 -7 -5 0 3 -9 -19 -13 -15 -3 -2 -2 -9 -13 2 -8 -4 -8 -7 0 9 5 -2 -8 9 6 20 14 7 4 17 16 18 14 6 6 9 9 -1
7526 -1 8 10 1 6 0 -1 -11 -9 -1 -6 4 -9 -2 -24 3 -6 -12 -10 -16 -12 -2 4 2 -2 -3 -3 -3 9 2 3 17 2 9 5 8 5 18 13 8 15 5 4 2 0 1 -7 -3 -13 2
7575 2 4 -8 -3 -15 -15 -10 -4 -14 -14 -16 -22 4 -11 1 -7 -5 6 13 7 -8 -2 -1 12 8 12 6 5 12 14 19 5 14 5 11 3 12 9 4 -3 1 14 -3 -3 -6 1 -6 3 -8
7623 -8 0 -3 -11 0 -2 0 -6 2 4 1 -1 -10 1 4 7 12 10 9 12 8 16 21 7 1 12 13 3 13 11 1 -3 11 5 5 -6 -1 -3 0 -1 -17 -11 -8 -5 -12 1 -14 -9 -13 -11
7672 -11 -10 -14 -8 -5 -11 -18 -10 -5 -3 5 5 4 7 4 17 20 16 9 9 10 7 10 -5 10 6 8 3 3 8 -1 -2 -10 -2 -11 -3 -3 -7 -9 -16 -22 -12 2 -16 -11 -15 -12 -8 -20 -2 -17 -10
7723 -10 1 2 0 6 12 -7 -2 5 16 7 13 8 9 13 2 3 2 5 10 13 -8 0 -3 -2 -4 3 -4 -3 -5 -20 -7 -20 -12 -11 -13 -1 -1 -13 -1 -9 -4 -10 0 4 7 6 5 8
7771 8 19 16 7 9 -2 11 16 20 14 13 16 -3 20 8 -2 0 7 7 -3 -5 -7 -8 -5 -17 -8 -9 -15 -10 4 -8 -8 -13 -9 3 -1 -4 5 1 8 13 14 15 11 9 4 22 12
7818 12 7 21 16 13 9 14 9 16 23 9 11 -7 0 2 13 7 -5 -11 -22 -7 -4 -1 -1 -10 -11 -11 -12 -21 -2 -5 -14 -1 -10 6 0 -3 2 9 0 12 5 4 13 11 14 15 8 17 7
7867 7 14 12 12 6 4 1 -9 -5 -6 -16 -5 -2 -6 -2 -9 -2 -13 -6 -5 -1 -10 -3 -5 -6 3 -3 -8 -5 -2 8 15 16 4 13 16 13 12 19 1 3 6 9 5 13 10 8 8 1 2 4 8 -1 -1 -1
7921 -1 -4 -10 -9 -1 -6 -3 -9 -12 -1 -7 0 0 -3 -5 -6 5 1 12 8 6 16 22 10 16 11 14 12 13 21 9 12 13 11 19 10 1 9 10 13 -1 2 4 -5 -3 -1 -9 -10 -14 0 -2 3 8 -3
7974 -3 -2 3 0 0 1 -9 0 14 22 4 11 11 10 15 11 15 15 13 16 14 14 8 12 11 12 26 11 0 0 -4 3 2 -6 -1 0 -5 -5 -10 -7 -14 0 -10 0 -4 1 -2 -8 10 8 9 11
8025 11 7 9 17 10 12 16 7 15 10 18 14 13 4 7 8 1 6 -1 4 -2 8 0 0 -6 -5 0 -11 -11 -1 -8 -3 -19 -16 -9 -9 -16 -9 -12 -3 -2 -6 -7 5 -8 14 13 12 13 18 -1 5 18
8077 18 15 12 15 7 10 9 17 14 12 12 1 12 4 -2 4 -1 9 0 -3 -4 -6 8 6 -10 -4 -3 -6 -6 -4 -12 -7 -2 -2 3 2 4 1 8 17 12 6 13 17 16 24 11 4 5 8 4 10 5 2 9
8131 9 -3 1 -6 -7 -5 -7 -9 2 -9 -8 -9 -7 -8 -2 -2 -11 2 3 -1 -2 2 -3 6 3 10 0 12 7 10 15 7 10 11 8 21 8 10 21 15 -1 7 8 9 3 11 0 6 -1 -1 1
8181 1 -5 -3 -8 -14 -8 0 -1 -9 1 4
8191D
##END NTUPLES=NMR FID
##END=
