##TITLE=1H_E3e-4-4
 CDCl3
 8 sc, 
 16.6.2023
##JCAMPDX= 6.0         $$ Bruker NMR JCAMP-DX V2.0
##DATA TYPE= NMR FID
##DATA CLASS= NTUPLES
##ORIGIN= UXNMR, Bruker Analytische Messtechnik GmbH
##OWNER= root
$$ XWIN-NMR		Version 3.5
$$ Fri Jun 16 14:08:11 2023 Russian Standard Time (UT+4h)  she@DPX200
##.OBSERVE FREQUENCY= 200.13135
##.OBSERVE NUCLEUS= ^1H
##.DELAY= (6, 6)
##.ACQUISITION MODE= SIMULTANEOUS
##.ACQUISITION SCHEME= undefined
##.AVERAGES= 8
##.DIGITISER RES= 18
##SPECTROMETER/DATA SYSTEM= spect
##.PULSE SEQUENCE= zg30
##.SOLVENT NAME= CDCl3
##.SHIFT REFERENCE= (INTERNAL, CDCl3, 0, 15.7039)
##AUDIT TRAIL= $$ (NUMBER, WHEN, WHO, WHERE, WHAT)
$$ ##TITLE= Audit trail, XWIN-NMR		Version 3.5
$$ ##JCAMPDX= 5.01
$$ ##ORIGIN= Bruker BioSpin GmbH
$$ ##OWNER= she
$$ F:/spectra/data/she/nmr/H-F/1/audita.txt
$$ ##AUDIT TRAIL=  $$ (NUMBER, WHEN, WHO, WHERE, WHAT)
(   1,<2023-06-16 14:07:00.29 +0400>,<she>,<DPX200>,
      <created by zg, POWCHK disabled, PULCHK disabled
       configuration hash MD5:
       00 E9 B6 7A A2 85 ED C7 34 08 36 98 17 FE 4E 26
       data hash MD5: 16K
       A9 D3 4E FB 55 75 D5 A2 22 ED 9D 0A B8 E5 6D BB>)
$$ ##END=
$$ 
$$ hash MD5
$$ 35 62 DE 77 8E 5B F9 59 70 8A 76 CA FD 00 85 0E
##$RELAX= 
##$RELAX= 
##$RELAX= 
##$RELAX= 
##$RELAX= 
##$RELAX= 
$$ Bruker specific parameters
$$ --------------------------
##$DU= <F:/spectra>
##$EXPNO= 1
##$NAME= <H-F>
##$PROCNO= 1
##$TYPE= <nmr>
##$USER= <she>
##$AMP= (0..31)
100 100 100 100 100 100 100 100 100 100 100 100 100 100 100 100 100 100 
100 100 100 100 100 100 100 100 100 100 100 100 100 100 
##$AQSEQ= 0
##$AQ_mod= 1
##$AUNM= <au_zg>
##$AUTOPOS= <>
##$BF1= 200.13
##$BF2= 200.13
##$BF3= 200.13
##$BF4= 200.13
##$BF5= 200.13
##$BF6= 200.13
##$BF7= 200.13
##$BF8= 200.13
##$BYTORDA= 1
##$CFDGTYP= 0
##$CFRGTYP= 5
##$CHEMSTR= <none>
##$CNST= (0..31)
1 1 145 1 1 1 1 1 1 1 1 1 1 1 1 1 1 1 1 1 1 1 1 1 1 1 1 1 1 1 1 1 
##$CPDPRG= <>
##$CPDPRG1= <>
##$CPDPRG2= <>
##$CPDPRG3= <>
##$CPDPRG4= <mlev>
##$CPDPRG5= <mlev>
##$CPDPRG6= <mlev>
##$CPDPRG7= <mlev>
##$CPDPRG8= <mlev>
##$CPDPRGB= <>
##$CPDPRGT= <>
##$D= (0..31)
0 1.2 0 0 0 0 0 0 0 0.06 0 0.03 0 0 0 0 0.0002 0 0 0 0 0 0 0 0 0 0 0 0 
0 0 0 
##$DATE= 1686910019
##$DBL= (0..7)
120 120 120 120 120 120 120 120 
##$DBP= (0..7)
150 150 150 150 150 150 150 150 
##$DBP07= 0
##$DBPNAM0= <>
##$DBPNAM1= <>
##$DBPNAM2= <>
##$DBPNAM3= <>
##$DBPNAM4= <>
##$DBPNAM5= <>
##$DBPNAM6= <>
##$DBPNAM7= <>
##$DBPOAL= (0..7)
0.5 0.5 0.5 0.5 0.5 0.5 0.5 0.5 
##$DBPOFFS= (0..7)
0 0 0 0 0 0 0 0 
##$DE= 6
##$DECBNUC= <off>
##$DECIM= 32
##$DECNUC= <off>
##$DECSTAT= 4
##$DIGMOD= 1
##$DIGTYP= 9
##$DL= (0..7)
0 120 120 120 120 120 120 120 
##$DP= (0..7)
150 150 150 150 150 150 150 150 
##$DP07= 0
##$DPNAME0= <>
##$DPNAME1= <>
##$DPNAME2= <>
##$DPNAME3= <>
##$DPNAME4= <>
##$DPNAME5= <>
##$DPNAME6= <>
##$DPNAME7= <>
##$DPOAL= (0..7)
0.5 0.5 0.5 0.5 0.5 0.5 0.5 0.5 
##$DPOFFS= (0..7)
0 0 0 0 0 0 0 0 
##$DQDMODE= 0
##$DR= 18
##$DS= 0
##$DSLIST= <SSSSSSSSSSSSSSS>
$$ [...]
##$SUBNAM2= <"">
##$SUBNAM3= <"">
##$SUBNAM4= <"">
##$SUBNAM5= <"">
##$SUBNAM6= <"">
##$SUBNAM7= <"">
##$SUBNAM8= <"">
##$SUBNAM9= <"">
##$SW= 18.05172834244
##$SWIBOX= (0..15)
0 0 2 0 0 0 0 0 0 0 0 0 0 0 0 0 
##$SW_h= 3612.71676300578
##$TD= 16384
##$TD0= 1
##$TE= 0
##$TE2= 300
##$TE3= 300
##$TEG= 300
##$TL= (0..7)
0 120 120 120 120 120 120 120 
##$TP= (0..7)
150 150 150 150 150 150 150 150 
##$TP07= 0
##$TPNAME0= <>
##$TPNAME1= <>
##$TPNAME2= <>
##$TPNAME3= <>
##$TPNAME4= <>
##$TPNAME5= <>
##$TPNAME6= <>
##$TPNAME7= <>
##$TPOAL= (0..7)
0.5 0.5 0.5 0.5 0.5 0.5 0.5 0.5 
##$TPOFFS= (0..7)
0 0 0 0 0 0 0 0 
##$TUNHIN= 0
##$TUNHOUT= 0
##$TUNXOUT= 0
##$USERA1= <user>
##$USERA2= <user>
##$USERA3= <user>
##$USERA4= <user>
##$USERA5= <user>
##$V9= 5
##$VALIST= <valist>
##$VCLIST= <CCCCCCCCCCCCCCC>
##$VD= 0
##$VDLIST= <DDDDDDDDDDDDDDD>
##$VPLIST= <PPPPPPPPPPPPPPP>
##$VTLIST= <TTTTTTTTTTTTTTT>
##$WBST= 1024
##$WBSW= 4
##$XGAIN= (0..3)
0 0 0 0 
##$XL= 0
##$YL= 0
##$YMAX_a= 358393
##$YMIN_a= -297108
##$ZGOPTNS= <>
##$ZL1= 120
##$ZL2= 120
##$ZL3= 120
##$ZL4= 120
##$ABSF1= 10
##$ABSF2= 0
##$ABSG= 5
##$ABSL= 3
##$ALPHA= 0
##$AQORDER= 0
##$ASSFAC= 0
##$ASSFACI= 0
##$ASSFACX= 0
##$ASSWID= 0
##$AUNMP= <proc_1d>
##$AZFE= 0.1
##$AZFW= 0.1
##$BCFW= 1
##$BC_mod= 2
##$BYTORDP= 1
##$COROFFS= 0
##$CY= 11.3945322036743
##$DATMOD= 1
##$DC= 2
##$DFILT= <>
##$DTYPP= 0
##$F1P= 15.7292609196834
##$F2P= 12.9074282941183
##$FCOR= 0.5
##$FTSIZE= 0
##$FT_mod= 4
##$GAMMA= 1
##$GB= 0.15
##$INTBC= 1
##$INTSCL= 1
##$ISEN= 128
##$LB= 0.24
##$LEV0= 0
##$LPBIN= 0
##$MAXI= 10000
##$MC2= 0
##$MEAN= 0
##$ME_mod= 0
##$MI= 1.114404
##$NCOEF= 0
##$NC_proc= 0
##$NLEV= 6
##$NOISF1= 3.799351
##$NOISF2= 2.8
##$NSP= 1
##$NTH_PI= 0
##$NZP= 0
##$OFFSET= 15.70392
##$PC= 1
##$PHC0= -20783.41
##$PHC1= 10.45272
##$PH_mod= 1
##$PKNL= yes
##$PPARMOD= 0
##$PSCAL= 0
##$PSIGN= 0
##$REVERSE= no
##$SF= 200.130013532006
##$SI= 16384
##$SIGF1= 3
##$SIGF2= 2
##$SINO= 400
##$SIOLD= 16384
##$SREGLST= <1H.CDCl3>
##$SSB= 0
##$STSI= 0
##$STSR= 0
##$SW_p= 3612.71676300578
##$SYMM= 0
##$S_DEV= 0
##$TDeff= 0
##$TDoff= 0
##$TI= <>
##$TILT= no
##$TM1= 0
##$TM2= 0
##$TOPLEV= 0
##$USERP1= <user>
##$USERP2= <user>
##$USERP3= <user>
##$USERP4= <user>
##$USERP5= <user>
##$WDW= 1
##$XDIM= 8192
##$YMAX_p= 0
##$YMIN_p= 0
$$ End of Bruker specific parameters
$$ ---------------------------------
##NTUPLES= NMR FID
##VAR_NAME=  TIME,          FID/REAL,        FID/IMAG
##SYMBOL=    X,             R,               I
##VAR_TYPE=  INDEPENDENT,   DEPENDENT,       DEPENDENT
##VAR_FORM=  AFFN,          ASDF,            ASDF
##VAR_DIM=   8192,          8192,            8192
##UNITS=     SECONDS,       ARBITRARY UNITS, ARBITRARY UNITS
##FACTOR=    0.0002768,     1,               1
##FIRST=     0,             0,               0
##LAST=      2.2672688,     0,               0
##MIN=       0,             -297108,         0
##MAX=       2.2672688,     358393,          0
$$ Real data points
##PAGE= N=1
##DATA TABLE= (X++(R..R)), XYDATA
0 0 0 0 0 0 0 0 0 0 0 0 0 0 0 0 0 -8 8 -8 8 -8 16 -16 16 -24 25 -32 36 -42 49 -57 68 -76 84 -100 111 -125 142
37 142 -160 179 -201 224 -249 278 -310 342 -378 417 -462 509 -562 618 -681 751 -826 910 -1004
56 -1004 1108 -1227 1360 -1515 1692 -1900 2146 -2442 2804 -3243 3754 -4221 3618 9338 358393
71 358393 118745 -89225 143563 -160121 -297108 180447 218028 -91415 18530 -41527
81 -41527 -229263 68701 235306 -21360 -12173 21439 -171122 -41705 172444 -7681 -82460
92 -82460 41851 -18928 -17433 118816 28919 -101561 -61316 -17127 48309 98724 -9884 -73852
104 -73852 -38097 -43275 60312 168735 -3919 -144528 -65914 -54222 13276 191930 79255
115 79255 -128761 -64345 -35341 -43780 150642 133618 -131990 -106468 11642 -46609 73387
126 73387 185526 -46992 -145118 10703 -8944 -15328 121425 18859 -133003 -9492 52581
137 52581 -9650 61240 41504 -112527 -51876 69587 6334 -3213 43007 -52587 -73486 67485
149 67485 78892 -19452 -26165 -30249 -61147 13267 94769 37837 -41929 -44006 -29597 1849 66551
162 66551 59520 -35042 -74056 -30513 7109 45374 71780 5047 -73215 -44207 7353 19583
174 19583 44405 27155 -51127 -52518 16079 28725 18696 23384 -18021 -50262 -4710 32102
186 32102 14996 2005 -6079 -20144 -4448 25676 19295 -11358 -21660 -8662 2745 14112
198 14112 24510 -1015 -35916 -13891 19673 9702 10247 11668 -32629 -34509 22792 22287 -1607
211 -1607 16980 -8788 -45606 6247 35297 -5812 3234 13608 -33320 -14747 36174 3109
223 3109 -11839 20554 -11364 -29338 23112 15173 -21387 10376 11204 -25580 2516 19381 -16404
236 -16404 -3309 18778 -12688 -10589 15100 -6855 -10572 16903 1845 -13989 4463 429 -6677
249 -6677 12593 7525 -10970 -2365 515 -3248 11059 9459 -9796 -7187 -709 82 11915 8712
263 8712 -12113 -10593 -327 613 11437 11114 -13403 -17053 80 5453 11953 12417 -13066 -22806
277 -22806 -721 11419 12998 13661 -8910 -27618 -6668 16855 18002 12973 -6337 -28296 -13689
290 -13689 16259 21609 12023 -4904 -26174 -19208 13219 25776 11890 -7325 -24547 -20743 9113
303 9113 27142 13417 -8954 -23244 -18304 8482 28507 15774 -11982 -26316 -17219 10186 30740
316 30740 19546 -11286 -28403 -17725 10377 30831 20845 -11836 -32444 -20515 10996 33085
328 33085 23686 -9778 -34198 -24629 7932 30895 23368 -7734 -33144 -25567 8928 34049 24862
341 24862 -7497 -33476 -28110 5702 33778 26944 -4904 -30366 -26332 6081 34916 27860 -7202
354 -7202 -34034 -28549 3974 34376 31197 -2732 -32275 -29700 1838 31267 28078 -4363 -33513
367 -33513 -30708 2646 33673 30458 -1385 -30604 -32293 -1920 31894 29957 -3095 -28320 -27516
380 -27516 -894 33556 34831 -2809 -32135 -28851 -4613 28036 37076 2009 -32378 -26806 -1285
393 -1285 24078 34372 4431 -35706 -32774 -578 23802 31965 10718 -29341 -34847 -557 25291
406 25291 25913 7312 -25378 -36201 -3227 31717 30657 5919 -20992 -32670 -11206 26461 33823
419 33823 3861 -24112 -26335 -9377 20114 36970 10613 -28121 -29267 -7465 11146 28684
431 28684 18261 -23376 -31533 147 15173 17912 16901 -16390 -38029 -2806 24741 14763 10531
444 10531 -5641 -34339 -9950 32365 19600 -3011 -7746 -27977 -19562 31025 35848 -2961 -15130
457 -15130 -20518 -23696 15259 40853 5694 -22540 -18633 -16519 4267 35974 19906 -19114 -23807
470 -23807 -12019 -155 20545 22914 -5814 -21860 -8997 5700 11716 12387 -53 -16556 -11862
483 -11862 9396 13684 1389 -3342 -6668 -10411 7019 20862 -1370 -18967 -7028 -2650 2216
496 2216 23941 12138 -25334 -19127 3906 2476 15769 23839 -16589 -33139 2006 10340 6440
509 6440 26258 4245 -37657 -12286 17354 850 12088 22228 -22593 -27735 16229 7693 -6663
522 -6663 20207 1487 -31206 3297 17064 -14124 3580 18354 -17833 -9142 21092 -9087
534 -9087 -16765 17926 2140 -13907 17512 6007 -25956 765 15738 -6257 6885 15287 -17543
547 -17543 -17054 9580 5684 4803 13321 -5052 -18746 -5530 4117 8573 10678 54 -8916 -10711
561 -10711 -7944 8522 13838 -1842 -679 110 -18305 -3787 20678 -978 -5413 16840 -9977
574 -9977 -24224 16918 10252 -15952 18350 13714 -32419 -2562 21749 -17329 2365 33109 -19041
587 -19041 -25282 21678 -5355 -17846 31901 7706 -33806 7508 10724 -24613 12414 26777
599 26777 -21748 -8299 17949 -16551 -8679 25903 -2722 -13558 15840 -3287 -19129 12027
611 12027 8379 -9924 10558 7696 -17996 -4520 7383 -3257 6958 12051 -8293 -11871 -3014
624 -3014 -2034 7978 12337 -1533 -7886 -8703 -8191 7910 14491 762 -2272 -5378 -14595 2583 17693
639 17693 1030 -2013 3737 -13671 -7953 17925 4013 -9141 8586 -1944 -15966 10426 10813
652 10813 -15353 1404 12526 -11849 -2373 14511 -12135 -13009 17023 4213 -9973 9415 -1959
665 -1959 -21586 6710 19246 -4391 -215 5060 -18569 -8695 21564 8500 -5935 4473 -8672
678 -8672 -18344 11142 18960 -3902 -2498 -133 -16085 -3070 19000 4368 -7562 563 -6879
691 -6879 -9386 10542 9776 -6833 -2898 438 -5826 3098 8983 -3403 -5478 2188 700 1581 4512
706 4512 -2788 -5852 890 4145 4752 2351 -5690 -6398 -201 3083 7193 5196 -8095 -9787 859
721 859 2131 5002 9264 -5312 -13992 112 4077 1508 9783 1414 -15165 -2987 7843 -404
735 -404 5521 7627 -12177 -8508 10393 2304 -1687 8247 -4940 -12649 7508 7589 -5586 2829 804
750 804 -11675 2733 11261 -4212 -3709 2268 -8001 -1560 12255 513 -7175 810 -3536 -3285
764 -3285 10438 5226 -7040 -2296 -966 -3003 7207 7590 -4726 -4150 -551 -2325 4265 6861 -3209
779 -3209 -4750 -129 -1893 1859 5812 -2409 -5464 507 -27 400 4323 -1542 -5916 690 2190 588
795 588 3626 -678 -6617 -122 4387 1371 2761 637 -6290 -2362 4950 2791 1544 932 -5152 -4433
811 -4433 3533 3640 918 656 -3583 -5112 1439 3925 844 30 -2379 -4296 280 3728 1251 -226
827 -226 -1389 -2887 -63 3350 1754 -429 -1110 -1498 388 2557 1728 -540 -1618 -1091 746 1993
843 1993 783 -563 -1936 -1435 1074 1511 -288 -749 -1534 -1880 1220 2192 -815 -1177 -463 -1657 899
860 899 3160 -293 -1790 183 -1084 227 3862 630 -2486 220 -79 -765 3234 1849 -2782 -925
876 -925 328 -1428 1674 2191 -2458 -1869 388 -966 677 2156 -1696 -1631 416 -937 764 2113
892 2113 -1620 -1261 1273 -1022 160 3301 -1186 -1938 2584 -427 -1523 3594 -174 -3286 2986 742
908 742 -3979 2604 1861 -4947 1705 3370 -5113 -492 4327 -4414 -1440 5906 -3082 -4342 4904 -900
924 -900 -4356 5511 1838 -5628 2140 2772 -4248 1873 4558 -2935 -859 2787 -2176 -968 3260 -138
940 -138 -1253 1122 -1010 -1718 454 638 650 161 -1317 -563 -1323 -1502 2899 1770 -2656 508 461 -4618
958 -4618 1963 6123 -2667 -1266 3956 -4709 -3104 8382 995 -5084 4601 -346 -7832 5027 5932
973 5932 -5850 768 4112 -7490 -1442 7577 -3030 -3245 5620 -2560 -5538 4772 864 -4650
987 -4650 3754 3031 -4761 -199 2236 -3158 566 5324 660 -2925 -922 -850 -1063 2765 5286 250
1003 250 -5488 -2491 748 -876 3986 6569 -4597 -7731 1466 -501 -1170 8851 2090 -10272 -1254
1018 -1254 2600 -4781 4965 9317 -7260 -5569 5659 -3883 -2976 11064 580 -8638 4790 1959
1032 1959 -8466 4093 6865 -5957 487 6665 -6419 -5434 5505 -624 -2013 7016 196 -9227
1046 -9227 -1749 2739 -547 4232 5946 -4958 -8845 -137 3541 1937 5388 3549 -7885 -7727 4163
1061 4163 4338 622 5750 224 -10799 -1607 7160 -965 892 6552 -6068 -7727 6128 1290
1075 1290 -5323 5809 2445 -8867 1639 5567 -7162 -1393 7855 -2773 -2960 6447 -3054 -7967
1089 -7967 4716 4659 -2031 3468 1283 -8692 -2360 6851 2734 990 2599 -4930 -7991 2237 7319
1104 7319 1558 -319 -564 -6523 -5468 6099 6775 -2033 -1346 -935 -7017 -549 8921 1032 -3657 2231
1120 2231 -3088 -5424 6515 4284 -5401 2204 3471 -7083 816 7446 -5425 -2891 8612 -1836
1134 -1836 -5854 5565 -1147 -7887 5811 6207 -5642 -484 1352 -7521 174 9074 -102 -3116
1148 -3116 666 -5214 -3852 7273 5204 -1910 -726 -2708 -4960 2333 6866 2131 -1698 -2589 -2722
1163 -2722 -718 2593 4092 1030 -3485 -2346 513 -846 1141 3373 -2022 -3261 2365 -509 -3269
1178 -3269 2881 992 -3976 2788 3516 -5294 -958 3934 -3042 -85 7054 -2130 -5814 3232 380
1193 380 -2888 6004 3073 -6705 -896 2482 -3277 2363 6001 -4221 -4406 2510 -1771 -1348 5728
1208 5728 -2 -5568 760 979 -2694 2631 3174 -3496 -1393 2197 -1074 -86 2815 -609 -1600 1515
1224 1515 381 -765 944 112 -799 681 538 -404 -257 -584 -192 693 -67 -350 -79 -1297 -878 1475
1242 1475 218 -920 675 -672 -1780 1526 1488 -1292 679 883 -2121 264 2567 -840 -588 2025
1258 2025 -1124 -1537 2397 183 -1894 1594 598 -2355 757 1301 -2222 54 1838 -1868 -1124 1612
1274 1612 -1190 -1266 2046 -146 -1710 1155 41 -1379 1476 1189 -1318 213 1018 -931 630 1678
1290 1678 -852 -654 725 -405 59 1333 -617 -1297 346 -66 -92 883 -444 -1662 -186 127 -159
1307 -159 992 -36 -1605 -282 616 100 897 684 -1228 -553 977 331 530 735 -929 -875 924 673
1325 673 222 315 -1027 -1236 724 1091 45 -161 -940 -1639 190 1533 446 -424 -1081 -1648 -135 1649
1343 1649 1258 11 -760 -1456 -605 1447 1726 472 -745 -1094 -688 890 1682 571 -663 -984 -600
1360 -600 500 1180 349 -1009 -1256 -170 443 802 375 -1321 -1782 40 1239 829 412 -815 -1902
1377 -1902 -581 1849 1379 453 -335 -1924 -1083 1814 1887 416 -93 -1355 -1578 957 2016 173 -535
1394 -535 -804 -1587 146 1856 314 -1171 -910 -1060 15 1687 911 -1172 -1625 -702 794 1947 1131
1411 1131 -713 -1939 -1365 969 2569 1263 -292 -1403 -1960 -33 2886 1584 -754 -898 -1917 -1261
1427 -1261 2383 2018 -1233 -850 -979 -2035 1185 2730 -1263 -1618 431 -1106 -48 2972 -123 -2926
1443 -2926 426 980 -512 2104 1411 -3139 -1261 2006 612 806 1758 -1774 -2925 977 1867 649
1459 649 820 -674 -3088 -938 2092 1272 37 -491 -1805 -1868 1060 2386 57 -1216 -398 -993 -224
1476 -224 2515 1170 -2088 -634 929 -427 1108 2424 -1774 -2517 1649 1132 -498 1839 -212 -3725
1492 -3725 186 2843 -348 51 728 -3490 -2195 3150 1595 -954 348 -1384 -3210 1351 3549
1507 3549 3 -678 -40 -2158 -891 3127 2133 -1272 -597 -291 -1622 884 3076 -217 -2139 397
1523 397 -144 -1670 1662 1934 -2555 -1001 2132 -1352 -1491 2385 -700 -2730 2579 1624 -3150 377
1539 377 1521 -2883 1033 4378 -1830 -2281 2024 -1347 -1301 4719 1350 -3824 316 338 -2704 2251
1555 2251 3991 -2252 -2384 583 -1729 -590 3556 894 -2516 -559 -503 -1191 1155 2281 -179 -1388
1571 -1388 -106 60 -683 1080 2065 -388 -1274 1132 -307 -1999 1912 2280 -1974 173 1653 -3154
1587 -3154 -1242 3625 -329 -1771 2686 -1203 -4221 2369 2098 -2715 1777 1841 -4567 -645 3634 -1749
1603 -1749 -556 3850 -1936 -3346 2987 476 -2327 3069 1617 -3432 232 1541 -2342 691 3146
1618 3146 -1052 -1505 649 -1482 -1231 2247 1305 -935 -807 -1075 -1324 497 2069 1231 -1087 -1747 -474
1635 -474 -200 679 2716 698 -2742 -698 928 -817 1690 2858 -2031 -2155 1794 -462 -913 3106
1651 3106 -301 -3360 1562 1388 -2692 1084 1818 -3353 -243 3500 -1943 -1983 2112 -1359 -1737 3794
1667 3794 945 -3299 255 479 -1659 2686 3253 -2433 -2151 617 -650 1121 3532 -410 -3344 -909
1683 -909 194 703 2367 821 -2328 -2604 -47 1246 1529 675 -1105 -2419 -1053 1747 1940 -140
1699 -140 -749 -1203 -1315 1438 2850 -164 -1659 -403 -753 423 3113 561 -2825 -955 426 190
1715 190 2238 1560 -3126 -2528 870 873 1232 1832 -2039 -3814 359 2167 1030 1327 -913 -3742 -992
1732 -992 2796 1888 593 -486 -2712 -1968 2357 2923 465 -995 -1834 -1831 1184 3319 951 -1572 -1914
1749 -1914 -1473 527 2805 1437 -1681 -2407 -943 597 2030 1658 -1360 -2854 -783 1239 2005 1590
1765 1590 -822 -2856 -1225 1756 2440 1323 -754 -2566 -1500 1539 2735 1314 -1131 -2538 -1861
1780 -1861 992 2743 1599 -1138 -2800 -1912 867 2468 1776 -849 -2921 -1847 802 2275 1914 -263
1796 -263 -2723 -2146 919 2484 1720 63 -2213 -2213 872 2643 1624 -90 -1748 -2149 271 2601 1458
1813 1458 -547 -1691 -2185 -50 2404 1738 -797 -1692 -1777 -231 2300 1807 -637 -1949 -1603 -224 2114
1830 2114 2183 -472 -1885 -1475 -40 1962 2301 -232 -1919 -1414 -74 1723 2314 -80 -2044 -1618 -121
1847 -121 1358 2103 80 -2248 -1660 -306 1150 1974 285 -1978 -1543 -104 1156 1717 513 -1630
1863 -1630 -1608 143 1106 1795 730 -1391 -1467 236 1083 1260 822 -1158 -1664 48 1044 865 468 -1042
1881 -1042 -1802 -253 1106 793 71 -628 -1509 -449 991 914 110 -514 -1063 -364 1044 1148 423 -541
1899 -541 -822 -309 705 1047 464 -554 -807 -143 536 714 357 -441 -998 -248 382 309 253 -76 -1023 -374
1919 -374 737 91 -332 226 -348 -692 677 662 -590 179 251 -521 390 943 -332 -307 605 -115 -188 821
1939 821 -54 -796 329 325 -507 163 349 -626 -130 349 -278 -451 232 -20 -346 251 281 -403 -308 546 376
1960 376 -92 140 6 -584 227 1220 222 -351 -35 -504 -367 1310 921 -866 -497 -170 -831 780 1681
1979 1681 -669 -1494 -90 -403 -105 1796 372 -1926 -596 372 -444 1062 1278 -1434 -1205 880 422
1996 422 89 1147 -350 -1680 465 1414 -108 23 -213 -1406 -205 1778 678 -822 -746 -944 -541
2013 -541 1437 1514 -703 -1737 -831 -141 863 2058 419 -2228 -1529 418 917 1626 1440 -1602 -2451
2030 -2451 362 1472 936 1324 -315 -2737 -868 1965 939 194 274 -1887 -1871 1639 1618 -639 -320
2047 -320 -631 -1795 860 2466 -477 -1584 -262 -650 189 2576 582 -2358 -958 653 351 1916
2063 1916 1647 -2079 -2418 691 1461 1064 1480 -1075 -3153 -621 2067 1426 685 -247 -2603 -1974 1670
2080 1670 2380 378 -603 -1612 -2080 488 2826 967 -1123 -971 -1130 -345 2252 1751 -1230 -1446 -83
2097 -83 -5 1055 2023 -751 -2536 -42 1096 432 1197 29 -2702 -1014 2061 1186 -55 43 -2184
2114 -2184 -2089 1967 2572 -191 -776 -1211 -2220 826 3554 838 -1514 -956 -1536 -284 2899 2045 -1340
2131 -1340 -1586 -793 -699 1649 2538 -650 -2203 -620 -142 454 1884 249 -2029 -1089 664 585 604 487
2149 487 -1296 -1333 758 1517 212 -366 -740 -1086 545 1971 899 -1016 -1004 -718 8 1923 1808 -1156
2167 -1156 -1741 -514 21 911 2131 -265 -2582 -1032 546 424 1437 843 -2029 -1840 754 801 489
2184 489 1028 -877 -2144 405 1530 218 575 194 -1688 -292 1792 580 -332 128 -795 -887 1202
2201 1202 1068 -914 -679 -150 -538 548 1190 -479 -1299 -385 -13 319 1055 276 -1250 -625 322 635
2219 635 789 399 -818 -1042 118 894 547 311 -225 -817 -330 784 786 -66 -428 -488 -489 228 769 -25 -699
2240 -699 -333 -187 -126 505 282 -648 -402 379 -110 200 377 -268 -508 518 440 -204 360 273 -611 251 632
2261 632 -171 -263 292 -278 -349 586 188 -490 83 158 -427 215 403 -609 -145 407 -201 -121 563 -70 -400
2282 -400 353 164 -183 243 124 -262 338 413 -138 59 89 -333 168 446 -200 -294 -53 -130 23 386 -133
2303 -133 -509 -122 -255 5 496 -87 -587 -84 -85 70 608 146 -532 -118 136 186 585 260 -534 -292 226
2324 226 64 403 377 -529 -609 252 63 143 342 -485 -764 163 291 76 203 -292 -833 24 455 122 121 -128
2346 -128 -674 30 735 449 134 -59 -666 -197 844 497 -26 -69 -555 -372 568 563 12 -271 -453 -395 346
2367 346 581 -151 -393 -433 -352 393 584 -112 -371 -353 -190 508 585 -120 -393 -302 -181 473 933 53 -304 -384
2389 -384 -284 294 776 213 -565 -367 -205 160 643 274 -623 -614 -224 213 536 408 -526 -645 -194 227 600
2410 600 350 -227 -692 -266 283 571 485 -23 -448 -271 245 513 408 -261 -431 -213 9 518 124 -290
2430 -290 -352 -168 -110 402 230 -511 -422 163 -61 274 365 -407 -672 358 467 39 490 -18 -736 19 828
2451 828 164 79 310 -716 -363 683 450 1 96 -437 -822 322 532 9 -177 -130 -606 -163 637 154
2471 154 -136 -175 -210 -244 200 316 -90 -221 163 204 33 237 200 -249 -42 506 116 -147 190 -140 -469 282
2493 282 452 -477 -261 145 -479 -162 661 -232 -594 271 -9 -415 523 373 -737 -49 434 -361 -24 818
2513 818 -253 -584 530 51 -382 694 265 -704 14 496 -449 -93 462 -174 -421 353 5 -554 201
2532 201 273 -308 -120 320 -426 -297 488 293 -238 231 244 -665 -12 793 -71 -88 572 -248 -581 616 569
2553 569 -493 111 334 -880 -40 763 -250 -356 465 -325 -702 514 258 -657 201 401 -563 -99 589
2572 589 -331 -282 849 200 -500 383 117 -425 369 756 -144 -297 325 -259 -251 546 464 -544 -316 -1 -302
2593 -302 1 773 -112 -865 73 15 -477 509 664 -762 -487 478 -218 -150 918 27 -768 483 262 -533
2613 -533 345 673 -759 -51 781 -374 -414 777 -179 -661 614 218 -929 93 393 -535 126 594
2631 594 -527 -584 406 -88 -197 677 250 -692 15 317 -103 208 685 -152 -477 303 227 10 412 398 -546
2652 -546 -337 272 -77 -158 411 -23 -697 -14 153 -297 52 419 -478 -395 283 -10 -329 529 258 -557 166
2673 166 445 -469 16 594 -314 -284 563 41 -445 307 171 -543 166 373 -583 -317 320 -289 -232 513 -94
2694 -94 -651 -31 120 -235 271 474 -382 -548 303 135 -150 555 169 -684 54 436 -115 182 360 -496
2714 -496 -631 593 249 -182 245 -79 -756 81 596 -196 -107 91 -559 -308 746 243 -395 -47 -193 -285
2734 -285 338 581 -274 -292 -145 -144 254 512 104 -310 -154 46 251 293 11 -495 -324 12 434 343 6 -429
2756 -429 -478 -188 457 471 7 -365 -403 -291 414 823 4 -461 -193 -181 204 908 233 -517 -218 -33 45 752
2778 752 454 -611 -591 -11 172 296 367 -382 -846 -54 305 264 392 -294 -817 -150 511 321 268 -88 -680
2799 -680 -221 578 495 220 -42 -538 -370 539 697 158 -294 -655 -375 400 543 198 -297 -618 -393 305
2819 305 587 272 -304 -536 -407 145 712 375 -211 -488 -534 131 789 458 -160 -593 -441 202 812 566
2839 566 -226 -510 -305 146 663 562 -267 -579 -241 6 515 434 -310 -772 -434 101 284 598 -22 -712
2859 -712 -375 317 342 451 -65 -621 -442 321 623 434 57 -577 -510 286 550 535 68 -493 -576 108 503
2880 503 347 -90 -527 -613 -85 531 364 -61 -594 -517 -97 384 463 -25 -429 -382 -100 366 537 22 -363
2901 -363 -400 59 509 460 4 -322 -383 -28 331 417 -32 -258 -427 -222 307 288 -38 -371 -321 -242 246 352
2923 352 38 -273 -303 -89 211 496 161 -359 -241 1 150 294 280 -148 -323 127 256 293 169 -52 -438
2944 -438 -239 222 45 -20 -17 -285 -299 205 122 -86 -3 -121 -358 149 373 -95 -190 170 -68 -126 353 184 -117
2967 -117 135 318 -77 115 141 -91 -98 117 72 -67 286 109 -234 -66 3 -208 -70 205 -143 -268 87 -94
2989 -94 -197 203 224 -214 -116 29 -153 109 469 111 -238 37 14 5 299 345 -272 -175 212 -72 2 288 -63
3012 -63 -398 15 170 -97 57 101 -418 -201 333 62 -239 122 -164 -394 277 540 -53 -87 63 -221 128
3033 128 665 89 -462 -124 -5 -192 491 431 -406 -520 49 -4 93 536 -130 -833 -113 293 108 197 239 -761
3055 -761 -590 470 415 69 223 -311 -632 309 688 60 2 1 -549 -110 728 362 -499 -197 -238 -343 496
3076 496 677 -530 -615 -45 -40 96 701 -115 -822 -96 348 200 539 140 -777 -582 433 517 322 191 -530
3097 -530 -760 286 742 387 -22 -349 -747 -202 875 573 -263 -472 -545 -428 449 750 -167 -743 -232 -59
3117 -59 125 606 366 -849 -353 394 208 357 539 -566 -829 366 663 99 352 -245 -911 256 960
3136 960 97 -124 -31 -663 -359 891 554 -406 -213 -324 -655 696 958 -240 -592 -121 -365 167 925
3155 925 125 -723 -256 52 51 595 409 -564 -704 97 347 455 394 -233 -827 -305 458 413 -52 -238 -533
3176 -533 -349 540 605 -115 -421 -337 -467 269 779 108 -586 -175 -126 51 711 419 -676 -452 124 145 407
3197 407 524 -355 -864 20 396 217 418 -114 -857 -413 546 263 92 2 -632 -511 447 535 -67 -142 -257
3218 -257 -358 104 731 151 -276 -176 -174 20 587 386 -314 -357 -37 38 254 458 -235 -624 -54 200 41
3239 41 316 -136 -613 -243 207 160 159 57 -369 -391 268 352 196 15 -138 -295 200 440 206 -84 -116 -248
3261 -248 -44 338 291 -52 -238 -119 34 187 123 -35 -244 -185 16 191 70 88 -197 -363 124 247 -47
3282 -47 -56 24 -332 10 410 75 -86 7 -103 -124 359 166 -225 154 -146 -256 298 178 -261 -124 7 -82
3304 -82 -69 367 -20 -148 80 15 -116 86 20 -169 -20 13 1 66 160 -121 52 38 28 70 109 -79 -169 -22
3328 -22 -66 32 50 -5 -182 -123 -68 -48 96 -70 -61 -33 -109 -104 -59 73 -94 60 -89 -120 56 158 -83 48 15 -90
3354 -90 118 187 68 20 -10 29 -63 211 90 -72 -99 -35 -4 -66 -15 15 -217 -32 71 -76 115 -147 33 20
3378 20 108 90 187 41 -128 -9 76 118 146 -7 -156 -102 29 219 131 48 -187 -141 13 134 14 -9 -168 -173 -79
3403 -79 53 147 74 -90 -54 -55 81 185 -15 -173 17 61 109 218 -22 -155 -24 153 170 146 -11 -234 -125
3426 -125 58 206 105 0 -144 -173 -156 147 193 -23 -155 -143 32 185 194 -10 -186 -138 55 70 165 51 -136
3449 -136 -104 121 146 150 116 -208 -219 136 162 56 140 -211 -349 142 223 -34 -91 -93 -250 -155 320 105 -166 -109 -216
3474 -216 -117 251 252 -76 -146 72 -119 149 351 -48 -224 -137 -41 71 330 -26 -274 -211 152 113 -34 166 -135
3497 -135 -358 -45 192 24 -46 -32 -212 -36 222 116 -149 -83 -123 -126 264 275 -157 -212 41 -45 129 410 25
3520 25 -445 -68 86 -8 234 138 -426 -179 164 44 71 185 -167 -374 2 213 98 84 9 -455 -136 420
3542 420 156 -88 -5 -61 -114 120 334 -135 -330 66 42 -55 312 165 -445 -156 107 92 142 90 -454 -271 230
3565 230 65 -178 116 -53 -507 108 391 -125 -16 219 -311 -203 288 362 -78 59 -164 -380 246 419
3585 419 -206 -200 55 -162 -33 299 89 -396 53 83 -140 195 214 -207 -210 209 112 19 227 10 -323 -71 397
3608 397 -45 32 88 -174 -144 294 117 -251 14 -55 -248 119 307 -210 -261 1 -98 -206 361 133 -317 -25
3630 -25 131 -149 1 405 -110 -210 90 -9 -160 174 120 -308 6 146 -55 -19 339 -137 -306 199 36
3651 36 -140 211 116 -333 -94 109 -260 -100 123 -48 -226 250 -52 -265 49 80 -350 -127 272 27 -180
3672 -180 224 -53 -196 213 114 -112 39 62 -170 9 269 35 -209 -81 -97 -107 221 186 -260 -177 72 -122
3694 -122 193 281 -53 -339 -89 90 11 255 110 -317 -283 214 190 85 230 -129 -338 40 255 113 -10
3715 -10 -58 -275 -56 295 126 -74 -84 -245 -235 157 397 -131 -319 -50 -131 9 383 25 -348 -87 22 78
3737 78 338 256 -304 -408 53 230 277 272 -218 -482 34 331 238 80 -17 -384 -176 377 412 70 -231 -344 -256
3760 -256 259 465 78 -182 -309 -301 153 511 72 -420 -433 -184 176 345 344 -291 -409 -194 163 376 263 -156
3782 -156 -432 -197 191 278 226 -273 -475 -324 243 331 183 -36 -355 -244 101 526 174 -219 -396 -229 230
3803 230 381 337 -156 -467 -132 204 389 408 -155 -557 -286 238 422 300 -202 -561 -366 134 407 299 -77
3824 -77 -474 -406 138 521 277 -110 -444 -457 202 530 253 -45 -342 -437 155 586 419 -111 -307 -409 180
3845 180 492 430 11 -476 -385 -9 371 270 -167 -314 -364 39 528 325 -52 -422 -501 -136 407 443 6 -355
3867 -355 -351 -36 357 412 10 -374 -366 -8 242 440 -14 -451 -327 81 267 314 117 -481 -315 39 273 311
3889 311 51 -284 -308 33 335 264 3 -364 -415 -98 323 390 98 -310 -421 -88 263 217 50 -203 -244 -78
3911 -78 203 246 9 -249 -348 -136 253 298 -14 -196 -312 -92 75 300 215 -146 -246 -84 176 241 89 -137
3933 -137 -344 -45 59 225 60 -167 -210 17 129 196 109 -97 -179 -176 169 208 21 -130 2 -166 79 70 78 -134
3957 -134 -52 -173 46 116 176 -26 -150 58 78 -20 42 106 -77 4 -59 -16 -57 216 -139 -79 173 24 -95 33
3981 33 -58 -116 -61 -57 -87 -115 98 -81 -68 2 -68 -11 175 88 -43 -33 -3 -20 15 197 -103 -144 -47 28 56 102 -38
4008 -38 -304 -17 246 85 -29 -9 -107 -231 70 192 -74 -107 -193 -127 -3 279 115 -162 -155 -75 -96 302 307 -92
4032 -92 -221 -87 -9 287 363 -38 -298 -189 61 71 271 119 -349 -254 -3 138 123 73 -227 -451 168 282
4054 282 137 68 -93 -372 -125 386 242 18 -232 -225 -98 417 394 -174 -210 -290 -35 231 465 23 -404 -283
4076 -283 70 99 334 185 -445 -526 1 345 241 253 -292 -615 66 404 251 57 -148 -540 -176 420 449
4097 449 21 -101 -203 -366 393 554 -1 -282 -315 -215 268 565 129 -441 -306 -141 42 428 248 -432
4117 -432 -564 -45 162 413 390 -169 -550 -226 347 410 231 -179 -414 -302 311 426 159 -92 -400 -481 268
4138 268 510 239 -299 -246 -408 113 683 305 -437 -419 -213 33 536 451 -229 -549 -133 161 363 330 -20
4159 -20 -672 -76 298 330 295 6 -617 -436 319 515 179 -9 -297 -462 150 563 139 -117 -359 -383 -52
4180 -52 515 446 -179 -406 -287 -60 402 491 -130 -452 -246 109 237 440 -18 -489 -354 189 266 409 142
4201 142 -444 -469 149 425 333 31 -287 -433 35 411 212 21 -266 -313 -69 451 428 -137 -184 -126 -217 307
4223 307 524 61 -331 -213 14 226 479 198 -181 -367 -36 157 321 326 -157 -419 6 202 335 137 -157
4244 -157 -412 -140 263 221 130 -157 -253 -151 234 336 75 -173 -193 -141 55 303 133 -227 -191 -78 86 258
4266 258 242 -126 -190 -68 57 90 197 -203 -205 -164 86 146 63 -8 -305 -129 76 61 -24 -33 -166 -137 132 133 24
4291 24 51 19 -149 95 160 63 -116 -8 -71 -13 85 75 -13 -57 -149 6 -14 83 -79 -19 -10 -103 -36 33 -13 -114 -43
4318 -43 82 55 -83 -79 42 2 27 72 -15 -13 -45 -14 -139 -93 19 -161 50 91 101 -109 -20 -30 24 5 -47 -134 -104
4345 -104 -28 85 -13 69 -150 -83 3 51 143 85 -80 -88 -16 159 122 40 69 -218 40 8 42 6 -139 -160 5 100
4371 100 53 -80 -122 -191 -60 105 202 197 -178 -130 -40 78 106 59 -142 -169 37 57 252 -32 -88 -145 -77 121 212
4396 212 -96 -133 -267 -19 89 252 28 -135 -183 -123 90 234 162 -159 -183 -194 80 206 243 -122 -219 -121 156
4419 156 295 104 -170 -238 -215 160 123 164 -24 -326 -214 100 190 206 -85 -248 -205 9 236 144 -30 -197 -193
4442 -193 68 240 221 -145 -291 -149 -66 355 130 -49 -250 -213 -4 179 210 -150 -391 -214 110 160 181 -73
4464 -73 -355 -91 -64 193 275 -5 -204 -298 41 215 188 42 -222 -282 -71 279 298 -51 -191 -212 -6 284 325
4487 325 54 -61 -127 -106 267 316 -76 -77 -169 -202 167 266 101 -255 -224 58 142 214 127 -218 -263 -24 200 230 160
4512 160 -157 -328 -20 242 224 -18 5 -260 -157 188 270 -46 -88 -263 -224 176 308 137 -76 -169 -217 38
4534 38 250 224 -135 -220 -150 -41 200 297 -61 -211 -3 -4 93 192 -19 -295 -187 198 105 85 32 -224 -136 109
4558 109 261 112 5 -127 -254 -129 199 155 -160 -75 -126 -43 211 313 -83 -162 -120 -6 86 145 -34 -161 -142
4581 -142 -31 28 196 69 -166 -167 103 46 143 250 -147 -270 146 166 13 -10 -42 -230 45 134 23 -110 86
4604 86 62 -208 139 151 6 -94 -41 -55 25 167 165 -86 -33 -4 -58 185 14 -211 -146 65 -49 125 59 -62
4628 -62 -121 35 16 -33 149 118 -126 -129 90 12 -37 84 -92 -203 26 105 -107 30 93 -200 -107 11 -73 1 58
4653 58 -17 -55 -1 152 -217 96 38 -41 -93 -26 101 -25 -65 47 -117 -85 6 117 -64 142 63 25 144 115 -150
4678 -150 5 112 -79 -17 135 -101 46 -10 -70 13 121 -20 -170 -36 6 -34 -1 56 -83 -59 -5 -28 37 22
4702 22 -27 -134 -91 127 51 -42 33 -116 -166 119 136 -22 64 -24 -186 -31 207 97 -21 -117 -63 -81 158 128 -50
4727 -50 -99 5 -7 97 240 -54 -90 19 79 50 62 62 -111 -155 38 20 21 73 -172 -218 -67 94 79 -31 -52 -183
4753 -183 -117 187 18 6 -109 -139 -159 126 227 -32 -140 -103 -156 78 232 57 -148 -159 -48 25 279 98 -173
4776 -173 -54 -20 60 154 76 -166 -193 -36 141 116 113 -25 -214 -195 -25 124 84 -69 -198 -156 -4 308 126 -52
4800 -52 -133 -127 4 191 56 -92 -126 -160 -27 106 202 -8 -217 -109 42 133 142 -67 -152 -99 28 180 104 -62
4824 -62 -138 -298 -18 68 158 13 -138 -147 3 217 156 -10 -52 -284 -83 129 200 52 -103 -181 -3 127 209 35
4848 35 -40 -177 -111 65 195 4 -97 -189 -233 163 178 77 -126 -193 -100 124 112 41 -56 -150 -100 145 174 91 -74
4873 -74 -177 -52 96 350 184 -122 -197 -97 72 218 80 -174 -250 -130 -76 125 110 -166 -176 -138 105 165 91
4896 91 -115 -81 -134 49 190 218 -34 -246 22 102 180 26 16 -126 -5 110 138 -11 -84 -53 -13 55 70 -30
4920 -30 -13 -129 -124 -62 89 64 70 -142 -68 -28 120 114 -116 -86 -83 73 71 75 9 -120 -133 66 157 72 -32 -46 -218 -174
4948 -174 199 13 -69 58 -240 29 221 149 -179 -76 -82 -27 132 66 -16 -75 11 79 -47 66 -12 -34 71 2
4972 2 102 -13 -70 6 -87 70 30 -30 55 -10 -112 142 114 137 32 9 -32 -40 32 89 3 -3 89 -72 61 3 97 -100
5000 -100 53 -66 -38 50 41 -58 -127 19 38 68 113 -91 -11 -31 96 85 109 -17 27 41 75 -33 -52 95 -75 -42
5026 -42 37 -81 -88 15 -41 -27 49 162 12 193 8 75 -131 -69 -4 58 104 118 -121 -41 96 134 -11 44 54 -106
5052 -106 121 13 24 -43 26 -100 11 -5 -8 52 10 -11 -73 175 -9 -37 -72 1 -94 52 176 36 -137 6 -28
5077 -28 48 11 76 -28 -115 121 -27 15 129 -35 -110 -58 97 62 83 28 -220 -22 51 101 -68 1 15 -112 94
5102 94 131 1 113 -58 -115 109 96 103 -64 0 -104 33 -4 110 -89 -108 62 35 56 45 -10 -162 -77 102 157
5127 157 2 -23 -150 -80 98 133 72 60 -64 -157 136 164 -42 5 -143 80 -56 88 39 33 62 -51 49 68
5151 68 293 15 -113 -3 -50 -59 135 54 -60 -44 26 20 212 -83 -107 -106 85 185 -9 -8 -25 -78 -31 111 58 -88
5177 -88 -128 -88 93 150 31 -25 -19 -9 -111 131 171 94 -177 -99 -43 -18 101 146 -142 -151 79 153 142 115 -101 -47 80
5204 80 56 51 28 -31 -143 -61 82 106 57 -16 -98 -51 87 66 80 -33 -75 25 27 92 9 -58 17 44 132 76 15 -115
5232 -115 -86 -51 -45 101 49 -49 -158 -53 96 -7 60 58 -119 44 40 98 -105 -30 -49 -67 94 64 -38 -54 -145 -2
5258 -2 40 40 12 -60 -32 35 68 123 -24 -84 -75 27 -36 34 36 -9 -51 -6 20 79 60 -59 -36 -70 40 7 85 19 10 8 48
5289 48 51 -48 59 57 52 40 140 -7 8 -6 54 47 117 44 -33 -73 11 55 49 58 -127 -48 69 95 67 11 -120 -102 3 -21
5319 -21 87 33 35 -63 3 69 -27 -23 95 -48 -8 -16 72 31 -76 10 -71 -13 18 99 -115 -47 -20 119 14 11 18 -203 -36
5348 -36 -114 66 42 -19 -66 126 71 5 -18 10 38 20 -95 -28 36 30 9 -53 -64 -63 -11 -61 60 36 51 13 -26 30 -2
5377 -2 -10 -65 -60 30 66 62 -58 55 -51 -72 76 41 1 22 1 -73 140 49 -58 -83 -58 -19 5 -43 8 -44 -8 -109 47
5406 47 140 -36 4 -81 7 110 86 52 -32 -138 -100 45 90 33 -26 -94 -12 40 67 12 -56 -72 -59 -19 26 -45 28 -140
5434 -140 -73 111 88 19 -39 -120 -79 -48 61 87 -77 -64 72 103 45 63 -81 -52 24 -34 58 24 -19 -132 -152 113
5460 113 21 161 -13 -92 -1 52 50 5 -122 -133 -46 50 -10 -48 -94 -32 -78 3 39 92 -81 -152 -42 71 130 127 -102
5487 -102 -58 -3 152 237 57 39 -116 -36 77 40 -11 -55 -116 -54 15 18 81 -91 -68 -90 62 142 128 29 -44 -90 -21
5514 -21 128 43 -5 20 19 -87 197 121 11 -168 -97 24 47 -20 12 -34 -109 50 60 7 41 -48 3 96 161 128 55
5541 55 -110 -69 -14 133 -28 42 -33 -29 55 215 176 -33 -194 31 40 64 52 -1 -85 -62 98 -48 106 -27 -89 -151
5567 -151 44 -72 134 183 6 12 16 33 120 32 -73 5 7 84 207 -32 -91 -58 -17 70 182 61 3 8 -96 54
5593 54 106 -15 -76 -164 -34 12 55 -49 -64 -217 -27 52 10 89 -18 -165 -18 52 -69 69 -69 18 -61 -27 38
5618 38 67 -64 -57 -45 -43 28 -41 8 -55 -97 67 166 -36 -178 -134 -12 61 76 150 -78 -115 -50 34 141 56 27 -4 -85
5646 -85 39 33 0 1 -87 -101 54 131 -24 -61 -103 -27 6 66 46 -94 -50 -13 -101 38 4 15 -90 -55 -68 15 1 -50
5674 -50 -86 48 75 -23 -51 0 63 -41 -46 9 41 -34 134 -161 59 117 -60 -77 71 -37 -99 30 -46 3 28 62
5700 62 -27 -80 -9 -33 70 -21 -32 -6 2 -120 -54 29 37 -47 -114 -11 51 84 -24 -101 -46 132 -16 25 112 -72 -23 -82
5728 -82 20 48 -120 16 -10 63 34 42 71 -31 -8 57 69 89 -69 9 -59 -98 -23 62 41 54 -42 -14 50 95 -24 -60
5756 -60 0 51 27 -35 15 5 -124 34 -33 1 112 -6 8 46 19 98 49 -69 -20 -39 89 156 -39 -85 -112 174
5782 174 17 -59 8 -18 -101 -76 64 -1 -16 15 -97 -124 108 202 59 2 -100 80 239 205 58 -98 -126 -156 -34
5807 -34 243 -11 -153 -86 -104 75 31 28 0 -98 67 -2 157 177 7 -105 -23 -35 96 68 28 -69 -118 63 91 84
5833 84 -29 55 -147 162 68 27 31 -215 -184 65 256 158 -158 -147 -150 123 146 140 75 -120 -99 63 130 112 -94 -198
5859 -198 -61 10 -10 125 -65 -149 -115 52 115 33 89 -23 -113 -57 155 8 69 -239 -63 39 99 180 -46 -44 -135
5884 -135 23 119 15 -12 -119 -164 12 96 60 15 -31 -169 46 35 36 86 -22 -44 -39 201 64 118 -78 -149 25
5909 25 9 208 30 -86 -73 42 65 85 -53 -146 -144 5 28 -13 -4 -43 -44 -24 -24 111 61 -71 -80 59 -28 79 160 -87
5937 -87 -122 35 72 72 -39 -4 -59 -89 -85 69 103 -27 -144 -122 98 54 55 58 -37 -44 116 106 28 -31 -111 -48 23 59 -20
5966 -20 77 -30 40 49 24 20 -9 -23 -37 85 -38 39 -20 -69 113 29 96 -9 -99 24 22 35 -17 71 -84 -41 -31 -65
5994 -65 -43 14 -48 42 -67 -30 13 -23 56 -46 -97 -130 -70 -11 -8 -99 9 -26 -28 -67 1 -115 -23 -41 46 -69 54 -9
6022 -9 -19 27 21 45 115 8 -62 173 -71 124 -66 110 44 56 37 22 -105 -75 4 -67 141 13 -166 -110 -4 -3
6048 -3 -58 -78 -51 23 27 51 -24 -199 -130 14 29 20 60 -94 44 62 -4 49 82 -60 -27 27 -53 -40 3 14 -83 74 170
6077 170 4 -72 46 25 35 165 55 39 -17 23 126 82 -38 26 13 -49 -19 25 81 49 -130 -61 67 15 49 -45
6103 -45 -44 -126 -40 10 94 -51 -130 3 -60 17 23 -24 -57 -71 42 80 58 -11 -62 -7 126 129 12 -76 -116 -60 80 88 53
6132 53 23 -61 -51 135 89 68 51 -166 -72 43 29 35 60 -80 -18 22 170 108 -100 -21 -68 58 90 116 73 21 -77
6159 -77 -41 63 47 -92 -81 -29 130 127 -10 -24 -12 -2 -42 -73 56 1 66 65 27 92 -13 14 -16 -84 -28 5 38 56
6187 56 76 -79 50 6 -48 -47 -167 75 -12 97 154 87 -9 -107 45 126 49 123 -17 -122 14 84 89 73 10 -81 -41
6214 -41 -24 80 -15 -53 -70 -54 -61 3 70 -67 -35 29 112 43 144 -4 -43 27 23 46 154 73 8 12 22 27 -10 -40 -101 138
6244 138 98 89 130 1 -104 13 61 27 25 38 -46 -67 -15 -112 -42 -188 -152 -6 94 -4 54 -66 -51 -172 -15 91
6270 91 -3 -4 -9 -31 5 21 66 -19 -70 26 -4 101 -30 -163 68 -124 16 8 -37 11 49 -41 60 175 60 74 -100
6297 -100 -42 -6 24 43 54 -26 25 34 26 -31 18 66 -10 88 28 71 -6 -33 -9 -28 44 45 59 107 -26 14 34 44 29 -175
6327 -175 36 3 34 45 -84 43 -22 -15 -48 42 27 0 -11 10 -60 -30 131 -43 70 -72 19 45 43 -37 65 49 33
6354 33 -28 -8 -121 28 -6 18 21 91 -9 5 75 -38 -63 -28 2 -3 -49 -1 -44 -28 150 16 2 58 37 84 -25 -23
6382 -23 -27 26 14 -50 5 -56 39 -13 16 -127 17 124 -12 151 13 -7 63 -66 -48 79 -38 -41 39 48 -15 -42 -93
6409 -93 3 55 35 -42 21 23 -25 78 56 -20 32 53 52 -69 0 32 55 -40 -58 128 -59 6 18 -115 -39 -29 -3 79 22
6438 22 -27 -45 -55 24 62 -42 -57 63 -27 -56 -85 -1 14 -37 19 12 -25 45 160 -51 -25 26 -19 92 -26 45 -35 -29
6466 -29 5 -21 -93 -15 -1 10 -45 -44 -62 -79 20 100 53 -49 -24 -20 -17 7 46 70 63 45 7 76 -117 47 28 -137 32 101
6496 101 113 -25 -133 68 -10 -57 121 23 -36 52 5 77 99 49 -43 40 -77 -40 5 111 34 -12 -1 -25 -14 20 21
6523 21 -80 -13 -91 93 63 7 69 -25 -27 12 0 50 -17 -96 -22 125 66 -20 -31 -2 111 4 9 151 -53 -67 -1 -87
6551 -87 76 -7 -34 -73 28 -144 10 -73 65 -21 1 -57 63 -42 -6 -23 53 -2 -114 19 -24 -70 -18 18 2 35
6577 35 -34 -1 14 -89 66 -66 36 76 -74 -30 -28 -101 -37 -67 32 -27 -59 8 10 5 -65 -91 -46 -61 10 22 -38 51 -8
6606 -8 57 -134 49 46 23 26 -18 27 -54 -88 38 22 -36 0 -104 20 -43 13 15 -49 15 24 -22 51 73 4 8 -103 18 -41
6636 -41 -59 0 -25 -67 -32 -67 -3 -28 -56 -19 -68 -19 65 13 -22 45 -3 27 -107 8 13 5 26 -12 -34 -27 -83 -17 40 23 32
6667 32 2 -64 -17 -66 54 19 -35 12 20 -20 -11 -37 28 31 -52 -71 -67 -27 -3 -50 -76 36 105 42 -30 -13 -37 43 26 42 -57
6698 -57 78 22 -26 77 -8 23 -119 -18 -2 -3 -28 -5 -53 90 96 -47 -34 -13 15 -11 -16 14 36 39 130 0 -19 -17 -57
6727 -57 -95 -11 97 -26 -14 25 -52 -53 -46 6 -86 -84 37 -60 67 38 -47 -93 12 22 -94 101 88 67 -74 27 -20
6754 -20 44 -102 -52 60 -73 -26 26 -2 -72 -8 -5 -30 -18 38 101 -53 -10 151 70 37 -31 -68 58 -15 -39 103 -6
6781 -6 -23 4 39 -6 17 -6 12 -70 19 -34 5 45 80 100 69 33 -9 52 -33 -17 -37 -33 97 -18 -19 84 -20 4 -64 55
6811 55 48 -162 -121 20 12 20 -8 -99 -28 23 13 4 -26 -85 -15 -95 8 -56 -14 69 -25 -12 93 77 -7 -36 121 -11 102
6840 102 -16 65 11 -1 -19 -1 33 1 14 21 35 43 40 1 -93 9 -52 -27 58 50 -21 -82 22 -60 63 -38 -40 25 18 44
6870 44 72 -52 57 -140 -157 116 46 -19 -32 -53 13 -27 -37 -109 -16 -21 -58 25 -84 -4 -51 54 7 19 -3 10 67 -3
6898 -3 19 7 110 -14 -39 26 63 101 -55 -11 22 -94 -14 -16 -20 -6 3 -50 -130 72 62 89 -1 -77 -86 7 90 3 -9 -68
6928 -68 -54 2 24 8 -89 -64 23 -48 -65 12 101 7 -52 40 23 46 -109 27 -8 -39 -104 -10 -54 -30 -7 16 63 55 88 -22
6958 -22 37 19 -92 49 33 65 -18 -36 -36 -44 -83 -49 35 -86 -32 9 53 -53 -34 -3 -16 -17 -38 -24 -88 63 -54 -119 35
6987 35 -39 -21 -42 10 -126 -48 -74 -118 -110 60 5 -26 25 -47 -52 84 -70 12 45 -22 41 53 39 -35 43 75 -43 -26 50
7016 50 57 37 -31 -11 -1 20 -5 3 -49 32 34 23 -21 -14 59 -44 -22 60 13 -61 65 -55 -106 -130 2 -7 -61 104 -104 -11
7046 -11 8 34 -28 64 -85 96 26 76 64 -68 75 17 -24 18 -58 -115 -64 -26 -26 8 -17 77 -17 40 -31 -7 -7 38 -5
7075 -5 3 13 83 56 -17 -71 4 14 -67 -11 13 -42 1 -68 -25 88 38 -20 102 -59 -94 -35 49 -16 -22 14 32 38 28 53 -44
7106 -44 6 -61 91 -35 48 -30 -94 -58 -21 46 1 52 10 -122 -61 62 -37 -74 -74 66 -26 3 72 -127 -126 -16 -45 19
7134 19 -79 -48 45 19 56 -2 -52 15 -32 36 78 24 27 48 27 -54 67 -87 -92 -61 22 16 -25 85 -11 -44 12 -8 -54 -21
7164 -21 47 -53 26 94 17 76 4 11 82 80 29 -13 28 10 -95 -37 11 51 10 -9 -95 48 69 64 64 15 -91 -90 21 173
7194 173 135 100 5 -72 10 10 -6 -15 17 -25 93 -50 -53 -11 -24 40 85 -53 -23 -20 45 -69 78 2 -25 -32 42 8 -51 88
7224 88 -17 8 -48 80 -19 -29 58 36 -57 -41 109 7 62 58 91 -45 -100 64 157 19 15 4 -54 2 -4 57 2 63
7252 63 123 102 35 -40 -15 13 -34 -3 -43 5 -112 -104 82 24 5 -13 20 9 35 72 28 32 42 28 0 -46 126 -111 45
7281 45 -43 62 59 75 -30 -34 17 4 -28 -146 -76 -56 47 -61 -15 -26 8 -62 69 16 33 105 -125 -78 -43 120 120 -15
7309 -15 41 -85 -50 77 -96 24 6 67 -95 64 -3 36 89 2 -62 -74 -32 -5 105 76 24 92 44 75 69 -87 30
7336 30 81 -2 -11 -17 -17 -97 9 5 -114 116 -49 -19 -32 -38 -34 -9 -42 28 -166 45 52 31 31 8 -33 32 58 -33 29 -13 68
7367 68 -48 48 -28 -15 104 21 -51 -78 -51 -11 -8 -18 29 81 -113 10 -66 172 14 -73 29 102 11 -82 72 -41
7393 -41 -10 12 49 -5 32 -82 99 -17 -78 101 -67 15 0 17 40 27 21 -38 88 108 53 34 38 14 87 93 -16 -36
7421 -36 -47 88 -142 -2 42 14 41 6 25 35 -25 65 -29 6 14 -93 -54 -85 -102 42 12 45 -19 -7 -58 46 112 14
7449 14 -86 105 47 69 31 -21 9 -7 -5 14 95 7 -82 -27 -33 -65 -3 -43 -12 72 -70 56 56 10 32 -13 35 41 49 59 34
7480 34 -14 154 10 27 40 -32 31 -65 26 64 17 83 -35 -49 34 -1 88 -29 -13 -24 73 147 -51 13 -94 37 5
7507 5 48 -20 -65 7 -26 43 -25 -87 72 37 24 38 -21 -110 -33 21 -169 43 -45 -92 -142 22 0 23 53 77 -64 -104
7535 -104 -88 34 40 -48 -100 -10 -11 -94 50 -17 -7 55 42 110 -22 -9 -16 -29 -43 -47 -76 23 26 -19 35 19 -70 -21 -68 7 -50
7566 -50 -16 60 56 43 19 -41 -100 39 -43 31 19 -45 -30 114 30 -131 10 18 10 -35 -42 -18 41 1 55 56 -80 31 -36 -19
7596 -19 -42 47 -28 -51 -40 -67 -47 20 -45 -39 -108 89 88 8 1 12 2 76 7 57 -42 -21 -33 -82 92 0 0 15 15 -17 110
7627 110 129 -2 -60 18 -24 -17 59 -56 -49 26 -114 77 -20 53 -81 44 -63 -147 97 -31 -28 -41 -63 5 130 105
7653 105 15 73 3 -41 -21 -33 -77 -88 46 3 57 -24 -82 -44 -8 11 -39 -28 -25 -56 -17 71 139 56 12 19 -105 -18 40 -28
7683 -28 -11 44 80 -48 62 -65 -6 11 19 0 -91 77 -2 -13 -33 18 115 52 22 61 -22 -30 15 19 0 12 -5 -40 46 111
7713 111 0 -47 -48 17 -95 -20 -51 -28 23 31 -20 -40 67 -44 -20 -5 7 -46 -39 25 15 131 91 -100 58 67 41 -40
7741 -40 -24 16 -154 5 60 -45 -76 -88 -8 63 137 52 6 79 95 42 -39 -55 35 -87 -87 -32 18 -35 -5 42 -85 90
7769 90 73 104 11 -85 -59 64 66 -70 -56 -91 -6 89 -31 2 -93 -50 9 113 -48 -59 24 -35 9 54 31 70 49 -12
7797 -12 -16 44 21 74 -70 120 -14 31 141 -17 -94 10 -95 111 -10 32 65 8 4 34 -62 15 -8 -65 -14 28 33
7824 33 -55 -134 -92 -109 83 51 101 -14 100 -43 -4 -83 -12 -51 -75 91 -37 17 -54 -84 -20 52 -132 55 -38 -126
7850 -126 25 -57 -24 -90 37 -80 -109 22 107 -50 16 -75 -98 -94 14 -39 -1 0 -32 4 41 49 38 90 -10 37 8 -8
7878 -8 -78 -125 86 -55 -56 -58 -91 24 2 -75 2 95 138 -9 33 -14 33 83 3 -7 -51 16 20 -13 51 -151 -97 -49 95
7907 95 -10 8 -72 -9 -41 38 32 -64 60 -24 -17 -14 7 98 1 -104 25 20 133 79 -47 43 18 12 10 103 -14 7 -75 12
7937 12 85 -17 -45 -10 -1 23 21 13 46 14 -91 -26 -31 58 -6 -31 -6 -84 10 141 -52 24 51 15 72 9 -31 -187 40
7966 40 96 8 -70 -40 -128 -76 -26 0 -47 71 16 -25 -14 11 1 -10 13 -106 40 12 63 15 -88 74 70 64 -83 -17
7994 -17 -19 -30 -68 -56 41 42 34 -123 104 85 -8 -48 34 -98 25 90 -31 28 -40 -35 88 71 0 34 -42 -50 8 71 -16 -4
8024 -4 26 -80 -41 -61 -7 -38 19 -43 11 -16 -12 4 25 49 -53 -2 -1 -72 3 50 67 73 104 -31 -30 7 61 9 -53 -72 -36
8055 -36 9 32 134 49 -58 75 67 -48 9 17 -86 -63 -28 63 27 -43 -49 57 11 51 -13 -7 62 -19 -12 1 -21 -36 52 -110
8085 -110 49 -19 -44 -28 4 14 36 -55 2 10 25 5 47 -40 -75 24 -27 32 -11 -25 110 -22 -33 40 -22 -60 48 17
8113 17 -100 69 40 14 75 -47 11 -74 -54 -3 -62 25 19 -4 -99 -35 -39 69 -60 -67 28 83 32 -141 -65 33 -71 77
8141 77 128 -4 12 -38 34 16 -99 -64 29 58 -34 56 29 -55 -117 -43 63 -12 40 -71 5 -23 27 62 -17 -100 -4 -37
8169 -37 -53 53 -16 -21 -111 23 -108 51 -15 -43 -32 17 -29 -111 -86 25 56 17 6 17 -12 16
8191A6
$$ Imaginary data points
##PAGE= N=2
##DATA TABLE= (X++(I..I)), XYDATA
0 0 0 0 0 0 0 0 0 0 0 8 -8 8 -8 16 -16 24 -24 32 -40 48 -56 64 -80 88 -104 123 -144 168 -192 220 -251 288
32 288 -325 368 -416 467 -525 588 -659 732 -817 907 -1005 1113 -1231 1360 -1500 1655 -1824
49 -1824 2008 -2211 2436 -2685 2964 -3276 3627 -4028 4490 -5025 5660 -6421 7358 -8544
63 -8544 10093 -12214 15315 -20274 29461 -52133 223540 203924 -270920 24381 -76516 -235716
75 -235716 181928 294524 -154472 -102624 13900 -134379 66223 269890 -50929 -137353
85 -137353 7105 -99600 -41612 193208 20863 -129015 32223 35789 -32393 77424 15384
96 15384 -127246 -48069 48786 61448 72339 -29406 -97795 -12875 25323 56842 115334 -42379
108 -42379 -183783 -40883 54871 54535 145164 38417 -184329 -90202 47312 13844 105041
119 105041 97127 -160127 -139150 76858 40294 44592 131898 -69354 -188740 24304 72502
130 72502 -8756 78094 20830 -138691 -13833 103134 2596 6880 25384 -99680 -53350
141 -53350 98769 33343 -36507 20004 -28226 -61396 66350 79882 -50795 -62015 -12180
152 -12180 -19212 29941 89071 13593 -75796 -48140 4846 28482 55992 30853 -58195 -75712
164 -75712 2481 49952 49259 38801 -23837 -83796 -31118 43904 38679 23315 3916 -54512 -45734
177 -45734 36019 45755 3333 -4095 -24204 -43618 6016 44952 11988 -14741 -11861 -13046 1543
190 1543 25067 12303 -19999 -22305 1631 15598 15079 12478 -8200 -32493 -6828 31646 15088
203 15088 -5044 -791 -24703 -25707 30877 33008 -12696 -4805 -6629 -36133 7371 44662 -5649
216 -5649 -18085 8661 -21520 -16041 38696 11113 -25355 9136 -434 -27203 19842 25768 -22833
229 -22833 -1688 17890 -19538 -4136 25483 -9602 -11679 19217 -5764 -16379 14967 1536
241 1536 -14259 12681 5484 -18121 943 7151 -6658 6537 6828 -14111 -5660 6390 -264
254 -264 6386 7241 -11599 -8759 6004 5093 7917 5366 -13115 -10279 7405 7156 7153 5864 -14060 -15781
270 -15781 7693 12953 6510 2925 -15279 -20632 6467 18958 7422 19 -14005 -23805 1412
283 1412 25491 14212 -2495 -14738 -23732 -3649 26194 21422 -1608 -15034 -21523 -7133 23557
296 23557 26475 -217 -18873 -21332 -7442 19819 27521 2547 -20922 -21666 -5748 17660 26019
309 26019 3107 -23897 -24819 -3435 20807 27368 4847 -24546 -27747 -3809 22533 28227 6039
322 6039 -24344 -29956 -4130 26271 32095 7755 -24587 -33412 -8530 24485 32482 9206 -22198
335 -22198 -32433 -10248 24022 33831 8380 -25087 -34716 -12792 22033 35462 12242 -22477
347 -22477 -33351 -12475 20718 34909 12185 -24452 -35537 -11872 23051 37836 16753 -20640
359 -20640 -36206 -15490 19887 35321 15325 -20332 -35072 -14571 21093 37475 16050 -20981
371 -20981 -36603 -18926 15627 36044 17924 -20208 -33941 -14134 15942 34970 19951 -21528
383 -21528 -39152 -15438 16403 33876 25022 -13999 -38936 -16236 18207 29969 20522 -11634
395 -11634 -40141 -21255 20527 33578 19580 -7819 -35713 -26768 15363 33644 14737 -11245
407 -11245 -30325 -25035 12845 38918 19565 -15131 -30847 -23023 5777 34071 26021 -11919 -32663
420 -32663 -17277 9493 28279 26936 -5392 -37155 -23527 11424 24445 21753 4293 -29125
432 -29125 -28342 12197 26360 10142 -339 -20768 -31564 7051 35301 10742 -8177 -12753 -25503
445 -25503 -2459 37070 16699 -19861 -16333 -13948 -4702 34821 32191 -18562 -29304 -11044 -4133
458 -4133 21801 37070 -5001 -35798 -14991 3155 14660 30481 8170 -31984 -26583 2034
470 2034 13253 19629 13287 -15220 -25818 -3226 14531 12148 4214 -6831 -16226 -6508 14207
483 14207 14719 -3123 -8804 -4106 -2878 7992 16807 -4603 -21902 -3077 10156 6736 14790 4531
497 4531 -28181 -18466 15781 13038 7076 10499 -19504 -32894 9348 24975 4140 8427 -2879
510 -2879 -36664 -10153 30566 9478 -1247 11396 -19589 -27810 21293 20798 -10473 7547 4066
523 4066 -28605 736 26670 -8251 -6425 17663 -12277 -15825 20198 -612 -20543 14782 10282
536 10282 -17549 7468 9511 -24338 -2677 23078 -3496 -4372 10799 -14560 -17444 15926 13622
549 13622 -1156 4630 -6464 -18228 572 13761 9245 4964 -5200 -12335 -6174 974 11023
562 11023 13211 -5407 -9783 -656 -10300 -2700 21732 2574 -14773 8088 -3511 -23112 14647
575 14647 20107 -16940 4061 15483 -28233 -9216 30422 -6156 -9399 27565 -11933 -32344
587 -32344 22176 11843 -20043 21106 13561 -36642 -851 23714 -17153 1803 28053 -19479
599 -19479 -20169 20419 -5361 -14166 23816 3143 -21769 9515 4392 -19360 9221 15870 -11295
612 -11295 1670 9001 -16275 -6126 14893 1840 902 8542 -9477 -13417 3436 5959 7067
625 7067 8472 -6165 -12639 -4538 -285 9581 13224 -4334 -10785 -4590 -7272 4315 18431 -243
639 -243 -11407 599 -6813 -6378 17905 7730 -14134 2339 3928 -13193 7103 15281 -13038
652 -13038 -4480 15249 -7100 -8273 13990 -5302 -14487 16139 9174 -15125 1682 3255 -17154
665 -17154 4995 22453 -6292 -11327 3763 -10706 -6823 22776 9883 -14966 -3128 -2361 -11759
678 -11759 12173 21523 -7326 -11628 1183 -7525 -626 20119 4757 -14346 -2682 -360 -5492
691 -5492 9882 10561 -9648 -7479 3174 -2321 1181 7925 -3810 -8196 2770 2882 -512 2020
705 2020 -2580 -5519 2612 5829 2251 -948 -5681 -4656 3781 6172 4419 1368 -8470 -8296 5226
720 5226 7309 2705 3753 -6284 -13534 2509 10075 1015 2796 -864 -14558 -3082 12578 1682
734 1682 -1361 3991 -10104 -9113 12411 6407 -6111 3480 -1750 -11256 7244 11657 -6642 -2266
748 -2266 3524 -7731 1426 12830 -3805 -8155 3266 -2518 -2006 11032 764 -11306 -470
761 -470 1570 -2319 7567 4242 -10234 -4619 3062 -362 4976 5893 -6735 -6420 2455 1450 3319
776 3319 5606 -3790 -6306 1814 1978 1586 4700 -2245 -6202 1544 3075 -87 2365 -1469 -5952 920
792 920 4179 -398 317 -1304 -6006 150 5858 692 -1106 -809 -5153 -1492 6566 3179 -1551 -937
808 -937 -3639 -2552 5451 5056 -1030 -1565 -2561 -3009 3194 5205 -82 -2148 -2105 -2767 1298 4276 238
825 238 -2489 -2048 -2045 470 3224 670 -2263 -1822 -676 880 2338 807 -1580 -1590 -210 1620 2121
842 2121 403 -1128 -1146 -301 1852 1891 -511 -1321 -684 -746 1468 2136 -1267 -2211 -148 -590 401 2413
860 2413 -1045 -3111 -87 297 -105 2658 223 -3512 -178 1509 -177 2127 1713 -2992 -1291 1951
876 1951 220 1075 2229 -2041 -2224 1687 522 267 1749 -1556 -2411 757 257 -100 1430 -1714 -2347
893 -2347 1263 -69 -798 2238 -893 -3044 2095 933 -2159 2426 1081 -3597 1918 2672 -3345 1407
909 1407 3502 -3845 158 4730 -3711 -2069 5140 -2053 -3231 5405 -1194 -6036 3941 1577 -5241
924 -5241 3049 2916 -6320 -109 4346 -3507 -267 4653 -2695 -2867 3243 -539 -1628 3567 665 -2147
940 -2147 1062 191 -1303 1259 1538 230 -149 -1220 -657 107 -527 2050 1660 -3412 -1426 1338 -3038
957 -3038 547 5658 -2575 -4491 3249 -1868 -3728 7385 2515 -7234 1811 2647 -6404 3368 8066
972 8066 -5519 -2745 5418 -4521 -2758 8511 -681 -5741 4600 -1 -6307 4059 3358 -5325
986 -5325 1364 3639 -5157 -2147 3394 -1632 -718 4502 -348 -4662 -967 953 499 2653 3566 -1469
1002 -1469 -6044 -1418 3967 1882 2312 4100 -4800 -8232 3250 4629 -887 5203 1512 -11038 -2557
1017 -2557 6737 -1734 1464 7530 -7245 -9039 6460 867 -4499 8353 1869 -10821 2078 5564
1031 5564 -6962 1743 8878 -5032 -3223 6863 -3896 -6161 7069 3166 -3645 4165 699 -9306
1045 -9306 -1039 6674 1039 997 2780 -5877 -8536 2380 6841 1651 892 24 -7826 -6364 6445
1060 6445 7030 -1322 659 -563 -9121 -1112 10311 1332 -2887 4038 -3774 -7833 6749 5470 -5608
1075 -5608 2670 4074 -8157 -807 7590 -4940 -3622 8055 -1057 -6238 4381 -586 -7767 4440
1089 4440 6907 -3816 -968 1149 -6819 -1528 9007 3269 -2895 -365 -3529 -5393 4460 9061
1103 9061 368 -4097 -1722 -3564 -2335 7323 6965 -4248 -5007 -186 -3409 169 8791 841 -7127
1118 -7127 23 -170 -4323 5145 5416 -6388 -1436 4624 -5076 -1419 7949 -2921 -5088 7822 644
1133 644 -7610 4071 2876 -6751 4345 7888 -6478 -3852 3759 -3613 -319 9192 -502 -7101
1147 -7101 -368 -1827 -2420 7110 4833 -5472 -3841 -1139 -2396 3129 6736 1 -4605 -2843 -939
1162 -939 1393 3701 3082 -645 -3999 -1975 2345 1383 781 2547 -1554 -3856 2007 1401 -3056 1636
1178 1636 2255 -3941 590 3616 -4758 -2716 4788 -1189 -2270 5272 -1607 -7265 2895 3610 -2926
1193 -2926 3479 3191 -6984 -2095 5386 -768 379 5213 -3606 -5634 3614 1613 -1867 4301 713
1208 713 -6516 72 3316 -1963 879 2955 -3620 -2753 2600 -66 -1212 2053 -560 -2377 1069
1223 1069 1070 -1090 469 640 -820 686 989 -450 -237 215 174 946 305 -566 -154 -490 -449 1524 544
1242 544 -1436 -101 -144 -1500 989 1546 -1722 -812 939 -1629 -466 2521 -519 -1729 1634 -144
1258 -144 -1772 2051 1319 -2088 900 1461 -1952 339 2325 -1462 -505 2320 -1139 -1591 1790 -219
1274 -219 -1663 1696 224 -2209 452 750 -1512 633 1233 -1678 -631 1159 -682 -1 1611 -731
1290 -731 -1182 1084 389 -115 1064 -158 -1255 758 970 64 689 -102 -1386 59 1049 74 281 -55
1308 -55 -1588 -437 919 63 46 -70 -1442 -733 1148 457 -243 120 -799 -803 1235 947 -234 32 -399
1327 -399 -590 1045 1476 -232 -727 -457 -604 722 1668 88 -1216 -1178 -918 278 1766 545 -1239
1344 -1239 -1432 -1053 -70 1598 1196 -601 -1464 -1023 65 1254 1421 -28 -1202 -781 242 1126 1145 82
1362 82 -1000 -807 607 1207 600 -170 -1184 -1263 633 1567 322 -665 -1220 -1684 28 2026 1014 -989
1380 -989 -1333 -1423 -619 2101 1798 -647 -1123 -770 -668 1416 2219 -73 -1128 -558 -350 889 2125 169
1398 169 -1666 -780 18 469 1507 218 -1798 -1522 91 1131 1355 1 -1772 -1864 -444 1433 2202
1415 2202 205 -1772 -1549 -854 1031 2975 1144 -1837 -1242 -419 -35 2741 2138 -1939 -1605 188 -624
1432 -624 1222 2568 -1359 -2630 678 204 -356 2174 -129 -3453 83 2024 -637 633 946 -2887
1448 -2887 -1515 2808 1136 -475 679 -1497 -2473 1796 2952 100 -277 -739 -2019 85 2866 1441
1464 1441 -1043 -1148 -1052 -805 1421 2226 -669 -2195 -664 -132 -3 1686 615 -2677 -1152 1612 257
1481 257 -6 1526 -1583 -2548 2213 2128 -956 561 65 -2883 577 3834 -181 -1409 638 -1930
1497 -1930 -1535 3612 2067 -2350 -841 -588 -2159 1461 3610 -818 -2479 -404 -1096 -342 3109 1726
1513 1726 -2423 -1529 332 -383 942 2871 -245 -2847 267 1203 -832 1112 2238 -2125 -1602 2512
1529 2512 -227 -2046 2056 456 -2849 1702 2024 -3468 -875 2340 -1946 -325 3728 -1685 -3779
1544 -3779 2133 545 -1690 3464 1398 -4594 -515 2335 -1100 1543 3912 -2392 -3317 1554 298
1559 298 -471 2978 598 -3298 -974 880 -301 889 1812 -932 -2182 -419 388 -355 605 1545 -808
1576 -808 -2105 642 581 -1444 1485 2494 -1910 -1147 2050 -1519 -1397 3967 783 -2795 1697 297
1592 297 -3713 2077 3613 -2670 -390 2186 -3641 -1507 4318 -631 -2462 2812 -1015 -4188 2589
1607 2589 2131 -2807 1432 1986 -3533 -726 2750 -1203 -75 3202 -807 -2431 934 162 -636 2443
1623 2443 1341 -1809 -1301 -255 -254 1010 1863 203 -2022 -2088 8 826 621 1486 -65 -3200 -1071
1640 -1071 1871 82 545 1977 -1953 -2759 2230 1224 -1168 2114 606 -3601 1002 2846 -2082
1655 -2082 -7 2573 -2397 -1038 3606 -1117 -3137 1961 234 -2099 2666 1203 -4234 -576 1902
1670 1902 -1036 1271 2455 -2844 -2924 1604 991 596 2553 -890 -3766 -231 2009 1158 1626 192
1686 192 -2707 -1818 1482 2238 1064 -269 -1705 -1872 -54 2182 1635 -1131 -1749 -877 -465 1298 2198
1703 2198 -900 -2622 -266 549 587 2128 54 -3188 -744 1989 958 1182 895 -2799 -2213 2308
1719 2308 2179 292 546 -1970 -3223 1254 3257 439 -624 -1456 -2971 -121 3535 1480 -1403 -1619
1735 -1619 -2021 -872 2749 2593 -960 -2226 -1320 -346 1936 3046 75 -2657 -1570 368 1627 2375
1751 2375 630 -2413 -2140 475 1760 1756 473 -1995 -2673 106 2210 1446 -13 -1760 -2679 -317 2553
1768 2553 2035 -213 -1825 -2211 -358 2406 2578 104 -2151 -2146 -262 2319 2701 453 -2082 -2539 -338
1785 -338 2196 2497 634 -1936 -2895 -731 2084 2424 477 -1636 -2865 -1233 1994 2557 373 -1479
1801 -1479 -2227 -1362 1696 2873 534 -1423 -1820 -1091 1396 2872 769 -1684 -1752 -832 1044 2600 1000
1818 1000 -1863 -1874 -701 937 2343 1172 -1906 -2324 -621 783 2078 1253 -1606 -2468 -616 912
1834 912 1902 1407 -1222 -2431 -703 1171 1912 1499 -920 -2334 -799 1311 1864 1388 -668 -2324 -981
1851 -981 1026 1602 1073 -521 -2118 -1298 922 1471 1039 -484 -2178 -1355 922 1453 739 -334 -1811
1868 -1811 -1203 1043 1538 665 -137 -1421 -1182 695 1683 591 -152 -1019 -1240 553 1652 660 -455
1885 -455 -787 -1081 59 1457 651 -649 -996 -945 -23 1102 792 -516 -1084 -698 178 859 817 -213 -861
1904 -861 -746 189 895 691 108 -354 -746 227 978 260 -149 -127 -703 -294 806 261 -620 -82 -276 -652
1924 -652 491 565 -810 -395 355 -552 -39 687 -415 -618 576 219 -461 561 110 -630 459 621
1942 621 -311 -14 461 -325 -184 637 67 -499 171 234 -342 85 177 -435 -450 392 149 -370 -235 -137 -408
1963 -408 142 869 -9 -863 -83 71 2 1222 838 -1008 -790 511 152 665 1340 -653 -1605 294 501
1982 501 94 1236 253 -2127 -698 1176 43 304 656 -1412 -1600 1229 908 -443 404 -384 -1461
1999 -1461 528 1750 -153 -679 141 -701 45 1868 524 -1347 -752 -78 90 1356 1201 -1330 -1895
2016 -1895 -137 893 1020 1061 -453 -2552 -1224 1369 1383 740 195 -1866 -2312 963 2264 534 -31
2033 -31 -758 -2322 -209 2742 1157 -779 -262 -1066 -999 2032 2052 -1225 -1290 -157 -864 728 2304 -759
2051 -759 -2518 -24 460 145 1725 213 -2839 -1056 1627 846 678 622 -2271 -2151 1602 2240 507
2068 507 196 -1193 -2484 343 3185 1346 -722 -1098 -1910 -856 2480 2477 -807 -1675 -1217 -1023 1166
2085 1166 2604 108 -2407 -1254 -140 380 1946 1099 -2116 -1948 644 886 748 1211 -967 -2384
2101 -2384 509 2225 478 35 -325 -1955 -424 2807 1163 -1104 -694 -1223 -1174 2229 2523 -1317 -1874
2118 -1874 -645 -1065 1092 3082 -63 -2806 -1023 -231 368 2772 1605 -2433 -2052 296 575 1612
2134 1612 2034 -1188 -2502 153 1185 721 1235 -220 -2272 -741 1426 836 110 -121 -1305 -1095 1071
2151 1071 1531 -464 -1046 -734 -484 674 1702 250 -1715 -1063 176 697 1649 988 -1594 -2033 426
2168 426 1226 1106 1201 -668 -2617 -581 1825 891 474 103 -2044 -1688 1488 1478 -77 -2 -941 -1943
2186 -1943 651 1919 -75 -477 -94 -1251 -301 1953 514 -1202 -123 -54 -338 1307 1190 -1027 -927
2203 -927 335 141 459 1011 -489 -1283 -72 723 286 414 -311 -1314 -545 824 696 82 -165 -928
2221 -928 -917 475 1191 340 -349 -450 -475 100 1022 773 -310 -601 -180 56 573 815 -18 -710 -169 278
2241 278 123 295 183 -692 -419 441 98 -202 256 -275 -634 527 510 -308 -93 94 -440 -6 716 -40
2261 -40 -506 323 -4 -219 620 391 -553 1 357 -195 65 597 -498 -421 420 -220 -289 318 -146 -591 276
2282 276 226 -392 -59 228 -494 170 429 -286 -105 176 -108 85 481 -154 -232 263 77 107 315 -3 -371
2303 -371 -16 181 61 275 -139 -714 -60 231 101 274 -100 -587 -165 282 42 125 31 -684 -217 341 331
2324 331 185 268 -473 -452 582 445 -56 247 -201 -531 394 530 -170 -110 -206 -591 148 691 -24 -295 -280
2345 -280 -632 -104 765 108 -521 -244 -485 -44 851 561 -394 -337 -259 -39 687 635 -200 -408 -151 21 521
2366 521 578 -298 -527 -237 -3 466 584 -388 -653 -195 86 472 319 -287 -764 -240 34 456 560 -214
2386 -214 -743 -203 259 545 721 -49 -715 -222 341 519 569 65 -746 -424 265 408 359 184 -750 -812 216
2407 216 470 395 94 -704 -772 26 414 317 -1 -376 -575 16 648 534 42 -364 -267 -6 425 516 190 -220
2429 -220 -222 217 204 352 191 -464 -425 214 248 -92 48 -431 -722 191 515 -235 -118 -109 -652 -10 807 207
2451 207 -403 -42 -454 -179 872 685 -287 -73 -219 -398 473 787 -101 -291 9 -241 -48 529 253 -432
2471 -432 -319 -167 -107 145 189 -290 -318 77 95 -57 -101 -39 -313 -171 400 167 -285 -17 194 -103 345 504
2493 504 -472 -293 311 -124 -172 620 23 -841 174 281 -495 297 273 -795 -405 622 -124 -217 540 -222
2513 -222 -705 347 247 -507 310 393 -684 -37 677 -124 -136 514 -118 -384 378 267 -352 34 398 -221
2533 -221 -227 143 -311 -419 297 251 -403 -28 238 -549 -211 753 22 -540 194 -41 -596 544 694 -510
2553 -510 -252 412 -379 -229 895 -78 -695 459 16 -669 463 474 -814 -99 523 -476 -425 637 -302
2572 -302 -498 525 112 -629 65 335 -338 162 611 -261 -491 314 38 -113 620 372 -533 -283 445 132
2592 132 37 770 39 -836 -42 380 -246 201 477 -812 -696 561 -121 -486 618 -15 -1004 174 665
2611 665 -524 97 734 -601 -390 907 -187 -604 769 85 -701 506 410 -805 -27 745 -439 -182
2629 -182 632 -392 -600 390 284 -301 356 131 -850 -220 546 -60 -51 388 -385 -599 442 433 -42 253 347
2650 347 -478 -325 458 198 -232 370 63 -650 27 518 -230 -179 387 -364 -551 408 175 -466 281 172
2670 172 -641 -117 443 -274 -295 508 -99 -415 496 92 -515 253 408 -391 37 501 -329 -358 472 52 -237
2691 -237 454 134 -647 -55 417 -137 -52 383 -420 -668 238 247 -133 183 114 -693 -256 603 108 -165 219
2712 219 -294 -607 672 601 -378 66 -27 -605 267 658 -27 -298 -1 -228 -174 706 177 -625 -207 -102 -251
2733 -251 206 401 -509 -509 75 35 71 439 -236 -533 -96 332 349 154 -19 -404 -172 313 449 219 -295 -481
2755 -481 -229 76 605 322 -432 -535 -235 -45 485 483 -288 -763 -224 178 194 552 30 -827 -237 338 246
2776 246 375 300 -650 -610 419 457 238 152 -489 -733 272 557 151 41 -321 -798 25 680 175 -229 -449
2797 -449 -539 -204 639 259 -295 -430 -435 -80 676 608 -225 -392 -305 -50 653 701 -81 -495 -318 -19 595 846
2819 846 -30 -638 -487 -1 544 705 -53 -635 -542 -110 323 721 30 -658 -601 -54 413 714 153 -612 -612
2840 -612 -81 427 662 341 -426 -559 16 366 505 301 -352 -630 -68 429 351 253 -370 -734 -165 468 442
2861 442 91 -320 -774 -307 409 507 109 -313 -615 -370 412 707 186 -209 -464 -262 408 689 293 -254
2881 -254 -530 -377 254 586 256 -330 -501 -370 138 474 362 -316 -726 -303 154 407 260 -303 -463 -317
2901 -317 133 502 220 -324 -506 -294 199 489 355 -101 -326 -135 178 372 339 -359 -318 -130 50 333 270
2922 270 -123 -452 -268 120 286 81 -17 -480 -231 250 201 334 100 -326 -348 193 261 251 -29 -169 -361 -7
2944 -7 413 227 -94 -84 -239 -138 305 230 -197 -132 0 -249 134 271 -148 -348 -19 -69 -19 233 130 -410
2966 -410 -79 199 -122 6 314 -146 -258 119 132 -89 171 181 -208 8 160 49 38 169 -189 -320 -5
2987 -5 -60 -140 127 105 -266 -83 78 -21 -58 256 56 -275 46 162 -54 71 111 -330 -143 235 175 35 143
3010 143 19 -297 28 415 52 -132 8 -258 -284 459 159 -367 -93 -155 -260 231 508 -263 -377 66 -31
3031 -31 -31 403 12 -604 -208 245 122 415 340 -368 -401 293 212 242 239 -231 -777 58 541 59 92 -60 -644
3054 -644 -464 680 499 -276 -145 -221 -495 314 796 -46 -378 -9 -218 31 835 333 -640 -209 271 -51
3074 -51 402 571 -554 -615 360 311 88 385 -229 -834 -24 679 161 102 -50 -776 -412 756 630 -69 -284
3095 -284 -467 -490 512 903 102 -604 -425 -320 148 956 509 -563 -644 -199 45 458 628 -330 -899 -207
3115 -207 325 213 488 90 -838 -473 587 393 49 168 -643 -646 499 712 -139 -63 -228 -627 136 1073
3135 1073 123 -554 6 -280 -151 1055 571 -770 -543 -98 -154 687 855 -393 -945 -135 65 314 732
3154 732 -119 -1026 -327 385 316 416 107 -798 -693 318 534 306 -22 -296 -690 32 825 361 -268 -388
3174 -388 -404 -95 668 542 -248 -718 -182 -9 293 585 -92 -751 -271 224 159 397 102 -740 -487 422 448
3195 448 259 297 -331 -680 291 746 -53 14 -3 -683 -28 711 339 -332 -307 -404 -310 472 576 -206 -456 -163
3217 -163 -241 205 616 79 -655 -208 82 31 468 236 -615 -465 244 337 285 290 -281 -456 142 539 72 48
3239 48 -91 -559 4 494 159 -83 -48 -446 -178 357 295 -143 -196 -147 -290 84 338 83 -237 -217 -128 123
3261 123 378 131 -233 -327 35 150 299 112 29 -313 -93 126 282 -93 -114 -288 -170 57 237 -49 -138
3282 -138 -21 -196 6 331 -53 -285 -30 -20 -78 343 221 -345 -9 103 59 98 237 -178 -194 127 63 0
3304 0 164 -168 -210 48 77 -57 63 -4 -242 -79 102 -135 -4 106 -175 -93 -8 -34 27 179 -23 -63 72
3327 72 40 9 9 -61 43 73 -43 53 -49 20 29 -57 35 -27 102 80 -222 28 31 -103 61 70 -45 -23 -107 -104 -16 31
3355 31 -87 97 84 28 -3 141 45 -21 -33 50 -104 120 47 59 -162 -42 77 75 174 -212 -267 -15 141 39 65
3380 65 -149 -222 -111 83 178 73 -38 -181 -153 204 153 49 -101 34 -165 102 230 125 -35 -73 -36 16 51
3403 51 82 -83 -281 -95 -100 55 25 -26 -286 -123 -29 164 197 -112 -200 -203 130 177 5 -152 -218 -134 164 211 29
3428 29 -90 -182 -13 122 154 55 -192 -275 -79 10 174 174 -82 -352 -194 -17 56 101 -91 -285 -156 146 121 -46
3452 -46 32 -262 39 264 213 7 67 -141 -357 137 395 41 -198 -93 -202 87 445 75 -320 -167 -85 1
3474 1 265 186 -295 -291 -51 -54 84 237 -122 -422 -206 243 121 171 77 -351 -103 231 283 31 -67 8 -229 190
3498 190 339 7 -109 -134 -142 -71 277 169 -355 -208 -34 -111 144 210 -218 -421 132 123 130 137 -56 -382 -90 349
3522 349 138 105 71 -350 -161 270 226 -102 47 -168 -362 216 471 -3 -230 60 -274 -101 343 111 -324
3543 -324 -136 -29 -71 123 279 -235 -276 7 107 119 221 53 -365 37 322 70 -47 72 -237 -282 276
3564 276 279 -149 -35 -94 -396 12 489 -51 -399 14 -239 -254 347 330 -303 -131 -22 -313 107 419 -136 -316
3586 -316 132 16 -84 364 30 -351 -40 192 -67 55 153 -290 -332 251 53 -191 150 -3 -394 -68 284
3607 284 -52 -190 141 -106 -189 338 135 -237 -44 195 -211 50 444 -149 -276 62 42 -217 156 253 -250
3628 -250 -219 204 -20 -67 399 -29 -452 38 153 -209 78 224 -384 -169 170 -48 -94 253 -27 -324 100
3649 100 198 -167 136 259 -216 -192 334 -14 -132 150 -12 -229 98 280 -209 -87 245 -219 -195 387 58
3670 58 -272 54 36 -204 84 311 -247 -122 117 -93 22 345 -9 -198 50 164 -126 146 260 -272 -109
3691 -109 132 23 36 232 39 -428 -40 253 9 172 29 -459 -177 214 168 6 -83 -143 -312 -10 347
3712 347 62 -114 -63 -194 52 347 203 -239 -177 -59 -64 273 231 -161 -449 -5 131 67 235 25 -427 -323
3734 -323 205 135 147 96 -378 -356 146 379 69 79 -273 -346 109 488 125 -122 -64 -284 66 573 383 -256
3756 -256 -370 -333 -53 361 344 -141 -509 -300 -83 299 345 -22 -466 -341 147 283 345 28 -491 -296 76
3777 76 457 228 95 -272 -395 -34 472 336 109 -400 -326 -175 314 451 -9 -381 -496 31 355 279 132
3798 132 -404 -374 51 338 370 42 -407 -423 -3 381 317 171 -315 -460 26 462 457 63 -267 -605 -167 409
3820 409 446 66 -286 -491 -288 438 497 5 -258 -524 -168 303 508 35 -350 -461 -222 208 525 125 -394
3841 -394 -451 -228 169 415 243 -305 -462 -236 259 479 257 -191 -499 -303 353 513 219 -259 -524 -102
3861 -102 259 428 225 -353 -503 -143 159 371 206 -297 -430 -333 229 454 346 -246 -358 -205 180 422
3881 422 298 -113 -442 -272 324 390 195 -154 -346 -352 116 305 253 -48 -330 -270 124 450 241 -252 -383 -252
3903 -252 107 303 347 -138 -259 -254 -48 428 178 -89 -300 -134 65 238 280 -110 -202 -248 69 125 164 -71 -297
3926 -297 -213 5 163 126 31 -242 -155 23 208 134 -49 -118 -236 41 167 264 -54 -164 -97 121 306 215 -61
3949 -61 -180 -87 117 -18 78 41 -85 -101 -84 36 217 91 -118 -99 -65 79 66 75 -1 -91 9 77 -6 48 81 -13
3975 -13 -83 123 109 -139 34 -18 -127 -65 51 -70 -47 137 -165 -111 100 -7 -81 44 125 -186 -115 28 -48 0
3999 0 102 -53 -154 101 113 -143 71 9 -186 -34 208 27 -8 -86 -139 -20 121 225 -31 -168 -85 -167 44
4022 44 307 -55 -246 -97 -8 20 201 149 -234 -314 52 114 136 235 -99 -453 38 196 131 131 78 -320 -234 332
4046 332 133 -39 18 -144 -198 149 332 21 -202 -149 -207 57 458 111 -278 -169 -72 159 268 301 -221 -464
4068 -464 4 101 284 359 -108 -529 -237 179 278 211 -13 -512 -484 150 315 131 -19 -219 -513 58 670 175
4090 175 -257 -159 -431 -19 656 433 -235 -273 -140 -157 429 488 -176 -521 -143 24 327 512 10 -545 -261
4111 -261 191 258 276 50 -581 -428 164 464 274 -46 -211 -525 -16 637 269 -34 -171 -498 -39 481 518
4132 518 -81 -323 -373 -71 366 606 13 -524 -258 -49 384 481 7 -440 -379 94 95 380 119 -472 -647 1
4154 1 405 229 149 -208 -612 -161 475 261 37 -224 -466 -237 460 571 102 -239 -314 -174 262 592 186
4175 186 -436 -406 -62 105 525 357 -506 -445 -41 175 272 314 -315 -610 -82 261 240 226 -135 -585 -231 332
4197 332 320 13 -102 -296 -355 188 495 75 -202 -255 -307 112 629 152 -337 -378 -228 90 377 156 -313 -324
4219 -324 -67 -5 259 415 -86 -499 -93 131 289 278 -40 -438 -255 175 292 206 28 -295 -347 191 433
4240 433 23 -61 -167 -298 13 351 196 -133 -233 -211 85 349 318 -111 -254 -135 -42 113 265 -3 -283
4261 -283 -151 -53 158 186 60 -199 -168 76 267 126 67 -138 -139 139 202 182 -78 63 -131 -122 172 169 -82 -15
4285 -15 -29 -65 101 157 -58 -155 -43 52 25 136 59 -78 41 1 99 82 107 -70 -94 66 59 27 148 -24 5 22
4311 22 -20 18 -58 -25 -82 -53 -31 36 -77 78 -72 -57 -46 139 -20 -28 20 45 -89 -83 -14 15 65 65 68 -96 48 13
4339 13 28 65 -75 -142 -110 22 101 -47 -32 -129 -105 125 -43 -36 22 -28 -68 84 92 94 32 -132 -103 99 112 47 -29 -127
4367 -127 -182 63 174 99 6 -142 -155 -23 63 170 -20 -221 -90 -12 50 61 62 -179 -156 47 208 257 -66 -124
4391 -124 -194 69 135 144 91 -178 -61 -14 153 241 60 -166 -71 27 200 252 -115 -226 -211 -16 125 166 32 -195
4415 -195 -280 -30 222 240 -4 -189 -297 100 307 222 128 -82 -290 -6 290 226 89 -168 -314 -64 347 286
4437 286 -1 -193 -201 -46 141 234 30 -153 -283 -83 214 184 37 -296 -237 -82 143 286 16 -158 -365 -174
4459 -174 188 270 203 -155 -256 -202 228 256 193 -95 -315 -136 149 207 56 -156 -366 -234 9 299 124 -69
4481 -69 -211 -167 94 245 260 -188 -138 -194 18 173 262 -15 -300 -178 202 283 185 -20 -228 -135 66 176 153
4504 153 -36 -233 -279 98 341 34 -45 -226 -278 73 284 226 -42 -164 -278 66 227 193 -67 -205 -88 -129
4526 -129 183 238 -129 -229 -166 -15 113 193 84 -292 -233 -1 93 116 35 -7 -258 37 171 -16 129 -28 -213
4549 -213 45 224 160 35 -66 -201 -50 56 113 -47 -78 -237 -68 18 296 18 -175 -154 -68 -31 221 103
4571 103 -12 -182 -25 65 109 232 -144 -117 -78 165 70 177 133 -117 -98 186 88 36 6 -32 -160 144 216 -30
4595 -30 -33 -32 -125 -70 392 67 -121 -105 -32 -34 111 108 -110 -166 92 -104 76 83 35 -156 -17 -12 71 102 101 -77 -157 197
4623 197 85 16 120 -45 -323 -35 119 18 81 55 -58 -85 63 122 -140 54 -79 -62 -110 -33 -3 -15 -39 -97
4647 -97 -68 82 70 -10 -57 30 -118 46 97 14 -8 14 9 -38 171 64 -67 -12 73 36 -89 89 -43 -78 30 54
4673 54 -108 67 34 -65 -45 74 -9 -15 193 17 -136 -76 12 -59 74 11 -122 -29 118 -22 10 28 -30 -65 47
4698 47 127 -16 36 22 -65 -25 183 87 -61 -40 -103 -181 28 91 -24 -5 -52 -93 68 143 -23 -144 -74 35 20 124
4724 124 74 -83 -155 24 1 28 88 -94 -161 -67 118 5 -42 103 -237 -95 140 131 42 -93 -125 -166 -54 287
4748 287 -61 13 -3 -118 24 230 185 -7 -139 -145 20 97 198 -61 -177 -111 -46 205 206 51 -321 -4 -9 110
4772 110 214 -122 -245 -108 -34 167 112 -26 -55 -194 29 156 108 16 -179 -144 -83 141 162 -64 -138 -216 -77
4795 -77 37 219 62 -35 -85 -17 61 45 136 -145 -202 -56 38 207 19 -22 -215 4 165 130 154 -128 -173 -178 128
4820 128 159 11 34 -238 -130 147 200 4 -167 -189 -157 104 300 139 -66 -184 -159 73 314 40 -97 -190
4842 -190 -72 73 271 61 -37 -214 -33 -11 203 146 -108 -186 -157 85 -2 62 0 -94 -182 30 114 99 146 -135
4866 -135 -259 -62 237 159 -33 -76 -98 -41 126 109 -23 -142 -44 -25 103 164 -77 -158 -113 46 106 207 58 -190
4890 -190 -143 -36 101 150 100 -156 -159 58 124 96 -66 -48 -108 148 128 144 -47 -144 -17 6 107 40 46 -105 -185 45
4916 45 102 195 82 -90 -146 -14 87 181 18 -13 -53 -118 83 71 -58 -155 -130 -76 159 65 33 -63 -101 -40 208 28
4942 28 24 -1 -172 -150 43 162 -17 -78 -21 -39 -69 195 118 -18 -55 81 1 10 130 -84 -121 15 -2 -41 45 -25
4968 -25 -73 -73 5 128 9 98 -113 -102 61 93 85 -25 26 16 -29 76 55 -9 29 61 -30 50 113 -63 -61 1 -68 49
4996 49 -2 19 -22 -6 -40 -122 54 -38 10 23 45 110 26 80 34 -129 17 -2 -16 73 -26 -146 58 33 -41 7 85 13
5024 13 -21 -69 60 14 56 70 -101 -60 11 30 54 -37 23 -22 44 100 5 30 68 -156 -33 101 19 51 111 -35 -49
5051 -49 84 100 -45 -83 30 29 6 38 -26 25 37 17 -99 104 100 -22 -144 -41 6 -35 151 -51 -130 -1 144
5076 144 25 95 41 -132 -130 99 -5 -102 87 -146 -152 -55 127 71 -17 -131 -101 -55 42 17 -72 31 17 -54 67 132
5102 132 -18 -190 16 -45 -53 36 94 -169 -54 39 -41 17 54 -113 -122 27 167 82 53 3 -143 64 -30 4 -35 20
5128 20 -82 -100 170 111 4 44 -60 33 117 153 -71 -106 -91 -103 92 218 42 -153 -81 56 119 162 87 -98 -110
5153 -110 -70 97 -43 69 56 -151 -201 157 24 59 -47 -56 -90 -3 157 -40 -22 -97 -22 73 180 158 -11 -37 9
5178 9 14 59 0 -166 -61 -16 -154 82 36 -57 -133 7 40 -75 144 -1 -213 3 52 52 -8 -28 -100 -147 96 109
5204 109 91 -14 -60 -139 -18 175 -37 -126 -141 -116 -21 201 -18 -120 -92 -30 67 18 153 4 -171 -97 29 -40
5228 -40 51 -33 -78 -24 85 55 91 40 -3 -85 135 57 79 -67 -63 -154 42 133 81 -39 21 90 -58 22 39 -66 -121
5255 -121 56 99 20 58 -51 -45 -26 49 50 102 139 1 -35 128 115 -10 89 -12 -45 43 36 -12 -74 -93 35 -93 169
5282 169 52 -136 -1 -110 47 90 41 49 -25 39 29 68 81 25 -15 -6 1 9 25 -53 -162 1 59 -12 -49 36 -107 4
5310 4 103 63 88 60 -79 26 9 38 -30 -1 84 -55 -39 77 8 -78 -16 -48 82 32 103 38 -154 -69 54 0 19
5337 19 76 82 -79 -15 -12 -3 94 -15 17 66 175 103 66 -52 2 12 -30 18 10 -47 -49 -44 96 68 -56 -31 -137 -20 -83
5366 -83 -16 -9 20 29 -159 -78 6 -30 -36 -41 33 -76 -62 64 12 13 -78 -49 8 36 109 -21 70 -80 77 36 -38 -24 0 -4
5396 -4 -75 67 74 62 7 -39 -63 81 65 32 -37 -23 -36 33 55 18 149 35 6 64 68 -114 -61 18 -61 25 -18 124 23
5425 23 -62 -86 26 54 -41 -110 -142 26 -18 78 77 -15 -92 -86 -91 -53 140 -11 -112 -213 14 90 181 105 -71 31 45
5452 45 84 13 -93 -72 -148 -2 107 101 -53 -84 -56 -127 20 86 -33 -31 -133 -60 60 97 45 -2 -91 -127 63 17 33
5479 33 -68 -70 86 4 142 -106 -69 -93 -16 150 31 -42 -66 -131 -123 135 138 126 -60 -107 -85 159 110 -14 -142 -153
5505 -153 -17 100 135 20 -76 -179 -20 120 160 192 -114 -186 68 122 45 31 -177 -144 -47 48 221 -5 -66 -168
5529 -168 -5 83 134 50 -126 -48 -96 83 107 -106 -79 -12 -146 -13 140 50 -194 -111 15 55 88 13 -31 -150 -11
5554 -11 55 65 180 49 -164 -47 66 109 31 33 -151 -47 73 141 43 -34 70 -169 -38 185 -39 -78 -44 -84
5578 -84 -28 77 106 -57 -78 -34 17 81 174 1 -138 56 101 -2 60 -80 -96 -80 42 118 134 -115 -67 -189 90
5603 90 188 9 9 -126 -108 19 149 118 -134 -120 -148 14 108 88 -37 -81 -27 1 125 -25 55 -66 -21 -76 88
5628 88 128 26 -31 0 10 44 -21 15 -75 -62 47 79 33 -43 -105 104 -38 134 70 32 -4 -4 -71 -18 -20 -1 -40 -53 -18
5657 -18 -6 38 -23 39 -11 -30 -9 44 91 -52 26 -49 -73 50 18 -19 -2 -14 90 46 -67 0 -83 -194 67 13 -25
5684 -25 1 4 -65 73 14 -59 8 3 -75 -107 98 -89 -10 56 -59 19 -80 31 6 -16 42 -106 -28 -36 -18 -7 -55 -81 -28
5713 -28 28 4 -75 45 32 66 -104 -48 114 48 13 54 -14 -83 85 80 24 66 -26 36 122 113 38 -7 -98 -63 46 87 -50
5742 -50 30 8 8 45 53 -35 -119 13 0 -6 18 75 -112 13 52 60 87 -69 -17 -34 8 118 -84 -55 -6 21 13 67 152 -21
5772 -21 -125 -103 64 8 95 75 -206 -166 -15 160 56 34 -102 -102 58 28 -24 49 -94 -128 10 91 117 -82 -93
5797 -93 -40 -37 230 110 53 -175 -80 39 91 93 -6 -106 5 18 119 154 49 -61 -53 8 93 142 -26 -77 -139 -24
5823 -24 170 59 56 -80 -178 -60 81 2 36 -54 -85 -6 57 64 71 -99 -125 -44 31 127 73 -131 -215 -122 32 -49 -48 -86
5851 -86 -69 24 85 133 86 -74 -113 -96 72 190 48 -49 -104 -13 63 143 47 -22 -73 -41 83 74 11 -34 -148 -101 33
5878 33 165 74 -23 -36 -47 155 125 -7 -91 -124 -111 4 45 89 -40 -96 -141 -74 145 62 -83 71 -115 21 164
5903 164 79 -84 -3 5 107 91 62 -26 -189 -71 53 146 43 -48 -134 24 19 89 218 -9 -97 -89 -6 57 -25 -11 -140
5930 -140 81 -7 112 184 1 11 -57 -16 29 96 80 -162 -63 36 98 103 -62 -44 41 104 84 153 44 -75 -134 17
5956 17 29 126 -3 -74 -21 41 77 88 -48 -67 36 46 153 66 107 -35 -86 -50 13 117 55 -53 14 63 54 67 -52
5983 -52 -92 -22 26 6 96 -75 -46 -78 -36 8 44 -60 -27 0 55 38 16 -5 -93 -54 14 47 -29 100 -93 -113 -60 97
6011 97 24 -10 -55 -3 148 73 16 -33 -70 13 -2 54 18 74 -17 -53 71 76 -28 -50 -85 -42 74 -36 -50 -39 -94 64
6039 64 1 -38 -65 91 17 -32 68 -1 -89 29 14 22 -43 -87 139 -140 67 40 -39 61 -82 -9 27 141 -18 2
6065 2 -41 -31 -37 -39 71 -41 -93 -145 -53 75 -22 31 -21 -22 -37 26 -29 35 -33 -111 -85 -51 69 86 117 -34 43 16 166
6094 166 -17 -119 -132 30 66 29 -18 -33 -119 -10 -26 129 -45 -85 -33 45 93 90 -57 -101 -2 -70 53 84 -15 -45
6120 -45 -64 178 82 -17 62 -35 -49 41 -18 86 -33 -63 -78 35 89 -11 -4 -138 -133 -55 18 110 6 -116 -103 -26 38
6147 38 133 -43 -15 -20 -97 21 89 24 -153 -143 -12 0 67 -24 66 -2 -83 172 31 -22 -100 -118 -44 66 106 62 -81
6174 -81 -3 -1 21 148 43 -4 7 -18 -19 -52 91 -12 -87 -22 42 123 73 -12 -53 -30 132 42 94 -16 -17 17 -34 -27 31
6203 31 -20 -87 -82 123 64 41 -22 -23 -57 -9 124 5 3 -63 -16 -29 205 -28 2 -34 -147 77 46 135 11 -143 -23
6230 -23 118 57 104 -46 -72 -19 50 -62 2 32 -123 -50 40 30 89 -1 -138 -15 13 43 9 -30 25 1 34 81 -12
6257 -12 -56 -22 -62 -26 28 97 104 -52 -85 28 70 68 -36 -144 -21 2 47 130 6 -85 -36 -119 -69 6 7 -52 0 0 169
6286 169 99 -39 65 -150 -34 59 0 20 16 -99 11 46 80 23 -32 -67 24 109 -2 -20 -24 63 68 -16 118 77 -58
6313 -58 -53 -71 -11 -35 -1 -34 -48 -21 41 23 -33 5 7 52 68 41 29 -16 -19 -29 128 16 -35 -45 -52 -2 -74 84 54 71 -32
6344 -32 61 -92 -22 99 -102 97 48 -1 12 -4 -48 26 -34 73 60 91 -71 27 -52 -55 26 -26 -52 -125 -2 -14 17
6371 17 13 26 -100 -13 23 -16 -10 -7 72 -19 10 -48 -34 -97 -46 48 20 -4 6 -27 -53 98 -21 61 -24 -1 -39 -16 3 10 -13
6402 -13 -67 -20 -54 -22 -58 -107 -52 -7 -14 -54 -51 27 -18 -4 16 -35 -17 -13 46 14 107 17 56 13 1 -50 1 18 -142 29 -6
6433 -6 -45 83 100 14 1 1 62 59 155 105 -44 -59 60 -66 11 101 45 -50 -61 6 57 21 18 -94 61 -116 33 -79
6461 -79 17 80 56 19 55 41 -7 2 -20 138 -45 -21 -77 65 66 59 136 15 -62 -53 -16 3 96 58 -19 -13 -19 -16 48 31 12 79
6493 79 -68 141 -28 -58 -142 16 -34 -20 91 83 40 -106 111 79 36 79 -1 4 95 -38 56 -66 -152 82 -14 -72
6519 -72 67 44 60 7 -77 58 -4 19 -109 17 37 21 57 8 -11 -14 82 -41 69 77 18 73 -79 -18 156 105 48
6546 48 -68 -29 -144 -7 -154 62 -38 -34 17 27 -77 32 36 -52 65 46 -47 48 10 28 -5 47 23 -104 -33 -52
6572 -52 -81 69 -62 -56 -10 -100 55 16 -20 -23 -55 -35 -40 -107 91 82 -74 84 32 2 6 -22 -22 -78 -96 -131 28 111 -68
6601 -68 -67 46 -98 -23 51 7 -36 40 145 -15 -13 35 -34 -38 105 49 10 44 -27 97 152 -134 -122 -43 20 -101 -42 -23
6629 -23 21 86 25 5 -4 3 -27 77 1 8 36 -41 -53 -102 17 25 -61 -14 -32 -94 45 19 -43 28 5 -3 137 -11 16 38
6659 38 -20 -31 -75 -95 29 44 60 11 25 105 -14 50 -14 -6 88 -69 17 64 1 -41 72 46 44 -78 -70 26 -46 -20 -29 -79
6689 -79 -70 18 -55 -93 53 7 -72 45 -37 89 -28 -89 -22 18 -59 74 3 -78 -27 98 3 102 67 -60 -73 38 -17
6716 -17 -39 -73 75 -96 -26 98 61 -48 -53 -22 -5 -7 63 -114 -125 9 -86 11 66 43 -51 -36 -18 48 17 4 8 -41 -74
6745 -74 -59 -94 74 -66 -34 42 3 -43 -69 -115 -136 -66 25 39 35 6 90 19 -11 101 -84 62 -3 -40 -57 -1 -28 15
6773 15 -82 0 -31 49 -14 -47 45 -98 -72 38 -26 -18 -35 -36 -44 -51 24 -4 -54 -154 -27 35 -52 -36 -116 -160 -16 -33 5 57
6803 57 21 -90 28 -37 -93 12 -19 -114 11 99 50 32 10 4 -164 16 -18 77 -135 35 -14 117 -8 11 -23 -49
6829 -49 26 97 79 44 -4 -42 -68 92 17 -14 109 45 3 102 -2 -40 -37 -7 -78 5 54 -46 9 -60 -6 42 -16 26 23
6858 23 39 -86 -21 123 25 40 3 40 22 48 111 57 42 -49 -88 118 -52 -37 -3 -125 -71 22 27 -92 -78 -27 -79 -78
6886 -78 78 -10 -62 -99 -64 -20 42 24 26 -81 20 -36 31 -30 47 70 69 181 59 101 -43 -44 -23 -82 -21 115 -65 42
6914 42 -97 61 -108 -36 -49 -23 -24 -88 58 21 62 -108 61 -65 -31 19 23 -32 -4 64 -11 -50 41 -18 -94 -54 34 5
6942 5 47 34 -103 36 32 49 -17 -67 -70 -16 15 4 32 24 33 61 120 1 25 64 -70 -24 38 31 -33 42 -37 40 39 22 -12 29
6974 29 -19 -49 44 -11 44 -69 -7 40 -35 18 48 86 -58 -47 12 27 20 -48 -45 11 27 62 15 -10 27 -46 25 55 -69 -51
7004 -51 44 -11 -64 31 28 -15 -155 -54 -125 -28 41 -31 -80 -73 -30 -13 -6 19 -33 -9 -6 -27 30 -50 -31 -22 22 55 -41 -58 -30 57
7036 57 -83 19 55 115 4 77 -17 23 9 8 -72 -42 -36 -56 -51 -17 51 -40 38 70 -15 8 83 13 29 -9 91 23 59 1
7066 1 -47 -61 -46 69 -32 22 -17 -84 17 -4 -2 -39 15 28 -60 -90 58 -23 -28 -35 -62 -87 85 -75 -8 65 105 22 -30
7095 -30 11 -19 -23 23 1 -1 67 -37 25 10 9 -26 23 6 4 -18 29 30 -37 12 -9 -23 44 4 -18 8 48 -70 -121 68 -39
7126 -39 -1 2 87 -67 -71 81 -29 7 -64 98 133 -35 54 16 7 37 -46 -74 61 -69 81 55 -59 46 61 -102
7152 -102 55 118 38 29 -3 -5 36 56 35 -61 1 -7 55 65 -34 40 -34 26 -34 -39 -36 28 -37 19 47 23 49 -29 8 46 -40 -63
7184 -63 48 36 24 38 -55 -34 -142 91 93 111 -97 -26 86 36 -132 43 50 -30 15 20 32 52 -23 -162 54 16 -59
7211 -59 -1 7 12 -11 -15 -106 112 46 29 -6 -27 22 59 132 30 -21 34 115 23 16 -22 41 -86 -2 28 15 57 5 -125 20
7241 20 -40 15 -64 -57 74 -40 -33 69 -60 -42 36 -7 69 74 -18 -86 21 34 -53 -37 29 28 81 119 54 80 -1 -44 -6 68
7271 68 -23 -58 -63 -24 27 92 25 -39 -50 -5 -74 -69 -169 -76 -40 -62 -74 -38 3 -62 19 45 -74 0 -60 -22 -114 -3 73 -37
7301 -37 79 180 115 -63 -24 -79 81 61 24 21 10 -92 -48 95 -29 -8 -9 -17 45 -58 99 14 -36 -8 122 -38
7327 -38 -109 3 -100 82 -26 -3 51 -125 -32 2 -25 -42 64 6 -40 -49 36 81 78 -12 25 -42 -19 -60 65 -8 0 35
7355 35 92 94 -25 -47 -95 -1 18 12 -99 -14 -10 -10 -115 -10 -19 -60 46 73 29 130 -16 64 -22 -79 -78 16 1 58 1 21
7385 21 70 62 98 -47 99 93 -77 -25 -15 -85 86 -62 22 -11 27 -15 -4 -31 9 -57 16 -11 53 -14 6 18 54 11 -1
7414 -1 11 62 136 56 -77 -8 5 -59 -50 5 36 -52 -58 73 -78 -97 68 91 -12 59 93 62 29 -82 39 37 -45 -47 34
7443 34 11 20 47 -102 12 41 -3 16 -30 -48 15 39 65 69 23 -91 49 -12 -65 150 -30 -12 19 -4 7 -23 46 -19
7471 -19 -54 49 65 -42 -29 83 -56 -21 79 36 0 -72 75 -94 36 54 3 12 -15 37 -7 -11 -3 21 4 -60 7 125
7499 125 4 -37 -77 -65 -20 -61 -20 -52 -102 -54 51 126 74 -121 -106 -2 9 127 -4 -8 -19 -123 72 37 -40 -58
7525 -58 -32 34 53 -40 -8 45 -44 -63 -39 14 -85 -18 -65 -70 26 -121 50 110 -55 2 9 65 75 80 -42 47 -39 54 -23 -17
7555 -17 -53 22 -85 98 30 55 51 89 -58 -69 0 -89 9 -40 -40 12 -13 -61 -29 63 3 18 36 43 2 26 -96 40 33 52
7585 52 19 -44 -26 32 58 -43 -81 -37 -68 -177 59 12 80 -6 29 11 86 40 -56 2 -34 27 69 4 122 -11 -17 -22 -68
7614 -68 23 51 -3 -73 -11 9 -4 -126 83 -30 -58 85 57 -110 -38 -64 69 -2 16 -97 -54 -44 -56 -15 77 31 -225
7641 -225 -94 25 22 68 -39 21 19 -2 125 28 -84 -17 -127 -31 -1 -35 -10 -63 -33 28 -7 92 -34 82 -94 92
7667 92 -20 65 -65 -35 51 -12 50 -132 98 -55 111 -30 -19 -26 -8 21 -61 -91 -10 45 -11 38 -6 -65 146 -72
7693 -72 32 -10 27 78 -57 -114 51 34 20 -44 46 16 -20 11 65 59 -49 32 -76 17 -3 19 102 -37 -83 -63 -1 114
7721 114 -57 -26 -11 9 -107 17 -14 29 -41 118 112 67 -13 19 33 38 43 -9 66 -101 8 21 -9 78 -46 -6 37 60
7749 60 81 5 -39 -36 20 -73 1 11 -90 10 -19 -98 35 38 1 -38 -64 74 16 46 86 29 -6 34 30 97 25 93 39 54
7779 54 -14 99 -103 -63 -28 -23 69 63 90 41 61 -53 -23 56 23 -117 -26 8 47 103 -58 91 69 -6 49 -28 75 -1
7807 -1 -36 -99 63 30 11 -4 -8 23 52 51 -34 73 18 -43 95 14 -72 -90 -30 45 61 82 73 -73 -174 5 -69 -1 147
7836 147 60 -48 -54 -28 39 -29 -133 -114 -116 -97 7 -17 -2 27 74 8 -41 41 61 -129 -84 70 -9 -31 82 -38 -108
7863 -108 23 6 -54 -21 -21 -56 -26 64 47 45 -59 -3 82 51 54 114 -100 23 -7 -9 -60 -32 -124 19 -27 82 35 -47 36
7892 36 -4 -3 84 -32 54 -70 -125 61 -52 146 37 -39 -107 36 57 60 20 -8 43 60 76 -10 14 -64 0 86 4 -12
7920 -12 36 -4 -31 -54 20 -123 11 18 -50 47 87 -18 -59 -51 -76 9 35 40 -72 -93 -18 106 -1 83 49 -9 116 -34
7948 -34 79 -31 -59 -4 -52 19 -78 -2 -22 -39 -100 60 14 119 90 42 17 -58 -48 9 40 -25 -56 -71 34 -28 -6 -60
7976 -60 13 -10 77 13 -153 -43 61 22 19 3 110 -122 -1 -4 -56 62 15 37 21 98 9 127 1 -10 -5 -28 42
8003 42 31 -24 -45 19 11 28 12 22 62 -45 17 74 -86 6 95 -59 103 -17 -2 85 -18 -12 -35 -54 -12 -52 44 -136
8031 -136 -123 -2 93 -1 21 7 6 127 -36 21 10 -77 125 123 -125 -44 75 -198 20 9 -108 33 30 94 84 42
8057 42 -12 33 -167 1 32 0 114 -12 -68 -87 61 22 13 -41 12 3 -8 62 34 -151 59 70 3 -11 -9 -19 -39 69
8085 69 73 -36 -33 57 -44 -67 -130 -43 16 -1 0 25 7 14 -9 -96 -15 -74 56 84 104 83 -131 63 -52 19 -35 -58 -70
8114 -70 59 67 177 15 -59 69 117 19 -71 23 -2 2 -69 74 -106 -7 -26 -55 11 109 51 10 -57 -36 49 -4 49 -41
8142 -41 77 -24 -51 58 36 -132 -30 -76 29 28 -90 -44 -40 31 91 -41 6 43 -170 -36 13 -32 -44 -31 -24 63 22
8169 22 18 104 20 57 -63 -72 51 56 8 -87 -23 5 7 -57 60 23 38 15 -65 60 0 -83
8191h3
##END NTUPLES=NMR FID
##END=
