##TITLE=1H_E3e-4-3
 CDCl3
 8 sc, 
 16.6.2023
##JCAMPDX= 6.0         $$ Bruker NMR JCAMP-DX V2.0
##DATA TYPE= NMR FID
##DATA CLASS= NTUPLES
##ORIGIN= UXNMR, Bruker Analytische Messtechnik GmbH
##OWNER= root
$$ XWIN-NMR		Version 3.5
$$ Fri Jun 16 13:42:09 2023 Russian Standard Time (UT+4h)  she@DPX200
##.OBSERVE FREQUENCY= 200.13135
##.OBSERVE NUCLEUS= ^1H
##.DELAY= (6, 6)
##.ACQUISITION MODE= SIMULTANEOUS
##.ACQUISITION SCHEME= undefined
##.AVERAGES= 8
##.DIGITISER RES= 18
##SPECTROMETER/DATA SYSTEM= spect
##.PULSE SEQUENCE= zg30
##.SOLVENT NAME= CDCl3
##.SHIFT REFERENCE= (INTERNAL, CDCl3, 0, 15.7039)
##AUDIT TRAIL= $$ (NUMBER, WHEN, WHO, WHERE, WHAT)
$$ ##TITLE= Audit trail, XWIN-NMR		Version 3.5
$$ ##JCAMPDX= 5.01
$$ ##ORIGIN= Bruker BioSpin GmbH
$$ ##OWNER= she
$$ F:/spectra/data/she/nmr/H-F/1/audita.txt
$$ ##AUDIT TRAIL=  $$ (NUMBER, WHEN, WHO, WHERE, WHAT)
(   1,<2023-06-16 13:40:30.85 +0400>,<she>,<DPX200>,
      <created by zg, POWCHK disabled, PULCHK disabled
       configuration hash MD5:
       00 E9 B6 7A A2 85 ED C7 34 08 36 98 17 FE 4E 26
       data hash MD5: 16K
       2F 85 B8 E2 B8 DB E9 60 AF AE 42 28 A0 9D 8E 87>)
$$ ##END=
$$ 
$$ hash MD5
$$ 48 8C 5A 9A FB 1B 7D D6 83 0F C2 E0 E9 4F 14 67
##$RELAX= 
##$RELAX= 
##$RELAX= 
##$RELAX= 
##$RELAX= 
##$RELAX= 
$$ Bruker specific parameters
$$ --------------------------
##$DU= <F:/spectra>
##$EXPNO= 1
##$NAME= <H-F>
##$PROCNO= 1
##$TYPE= <nmr>
##$USER= <she>
##$AMP= (0..31)
100 100 100 100 100 100 100 100 100 100 100 100 100 100 100 100 100 100 
100 100 100 100 100 100 100 100 100 100 100 100 100 100 
##$AQSEQ= 0
##$AQ_mod= 1
##$AUNM= <au_zg>
##$AUTOPOS= <>
##$BF1= 200.13
##$BF2= 200.13
##$BF3= 200.13
##$BF4= 200.13
##$BF5= 200.13
##$BF6= 200.13
##$BF7= 200.13
##$BF8= 200.13
##$BYTORDA= 1
##$CFDGTYP= 0
##$CFRGTYP= 5
##$CHEMSTR= <none>
##$CNST= (0..31)
1 1 145 1 1 1 1 1 1 1 1 1 1 1 1 1 1 1 1 1 1 1 1 1 1 1 1 1 1 1 1 1 
##$CPDPRG= <>
##$CPDPRG1= <>
##$CPDPRG2= <>
##$CPDPRG3= <>
##$CPDPRG4= <mlev>
##$CPDPRG5= <mlev>
##$CPDPRG6= <mlev>
##$CPDPRG7= <mlev>
##$CPDPRG8= <mlev>
##$CPDPRGB= <>
##$CPDPRGT= <>
##$D= (0..31)
0 1.2 0 0 0 0 0 0 0 0.06 0 0.03 0 0 0 0 0.0002 0 0 0 0 0 0 0 0 0 0 0 0 
0 0 0 
##$DATE= 1686908430
##$DBL= (0..7)
120 120 120 120 120 120 120 120 
##$DBP= (0..7)
150 150 150 150 150 150 150 150 
##$DBP07= 0
##$DBPNAM0= <>
##$DBPNAM1= <>
##$DBPNAM2= <>
##$DBPNAM3= <>
##$DBPNAM4= <>
##$DBPNAM5= <>
##$DBPNAM6= <>
##$DBPNAM7= <>
##$DBPOAL= (0..7)
0.5 0.5 0.5 0.5 0.5 0.5 0.5 0.5 
##$DBPOFFS= (0..7)
0 0 0 0 0 0 0 0 
##$DE= 6
##$DECBNUC= <off>
##$DECIM= 32
##$DECNUC= <off>
##$DECSTAT= 4
##$DIGMOD= 1
##$DIGTYP= 9
##$DL= (0..7)
0 120 120 120 120 120 120 120 
##$DP= (0..7)
150 150 150 150 150 150 150 150 
##$DP07= 0
##$DPNAME0= <>
##$DPNAME1= <>
##$DPNAME2= <>
##$DPNAME3= <>
##$DPNAME4= <>
##$DPNAME5= <>
##$DPNAME6= <>
##$DPNAME7= <>
##$DPOAL= (0..7)
0.5 0.5 0.5 0.5 0.5 0.5 0.5 0.5 
##$DPOFFS= (0..7)
0 0 0 0 0 0 0 0 
##$DQDMODE= 0
##$DR= 18
##$DS= 0
##$DSLIST= <SSSSSSSSSSSSSSS>
$$ [...]
##$SUBNAM2= <"">
##$SUBNAM3= <"">
##$SUBNAM4= <"">
##$SUBNAM5= <"">
##$SUBNAM6= <"">
##$SUBNAM7= <"">
##$SUBNAM8= <"">
##$SUBNAM9= <"">
##$SW= 18.05172834244
##$SWIBOX= (0..15)
0 0 2 0 0 0 0 0 0 0 0 0 0 0 0 0 
##$SW_h= 3612.71676300578
##$TD= 16384
##$TD0= 1
##$TE= 0
##$TE2= 300
##$TE3= 300
##$TEG= 300
##$TL= (0..7)
0 120 120 120 120 120 120 120 
##$TP= (0..7)
150 150 150 150 150 150 150 150 
##$TP07= 0
##$TPNAME0= <>
##$TPNAME1= <>
##$TPNAME2= <>
##$TPNAME3= <>
##$TPNAME4= <>
##$TPNAME5= <>
##$TPNAME6= <>
##$TPNAME7= <>
##$TPOAL= (0..7)
0.5 0.5 0.5 0.5 0.5 0.5 0.5 0.5 
##$TPOFFS= (0..7)
0 0 0 0 0 0 0 0 
##$TUNHIN= 0
##$TUNHOUT= 0
##$TUNXOUT= 0
##$USERA1= <user>
##$USERA2= <user>
##$USERA3= <user>
##$USERA4= <user>
##$USERA5= <user>
##$V9= 5
##$VALIST= <valist>
##$VCLIST= <CCCCCCCCCCCCCCC>
##$VD= 0
##$VDLIST= <DDDDDDDDDDDDDDD>
##$VPLIST= <PPPPPPPPPPPPPPP>
##$VTLIST= <TTTTTTTTTTTTTTT>
##$WBST= 1024
##$WBSW= 4
##$XGAIN= (0..3)
0 0 0 0 
##$XL= 0
##$YL= 0
##$YMAX_a= 454760
##$YMIN_a= -383400
##$ZGOPTNS= <>
##$ZL1= 120
##$ZL2= 120
##$ZL3= 120
##$ZL4= 120
##$ABSF1= 10
##$ABSF2= 0
##$ABSG= 5
##$ABSL= 3
##$ALPHA= 0
##$AQORDER= 0
##$ASSFAC= 0
##$ASSFACI= 0
##$ASSFACX= 0
##$ASSWID= 0
##$AUNMP= <proc_1d>
##$AZFE= 0.1
##$AZFW= 0.1
##$BCFW= 1
##$BC_mod= 2
##$BYTORDP= 1
##$COROFFS= 0
##$CY= 11.3945322036743
##$DATMOD= 1
##$DC= 2
##$DFILT= <>
##$DTYPP= 0
##$F1P= 15.7292609196834
##$F2P= 12.9074282941183
##$FCOR= 0.5
##$FTSIZE= 0
##$FT_mod= 4
##$GAMMA= 1
##$GB= 0.15
##$INTBC= 1
##$INTSCL= 1
##$ISEN= 128
##$LB= 0.24
##$LEV0= 0
##$LPBIN= 0
##$MAXI= 10000
##$MC2= 0
##$MEAN= 0
##$ME_mod= 0
##$MI= 1.114404
##$NCOEF= 0
##$NC_proc= 0
##$NLEV= 6
##$NOISF1= 3.799351
##$NOISF2= 2.8
##$NSP= 1
##$NTH_PI= 0
##$NZP= 0
##$OFFSET= 15.70392
##$PC= 1
##$PHC0= -20777.96
##$PHC1= 6.452721
##$PH_mod= 1
##$PKNL= yes
##$PPARMOD= 0
##$PSCAL= 0
##$PSIGN= 0
##$REVERSE= no
##$SF= 200.130013532006
##$SI= 16384
##$SIGF1= 3
##$SIGF2= 2
##$SINO= 400
##$SIOLD= 16384
##$SREGLST= <1H.CDCl3>
##$SSB= 0
##$STSI= 0
##$STSR= 0
##$SW_p= 3612.71676300578
##$SYMM= 0
##$S_DEV= 0
##$TDeff= 0
##$TDoff= 0
##$TI= <>
##$TILT= no
##$TM1= 0
##$TM2= 0
##$TOPLEV= 0
##$USERP1= <user>
##$USERP2= <user>
##$USERP3= <user>
##$USERP4= <user>
##$USERP5= <user>
##$WDW= 1
##$XDIM= 8192
##$YMAX_p= 0
##$YMIN_p= 0
$$ End of Bruker specific parameters
$$ ---------------------------------
##NTUPLES= NMR FID
##VAR_NAME=  TIME,          FID/REAL,        FID/IMAG
##SYMBOL=    X,             R,               I
##VAR_TYPE=  INDEPENDENT,   DEPENDENT,       DEPENDENT
##VAR_FORM=  AFFN,          ASDF,            ASDF
##VAR_DIM=   8192,          8192,            8192
##UNITS=     SECONDS,       ARBITRARY UNITS, ARBITRARY UNITS
##FACTOR=    0.0002768,     1,               1
##FIRST=     0,             0,               0
##LAST=      2.2672688,     0,               0
##MIN=       0,             -383400,         0
##MAX=       2.2672688,     454760,          0
$$ Real data points
##PAGE= N=1
##DATA TABLE= (X++(R..R)), XYDATA
0 0 0 0 0 0 0 0 0 0 0 0 0 0 0 -8 8 -8 8 -8 16 -16 20 -24 30 -32 40 -48 56 -65 76 -87 100 -116 131 -148 170
35 170 -190 214 -244 271 -304 340 -378 422 -468 518 -571 634 -699 772 -850 936 -1029 1136
53 1136 -1250 1378 -1522 1679 -1860 2067 -2302 2579 -2904 3291 -3765 4359 -5104 6051 -7171
68 -7171 7632 941 454760 165534 -120029 185311 -205021 -383400 236910 280806 -124476
79 -124476 18523 -68011 -299842 102176 305246 -32341 -9558 23215 -217569 -27281 223530
90 223530 -34363 -109758 53090 -29762 -5490 164808 28111 -127088 -68259 -15114 72479
101 72479 112548 -49024 -107363 -41534 -34783 110323 208056 -45719 -187810 -74237 -65295
112 -65295 51650 244021 30838 -191446 -56293 -25978 -2324 228202 104982 -213967
122 -213967 -104833 15034 -48754 147420 199891 -135026 -153475 59717 -5407 18744 145937
133 145937 -55966 -173883 28463 53290 -3701 97523 3218 -155425 -1102 99312
143 99312 -21500 -6242 20184 -101248 -43579 127433 66793 -45055 -23904 -43150 -54071
154 -54071 67337 108159 -18791 -85069 -39058 -1242 49347 100675 28729 -89833 -80596 -7205
166 -7205 30614 72905 56316 -63036 -96305 1228 42900 34946 45334 -20895 -95848 -29328
178 -29328 48279 31471 23295 7393 -52971 -35579 40816 37447 -3348 -9365 -18412 -17247 20945
191 20945 37303 5019 -25204 -18598 5227 17222 20920 6973 -35508 -37597 19518 31241 1699
204 1699 7022 -14666 -54069 91 49566 3656 -7058 5336 -43912 -23529 55706 20266
216 20266 -23907 14278 -11462 -40604 32763 39222 -23387 3743 12486 -37488 6305 44000
228 44000 -19391 -15968 27190 -17730 -22156 29866 -1413 -24434 18587 289 -27139 12726
240 12726 7911 -22385 10762 15544 -21552 -5077 11702 -6564 7494 15765 -13266 -9435 9612
253 9612 935 7558 14903 -9589 -13924 4510 5902 11544 11288 -16887 -19625 5651 7977 6453
267 6453 8366 -16010 -24171 4202 14293 8831 6547 -19452 -32495 4677 27861 13175 2664
280 2664 -13681 -29216 -294 32105 21498 1298 -16757 -32256 -5801 37530 32282 -532
292 -532 -20170 -29726 -12173 27323 31692 -1108 -24561 -29456 -11583 26574 36865 857 -31987
305 -31987 -31934 -8220 24411 33242 2423 -29853 -27856 103 30963 37161 3941 -35864 -36351 477
319 477 36507 38535 3240 -33938 -33537 2053 36133 36889 683 -40614 -44541 -3680 39518 40540
333 40540 1279 -37793 -40078 -3519 35985 36421 -2151 -40084 -41485 -3172 42026 46771 3755
346 3755 -38831 -38768 -1066 38608 41245 42 -41004 -38047 2944 43577 46779 4153 -43135
359 -43135 -45598 -3895 38458 40098 -1714 -42835 -39744 1774 41610 41830 -1755 -45948 -45142
372 -45142 -4212 38773 44206 402 -43187 -34061 8406 40323 41062 273 -48334 -42616 6971
385 6971 41437 42846 8216 -42966 -43549 10120 41940 30118 -1026 -42617 -49727 4310 47768
398 47768 34359 -78 -34759 -47462 -3085 46631 31947 -11810 -35356 -36217 -595 49221
410 49221 44008 -8119 -38879 -32492 -2541 38644 44498 -3624 -45000 -30992 10207 37818 37884
423 37884 2978 -43535 -43863 3918 35412 28180 3809 -31782 -43498 3196 43931 22222 -9524
436 -9524 -23880 -36661 -8148 43942 31137 -15885 -21628 -18117 -6126 40359 39513 -24299 -39092
449 -39092 -8804 1973 29412 46988 -10698 -52268 -14932 13086 20580 37845 1372 -57613
461 -57613 -33359 19773 25534 26510 13438 -39075 -45714 8135 29383 18050 10511 -18379 -38947
474 -38947 -2062 33622 19427 95 -8148 -20102 -9375 21009 21139 -5398 -13582 -4882 1391
487 1391 12798 17466 -8028 -28985 -6535 17538 10702 5787 -1936 -30166 -22523 25082 28479
500 28479 -1165 -6000 -21517 -34992 14179 46918 6096 -12695 -5951 -31134 -10639 49040
512 49040 24002 -21314 -2049 -12630 -30576 29402 42827 -20684 -12812 11285 -28785 -7620
524 -7620 42671 -4427 -27084 18258 -5895 -28299 25285 11676 -33345 13097 23553 -29150
536 -29150 -2265 22335 -25074 -5681 39897 -3534 -20957 13608 -10148 -19265 31586 23369
548 23369 -17781 -5962 -4179 -17767 11040 27264 2074 -10288 -13178 -15292 1576 14346 12248
561 12248 3040 -17341 -17528 3808 524 3330 23891 -3351 -27688 6507 4631 -17885 23898
574 23898 25519 -28417 -3343 19419 -29319 -1999 47807 -9753 -24086 25847 -16222 -33796
586 -33796 39592 18727 -32810 16173 6762 -48254 11216 40127 -24641 -4393 26865 -33190
598 -33190 -21026 37228 -2679 -17038 28020 -5381 -31926 18858 11743 -19557 18093 17961 -23386
611 -23386 -2134 11907 -16094 3409 26416 -4171 -12102 2564 -12164 -8997 18288 13356 -5057
624 -5057 -9241 -14439 -9832 8496 15738 8995 -6108 -18880 -10633 3711 10138 17778 5807 -20686
638 -20686 -12257 8236 2989 9740 17978 -11565 -19789 9269 4987 -5340 15977 3440 -22403
651 -22403 4302 14877 -15658 -3900 14659 -12283 -7142 21496 -6131 -24163 8628 6298
663 6298 -10307 17240 11760 -29873 -11571 17931 188 7062 23162 -16069 -29578 11602 13183
676 13183 -479 20883 2609 -35972 -6103 22680 1075 6629 14046 -24398 -23623 16912 8658
689 8658 -3945 12146 -7596 -26223 7211 16249 -6661 1750 3663 -15780 -691 16069 -2154
702 -2154 -5024 4843 -4295 613 13548 -436 -9746 -815 523 5065 11417 -1553 -10511 -4602
716 -4602 -2807 6531 14154 -3513 -13836 -5331 -5952 3162 19071 605 -17269 -3541 -2588 -3480
730 -3480 18587 9353 -17991 -5096 4148 -6121 13459 17647 -16064 -11152 11758 -3263 394
743 394 18710 -7485 -18498 10166 5504 -6453 10838 -1498 -20954 4724 13080 -7412 1258
756 1258 2832 -17440 -1819 17187 -1195 -4740 3019 -11861 -5808 17237 6483 -6176 1178
769 1178 -5620 -6518 12890 9799 -5013 -1286 -3288 -6758 8016 9893 -4287 -3652 -2018 -5814 4121
784 4121 7510 -5325 -5309 -326 -4274 1939 7713 -4184 -7442 552 -189 2678 7826 -3074 -8688
799 -8688 1701 3250 2581 8304 547 -9898 -1596 5353 3510 5974 1376 -9789 -4839 4592 3362
814 3362 3343 1264 -8167 -7246 2501 3679 1745 230 -6175 -6644 2042 4817 1542 -212 -3229 -4035
830 -4035 1834 5309 2785 -55 -2074 -2245 1844 5121 3004 -1133 -2682 -633 1197 1965 1914 -789
846 -789 -3908 -1815 1259 526 262 -1020 -4335 -1704 2904 68 -1551 289 -2758 -2232 4002 2608
862 2608 -1748 656 -899 -2169 4915 4890 -2022 -470 679 -2593 2961 5681 -1756 -2440 379 -2938
878 -2938 237 5201 -1329 -4423 -784 -2016 -778 3106 -1111 -3455 -1 -1918 -706 4263 -310
893 -310 -2940 1788 -420 -802 5277 650 -3110 3956 1105 -3651 4785 2827 -5130 2704 3366 -6046
909 -6046 1415 4650 -6642 -470 6555 -6489 -4138 6781 -4584 -5411 8101 -1448 -8313 5391
923 5391 1227 -7857 5711 5854 -7261 731 5471 -4940 375 7660 -1581 -2066 4139 -1584 -2453
938 -2453 4374 1743 -1957 642 -14 -2651 -1692 935 1415 -1118 -1674 -276 -3554 -3077 4513 1777
954 1777 -3930 2088 -592 -8394 3830 9320 -4301 -580 5801 -8063 -3394 13292 931 -5903
968 -5903 7016 -2441 -10607 9027 7883 -8502 1752 4055 -11008 -330 9806 -5295 -3986
981 -3986 6596 -5101 -6848 6251 332 -5984 4451 3551 -5208 -804 2013 -2654 1079 7311
995 7311 2148 -4495 -2242 970 -1147 3775 10730 -649 -11429 -934 2325 -3333 9060 9913
1009 9913 -12875 -10335 5202 -4097 713 16859 -4250 -18036 3217 991 -7529 14501 9273
1022 9273 -17240 -2159 8649 -9718 3266 17702 -8179 -9485 11909 -2742 -9769 12052
1034 12052 4372 -9615 7146 5617 -13016 -2582 7086 -3377 1961 9232 -6369 -13214 -496
1047 -496 3935 2493 6975 2913 -11894 -12046 3872 8450 3478 6915 372 -16925 -6114 14638
1061 14638 5188 -294 9460 -7305 -17648 9021 12240 -5891 5488 5422 -17466 -2830 14648
1074 14648 -6297 -4838 12132 -7037 -11332 12093 -702 -14359 8503 7339 -10531 4476
1086 4476 6386 -15087 -3014 14774 1153 -1118 5779 -8927 -11039 9303 10894 1161 2020 -4290
1100 -4290 -12696 -1157 13034 7937 -2413 -4509 -7400 -8867 4183 14474 1685 -9132 -3235
1113 -3235 -5304 -5938 11140 10330 -9121 -4640 2707 -7528 2257 14576 -3943 -7751 8271 -2479
1127 -2479 -7402 12198 2213 -12773 8381 9297 -12599 533 8668 -12049 -1160 17451 -4672
1140 -4672 -12132 4714 -4825 -8011 14986 8162 -12753 -4416 -867 -7583 8422 14981 -4762 -8872
1154 -8872 -981 -4985 1684 14898 5017 -8714 -4481 -922 -1005 6338 8792 -1135 -7816 -3080 1320
1169 1320 623 2647 3548 -3655 -6150 1707 1413 -3759 1592 2137 -5155 450 5458 -5290 -4375 5751
1185 5751 -350 -1916 8741 -167 -10811 2470 6427 -2638 5395 6522 -10035 -5770 7453 708
1199 708 512 7903 -5293 -11390 3993 3789 -3189 5351 1425 -11435 -1760 6384 -2441 293 5223
1214 5223 -5943 -5567 5955 1528 -2835 4162 901 -4791 2408 4053 -2096 526 2688 -1637 249
1229 249 2800 -1040 -1646 1040 -155 -233 930 -1120 -1930 -902 -330 712 356 -1714 -1309 -897 -1222
1246 -1222 1873 2216 -1972 -806 1365 -1495 502 4246 -294 -2132 2305 157 -1435 3747 1264
1261 1264 -3277 1637 1790 -3596 727 2929 -3522 -992 3253 -3027 -2816 2580 -1213 -2500 2940
1276 2940 -587 -4342 1346 1476 -2058 2125 1807 -3287 209 3196 -388 648 2483 -1775 -1272 3050
1292 3050 1001 -418 1152 -1251 -1838 1941 1275 -1240 -298 -1469 -2656 775 1610 -939 -1033 -1376 -2146
1309 -2146 628 2179 -182 -628 -803 -1740 917 3158 882 -713 -302 -595 1137 3287 1062 -1377
1325 -1377 -998 -578 839 3150 1109 -2610 -2665 -949 631 2649 1296 -3231 -4043 -1432 964 2737
1341 2737 2109 -2216 -4106 -1762 1471 3186 3000 -471 -3476 -1621 2151 3241 2400 310 -2485 -1911
1357 -1911 1666 2983 1437 -403 -2621 -2486 1474 3099 -66 -2031 -2516 -2786 804 4080 833 -3036
1373 -3036 -2921 -2343 319 4929 2707 -2965 -3109 -1489 229 4894 4721 -1650 -3532 -1067 247 3407
1389 3407 4763 -903 -4329 -1264 836 2056 3103 -860 -4843 -2011 1255 1705 1439 -1171 -4503
1404 -4503 -2606 1990 3760 1624 -2352 -4090 -2045 1656 4728 4057 -1949 -4989 -1524 1852 4169
1419 4169 5308 -391 -6025 -2167 1977 2372 4599 1374 -6406 -4141 2165 1301 1957 2312 -5111 -5830
1435 -5830 2641 2739 -610 1580 -2122 -6441 1794 5960 -275 -920 -42 -4151 -187 7302 2968 -3054
1451 -3054 -1515 -1504 -1149 4971 5473 -2135 -4571 -1413 -144 1858 4559 210 -6231 -3328 1706 823
1467 823 1693 2389 -4338 -5730 2842 3171 -1149 1981 -355 -6398 1655 7133 -1086 -1561 2536 -4020
1483 -4020 -1895 8629 2299 -5689 700 -389 -4115 6244 6149 -6355 -4263 1165 -2848 2041 7390
1498 7390 -3048 -7840 -704 311 637 5737 1176 -6703 -3841 1874 2588 3411 2480 -2375 -5006 -504
1514 -504 4748 3055 236 570 -2256 -4188 3470 4925 -3151 -745 2565 -5054 -1367 6999 -2810
1529 -2810 -6004 5303 -325 -6196 5577 1529 -9991 2656 7041 -5786 957 6013 -8994
1542 -8994 -3403 10786 -200 -3183 6843 -4252 -9170 8350 6405 -4655 3498 959 -10495
1555 -10495 760 9091 -1488 -954 2511 -6612 -4938 5349 2471 -1611 1104 -1991 -4502 156
1569 156 2747 1133 -3 -103 -75 -1829 -975 3337 1460 -1552 3366 1152 -5492 1087 4691 -3146
1585 -3146 1433 6249 -5820 -5331 5929 -1455 -3620 7974 -492 -9888 3038 2754 -6803 4815
1599 4815 6247 -8848 -1820 6073 -5779 -1012 9845 -2830 -5774 6253 -1232 -6256 7059
1612 7059 4344 -5559 2539 2581 -6637 452 6211 -1214 -475 2581 -4626 -4617 3321 2606 -309 869 -1903
1629 -1903 -5381 -1657 3800 3292 -326 -1522 -2189 -3681 828 6515 1759 -3333 187 -1030 -2978
1644 -2978 5195 5450 -4048 -1468 2581 -3494 299 6600 -2641 -5006 4199 29 -4368 3993 433
1659 433 -7423 1970 5301 -3950 -916 2474 -5885 -1902 8102 1086 -4007 1188 -2420 -3993 6426
1674 6426 6589 -3039 -2435 -680 -3369 2843 8249 411 -5268 -2150 -1414 85 5734 3667 -5109 -5434
1690 -5434 -88 1026 2345 3744 -2212 -7021 -1167 3695 1751 1553 -174 -5368 -2625 5190 3918
1705 3918 -383 -531 -2888 -2979 4528 6290 -1010 -3376 -1948 -2071 2583 6869 485 -5752 -3605 -614
1721 -614 1756 5201 2100 -5896 -5931 -90 2864 4071 2640 -3915 -7294 -905 5051 4334 1857 -1937
1737 -1937 -6319 -2785 5805 6152 685 -2034 -4412 -3749 4242 7412 563 -3931 -3517 -3355 2167 7348
1753 7348 1317 -5597 -3962 -1760 993 6079 2574 -6077 -5256 -134 2154 5069 3269 -5064 -6016
1768 -6016 631 3934 4688 3137 -4075 -6315 44 5054 5143 2279 -3810 -6531 -975 4690 5135 1784
1784 1784 -4196 -6928 -1792 4035 4990 1917 -4322 -7121 -1769 4107 4807 2381 -3346 -6923 -1553
1799 -1553 4903 4963 2324 -2220 -6380 -1819 5356 5268 1570 -1842 -5660 -2585 5026 5298 519 -2632
1815 -2632 -5208 -3060 4130 5520 -153 -3558 -4608 -3044 3472 5492 88 -3773 -4023 -2249 3246
1830 3246 5886 843 -3886 -3506 -1131 3304 5697 1357 -3658 -3555 -981 3141 5415 1464 -3820
1845 -3820 -3922 -1279 2466 4593 1244 -3913 -4351 -1341 2157 4190 1257 -3944 -4322 -1020 2229 4087
1861 4087 1567 -3392 -3788 -325 2558 3923 1896 -2964 -3456 152 2603 3529 1872 -2565 -3722 178
1877 178 2490 2493 1150 -2220 -3886 -572 2265 1901 302 -2090 -3393 -912 2188 2030 161 -1756
1893 -1756 -2618 -662 2203 2299 611 -1465 -1924 -89 1880 2387 1130 -1308 -1854 77 1184 1639 1146
1910 1146 -1235 -2437 -60 1174 176 548 -450 -2645 -665 1674 -291 -785 420 -1488 -1166 1890
1926 1890 664 -1367 524 405 -1094 1549 1783 -1342 -222 1368 -215 367 1934 -545 -1357 1237
1942 1237 521 -921 591 150 -1602 -48 853 -1156 -1099 440 -271 -705 439 -170 -1630 -204 1385
1959 1385 462 -442 176 -556 -734 1902 2401 -490 -1016 -66 -887 904 3384 408 -2566 -641 -384
1976 -384 -463 3012 1891 -3470 -2586 451 -673 1306 3109 -2326 -4438 451 1020 -91 2638 305
1992 305 -4627 -655 3344 494 676 1644 -2910 -2158 3854 2693 -1198 73 -1059 -2562 2624 4383
2008 4383 -1496 -3051 -869 -1398 991 4747 8 -5282 -2516 290 936 3846 2336 -4832 -4886 916
2024 916 2763 2696 3120 -2085 -6062 -618 4493 2855 1664 -45 -4673 -2962 4174 4387 -48 -868
2040 -868 -2506 -3877 2004 5336 -290 -3250 -1533 -2114 -26 5025 1354 -5177 -2406 872 197 3322
2056 3322 3088 -4673 -4757 2592 3052 1877 3146 -2749 -6764 1339 6203 1924 870 -993 -6493 -2172
2072 -2172 6756 4048 -1572 -1706 -4337 -4154 4415 6422 -1288 -3907 -2794 -3352 1699 6672 1061 -4978
2088 -4978 -2646 -674 664 5006 3287 -4120 -3940 1288 2095 2336 3110 -2088 -5210 931 4458 1196
2104 1196 26 -1122 -4795 -1152 5714 2903 -2680 -2450 -3232 -2492 5042 5675 -2853 -4809 -1963 -1724
2120 -1724 2947 7534 -18 -6724 -2508 621 1632 6079 3263 -6075 -4676 1595 2034 3359 4027
2135 4027 -3407 -6258 694 3259 1319 2062 -1109 -5685 -1222 4358 1303 -1165 -647 -3142 -2174 3870
2151 3870 3299 -2279 -2531 -826 -740 2840 4698 -1043 -4580 -886 1342 2132 4286 784 -5245 -3231
2167 -3231 2264 2572 2383 1746 -3988 -5478 1173 4003 1214 568 -1744 -5473 -1189 4458 2236 -977
2183 -977 -1007 -2894 -2277 3493 3876 -1057 -1593 -795 -1608 1828 4249 -288 -2949 -129 338 313 3078 990
2201 990 -3809 -1704 1833 534 755 1230 -2671 -3327 1563 2086 -253 197 -1231 -3301 314 3213
2217 3213 470 -714 -268 -2142 -719 3477 1977 -1281 -539 -659 -996 2090 2662 -778 -1453 -191
2233 -191 -399 639 2040 -163 -1850 -916 57 353 653 -15 -1507 -1099 176 716 225 -233 -500 -669
2251 -669 198 1383 598 -596 -5 317 -105 1050 1358 -946 -739 1049 -44 -144 1273 -369 -1587
2268 -1587 551 505 -968 445 187 -1803 -89 1051 -1053 -383 697 -1144 -598 1490 -258 -927
2284 -927 786 90 -525 1241 547 -1056 605 791 -346 756 560 -992 96 970 -135 68 219
2301 219 -1218 -535 795 16 -252 -241 -1359 -630 851 396 -57 -165 -1241 -726 1185 845 154 128 -845
2320 -845 -645 1462 1280 -12 145 -522 -826 1278 1417 -461 -542 -403 -865 642 1322 -659 -1244 -542
2338 -542 -794 328 1510 -323 -1606 -589 -331 451 1576 152 -1564 -880 279 731 1702 848 -1296
2355 -1296 -1076 355 996 1461 801 -1080 -1308 -92 772 1215 345 -1232 -1448 -288 812 775 8 -1404
2373 -1404 -1254 -105 662 859 114 -1434 -1070 322 1158 1209 301 -1282 -1114 724 1407 1156 415 -1241
2391 -1241 -1248 605 1448 1036 159 -1357 -1625 185 1410 614 -270 -1393 -1704 -161 1441 927 -288 -1151
2409 -1151 -1366 -234 1322 1322 126 -915 -1106 -45 1296 1441 643 -838 -1025 213 1036 844 595 -667
2427 -667 -1350 57 878 69 -34 -373 -1485 -235 1236 -55 -941 -178 -972 -509 1742 668 -1576
2444 -1576 -512 -34 -462 1628 1575 -1099 -1118 481 15 976 1969 -373 -1685 136 363 204 1371 182
2462 182 -1883 -772 433 -56 284 472 -1101 -1400 263 462 -145 46 -156 -877 -111 1010 271 -466
2480 -466 166 148 -357 762 1198 -565 -695 814 247 -56 1150 -89 -1453 351 916 -602 261 418
2498 418 -1719 -757 1354 -162 -843 587 -663 -1426 1121 1035 -1024 77 537 -1085 284 1700 -192
2515 -192 -732 798 5 -651 1294 783 -934 30 748 -681 -237 903 -233 -970 453 97 -1409
2532 -1409 30 772 -1045 -333 1121 -847 -1262 968 263 -1086 1137 779 -1757 190 1623 -697
2548 -697 141 2000 -986 -1384 1553 353 -934 1597 493 -2109 298 1182 -1251 -8 1311 -1394
2564 -1394 -1115 1230 -443 -1241 1109 195 -1218 515 597 -1185 -65 1173 -170 -123 795 -233 -808
2581 -808 854 1297 -116 28 329 -736 -601 1348 861 -926 -36 2 -1463 131 1696 -618 -1197
2598 -1197 649 -990 -1442 1539 826 -1574 216 738 -1742 419 2217 -873 -776 1681 -612 -1072
2614 -1072 2028 429 -1620 1173 919 -1682 489 1344 -1595 -270 1645 -850 -1226 968 -550 -1420
2630 -1420 1107 733 -1537 -154 272 -1238 180 1638 -255 -949 499 -144 -584 1268 1266 -645 -346
2647 -346 545 -443 -39 1595 323 -1143 66 276 -883 450 1244 -886 -1062 429 -520 -768 1088
2664 1088 176 -1524 8 415 -1001 217 1157 -891 -787 1133 -97 -585 1122 403 -1003 641
2680 641 1096 -724 25 892 -736 -249 1183 21 -1062 261 -11 -1046 520 881 -987 -771 271
2697 271 -582 -477 1212 205 -1451 19 283 -397 824 1228 -1115 -877 770 285 196 1386 -16
2714 -16 -1406 240 988 -126 525 379 -1444 -721 1110 275 -220 176 -1094 -1307 693 898 -400 -214
2732 -214 -379 -934 193 1306 111 -589 -158 -190 172 1221 785 -658 -466 122 352 864 617 -408
2750 -408 -1186 -164 690 818 238 -443 -1269 -827 621 1128 17 -530 -1067 -1084 422 1473 283 -871
2768 -871 -919 -687 366 1727 916 -920 -930 -227 362 1425 1283 -696 -1289 -91 431 823 1072 -679
2786 -679 -1744 -375 699 651 678 -518 -1785 -757 830 696 306 -372 -1456 -786 1028 1300 300
2803 300 -350 -1039 -821 1078 1702 433 -607 -936 -516 750 1599 489 -848 -1388 -730 671 1504 506
2821 506 -1102 -1602 -930 498 1371 637 -945 -1651 -935 673 1579 691 -903 -1280 -725 779 1788 954
2839 954 -688 -1222 -388 629 1678 943 -818 -1352 -421 592 1296 845 -892 -1701 -471 640 884
2856 884 634 -945 -1679 -483 794 1091 528 -598 -1484 -676 1085 1321 598 -364 -1219 -624 998 1545
2874 1545 600 -510 -1183 -617 792 1416 543 -748 -1281 -836 511 1189 422 -898 -1252 -697 390 1023
2892 1023 526 -801 -1273 -488 541 971 483 -446 -1104 -268 743 1103 650 -339 -1030 -409 702 987
2910 987 389 -259 -771 -559 514 1047 229 -574 -887 -537 248 857 238 -687 -853 -367 313 637 552 -325
2930 -325 -849 -285 425 674 747 -55 -735 -175 653 625 438 122 -691 -502 455 560 -72 -106 -433 -633 57
2951 57 552 -255 -600 -165 -516 -254 556 119 -532 57 74 -233 506 565 -513 -287 586 -21 54 862 81
2972 81 -440 391 343 -210 288 301 -441 -207 84 -252 -283 347 -66 -614 -166 59 -446 111 372 -425 -534
2993 -534 168 81 -91 613 401 -473 -201 452 -26 354 778 -191 -547 450 355 -169 549 178 -981 -97
3013 -97 656 -242 -147 284 -740 -670 869 321 -695 82 -60 -646 540 1111 -346 -685 88 -142 266
3032 266 1212 359 -1075 -352 331 294 889 710 -931 -1003 285 624 298 449 -602 -1604 -365 870
3050 870 513 16 -108 -1355 -1060 1133 1021 -358 -158 -354 -1061 739 1810 -72 -801 137 -473 -21
3068 -21 1719 434 -1317 -108 283 -319 1136 881 -1470 -1182 605 128 263 893 -964 -1726 443
3085 443 1085 69 349 -373 -1663 -193 1656 746 -168 -221 -979 -527 1536 1565 -167 -828 -694 -377 759
3104 759 1669 304 -1268 -955 31 370 1027 802 -1308 -1565 246 707 311 564 -609 -1873 -34 1547
3122 1547 306 -51 -17 -1421 -480 1896 963 -563 -183 -636 -893 1525 1739 -751 -918 -239 -649 761
3140 761 2126 -303 -1804 -546 -76 164 1492 378 -2022 -1023 481 357 823 716 -1334 -1595 559
3157 559 1111 489 495 -551 -1425 111 1644 757 -105 -193 -823 -495 1371 1157 -538 -810 -532 -400 679
3176 679 1233 -417 -1447 -455 26 255 1081 66 -1507 -841 539 597 754 467 -1050 -1237 500 1148
3194 1148 600 378 -562 -1153 -50 1315 722 -339 -485 -871 -403 1101 1087 -502 -949 -575 -405 476
3212 476 1226 -76 -1285 -479 30 183 980 393 -1151 -620 667 453 550 622 -780 -851 602 818 129
3231 129 316 -327 -1048 192 1153 82 -216 -161 -897 -289 1052 333 -524 -441 -556 -498 677 642 -506 -467
3251 -467 -237 -201 510 811 -99 -602 -152 156 426 674 128 -388 -277 77 525 393 23 -382 -417 -88 600
3272 600 370 -193 -404 -279 -191 146 323 -260 -485 -162 -98 149 472 -52 -560 79 269 68 346 202 -528
3293 -528 19 408 117 131 292 -383 -259 284 150 -35 171 -248 -517 158 163 -244 -83 -116 -528 -198 253
3314 253 -12 -216 65 -77 -92 297 238 74 90 86 16 198 140 -80 39 49 42 -23 -9 12 -77 -108 -22 -120 -161 -71
3340 -71 -85 -34 -106 -16 45 -97 91 26 2 -48 73 54 98 114 -3 28 -37 110 105 199 125 -88 -1 187 66 63 0
3367 0 -190 -101 90 73 -117 -135 -171 -172 5 166 -121 -178 -166 6 22 264 91 -250 -32 86 201 490 274 -146
3391 -146 -199 82 144 323 213 -187 -270 114 88 38 178 -175 -319 -134 214 -37 -54 -198 -230 -46 307 48
3413 48 -91 -54 -208 25 414 332 -8 -50 -150 -10 426 394 -43 -146 -183 81 176 213 112 -280 -289 -109 114
3436 114 40 -104 -155 -249 -110 198 76 -65 -56 -226 -82 255 251 -88 26 14 11 308 448 -149 -241 149 82 203
3460 203 344 -13 -584 -29 126 -63 293 -8 -681 -373 263 137 89 43 -434 -424 184 335 -1 2 -65 -357
3482 -357 89 494 86 -179 85 66 61 382 187 -283 -149 32 26 128 305 -200 -479 -33 113 -87 116 15
3504 15 -453 -164 312 -24 -160 182 -273 -300 420 479 -59 -74 -48 -392 260 741 38 -290 71 -28 -54 652
3526 652 218 -472 -115 -12 -136 220 332 -418 -538 84 79 -3 215 -100 -523 48 420 -27 33 58 -241 -269
3548 -269 557 372 -241 25 160 -164 332 634 -252 -337 172 95 -64 468 201 -591 -273 223 -297 60 320
3569 320 -535 -575 266 210 -132 323 -16 -651 61 541 -24 63 349 -392 -134 584 315 -143 161 70 -432
3590 -432 195 477 -203 -252 182 -242 -98 418 -78 -456 -64 139 -230 93 281 -561 -382 373 43 -136
3610 -136 348 -53 -468 128 384 -19 94 192 -222 -114 383 214 -229 131 -27 -401 130 387 -123 -286
3630 -286 143 -260 -254 333 165 -374 26 -33 -315 121 360 -161 -164 199 -87 -65 451 208 -378 159 290 -121
3652 -121 85 406 -186 -255 265 35 -243 162 24 -495 -80 240 -294 -35 238 -357 -327 284 -9 -248 108
3673 108 -76 -321 141 453 -66 -77 228 -207 -42 617 254 -298 23 -5 -240 196 402 -77 -406 -62 -129
3694 -129 -1 267 13 -473 -192 12 29 178 164 -443 -462 178 165 44 207 -145 -404 44 443 239 9
3715 9 48 -307 -79 426 314 -307 -200 -72 -211 354 459 -125 -385 -148 -177 58 506 0 -596 -283 95
3736 95 124 443 198 -540 -413 265 313 342 292 -270 -623 128 555 269 96 -96 -509 -105 574 326 -243 -290
3758 -290 -477 -260 434 535 -283 -591 -424 -243 373 576 -67 -475 -432 -20 386 632 192 -485 -428 93 436
3779 436 619 231 -423 -473 51 613 496 118 -386 -582 -204 490 472 47 -432 -527 -132 389 441 -29 -521
3800 -521 -329 -28 387 565 16 -487 -549 188 366 573 146 -507 -518 263 513 422 154 -601 -549 109 619
3821 619 435 -54 -526 -564 -236 473 478 -150 -489 -724 -38 579 597 3 -353 -410 -66 481 608 32 -486 -518
3843 -518 -90 606 640 194 -546 -476 118 528 417 -112 -521 -564 -121 464 461 -30 -555 -494 5 459 432 -3
3865 -3 -383 -558 3 539 480 47 -284 -243 98 496 618 67 -460 -385 126 495 363 -2 -341 -536 109 414
3887 414 438 -5 -332 -442 -51 427 303 -57 -383 -448 -79 456 414 -14 -294 -271 37 377 509 -58 -257
3908 -257 -218 15 388 452 -27 -328 -205 27 315 313 113 -480 -341 37 127 150 -47 -458 -337 98 199 241
3930 241 99 -172 -201 102 273 316 66 -163 -183 127 235 213 -27 -86 -171 -7 206 268 -75 -192 -63 -127 79
3953 79 54 -8 -122 -133 -101 95 97 152 -74 -212 52 212 67 68 -14 -143 18 281 -23 109 71 -136 -36 146
3977 146 -4 -113 -15 49 -204 121 144 -218 -101 -61 -64 -57 80 -22 -85 118 -64 -161 -79 133 64 82 30 -15 -115
4002 -115 78 183 -26 54 85 -36 108 287 123 -210 -62 -117 -43 269 115 -243 -204 -68 -84 87 194 -157
4024 -157 -321 -39 82 14 213 40 -340 11 212 144 238 190 -214 -186 243 199 82 107 -268 -375 197 375
4046 375 65 -67 -199 -268 -5 446 135 -196 -258 -206 -154 369 283 -266 -357 -200 131 165 407 -77 -497 -247
4068 -247 233 227 306 16 -424 -426 286 462 196 -55 -361 -528 81 538 95 -178 -278 -475 40 545 172 -356
4090 -356 -229 -262 -66 567 415 -258 -427 -87 121 465 393 -126 -593 -136 207 398 364 5 -587 -287 337
4111 337 422 211 -59 -589 -479 166 438 111 -268 -406 -453 136 651 213 -210 -370 -302 41 637 453 -272
4132 -272 -503 -122 129 420 651 -157 -622 -195 188 281 357 -17 -509 -445 328 405 264 -213 -621 -421 -9
4153 -9 472 104 -126 -287 -323 163 588 170 -251 -419 -315 117 456 431 -207 -473 -88 55 419 419 -213 -551
4175 -551 -192 288 317 339 -51 -632 -381 188 379 283 -5 -577 -504 172 455 119 -33 -376 -392 91 603 105
4197 105 -217 -255 -259 117 542 373 -240 -391 -48 8 263 349 -267 -422 -156 141 310 255 5 -416 -68 142
4219 142 203 171 -26 -230 -261 178 431 155 -33 -99 -337 90 503 244 -181 -279 -98 94 403 267 -152 -376
4241 -376 -175 52 81 265 -195 -382 -114 6 140 83 -16 -379 -242 75 127 172 62 -171 -159 99 314 160
4263 160 72 -80 -214 87 174 106 -79 -121 -61 96 274 175 -161 -181 -69 -96 70 122 -106 -246 -96 13 99
4286 99 36 26 -161 4 165 88 27 44 -106 -106 42 24 138 -34 108 -51 66 156 5 18 -61 -22 46 28 50
4311 50 -144 -23 -26 -197 24 -2 73 25 135 -55 22 46 104 107 -87 92 2 10 -44 -58 -77 68 31 29 -15 8 11 40
4339 40 -20 -16 -87 8 21 25 -41 -140 139 137 83 -25 -130 -111 118 -30 84 -48 -26 -64 68 155 130 -54 -115 -145 126
4366 126 125 13 -29 -174 79 21 167 -38 -71 -144 -69 36 131 -52 -177 -213 -95 -67 91 101 -34 -132 9 32
4390 32 190 195 -32 -253 -52 243 237 82 -20 -205 -214 236 158 118 -60 -208 -168 80 190 38 -81 -176 -140 69
4414 69 85 111 -38 -221 -75 24 243 167 -21 -140 -81 111 362 292 -44 -293 -102 82 308 174 -126 -222 -159
4437 -159 132 258 171 -132 -221 -184 16 153 87 -61 -162 -187 160 325 147 -67 -139 -165 -46 189 296 -149
4459 -149 -168 -72 61 303 259 -209 -277 -141 76 198 99 -107 -272 -147 13 148 142 -108 -207 -190 117 260 258 -67
4483 -67 -124 -154 61 362 108 52 -186 -118 -31 221 -3 -87 -164 -126 -7 107 166 -89 -181 -137 -64 84 119 -15 -252
4508 -252 -27 83 184 202 56 -282 -164 148 163 139 31 -291 -167 102 289 205 -13 -142 -82 99 227 160
4530 160 -150 -150 -164 -63 278 186 -99 -60 -37 -75 110 135 21 -266 -76 81 147 151 -7 -209 -76 65 92 58
4554 58 7 -106 -122 111 146 58 45 -55 -137 36 175 129 50 -95 -227 108 211 185 -97 -166 -158 -58 -7 37 22
4579 22 -123 -70 58 20 90 164 -119 -180 99 120 81 70 -29 -132 9 86 68 -44 64 -78 -82 150 -5 -78 28
4604 28 -88 34 171 82 -47 -118 32 31 69 124 -20 -58 -4 171 76 81 151 -48 48 56 30 5 69 -81 -102 36 -69
4631 -69 -10 63 -7 -165 -116 -35 41 -41 40 -31 -48 44 42 -78 -18 -66 -33 63 36 -67 -147 46 -17 102 202 -63 12
4658 12 127 87 -41 -28 94 -30 -26 38 -37 -65 57 133 -55 -45 31 -19 6 27 -30 -119 28 -112 36 152 8
4683 8 -27 29 61 -20 100 99 13 -35 142 47 -21 61 -37 -40 44 150 69 -27 -3 -62 -202 33 102 -20 -10 -8 -111 112
4711 112 111 -30 -158 -35 16 -2 215 136 -174 14 -26 -39 39 76 25 -88 -74 38 75 70 -94 -165 11 -16 34 -26
4737 -26 -14 -179 -52 49 135 61 -129 -114 -74 135 131 19 1 -101 40 93 159 87 -47 20 -44 -64 42 105 43 -76
4763 -76 -77 -37 60 128 126 -127 -141 -78 9 -4 -14 7 -89 -40 4 57 60 -24 -49 98 70 161 29 -13 -94 -85 181 145 -52 -94
4793 -94 -49 27 86 94 -26 -93 -61 -105 30 77 -38 -148 -142 -82 204 66 -81 -6 -22 27 138 64 -44 -72 26 -94
4819 -94 151 225 -24 -113 -16 11 147 205 51 -118 -51 -30 105 50 -87 -105 -54 -11 46 94 19 -36 -154 -111 -36 121
4845 121 18 -78 -72 -10 82 103 -64 -50 -115 23 18 -17 -9 -90 -175 -61 17 46 58 29 -100 48 -5 63 -29 -127 -116 25
4873 25 69 -8 -15 60 -6 -62 -111 10 42 -42 -69 -147 20 -7 84 -110 -32 -59 44 23 -50 -101 -59 -130 97 87 -59 -45
4901 -45 -74 20 104 21 28 6 -34 36 102 60 -26 54 -57 75 54 12 -9 -12 12 63 -49 -88 -6 -88 -33 -125 -47 84 -33
4930 -33 -147 -116 -33 10 46 44 -22 -57 -15 115 46 30 111 -33 48 76 105 -37 -64 128 152 100 28 168 -96 -67 -102
4957 -102 2 44 -5 -22 -30 -42 -15 85 -10 -3 -16 -108 44 -69 41 -69 47 -43 136 32 15 47 34 -22 68 -63
4983 -63 -17 -92 -10 -54 104 49 -2 -1 18 -103 -63 -25 9 -17 40 -93 37 65 17 -4 -60 136 -109 6 -2 -90 46
5010 46 46 28 -51 123 13 11 86 -52 42 133 -7 97 -89 -69 -21 -60 35 -87 28 -37 -2 90 -13 100 1 -47
5036 -47 31 24 126 58 72 52 56 97 78 30 -12 90 -2 -22 53 -44 -14 -59 54 -94 -131 45 -83 -41 -60 64 -127
5063 -127 -122 19 14 18 30 8 -25 -93 34 22 59 54 21 -83 -4 9 -35 58 6 -26 -28 -101 -33 124 -15 52 -134 -123 -16
5092 -16 11 -47 -85 -65 61 20 46 -93 116 -61 18 -29 -4 -60 -5 -54 -1 78 -19 80 -113 24 34 137 -18 -20 11
5119 11 -72 52 -21 -70 2 -77 31 110 82 32 -23 -51 30 30 -16 -106 16 28 -89 38 10 143 4 -5 75 -42 57
5146 57 -67 -15 -14 11 -1 24 31 17 -18 -36 -57 -89 -12 34 10 6 33 -43 14 -43 10 1 77 -36 -57 -91 -9 -69 20 14 35 -51
5178 -51 -94 -136 -58 71 -17 -87 13 -29 -64 137 11 -13 -17 -27 -108 46 -10 -88 -19 -6 5 -53 106 18 -50 97 -41
5205 -41 -52 -32 -56 2 50 -15 -51 -24 90 54 -8 6 155 6 -110 5 -51 -126 43 -54 -89 -33 28 22 -44 -12 -19 -143
5233 -143 -22 -86 -31 16 2 -12 -25 -31 -14 126 41 -16 -25 -38 -108 -44 -29 -9 15 116 79 25 72 3 -38 55 4 -102 -67
5262 -67 -10 80 -22 30 160 -82 -34 -13 24 43 -24 -56 -92 -6 45 24 -12 33 89 -12 45 71 -25 -71 50 -73 -47
5289 -47 -21 13 -24 48 -62 -63 -10 -6 -62 -6 -11 -14 58 25 -69 -20 38 -67 45 -73 -88 20 -27 -33 -56 10 -82 -55 84 -26
5319 -26 4 -58 32 -43 -60 -6 -23 -77 47 -106 -79 -129 24 63 18 18 13 33 -1 -66 76 91 5 41 -82 76 14 -34
5347 -34 34 7 -13 -134 8 -67 31 -87 -2 38 8 -5 86 -65 1 -37 36 82 112 26 88 126 58 -119 72 -11 13
5374 13 4 -6 12 -97 114 4 -3 38 -24 38 31 34 -9 -36 70 23 -63 -1 -20 7 -43 54 9 -14 19 -113 -4 -81 80
5403 80 42 46 20 -26 11 -2 -24 33 54 -62 -99 61 -35 -41 17 21 -85 -7 105 -4 11 111 -26 -26 77 68 50 -112
5431 -112 92 11 64 29 62 -61 -27 -50 -37 110 8 18 26 60 99 -2 53 0 -14 -28 -47 74 6 -25 -124 -40 -32 -3
5459 -3 68 84 24 -19 -65 -66 85 -102 -144 3 85 8 112 112 86 38 62 25 27 21 -48 12 54 -106 68 -56 -32 11 22
5488 22 -38 18 -113 -145 23 78 21 0 15 10 -7 -13 5 -64 -29 -11 -37 15 94 -145 -143 19 -13 21 -27 -33 -105 -27 -10 -70
5518 -70 -14 -85 -103 31 -8 52 -44 113 -83 -144 115 6 130 19 -23 46 53 79 89 22 -21 -129 -90 -70 -28 45 -7
5545 -7 -43 -26 -22 93 -5 -103 -95 -24 38 102 11 34 -121 -25 38 -20 140 24 -33 -45 -26 115 -75 65 32 -7 76 60
5573 60 23 -48 -104 5 -25 40 19 -113 52 -110 160 63 -1 0 -74 -4 120 66 10 -50 42 -55 31 179 -30 -16 -83
5600 -83 -33 132 70 7 101 24 0 19 37 -109 50 34 -12 35 56 -91 54 -32 -53 -38 -98 67 65 -76 69 64 -14
5627 -14 13 -35 -71 -117 113 -91 -20 76 67 -3 61 21 99 76 -14 -33 117 115 31 -50 26 -36 -62 14 38 -36 -64 -27 76
5656 76 57 -54 54 -47 32 -101 147 -64 -12 -65 -77 -14 -115 34 -143 -32 93 26 77 2 2 -42 -1 -158 28
5681 28 49 -55 -20 -6 -56 52 33 -30 61 -17 -87 2 17 16 36 10 74 77 59 -64 25 -73 125 9 -56 26 -130 1
5709 1 82 -17 -53 -55 37 -54 74 -9 -37 -55 -72 62 3 37 34 36 11 -35 -23 -15 13 38 43 -4 36 82 -15 33 -91 18 94
5740 94 -77 88 57 -10 -157 -82 82 16 -28 93 -25 -34 -33 -11 53 -12 -3 9 64 -94 102 74 79 113 75 42 -51 -30
5768 -30 55 -51 -144 11 41 41 -29 7 39 -12 -12 131 15 -92 -59 -9 38 41 -104 -61 -59 55 51 -55 12 -27 -79 41
5796 41 -45 21 45 -73 -38 78 148 70 -37 -110 -99 100 10 -60 3 -10 24 -76 97 102 -9 -1 -30 -19 -22 15 -19 -81
5824 -81 -63 37 90 149 -74 -67 44 49 88 117 -77 -97 -94 48 -91 67 7 -80 -108 -49 25 29 33 -100 -113 103 95 -30
5852 -30 -59 -15 -59 134 19 48 -61 -23 -27 64 111 43 -22 26 68 46 127 -7 49 -76 -25 107 80 -102 55 -82
5878 -82 70 -11 82 -37 -116 -93 -36 77 121 78 -77 -38 -4 105 84 15 -21 0 34 96 46 4 51 35 -42 61 55 -53
5906 -53 -19 52 -137 70 103 31 -1 35 31 -39 -35 -16 -191 -38 -5 81 99 27 28 -83 40 27 132 -27 -127 -34 -61
5933 -61 164 -29 66 4 -43 -95 -56 4 74 -52 -112 -67 -39 145 78 -9 -18 -13 141 54 10 -1 -100 -18 -68 64 13 33
5961 33 -23 -41 72 -14 -101 -30 -7 16 -28 58 82 -83 -43 63 48 -90 69 -79 -21 5 -12 -49 -36 -20 -80 -22 29
5988 29 -106 0 67 -113 0 17 30 112 43 62 85 36 -10 22 -156 -67 3 -42 -103 -74 19 -52 54 -11 -98 21 -5
6015 -5 -62 -43 4 19 129 -44 -49 146 55 32 -78 60 23 35 -6 44 52 10 5 -70 -30 153 11 -15 55 14 18 71 74 38
6045 38 26 -61 21 -57 -10 6 2 65 -1 86 62 50 28 -27 10 79 -20 35 3 38 47 -35 62 -44 -12 -56 66 21 -9 -56
6075 -56 -69 6 38 -47 -53 52 136 8 55 66 -12 60 29 84 -47 71 70 15 78 -56 -43 -5 -5 70 66 58 3 -47 -86 -64
6105 -64 14 75 -43 -97 -125 -86 14 19 -23 -35 -16 104 68 90 61 72 38 36 59 96 47 -14 10 18 66 -83 -105 1 -116
6134 -116 61 -117 -68 -42 -115 68 13 39 -35 -167 40 -53 39 20 -115 -74 -35 -28 38 -10 6 -5 110 -7 38 50
6160 50 19 -85 -89 -34 35 16 51 -7 -53 37 39 59 -119 81 -105 2 44 -49 -5 -48 57 89 175 95 89 -14 22 -57
6188 -57 147 104 -9 -177 87 27 -20 -38 -42 -30 -66 8 65 188 21 -99 -80 79 -44 -25 13 -73 15 -22 22 65
6214 65 30 -12 60 73 92 26 65 -64 12 21 27 26 -58 -132 -3 -79 120 -121 -78 -134 -80 22 11 86 7 -106 -99 -40 -16
6243 -16 -27 -1 20 43 24 -61 13 129 -52 40 82 41 83 -42 -128 36 -41 -92 -99 -66 -55 26 -29 -50 43 -51 36 -56 67
6272 67 135 -40 -104 -89 -121 -68 43 -16 -33 40 -125 71 83 78 8 -23 13 -3 111 40 -4 -24 -105 -23 -53 103 -18
6299 -18 -45 20 -4 -8 -36 -89 -85 5 25 -39 73 -25 -24 118 60 -65 121 9 -114 -31 -6 96 -16 -16 -41 -49 27 -9 -36
6328 -36 -55 3 -30 52 29 -49 -69 -19 64 14 30 31 45 -22 17 1 94 41 64 -35 -36 -78 -56 -62 17 59 -57 -45 -8 -47 -33
6359 -33 25 24 -28 -20 -60 -52 -1 -21 -7 -8 -80 4 -21 -10 46 -37 -86 -6 65 -95 48 -44 74 -22 130 -76 55 -43 38
6388 38 -9 -16 94 18 36 136 2 35 36 -20 79 -104 47 19 33 6 50 -85 -26 106 69 -57 38 13 -40 22 105
6415 105 -66 64 66 46 32 105 -73 -16 -48 37 -63 10 -21 -22 30 30 96 67 5 -60 43 154 20 8 28 49 22 51
6443 51 -21 -56 105 22 0 66 -27 53 -80 60 -108 21 85 -43 -30 5 -32 57 59 23 -70 42 -27 73 37 3 -21
6470 -21 0 15 89 124 -40 -58 34 45 -72 -4 112 25 -24 41 30 79 -17 -13 -174 32 -28 -65 -112 -49 -24 11 12 -11 19
6499 19 39 9 17 59 87 -14 -114 -22 19 -24 -38 -41 -13 -86 -44 84 -39 -49 37 -6 70 -28 19 -26 54 -52 79 -81
6527 -81 -2 117 -15 39 -9 -1 -45 44 -116 21 -24 57 1 -26 14 18 63 -54 57 -55 19 9 27 -38 85 28 43
6554 43 -29 -37 -24 -36 0 11 -68 -94 96 28 100 93 68 -4 -42 26 68 82 -51 53 19 -82 53 11 -48 -75 -60 35 20
6583 20 -57 -18 70 -16 -26 16 -20 -16 -36 -52 28 -56 4 -17 -6 -79 96 22 64 -27 -10 -2 -69 21 -11 62 -18 19 -24 73 15
6614 15 23 2 -27 -78 -13 28 -90 -64 -19 -13 18 -45 -36 5 38 -19 3 -10 66 -29 66 79 79 50 4 -29 14 12 54 -129 -17
6645 -17 29 71 -38 -96 156 47 35 10 0 -64 -94 -93 2 -111 24 -15 -43 45 -19 44 -34 -38 97 -115 40 -39 -22
6672 -22 132 64 52 -43 -71 -23 76 1 4 1 -43 -54 -9 8 -53 -7 -43 74 -31 -49 119 85 23 -8 6 17 -52 -62 116
6701 116 -115 -1 -41 -24 53 -2 28 -74 -21 -60 153 -24 -23 -25 2 0 58 3 -19 -22 8 32 -96 26 -18 -1 27 -2
6729 -2 -78 68 1 11 5 85 116 -34 -58 58 -56 -57 -18 50 -23 18 65 -16 -35 -27 -91 -7 125 -58 64 -31 91 46
6757 46 -4 30 -1 -14 -6 -52 -20 15 3 28 -53 3 32 17 -7 -30 8 -28 -29 15 57 66 109 -19 -97 -85 -8 63 49 -59 -92
6788 -92 -142 -21 60 -20 -64 19 -82 -6 18 -31 37 -15 84 -1 -40 62 -40 18 -18 121 179 -70 -29 2 -1 1 -87 20
6816 20 -97 -8 26 27 -10 -145 -30 -94 -128 42 -76 83 3 -110 41 -110 -112 -10 10 106 -50 -10 107 81 -114
6841 -114 -47 36 33 -22 3 -39 -47 -17 -45 86 11 46 79 50 -48 -104 16 -84 31 19 -12 -21 -24 -21 -91 98 52 30 -72
6870 -72 89 136 42 -49 -35 90 -18 35 58 -7 -59 -51 37 23 -22 21 38 -46 27 46 -51 -27 14 56 137 75 -4 -5 45 71
6900 71 -78 68 -8 46 5 15 67 -59 -81 -58 -21 31 39 52 8 -80 -48 11 83 -112 -2 -4 96 5 42 -26 -62 27
6928 27 104 1 -28 29 155 83 49 -35 38 2 60 57 111 29 45 -99 -46 46 -61 -12 16 -72 -60 -3 -26 -12 25 14 75
6957 75 86 50 -19 3 -20 25 103 -8 53 -9 52 -63 115 9 83 46 0 -12 -123 -41 1 12 -70 -137 -26 -22 53 -31
6985 -31 -52 -95 -3 36 58 1 0 186 62 48 73 79 -62 -20 -5 112 64 14 -25 -111 -33 35 0 -2 4 -31 -6 -106 -15 -4
7015 -4 12 8 25 -72 74 -7 -5 -49 77 -98 -19 23 -25 74 10 -35 7 72 7 29 47 48 3 -12 31 38 -38 -50 3 -81 10
7046 10 59 58 -44 61 62 -94 -1 -20 62 -52 37 20 -44 10 -55 -76 50 -41 -60 111 84 51 -113 31 -34 90 119
7073 119 0 9 17 -106 49 5 48 28 -104 43 67 52 -22 57 41 -32 54 -16 -71 50 -53 64 127 -60 -53 -6 23
7100 23 63 28 23 -12 -147 -84 9 24 -41 -22 -74 -90 -1 44 9 -42 25 61 58 61 70 50 4 56 -20 -61 37 93 65 -43 -56
7131 -56 6 52 61 10 74 1 -113 18 -31 47 -4 39 -44 -7 12 -69 -142 47 -2 66 48 112 58 -11 65 50 66 -47 64
7160 64 30 -11 -67 20 60 36 68 5 -70 65 15 -20 -13 -20 76 18 44 59 27 -59 -76 -27 43 -35 -2 63 -86 -47 47 8
7190 8 80 37 35 11 40 181 -72 54 46 -59 77 46 -17 -48 9 -44 61 74 113 41 44 38 66 65 2 12 -46 11 45 -106
7220 -106 76 -32 -69 92 -19 47 -1 18 -81 -15 19 -34 -81 31 -15 22 -46 -60 -46 -12 -24 49 16 36 111 -1 -22
7247 -22 -25 16 -79 12 -70 -102 -60 -36 36 63 28 -15 -23 -71 78 24 -146 21 40 38 22 16 113 -18 -52 -14 -9 3 32 15 -19
7278 -19 104 105 19 -18 -101 87 6 46 -54 -35 38 -44 125 110 -2 109 105 -129 -11 85 -18 7 6 15 31 -118 -2
7305 -2 -101 -36 47 32 -64 22 -14 -88 -52 -89 -13 30 -20 26 38 -46 2 80 -19 -11 -64 10 88 27 21 -22 -5 44 -46 67 25
7336 25 -12 76 -22 61 -30 -14 -70 -77 93 13 -73 34 -11 53 63 51 91 -31 -69 -79 68 -75 -4 -90 -24 103 44 72
7364 72 -73 -102 -26 -104 17 -91 -17 -64 -89 15 30 -13 -66 52 48 8 50 12 1 -33 41 18 -84 107 -17 -40 -70
7391 -70 -6 -63 6 21 -10 -17 60 31 7 -47 -24 -132 -54 106 22 -42 99 -58 -108 88 -44 -24 -32 -57 -41 96 120 39
7419 39 -8 85 14 21 -10 -2 -28 20 -11 -55 -13 61 -130 63 -4 -45 -82 111 -53 -66 -15 -70 108 2 95 117 -52 -62
7447 -62 -41 -106 27 -18 2 -42 77 -31 15 -42 3 98 75 78 -83 -37 -79 8 -28 -103 -10 28 -7 43 -69 176 93 39
7475 39 58 61 31 -28 24 72 51 15 18 14 22 20 94 91 -4 -28 -58 -155 9 40 -24 24 -21 -41 -107 -62 41 -17 -18 -46 23 18 -41
7508 -41 62 112 30 14 52 42 116 -35 40 -8 128 -31 -65 70 52 -87 -69 -17 -123 -49 50 20 0 -24 -56 -63 -18
7535 -18 29 -63 30 -74 -12 29 90 -34 1 36 76 -27 124 -30 49 -119 -3 63 -6 -19 -51 61 -9 -56 60 -54
7561 -54 28 -26 -22 45 -21 -39 -51 30 79 54 -60 17 -8 -67 -33 78 117 21 55 47 -7 127 45 190 -6 -120 93 19
7589 19 -67 -15 7 47 -32 -45 72 59 141 67 30 73 -7 90 24 15 18 45 -19 -57 1 46 20 59 -54 -31 -38 38 87 -31
7619 -31 -17 -12 -61 -63 -62 -9 -43 0 39 -103 59 67 9 27 -6 -19 -135 -55 25 -107 27 -28 -13 73 135 85 -12 39 87 16
7649 16 -94 54 -90 -37 -14 -161 34 56 -41 -64 30 -138 102 -85 -52 -73 -74 -9 73 122 11 35 -12 16 34 15
7675 15 3 47 41 -29 38 85 60 36 -32 15 -13 -102 44 55 -68 56 8 -33 -55 -70 30 85 -41 56 -45 -24 44 70
7703 70 9 15 -71 -58 -58 -51 -14 -16 -3 -33 14 81 11 -147 -22 23 -63 -66 71 21 11 -24 89 31 -26 3 -49 52 19 84
7733 84 86 -38 -16 49 -74 72 49 -129 -4 26 -8 -63 -76 -4 36 41 -15 7 -34 -12 -12 -99 -24 -65 -67 -78 -79 -44 84 43
7763 43 68 81 33 -51 82 18 1 37 -13 63 23 39 32 -6 -113 -57 18 -6 31 -43 -15 -46 -120 64 -37 -80 -106 18
7791 18 49 55 8 -11 -103 -67 1 -39 -133 45 68 105 42 69 -3 5 10 72 -38 -64 45 3 -81 -51 107 71 87 18 -1 -29
7821 -29 51 -11 82 -16 43 82 121 31 -20 -29 -67 -3 -55 83 -35 7 -4 -117 3 11 3 168 -61 99 44 -66 -59 -95
7849 -95 21 -5 -59 62 -12 -46 1 -58 57 113 -24 -2 42 42 131 39 -115 -16 -38 -35 70 -5 -37 -17 -86 0 73 50
7877 50 -41 -60 42 5 -5 -108 28 -47 -46 79 26 25 -92 -75 -13 9 -14 121 -44 -57 20 82 47 -20 64 -14 79 63
7905 63 28 -5 -108 -127 -2 -25 -64 99 -27 -14 -151 21 -16 36 3 -97 -93 -23 16 -80 24 -36 -140 16 -21 -53
7931 -53 -26 -29 -28 69 -3 76 9 22 42 77 33 -36 -56 48 -19 20 -63 27 -28 -81 -67 -73 -117 30 -3 15 -113 -88 0 -91
7961 -91 -50 53 58 -2 -37 -11 -35 33 78 10 14 37 19 -70 12 -53 121 -39 31 -38 -53 30 4 -15 55 47 -32 74 -25 31
7991 31 3 -76 26 116 62 -99 -28 -18 -14 93 -39 -36 -128 80 -45 -55 7 26 -56 -44 69 7 28 20 -42 -39 58 -24 5
8020 5 -65 49 -27 9 142 -31 -12 -82 52 -20 36 20 8 52 126 -1 -84 -16 101 -6 27 -15 93 -43 -22 -44
8046 -44 -86 95 -6 -37 -63 -11 61 67 48 3 72 -64 -72 -13 62 -34 -59 31 54 48 37 -23 -8 -46 164 -29 -20 -76 -122 42
8076 42 -25 66 -65 -60 57 -59 55 -25 -51 -64 -45 -64 -6 51 168 -171 41 -39 2 -18 -30 32 -166 -81 -43 -2 -49
8103 -49 -65 21 -58 68 -109 -11 -44 -2 -73 1 -47 22 -90 -6 34 88 45 61 -30 64 63 -5 -64 -172 22 73 55 51 -23
8132 -23 -26 49 17 56 54 -103 29 -35 34 -67 -10 47 -102 -16 -2 -6 -55 46 -67 -85 -31 -10 5 -24 7 -98 32 -16
8160 -16 -1 -90 -14 5 -50 19 -3 -80 -177 5 27 35 9 -34 -30 17 -15 -91 8 -5 30 -99 -60 -53 108 31 4 -100 -46 115
8190 115 22
8191B2
$$ Imaginary data points
##PAGE= N=2
##DATA TABLE= (X++(I..I)), XYDATA
0 0 0 0 0 0 0 0 0 0 0 8 -8 8 -16 16 -24 24 -32 40 -48 56 -72 83 -97 120 -136 160 -184 216 -248 284 -326
31 -326 371 -419 475 -538 603 -679 760 -850 948 -1054 1170 -1298 1438 -1589 1756 -1936
47 -1936 2135 -2353 2592 -2853 3144 -3467 3826 -4228 4683 -5200 5797 -6490 7309 -8297
61 -8297 9507 -11042 13053 -15805 19830 -26276 38249 -67884 292613 285618 -345707 29506
73 29506 -92622 -304007 235492 377992 -208403 -137419 12187 -174464 99941 350903
83 350903 -77293 -175897 8102 -133067 -40550 244299 -4666 -170876 54330 47137 -28010
94 -28010 113020 8231 -165079 -49486 63342 77444 80347 -63083 -120471 13942 55614
105 55614 90004 132986 -96382 -234588 -24918 72180 78691 177946 -11881 -249888 -58465
116 -58465 89993 32708 139844 52336 -256334 -128058 124192 41768 86340 142624 -156464
127 -156464 -199007 101971 81920 -15038 88384 -41626 -174990 51120 131404 -9207 30196
138 30196 2748 -142304 -5768 135409 -13169 -58464 18876 -53655 -30782 126260 56658
149 56658 -98658 -57604 -7809 -17339 63262 86866 -49619 -106364 -11388 50264 57484 60278
161 60278 -13689 -108740 -62740 48066 70088 52527 17184 -74747 -84811 35423 80133 22824
173 22824 388 -36487 -83440 -7684 79080 35452 -13041 -17054 -47741 -27747 48547 37918
185 37918 -24670 -26817 -10908 -4747 23820 31239 -7455 -32061 -11516 18567 23287 10857 -4566
198 -4566 -28386 -21521 32720 41983 -7048 -14616 -10997 -34006 8008 57267 2117 -33969 -3729
211 -3729 -23623 -18034 53371 23345 -45698 -7409 3095 -31623 24543 44936 -30064 -19483
223 -19483 19438 -22028 -1207 47706 -10957 -30109 27241 333 -24626 29153 13229 -28035
235 -28035 12044 13315 -25494 6881 18617 -20392 281 18104 -20819 -13239 16210 -3427
247 -3427 -4232 10134 -14145 -15407 12141 5332 -1018 8018 -9377 -14743 10264 13178 5753 4899
261 4899 -13883 -15163 15079 17937 2567 1485 -11864 -17492 12095 21702 1423 -6516 -17889
274 -17889 -23146 12204 32176 3001 -16638 -18462 -20203 6399 33399 10910 -18946 -22595 -18383
287 -18383 8139 41369 23305 -19946 -28982 -15760 6733 35017 27247 -13852 -30386 -14577
299 -14577 9453 33495 27626 -15329 -40375 -20435 11831 30842 22216 -14104 -37511 -19041
311 -19041 15303 31561 18586 -18380 -43769 -23703 20842 42377 22989 -17723 -39954 -19563
323 -19563 22344 41677 21137 -19590 -43249 -23712 23972 50752 27540 -20482 -44758 -24424
335 -24424 18689 42182 21260 -23951 -45971 -23814 20516 46978 26981 -23917 -51287 -26863
347 -26863 19399 42862 23472 -22185 -46395 -20255 27450 49306 26970 -21786 -51152 -27694
359 -27694 23906 49923 27352 -20509 -45319 -20169 26833 47176 22304 -26637 -52744 -27205
371 -27205 22516 47031 26713 -22792 -50916 -21479 27474 40830 16382 -25525 -52879 -24966
383 -24966 32504 50284 22823 -17482 -47583 -28364 31057 49957 13117 -23654 -40594 -25654
395 -25654 29411 58189 19151 -26947 -40860 -28520 16650 51546 18377 -34272 -40012 -15248
407 -15248 19605 47830 23554 -34650 -49842 -16577 19881 40973 26677 -23497 -49320 -14191
419 -14191 33117 42016 17629 -19739 -46127 -25688 28154 47674 16760 -16601 -33563 -25980
431 -25980 19610 48861 10609 -31663 -29247 -17355 8092 44466 21328 -34559 -31844 -3370
443 -3370 7956 31451 23465 -37303 -44826 8531 25224 24541 26359 -22031 -54623 -1389 38596
456 38596 23242 15470 -11135 -53127 -18382 45032 36011 5873 -8343 -39713 -35113 24829 41666
469 41666 6012 -11859 -23570 -30087 7800 39598 11956 -18953 -17547 -13664 -1222 23293 17873
482 17873 -12723 -17699 1163 9818 11517 9609 -10390 -23682 2581 27507 11647 -6146 -7853
495 -7853 -19656 -10412 30961 28189 -15840 -22567 -14335 -16786 19715 45184 -4967 -35804 -10603
508 -10603 -11879 -2120 44994 20059 -39055 -16606 3808 -13859 25863 43163 -25042 -30401 16804
521 16804 -7774 -7916 41675 4044 -37148 11920 10934 -25639 17299 21962 -32106 -414 28856
534 28856 -25278 -15952 26431 -13281 -15478 34590 -769 -34942 7729 5239 -16574 24766 23452
547 23452 -27232 -15801 7497 -4795 12410 27472 -4181 -20107 -8581 -2587 10595 19104
559 19104 6404 -6780 -17542 -13720 10474 11276 -165 11133 -5355 -31382 2157 17077 -12897
572 -12897 10113 23233 -29811 -18295 25297 -12775 -10088 43568 -2933 -39172 19023 5347
584 5347 -30287 33312 31108 -38324 -1638 21307 -34504 3845 49637 -19076 -24795 26072 -18017
597 -18017 -27118 38208 9354 -30420 15237 3509 -34929 12432 23298 -20773 3899 19436
609 19436 -24002 -11032 19878 -6142 -1955 25005 -3682 -20490 4292 958 -3505 19574 12950
622 12950 -13011 -12732 -5789 -56 14413 14516 -949 -14000 -18022 -4681 12289 11640 6475 -4136
636 -4136 -23178 -12116 15096 9330 1439 8044 -11855 -21181 11525 15204 -5709 7622 6102
649 6102 -19819 1005 21102 -9251 -8661 17447 -3509 -11405 17754 -200 -25303 7621 16220
662 16220 -10652 4323 9355 -27676 -14040 25463 6750 -6218 10526 -14782 -29771 15214
674 15214 24778 -4897 4686 1172 -30928 -3677 34086 6790 -6756 7189 -17370 -20085 23952
687 23952 19313 -9972 1975 -2942 -21946 7621 22707 -8142 -8879 3860 -11653 -3802 16488
700 16488 -1832 -12090 3272 -584 -2857 9476 -984 -12662 931 6788 4283 7371 -2762
713 -2762 -11537 -276 6080 7749 10611 -5010 -15682 -872 5354 5374 13931 -1878 -21576 -3968
727 -3968 7090 -374 10800 5747 -21838 -9877 11176 -879 4672 12768 -16762 -16499 15137
740 15137 5123 -5026 13069 -3388 -19420 10890 14540 -7805 4121 3635 -16626 4263 19411
753 19411 -6276 -6413 5167 -10833 -2876 18542 -855 -13531 612 -5428 -5662 15466 5735
766 5735 -13939 -4070 -732 -4471 10591 9348 -9715 -5909 1455 -2235 7757 10860 -5721 -6503
780 -6503 2270 -353 4503 8382 -4681 -6831 2906 492 949 6174 -4226 -9471 1615 3034 -36
795 -36 3230 -4513 -10255 1713 6019 211 2468 -1654 -10397 -895 9270 3773 1306 -478 -7965
810 -7965 -2309 9275 5941 418 -302 -5865 -4087 6463 6411 -220 -2273 -5015 -4677 3812 5443 -1265
826 -1265 -3912 -4053 -3402 1692 4217 -161 -3638 -3243 -1597 2245 4453 1198 -2772 -2483 1018 3235
842 3235 2719 1477 -434 -2052 311 3707 1943 -164 -516 -2415 -724 3578 585 -3123 -804 -1594
858 -1594 -2428 2695 1591 -4174 -2201 -380 -2097 2758 3550 -3990 -2895 1751 -626 2090 5429 -1535
874 -1535 -3540 2296 832 1097 5492 -96 -4650 747 1638 241 3078 -558 -4276 -169 60 -1370
890 -1370 2420 -876 -5159 42 483 -2453 2420 474 -5066 1472 2597 -3842 2400 4200 -4799
905 -4799 653 5719 -3654 -97 6976 -3324 -2015 7890 -2884 -5695 7448 -274 -6761 6660
919 6660 1597 -9814 2780 4165 -8132 1674 6433 -8139 -3751 6155 -3787 -3059 6727 -1263
933 -1263 -5190 3445 682 -2663 4360 3178 -2486 340 1746 -907 342 2795 2206 -528 -1774
948 -1774 142 -961 -1823 3975 2227 -5510 -1283 703 -6468 1673 9049 -5076 -6688 4366 -4525
963 -4525 -5136 11773 2831 -10429 3225 2308 -8760 7437 11263 -8433 -2396 7390 -6303 -1343
977 -1343 12305 -2113 -7190 6348 -1114 -7719 5935 3410 -7159 1654 3787 -6572 -3390 3042
991 3042 -1639 -813 4676 -321 -6989 -2975 3079 1731 2516 6692 -2056 -11635 258 8847 549
1006 549 4788 7814 -11756 -11068 10372 4717 -1487 11448 -3454 -20320 2883 10133 -5735 6903
1020 6903 8300 -18740 -7866 13055 -4489 -3017 14689 -6682 -15328 10316 3488 -11062 9302
1033 9302 8560 -10996 2227 8446 -10505 -3243 12169 795 -1588 6913 -5214 -12068 3607
1046 3607 9689 2240 1447 -1434 -11809 -8993 7840 11320 -145 -2165 -3628 -14207 -4231 17313
1060 17313 7131 -7774 1572 -4325 -14614 9580 17703 -6592 -2905 6461 -12076 -4022 18416
1073 18416 -436 -9603 10383 -1212 -12944 10068 5531 -14339 4884 11195 -11445 -2667 7950
1086 7950 -11459 -5275 15955 1505 -9274 1429 -5340 -8955 10910 12639 -3933 -4672 -3532
1099 -3532 -7465 3331 15486 6051 -7566 -7013 -2841 -1241 7569 13630 -793 -13319 -4026 1481
1113 1481 -1443 9008 8458 -12003 -9714 5034 -2216 -663 11819 -3854 -13037 5817 2412 -8576
1127 -8576 8337 6025 -12835 3658 12421 -10831 -4095 12309 -5547 -3971 16691 -1537 -16021
1140 -16021 5155 4318 -6070 11325 8173 -16266 -7889 5483 -2060 5173 11773 -8520 -14563
1153 -14563 827 1686 1855 11035 1472 -13417 -5752 3881 2834 5385 6087 -3613 -8674 -695 5607
1168 5607 3528 1951 2168 -2946 -5175 2705 4243 -2744 -112 3007 -4084 -1790 4861 -3783 -6022
1183 -6022 5321 1673 -4834 4003 -19 -11127 1191 9595 -2231 -329 4892 -8318 -6174 10420
1197 10420 4611 -2699 4608 -2974 -10109 5860 9171 -3122 1295 2344 -9589 -2002 9641 -481
1211 -481 -3544 3408 -4417 -6772 5663 3165 -5231 932 1307 -5382 680 4560 -2470 -1495 2844
1226 2844 -991 -766 3065 -81 -1537 2139 1602 4 1200 -10 -1110 394 1104 922 367 -1585
1242 -1585 -1428 -43 -572 839 1174 -2867 -2619 1014 -952 -997 2644 -832 -3756 1287 1298 -1629 2441
1259 2441 1965 -3290 743 3447 -2054 264 4235 -1599 -1441 4050 -694 -3053 3153 821 -2907
1274 -2907 1975 536 -4629 431 2494 -2565 -514 1387 -3709 -1570 3107 -777 -1599 1445 -1552
1289 -1552 -1821 3034 1622 -1356 730 177 -872 2602 2469 -1054 -191 267 -891 1550 2588 -968
1305 -968 -1562 -610 -1071 776 1858 -1096 -2245 -1023 -1311 227 2143 -475 -2550 -1036 -78 695 2285
1322 2285 264 -2219 -598 1071 1823 2641 773 -2597 -1407 1548 2339 2603 642 -3283 -2965 1019
1338 1019 2735 2093 135 -3438 -4346 -490 2527 2083 122 -2733 -4229 -1093 2781 2703 233 -1705
1354 -1705 -2724 -947 2673 3373 553 -1203 -1541 -445 2886 3621 -284 -2510 -1154 -164 2108 3855
1370 3855 -137 -4450 -2594 -124 1475 3600 513 -5101 -4143 147 1607 3416 2118 -4063 -5005
1385 -5005 205 2463 3049 2834 -1951 -4501 272 3553 2640 1977 -982 -3943 -313 3708 2482 393
1401 393 -1693 -3437 -861 3390 3050 -866 -4046 -4027 -438 2777 3176 749 -4255 -5543 -167 3791
1417 3791 3367 2056 -2465 -6292 -832 5036 3529 2206 90 -5649 -2667 5385 3800 424 744
1432 744 -3897 -4635 4207 4728 -1945 -1115 -1598 -5087 1466 6157 -1622 -4356 -692 -2363 -261 6104
1448 6104 1520 -5821 -2579 911 729 4160 4005 -3335 -4999 756 3236 2655 3292 -630 -5666 -1949
1464 -1949 4529 2661 145 669 -3774 -5036 3415 4525 -2509 -1430 -414 -5135 511 6948 -1769
1479 -1769 -5185 1693 -1507 -2236 7207 2514 -7636 -526 3389 -1716 4594 6009 -6413 -5287 4592
1494 4592 1380 1108 5844 -3037 -8587 1139 4425 685 2695 -485 -7803 -3366 4168 3218 598
1509 598 -647 -3978 -4535 801 5307 2357 -2388 -1413 -1368 -2164 3613 5583 -2854 -2616 3434 -1891 -1737
1526 -1737 6981 -272 -6790 4560 3209 -6542 2763 3905 -8623 291 8880 -5220 -4091 5636
1540 5636 -6061 -5598 10533 1520 -8066 3377 -829 -8599 7435 9020 -6624 -1278 3242 -7327
1554 -7327 731 11510 -432 -5017 2219 -3118 -3731 7158 4333 -3772 -977 -892 -3585 859 3582
1569 3582 276 -1931 -1576 -979 -1405 -908 2479 1403 -2740 682 1388 -4739 96 6268 -1583 -1364
1585 -1364 5450 -3427 -5937 6957 2916 -4537 5491 1797 -9757 1958 6974 -5264 1167 6866
1599 6866 -8027 -5210 7491 -2549 -4158 8062 -1644 -9188 4316 2040 -6739 4794 5752 -6761
1613 -6761 -765 4408 -4649 -456 7870 -225 -3210 2444 -2030 -3329 4994 4453 -1591 -1015 -1276 -3516
1629 -3516 167 5010 2444 -2663 -3497 -1911 -1671 1309 5200 218 -5870 -1689 710 -1690 3530
1644 3530 4797 -4833 -3732 3887 -570 -859 6060 -822 -5788 4057 3239 -4149 2464 2943 -5970 961
1660 961 6827 -3500 -3713 3142 -3125 -2605 7214 925 -7327 -649 405 -3044 4888 5609 -5477
1675 -5477 -5137 1011 -92 2653 6641 -1022 -7150 -1245 2726 2141 4728 2308 -5815 -4781 3028
1690 3028 3979 1836 1511 -2769 -6297 313 5678 1384 -1647 -1814 -4538 -1829 5281 3240 -3411 -2861
1706 -2861 -1727 -1474 4306 5316 -2936 -5207 -137 1236 3168 5584 -659 -6627 -1904 3288 3649
1721 3649 3635 248 -6205 -4457 3173 5052 2202 -621 -5141 -6095 1204 6453 2637 -2255 -4288 -4831
1737 -4831 -656 6721 5014 -2780 -4773 -3080 -537 5326 6750 -1594 -5896 -2065 871 3934 6530
1752 6530 -100 -7074 -2905 2356 2968 4460 597 -7140 -4852 2952 3847 2580 51 -6357 -5721 2791
1768 2791 5335 2239 -749 -5171 -5552 2427 6720 3158 -1205 -4853 -4683 2196 6910 3988 -1155
1783 -1155 -4921 -4747 1902 6703 3989 -1238 -5363 -5298 1181 6185 3593 -1520 -5143 -5698 497 6267
1799 6267 3298 -1845 -4455 -5147 23 6635 4246 -1981 -4002 -3860 100 6408 5062 -2017 -4009
1814 -4009 -2865 152 5747 5129 -2282 -4868 -2574 314 4759 4703 -2296 -5693 -2722 597 3666 4133
1830 4133 -1778 -6050 -2952 1139 3716 3772 -1193 -5485 -2833 1607 4131 3929 -592 -4990 -2701 2044
1846 2044 4168 3826 -293 -4583 -2965 1676 3935 3356 -673 -4792 -3339 1342 3283 2719 -876 -4785
1862 -4785 -3596 1183 3068 2177 -617 -4150 -3197 1667 3442 2066 -156 -3153 -2895 1919 4017 1766
1878 1766 -315 -2262 -2397 1420 3698 1659 -986 -2275 -2242 583 3037 1452 -1585 -2586 -1980 38
1894 38 2300 1262 -1269 -2536 -1769 606 2005 1414 -534 -2050 -1512 1137 2194 1248 324 -1221 -1579
1911 -1579 1053 2462 623 -69 -175 -1567 -1 2503 215 -1402 14 -685 -1163 1502 681 -2250
1927 -2250 -579 459 -1244 346 1345 -1751 -1099 1529 115 -557 1351 -185 -1331 1398 1292 -756
1943 -756 585 932 -818 332 1517 -443 -843 857 289 -685 19 -71 -1302 -289 1225 -92 -1528
1960 -1528 -581 -430 -623 1121 1596 -1404 -2005 194 349 757 2689 -40 -3024 -206 1715 673 2294
1977 2294 1541 -3302 -2359 2209 1334 639 2114 -2162 -4325 1222 2698 -402 711 -406 -4541 -946
1993 -946 4048 497 -1744 290 -2098 -2088 3657 2663 -2604 -1359 335 -946 2478 4210 -1947 -3819
2009 -3819 670 1367 1462 3527 -576 -5535 -1471 3173 1990 1888 237 -5259 -4450 2805 4089 834
2025 834 -298 -3263 -5496 598 5861 2112 -1707 -1938 -3581 -1359 5399 4538 -1990 -2641 -1241 -1303
2041 -1303 2983 5532 -795 -4656 -599 810 905 3991 545 -5771 -2367 3022 1250 1064 1073 -4970
2057 -4970 -4565 3821 4135 -644 -391 -2881 -5444 2379 7345 574 -2858 -1683 -3770 -33 7761 3944
2073 3944 -4212 -3197 -1518 -928 5389 6048 -3064 -5969 -1228 320 2517 5324 -692 -6827 -2610
2088 -2610 1914 1613 2960 984 -5422 -4312 2771 3390 744 472 -2429 -4341 1970 5728 684 -2182
2104 -2182 -1182 -2393 498 6230 2539 -4361 -2971 -370 211 4637 4351 -4618 -6251 153 1592
2119 1592 2665 4681 -2185 -8358 -1892 3882 2356 3214 668 -7003 -4492 4328 4109 1470 1284 -3731
2135 -3731 -5436 2594 5690 965 -434 -1138 -4147 65 5562 1508 -2817 -1289 -1338 -951 3619 2584
2151 2584 -3801 -3579 405 701 1840 2580 -2523 -5337 -210 3379 1943 1690 -704 -5248 -2029 4668
2167 4668 3766 525 -262 -3436 -3639 3288 5676 376 -1845 -1852 -3423 289 5529 1774 -3205 -2177
2183 -2177 -1538 -1096 3303 3009 -2946 -3247 -236 -240 1455 3176 -1162 -3851 188 1957 581 1873 599
2200 599 -3410 -1068 3304 1681 -99 591 -1705 -2269 2484 3072 -919 -1180 -812 -2227 794 3451
2216 3451 -254 -2564 -833 -1165 -418 2970 1096 -2796 -1484 175 -178 1716 2279 -1463 -2160 563
2232 563 909 864 1760 -148 -1913 -111 1130 773 420 -183 -1199 -667 720 829 -207 -804 -787 -532
2250 -532 39 777 -100 -1488 -656 504 -49 404 797 -988 -1037 1321 763 -172 1033 163 -1185 863
2268 863 1519 -582 136 690 -1143 -167 1504 -525 -902 762 -627 -1014 1125 -210 -1670 344 265
2285 265 -1044 446 410 -1300 -76 884 -425 144 727 -816 -48 1390 231 -190 521 -380 -133 1341
2303 1341 558 -360 -146 -510 -287 1259 429 -738 -594 -951 -640 1077 529 -938 -776 -778 -602 1163 1032
2322 1032 -908 -604 -135 -443 1147 1556 -650 -681 354 39 916 1538 -498 -1264 177 373 590 1167
2340 1167 -563 -1948 -370 660 507 692 -527 -2196 -910 765 766 847 4 -1875 -1037 922 1275
2357 1275 779 91 -1172 -952 793 1478 1088 -54 -979 -798 669 1350 779 -123 -1278 -864 657 1030
2375 1030 369 -636 -1551 -911 750 943 94 -796 -1588 -898 1038 1288 312 -592 -1315 -689 1244 1690
2393 1690 422 -557 -1047 -684 1126 1935 440 -747 -1034 -859 633 1795 554 -1041 -1464 -924 510
2410 510 1349 632 -1082 -1623 -865 408 1091 803 -401 -1281 -897 625 1347 525 -24 -701 -847 739
2428 739 1574 430 -338 -189 -629 319 1574 200 -1329 -263 -252 -323 1260 370 -1912 -953 541 -132
2446 -132 665 846 -1753 -1631 877 705 402 1133 -785 -1866 421 1369 463 810 301 -1552 -303 1461
2464 1461 682 194 407 -831 -957 719 961 -351 -352 -392 -863 -276 816 51 -1074 -365 144 -219 279
2483 279 695 -698 -954 749 644 -277 677 314 -1162 434 1431 -210 -67 786 -890 -525 1740 334
2501 334 -1243 293 -116 -1340 840 1029 -1470 -773 412 -899 -333 1410 -273 -1544 446 251
2517 251 -693 781 850 -988 -294 1044 -121 -352 1164 217 -815 582 787 -902 20 1196 -537
2534 -537 -655 999 -504 -1501 832 604 -1258 215 621 -1867 -671 1685 -489 -778 1479 -737
2550 -737 -1814 1485 1185 -1178 948 999 -1811 169 2045 -637 -319 1718 -633 -1205 1508 413
2566 413 -1344 811 663 -1550 -13 679 -1203 -428 1012 -340 -933 289 -219 -902 674 1198 -423
2583 -423 -561 204 -351 -229 1383 1010 -834 -339 664 -508 249 1972 -179 -1585 385 59 -1107
2600 -1107 1199 1319 -2010 -684 1009 -1329 -258 1816 -991 -1729 1210 1 -1633 1378 966 -1851
2616 -1851 464 1505 -1419 62 1870 -869 -620 1886 -150 -1322 1085 476 -1113 1012 1074 -1525
2632 -1525 -609 744 -690 -322 1302 -512 -1698 175 150 -619 683 798 -1227 -865 733 117 -146
2649 -146 1186 453 -1283 28 945 -207 443 1237 -467 -1022 816 389 -557 837 524 -1430 -260
2666 -260 799 -752 -297 873 -785 -1280 884 129 -1075 552 414 -1152 181 1140 -659 -548 1003
2683 1003 -190 -450 1316 377 -1012 220 693 -552 447 1125 -720 -878 601 5 -267 836 -71
2700 -71 -1665 -197 690 -373 85 621 -1208 -1171 890 572 -358 540 -187 -1455 405 1567 -12 -39
2718 -39 366 -897 -431 1603 732 -625 89 -256 -842 943 1204 -751 -748 -164 -599 164 1115 -169 -1266
2737 -1266 -313 -63 64 653 196 -1039 -810 432 605 629 372 -504 -738 476 1223 750 -28 -525 -727
2756 -727 -67 1188 1022 -267 -926 -777 -318 808 1308 -188 -1512 -818 -163 446 1196 217 -1596 -1119
2774 -1119 190 716 1096 727 -1143 -1392 594 1216 786 610 -618 -1380 338 1530 803 70 -573 -1279
2792 -1279 -163 1456 832 -402 -865 -1174 -455 1260 963 -646 -1210 -1030 -329 1151 1227 -326 -1132 -855
2810 -855 -23 1153 1431 -38 -1174 -994 247 1401 1491 124 -1278 -1077 226 1273 1275 -118 -1476
2827 -1476 -1409 7 1162 1307 -181 -1532 -1395 -11 1112 1303 -15 -1433 -1180 193 1083 1332 239
2844 239 -1206 -1043 365 1204 1088 342 -1049 -1150 364 1349 1027 52 -1043 -1381 11 1348 826 -279
2862 -279 -1229 -1283 -170 1348 921 -357 -1140 -1256 -211 1337 1207 -176 -1032 -909 7 1341 1332 74
2880 74 -1107 -855 247 1126 1305 102 -1122 -1034 76 853 934 -21 -1209 -1124 -7 822 652 -179 -1057
2899 -1057 -1194 -5 848 677 -153 -784 -848 73 1071 945 30 -674 -500 215 1016 1066 96 -770 -529 82
2919 82 729 816 -22 -950 -798 -36 497 418 13 -925 -982 -71 559 338 2 -451 -921 -128 816 532 12
2940 12 -201 -460 -236 711 931 -110 -232 3 -246 347 984 -45 -524 12 41 -113 456 60 -866 -253
2960 -253 266 -189 5 307 -625 -569 229 -6 -278 438 -19 -548 270 531 -163 223 416 -133 -191 515 167
2981 167 -109 410 137 -504 -35 283 -135 -58 224 -341 -658 113 138 -186 204 142 -681 -240 472 110 -57
3002 -57 524 -245 -719 439 691 -126 218 220 -612 19 987 15 -285 369 -316 -430 865 451 -946 -254
3022 -254 81 -531 212 782 -699 -1106 221 129 103 689 -8 -1341 -193 736 454 486 229 -778 -673
3041 -673 917 1185 330 58 -485 -1048 251 1639 391 -516 -508 -713 -571 1188 974 -916 -894 -327 -580
3060 -580 483 1405 -559 -1518 102 186 -15 1321 326 -1644 -243 1098 155 552 875 -1302 -1076 1360
3078 1360 854 -135 423 -786 -1510 980 1607 -247 -580 -545 -1308 -48 1713 336 -1183 -774 -562 -203
3096 -203 1423 987 -878 -1335 -338 226 947 1276 -254 -1591 -600 971 908 815 269 -1167 -1187 819 1387
3115 1387 115 -47 -703 -1435 192 1695 86 -864 -250 -1024 -374 1666 810 -1413 -691 -2 -432 1194
3133 1194 1476 -1177 -1451 385 341 723 1666 -507 -1908 38 1136 343 961 156 -1974 -975 1256
3150 1256 764 213 -60 -1327 -1376 777 1378 -74 -547 -715 -1199 318 1622 420 -958 -553 -310 106
3168 106 1500 1003 -911 -1028 112 499 843 1093 -485 -1483 -119 797 386 617 -293 -1452 -619 971
3186 971 721 19 -271 -1163 -1047 700 1339 -52 -446 -589 -754 203 1558 568 -892 -657 -337 142 1263
3205 1263 967 -730 -1011 13 264 614 892 -467 -1354 -305 602 215 321 -25 -1318 -875 845 583
3223 583 -71 -6 -747 -909 761 1060 -180 -201 -168 -558 411 1375 128 -544 1 -114 42 1277 452 -784
3243 -784 -374 5 -25 730 486 -787 -713 -20 72 398 414 -400 -1057 -260 240 272 373 -122 -576 -139 426
3264 426 536 290 -214 -269 -63 306 543 319 -310 -398 55 214 175 328 -350 -550 38 8 -73 178 -271 -713
3286 -713 -93 262 -98 121 -14 -510 -210 517 62 -66 171 -264 -254 518 381 -52 56 -11 -194 372 496
3307 496 -19 -174 62 -261 -79 294 -88 -436 -7 -187 -151 168 59 -248 -229 -94 -52 100 137 35 -31 84
3329 84 83 188 134 117 -51 125 1 60 153 67 139 19 -48 -11 -48 -43 -104 -91 -299 -194 -139 -105 -41 -43 -104 -173 59 31
3357 31 30 72 -57 2 98 159 183 -87 97 19 125 225 255 32 -86 111 -44 168 123 -183 -159 -48 -9 33 115
3382 115 -112 -377 -115 27 80 76 -10 -215 -109 229 241 152 254 -204 -237 305 353 141 73 -116 -257 179 287
3405 287 53 -66 -46 -272 -56 198 54 -213 -246 -132 -95 194 18 -291 -141 -164 77 378 286 -108 -275 -99
3427 -99 214 436 286 -88 -136 -73 245 408 205 36 -98 -284 30 294 61 -255 -190 -151 -233 127 127 -336 -291
3450 -291 -56 35 129 237 -329 -418 56 179 177 282 23 -492 187 399 61 220 -6 -388 -8 535 213 -132
3472 -132 -50 -353 -272 307 440 -195 -339 -156 -369 152 347 -102 -389 -37 26 177 383 168 -336 -154 232
3493 232 297 153 275 -33 -324 170 392 91 -84 -4 -469 -86 471 105 -412 -116 -250 -200 398 376 -502
3514 -502 -437 -22 -265 120 535 -42 -451 -54 98 188 632 246 -602 -163 432 165 125 444 -269 -412 281
3535 281 329 -69 115 -123 -519 -64 259 -54 -372 -106 -329 -270 388 129 -401 -224 205 -50 57 413 -120
3556 -120 -407 270 330 24 325 300 -513 -109 573 139 2 319 -410 -547 355 398 -321 -17 -114 -703 -81
3577 -81 587 -74 -301 12 -170 -315 488 295 -338 -66 168 -265 178 579 -146 -385 263 61 -28 393 120
3598 120 -446 -35 372 -96 119 268 -308 -369 412 138 -340 34 -43 -390 41 341 -160 -230 61 -118 -230
3619 -230 438 299 -313 73 139 -183 259 489 -20 -287 301 -84 -316 362 100 -416 -86 186 -317 -22
3639 -22 375 -270 -486 103 -11 -239 200 222 -520 92 360 -178 -94 339 -167 -401 382 150 -236 214 306
3660 306 -359 86 591 -118 -77 218 -208 -288 394 64 -340 -61 43 -290 -64 344 -248 -413 132 -150 -120
3681 -120 423 203 -407 -1 126 -157 204 445 -272 -358 298 119 156 334 -54 -510 -45 322 20 -83 24
3702 24 -496 -365 191 165 -189 -37 -158 -310 59 446 -18 -220 -36 -145 3 447 283 -272 -193 72 -71
3723 -71 323 366 -239 -464 -98 187 163 286 -123 -711 -269 401 216 132 -50 -537 -510 283 551 30 -52 -332
3745 -332 -476 175 714 146 -119 -92 -325 123 817 246 -415 -236 -15 55 559 350 -336 -561 -68 123 367
3766 367 366 -270 -718 -235 286 412 264 -179 -725 -390 303 694 161 -220 -515 -390 247 569 376 -217 -432
3787 -432 -353 221 691 441 -373 -600 -282 107 468 476 -309 -665 -352 221 350 333 -222 -588 -321 385 506
3808 506 223 -249 -636 -377 327 598 252 -181 -524 -381 398 680 370 -215 -510 -384 339 750 377 -389
3828 -389 -581 -188 181 584 301 -311 -591 -344 213 477 281 -446 -790 -384 218 555 303 -193 -627 -240
3848 -240 445 663 370 -204 -521 -304 331 579 374 -297 -519 -400 327 652 157 -360 -547 -310 159 606
3868 606 226 -437 -548 -274 188 573 154 -208 -486 -258 316 471 314 -195 -455 -229 234 502 232 -216
3888 -216 -474 -205 254 421 295 -365 -554 -186 153 340 226 -241 -412 -233 105 364 275 -276 -464 -105
3908 -105 203 392 205 -132 -516 -125 216 357 292 -76 -334 -93 214 286 187 -104 -425 -127 226 212 182 -184
3930 -184 -416 -328 145 239 80 -272 -252 -222 100 361 33 -228 -185 -72 223 246 139 -3 -244 -15 185 257
3952 257 163 -104 -271 -189 96 281 -30 -23 -163 -217 77 49 -91 -178 -71 -325 -150 174 26 -67 24 -40 -97 203
3976 203 158 -34 113 102 -51 2 222 -87 39 198 -65 -97 174 60 -145 95 -95 -233 26 160 -91
3997 -91 -84 15 -162 -187 73 0 -122 -77 -3 -68 81 287 -34 -73 67 84 92 203 -33 -153 -68 122 42 158 107
4022 107 -215 -377 9 188 27 -1 41 -436 -106 423 86 35 24 -289 -179 504 334 -75 -37 -134 -107 285
4044 285 487 -17 -184 -67 -163 164 386 237 -363 -203 -84 116 317 169 -355 -394 -63 203 219 68 -251
4065 -251 -548 -82 368 271 -17 -220 -356 -135 487 528 -33 -165 -245 -234 419 586 -22 -252 -260 -143 177 483
4087 483 179 -461 -293 -118 -37 381 206 -493 -583 40 257 194 98 -421 -687 -73 432 245 -35 -193 -459
4108 -459 -102 560 450 27 -306 -366 -101 362 612 106 -333 -272 -188 232 579 -30 -579 -422 8 106 605
4129 605 134 -528 -532 -42 313 256 208 -278 -623 -42 459 442 144 -237 -600 -80 552 488 29 -320 -427 -114
4151 -114 280 436 26 -488 -402 -164 175 626 121 -444 -507 -89 194 524 177 -506 -535 142 447 378 313 -297
4173 -297 -487 21 413 373 151 -153 -434 -196 426 366 -74 -178 -421 -239 302 451 -104 -260 -381 -93 305
4194 305 474 -29 -397 -329 -73 204 387 159 -358 -191 -26 294 372 222 -327 -385 98 408 311 91 -206
4215 -206 -329 -49 426 213 -16 -248 -426 -209 226 324 -165 -303 -201 -156 58 312 86 -349 -202 53 188
4236 188 344 244 -250 -225 95 198 318 129 -204 -299 88 244 75 8 -65 -440 25 308 187 -72 -117 -181
4258 -181 -124 138 210 48 -106 -101 -123 89 238 70 -223 -116 -39 72 224 129 -102 -136 8 122 -2 65 -108
4281 -108 -107 -35 104 81 0 -149 -113 1 47 42 11 -77 -209 -76 127 91 112 -155 77 14 79 163 103 25 -25 67 24
4308 24 134 136 -120 -7 -36 5 -30 -76 -56 -90 19 -58 -106 -20 -38 -40 -34 -4 -43 -31 180 172 -87 -23 16 -87 178 101
4336 101 -14 80 150 34 35 44 17 -104 42 84 7 61 -30 -119 -76 27 104 -35 -75 -7 -135 -131 86 88 -30 -70 -42
4363 -42 -23 122 142 -72 -36 -123 13 46 168 21 -101 -176 -4 176 277 13 -121 -137 -71 118 152 48 -129
4386 -129 -193 68 177 174 -27 -212 -125 -116 111 320 49 -135 -157 -26 205 285 5 -216 -122 -54 227 179 -94 -187
4410 -187 -99 -47 113 123 -9 -163 -298 -42 138 198 18 -152 -116 5 227 279 103 -107 -196 62 146 230 30
4433 30 -47 -169 -66 234 266 -47 -65 -235 -35 184 224 126 -267 -223 -138 196 97 -25 -372 -221 -71 158 201
4456 201 36 -196 -181 68 99 315 63 -175 -172 22 251 188 76 -201 -239 -13 222 273 64 -92 -180 -95 161
4479 161 275 35 -172 -160 -115 -27 262 -44 -184 -211 -60 140 198 64 -250 -149 92 128 223 131 -170 -158 43
4502 43 243 145 91 28 -153 -47 124 172 41 -186 -277 -126 150 134 81 -98 -194 -158 90 234 -76 -171 -103 -18
4526 -18 47 172 78 -180 -77 2 61 162 264 -85 -124 40 85 184 97 -147 -132 29 108 -17 -74 -18 -177 37
4550 37 72 138 3 -4 -109 -129 163 137 10 -1 -169 -128 -10 259 -30 -168 -113 -113 -73 194 88 -54 -147 -33 57
4575 57 140 42 -177 -207 -191 66 35 23 -1 -166 -166 61 63 -21 102 -18 -59 171 40 -64 5 58 -10 102 107 26 -67
4602 -67 18 -50 30 24 0 -129 -95 32 -96 44 88 -49 -134 28 -33 55 112 48 -155 -50 56 87 8 27 -14 -85
4628 -85 135 26 -1 38 -19 -4 152 115 15 -38 67 0 -8 177 18 -14 -28 -108 -28 -112 -4 -44 3 34 -3 -71 -4
4655 -4 60 -69 73 31 -71 1 98 5 -7 72 -9 -77 160 43 -27 -52 -1 13 -7 32 -115 -15 31 94 -105 44
4681 44 57 -138 -11 85 17 -18 62 30 -129 43 89 68 11 42 -56 -11 97 118 -6 -50 39 -74 112 80 7 17
4707 17 -81 -23 -45 57 -121 -124 26 109 -104 85 102 -34 27 45 86 123 20 -18 -24 29 165 18 98 -141 -20 -115
4733 -115 121 22 8 32 -124 16 80 126 22 -173 -119 -63 -30 66 -35 -103 -101 6 55 82 109 -30 64 -41 110
4758 110 164 5 -7 -102 -28 79 34 100 -104 -163 -128 88 -42 -41 71 -140 -126 49 127 -31 -80 -27 -90 76 125
4783 125 -20 -78 -37 -98 75 116 152 -89 -13 -71 17 51 74 -18 -59 -44 26 79 78 39 -222 -26 27 27 84 -60 -130 -95
4811 -95 34 137 36 -84 -69 -108 71 146 -17 -94 -35 -195 80 60 -67 139 -33 134 20 168 21 -21 -52
4834 -52 -1 -43 -106 13 21 -147 -40 -62 111 77 -7 -96 -24 -39 169 120 3 -41 -14 45 151 142 -54 -27 -13 27 109
4861 109 146 -9 -195 -62 -103 29 -80 -98 -123 -78 30 -94 -48 -29 -116 -26 -30 13 70 -94 -28 -53 26 108 69 72 -91
4888 -91 -48 99 159 21 -45 -95 -57 54 7 49 -186 -6 40 -124 90 61 -44 -116 -71 95 19 -50 9 53 -18 81
4914 81 9 76 34 -24 -5 -109 70 117 -62 -41 -78 158 1 -144 38 -172 -72 14 -89 8 58 -94 2 -69 48
4939 48 -102 -41 -28 1 -60 -34 3 5 -57 -23 -23 92 102 20 -59 77 80 46 37 135 -167 -50 78 -53 16 -66 -72 -32 76
4968 76 46 45 6 -76 29 -113 148 23 -3 -98 108 19 -4 54 -20 -24 83 13 28 36 62 -26 7 66 -49 -134 39 90
4996 90 -156 119 56 -45 -26 48 -92 29 -34 27 -84 -65 -54 -35 -97 18 -170 48 -34 -22 60 5 -64 71 -17
5021 -17 96 -10 144 67 -5 62 209 53 14 52 -9 -82 -16 -12 65 -47 -81 -39 -66 19 18 28 -35 33 -4 50 -17 -122
5049 -122 66 57 -81 88 82 53 -43 -41 15 -42 17 -5 7 59 13 -71 37 -25 -3 12 -31 -49 35 -1 187 67 4 -64
5077 -64 -50 -36 -2 -86 -88 91 15 -90 33 -77 -136 41 65 42 107 1 24 -76 -40 -111 -88 -49 -43 -21 68 3 -158
5104 -158 -46 -14 -56 103 45 -40 10 93 -24 63 -25 70 95 16 60 164 122 -38 -57 44 71 26 10 99 -41 -10
5130 -10 3 58 53 20 -12 10 -12 33 58 -40 -40 -57 46 29 -92 -11 -5 45 44 10 13 47 -46 17 11 6 -38 50 1 41 -53 14 34
5163 34 103 -3 -32 -6 -50 40 -9 13 -91 9 94 41 -38 -23 0 -108 10 -29 136 -14 70 25 69 115 2 -32
5189 -32 63 80 62 -45 -76 24 59 -51 46 -28 84 -42 -34 -19 102 36 -106 -58 27 14 106 112 -69 -24 6 16 -10
5216 -10 71 -57 97 11 -35 -24 125 120 -60 16 -6 -52 47 28 -122 165 15 -79 37 -20 64 -20 7 -27 -38 -69 -104
5243 -104 5 -13 64 -110 32 -23 -93 70 28 75 -83 51 57 -13 0 33 -32 6 -13 -36 -22 -38 -56 -52 -135 -45 121
5270 121 -12 25 -96 7 -9 88 30 -144 77 -5 55 111 3 -21 83 58 79 18 -24 -26 20 102 -19 43 24 30 -76
5297 -76 21 2 -15 1 1 -70 -114 -4 -85 80 28 45 8 -124 122 -16 115 72 28 -45 1 -5 73 14 0 -79 -27 54
5325 54 82 95 -142 84 27 3 -183 16 -4 -56 84 18 19 -26 6 -64 78 10 90 86 10 68 -62 -48 23 9 24 71
5353 71 27 58 -49 64 -29 -63 28 -73 -27 -11 1 3 24 -73 -42 83 -66 12 26 10 -67 88 -37 1 -22 7 57
5380 57 45 19 -38 75 -14 13 26 -22 -86 90 58 -41 20 -58 -51 -114 -60 -15 -38 -82 46 -15 16 82 -49 96 20 7
5408 7 6 -94 -28 -18 24 45 55 115 27 64 42 -6 8 88 -30 -149 23 -65 -45 67 30 -17 -93 -8 -35 -94 -71 -93 37
5437 37 19 9 -30 44 -18 -39 82 25 -41 44 70 -57 -82 41 -47 -97 68 -115 34 13 -17 61 4 -128 15 101
5463 101 70 3 -11 11 19 39 86 34 -65 8 48 3 -34 64 -7 -54 -96 38 11 -23 -43 -32 -27 17 66 -66 4 10 -45 -51 -51
5494 -51 -9 38 -31 68 44 79 66 -46 -15 -67 87 47 53 -32 -62 -20 123 27 128 2 -2 19 22 131 1 -75 -106 -44
5522 -44 83 80 -4 -43 -8 -152 -25 76 19 9 70 -76 93 -19 10 -112 9 -54 167 72 -30 17 9 64 29 12
5548 12 44 -31 -122 -23 104 96 17 -71 -84 -20 113 -33 -46 50 19 -33 133 92 -57 50 11 37 -104 19 22 -25 -88
5575 -88 -49 27 70 28 -87 1 36 63 -51 22 -84 39 60 43 50 -48 -20 -81 -95 104 70 29 11 19 49 -25 16 -27 -71
5604 -71 -21 -39 25 38 -92 31 -69 88 59 11 -14 7 -11 -19 5 -22 -15 -66 0 -4 13 85 51 14 -57 95 37 39 29 -50
5634 -50 32 62 45 95 9 44 -36 -122 69 43 -47 -69 119 -78 -15 33 -64 23 89 24 -97 -89 72 -57 -11 47 28 -39
5662 -39 12 -43 -23 90 -32 -29 20 7 48 55 19 59 31 -53 -44 2 -58 44 -26 29 38 88 -31 1 -21 69 -46 -17 -89 -145
5692 -145 -44 -84 -10 44 -43 -45 -38 29 -50 31 28 48 105 -13 -62 12 52 -13 17 -12 -23 -98 26 -123 -67 -4 -35 -116 -15
5721 -15 -7 4 -3 37 31 -41 84 -40 7 -55 29 -91 52 50 -95 -7 -29 153 -88 8 64 -32 -31 41 -25 50 -107 -10 44
5750 44 -68 -25 -42 59 -5 -90 -2 -76 71 -9 36 28 43 82 78 38 -37 20 1 -16 122 47 -47 -31 -54 -37 46 -82 58
5779 58 -72 -86 -20 31 2 24 -176 -9 21 4 59 -86 -6 -43 -29 130 170 6 46 1 23 28 13 -42 -14 -45 40 12
5807 12 -3 -86 -109 -34 -1 -40 98 64 82 4 33 -14 29 -9 -105 -41 -28 47 68 -19 -39 -86 76 -34 -8 8 45 -104
5835 -104 -111 -4 11 66 -44 -1 -73 86 147 -3 11 -12 109 64 85 -11 -101 93 -6 74 117 -1 -17 69 -168 77
5861 77 88 72 -37 -96 90 58 -126 -106 -105 -104 -40 44 -40 -75 -90 -73 29 104 -23 32 -78 -34 26 52 74 -41 -84 -75
5889 -75 74 -47 165 81 41 -34 -73 42 -52 7 50 19 -9 61 120 30 0 -22 5 150 -21 -88 -77 -154 -77 -47 94
5916 94 -101 -86 -19 -12 111 107 -87 35 -39 -40 -54 -19 37 -57 -16 149 36 60 -113 -22 -21 40 158 0 63 -97 -37
5943 -37 3 55 126 13 -51 -86 32 -33 40 69 48 -71 -56 149 -21 9 -86 -162 54 71 56 -9 39 0 -79 97 16
5970 16 -153 -85 32 59 82 117 47 -37 -49 21 -45 57 15 66 4 20 60 12 -22 -12 42 5 28 76 -3 77 21 60 26
5999 26 37 -41 27 -60 99 40 31 65 40 31 -74 80 13 -11 -123 -96 6 34 54 7 8 -48 99 -84 -2 -8 -63 -115 122
6028 122 104 -63 -13 -21 -40 58 45 -17 39 13 14 -78 32 -210 -15 -34 -19 81 50 61 -42 -40 15 -12 -48 -7 35 -18
6056 -18 -133 -32 35 8 16 -43 -21 63 63 18 -25 32 -142 -42 -39 5 -53 117 28 29 -57 1 -10 -75 -34 -45 -134 -41 -18 55
6086 55 107 -17 15 -14 -5 53 85 -44 -52 160 93 33 -2 -2 31 -8 64 0 57 -17 20 -21 26 -19 -67 0 51 -58 28 -4
6116 -4 7 52 -20 -68 108 58 136 -1 -9 55 -33 24 3 44 -153 -37 18 47 -112 -124 -31 4 -40 71 47 -43 -68 -28
6144 -28 -144 70 46 28 10 -8 55 -28 -79 37 -30 10 62 -22 40 -33 -53 12 -20 -1 -90 -47 -129 -18 48 69 26 96
6172 96 -59 -104 -20 61 27 -49 -72 -56 -54 2 82 -36 -36 30 106 14 -80 -90 -28 -55 42 180 51 -1 -30 21 43 35 34 -25
6202 -25 -117 40 76 0 45 -124 -90 41 30 85 -131 -38 -32 -102 -3 54 122 -92 -23 -95 41 -19 50 12 -44 -120 39
6229 39 -48 14 -70 -85 30 38 68 14 -68 -60 -6 126 101 -106 0 -45 -40 -4 189 -3 -12 -58 38 40 -4 -1 125 -46 75
6258 75 88 -16 -35 -57 -59 -54 -14 13 4 -152 -52 -29 -12 -28 -22 -88 -96 -34 44 49 6 -88 -124 -32 -38 7 -77 -27 37 0 -33 39
6290 39 128 5 40 82 -13 9 -37 -72 -71 1 11 12 -127 -37 -59 -28 -7 -117 -34 -36 -55 -52 81 38 6 -59 -65 52 95 141
6320 141 -71 -133 6 -33 -1 -61 90 25 -30 102 -6 19 -79 -37 -15 25 7 58 31 -48 -85 -130 -88 -49 98 35 -37
6347 -37 113 36 36 -61 -75 -6 -26 -148 104 -23 57 -161 -93 84 37 -4 47 51 -37 -163 -70 42 -61 5 6 -21 58
6374 58 42 -43 20 -118 76 11 -81 188 75 25 3 10 21 -92 27 45 9 12 72 19 -29 56 -41 23 12 -1 26 -60
6402 -60 -16 -54 67 40 -52 -71 -68 65 15 46 113 74 27 76 3 55 8 -30 -7 107 -59 10 87 33 0 -142 -22 79
6430 79 24 4 19 6 26 8 23 4 -50 -90 -24 24 13 39 -61 -74 31 15 -30 35 -43 -75 -14 -16 -12 44 13 -88 64
6459 64 98 60 83 -21 -52 4 -15 -26 68 -65 -59 142 78 -34 3 24 38 63 -29 -14 -82 -30 -21 -29 -48 98 -15 -19 -83
6488 -83 119 -53 59 -36 -72 -74 66 1 29 -44 -81 -99 11 -13 -42 62 -31 -163 13 -58 47 70 -52 14 51 9
6514 9 51 -53 3 -14 -97 95 25 73 -121 -61 79 124 50 -18 -19 -97 48 56 -3 -90 48 -144 -46 -78 59 -63 -62 28
6542 28 -18 30 -44 44 6 -28 106 79 25 85 117 -103 -62 81 87 42 -53 16 -84 56 33 -114 -3 39 -82 10 -65
6569 -65 -24 69 49 -78 32 14 -15 -1 -37 -36 -16 137 8 -56 -13 65 -27 40 97 11 -10 141 -35 -17 89 -30 -165
6596 -165 12 -31 -36 -9 -45 62 73 -70 3 10 -70 14 -90 35 42 -4 -34 13 39 5 41 -22 -5 46 -36 -34 -14 6 10 -44
6626 -44 -55 -9 -43 5 -88 -1 21 -49 -75 46 -6 -14 43 73 86 -18 130 79 -92 -10 -44 -79 73 51 -57 -22 -6 12
6654 12 -98 -26 47 13 37 -55 -61 -50 -34 5 21 -1 0 123 17 2 18 -78 59 -53 -38 51 2 8 42 -37 35 -23 50
6683 50 -1 -7 71 1 -20 -39 -63 40 73 7 2 -23 -59 1 -15 1 47 -24 -2 -18 9 -77 -76 -41 -40 64 116 70 38 57 -35
6714 -35 79 -22 22 -126 32 -55 9 115 -93 -60 -112 76 97 -41 -32 3 -20 -44 -30 -75 6 57 53 19 -102 -68 -73
6741 -73 -38 -74 5 -51 113 52 92 49 -128 -35 -22 -97 97 79 -4 4 88 29 89 -64 -96 -8 -55 67 -22 -5 7 28
6769 28 -76 -32 2 -8 -9 50 32 -54 -81 2 -27 -59 3 36 14 -121 39 65 13 -6 20 -106 -44 -19 -106 -3 2 -62 -10
6798 -10 109 8 82 -8 35 -73 -4 -56 55 47 53 86 61 45 31 -38 -77 92 91 37 -43 31 -28 10 53 -20 105 16 -97
6827 -97 -48 -35 -35 0 -79 -61 -118 19 151 133 -21 -34 1 73 -67 -48 102 111 -150 97 -5 107 14 89 -51 -42 -35
6854 -35 62 4 -2 -73 56 56 -15 51 -60 1 21 -46 136 92 -67 71 -134 11 77 -5 110 26 -99 113 46 -24
6880 -24 11 -29 -108 54 34 -34 69 -75 9 21 6 26 23 -32 19 -27 23 -44 -23 41 30 15 -10 11 34 38 -22 -3 6 -2 -13
6911 -13 -3 36 -129 -29 165 -10 -63 -29 -27 16 -42 -31 -56 -102 13 -84 -3 35 59 -38 -93 19 19 -37 36 84 -27 60
6939 60 20 -16 -65 7 4 -53 -41 67 -36 -27 -45 -6 29 21 34 -94 33 44 74 -6 15 -38 -30 141 -79 -24 -8 -47 -40 17
6969 17 -4 95 84 -35 -105 -5 24 -9 -14 107 117 155 7 -17 35 -46 102 3 18 -99 -53 16 -29 -20 51 5 122 -40
6997 -40 61 22 -3 29 62 -22 -77 -72 -23 -9 -49 21 -65 28 69 7 72 13 -66 -48 133 0 -48 -78 30 -24 90 57
7025 57 -6 48 49 68 63 24 15 78 -48 122 -21 27 13 -8 1 -12 26 -9 12 -103 -28 47 -27 -45 -1 -13 24 73 103 1
7055 1 -72 110 -17 16 35 9 -47 -81 -15 -45 84 50 3 -5 -83 86 24 -55 21 88 0 -2 -117 -39 -20 -67 -2 -2 -126
7084 -126 -32 9 38 -40 57 42 37 24 -114 94 17 -73 4 105 -2 -94 -4 16 -6 83 10 8 -69 -38 40 25 40 -45 -50
7113 -50 86 5 83 -36 -42 22 0 -48 2 -66 84 -20 67 -2 46 60 -46 0 -91 -22 45 60 11 12 89 5 54 75 12
7142 12 43 39 63 -80 -75 56 -49 -6 -48 -80 20 -4 42 -2 48 33 60 46 10 46 75 77 14 136 41 -9 73 -14 22
7171 22 114 -13 0 16 -34 -41 -1 -22 -83 103 -42 48 -13 25 -118 48 44 18 8 -65 43 -9 23 51 42 5 6 -34 -25 44
7201 44 23 30 -39 56 -21 -11 -110 -100 -62 -72 0 -105 -36 -55 -20 29 -46 -95 -69 16 -67 34 43 -61 56 -57 42 41 64
7230 64 24 -70 45 18 -16 105 -43 -9 84 -80 -64 1 101 39 -60 -86 26 -2 -7 -19 -2 -39 66 54 -45 -77 -55
7257 -55 30 -39 -106 17 38 118 -13 -19 87 -17 -10 60 13 -9 49 33 31 -36 19 -78 -104 18 33 107 30 59 63 -50 85
7286 85 -63 16 -73 18 98 77 -80 2 -32 143 -21 116 42 76 41 42 -9 63 -175 -24 24 42 52 -109 -112 -3 -5
7313 -5 -53 163 -81 -46 -52 47 46 86 -26 -38 -56 -88 0 70 83 -30 99 17 91 4 -13 19 5 104 30 43 -74 106
7341 106 -60 -27 -98 2 15 29 -33 124 -24 -16 33 -10 -3 0 79 39 39 -9 12 -71 94 24 94 77 85 98 9 31 -5 124
7371 124 44 -18 84 25 -95 -9 -43 -73 52 106 11 12 -15 -50 -84 96 20 -53 -22 19 -140 104 111 -86 11 -16 26
7398 26 15 43 66 29 7 67 65 3 -101 -14 4 1 55 79 -31 62 78 111 -25 -89 2 9 -9 -64 1 58 -66 13 -98
7427 -98 3 -29 51 59 -2 66 64 0 -20 -132 52 19 100 -20 -10 34 -36 -59 -38 4 -59 17 78 -127 84 105 50 1
7455 1 54 57 5 64 -65 64 -76 -26 41 17 3 -8 19 52 -76 -136 -25 -13 -98 45 65 -58 76 -21 37 -24 43
7482 43 -10 -44 7 -58 27 -4 41 -20 3 36 69 20 -52 18 -76 -25 -36 4 119 32 59 -59 -19 -37 -47 -21 -62 -100 -54
7511 -54 35 37 52 -13 -27 -9 14 44 -34 -12 -87 42 -105 58 -45 -75 23 5 40 59 -36 43 -1 67 105 -94 27 5
7539 5 41 -48 21 24 -71 -17 -11 11 30 88 32 9 86 -17 99 -55 -7 -26 -20 103 -55 64 -21 37 -67 -14 -15 -83 54
7568 54 61 5 -1 -4 -55 -86 -43 38 7 59 -17 -28 87 64 23 -52 -25 -11 52 -6 68 0 -29 -30 -13 -14 8 -2 20 -89 -107 59
7600 59 10 17 -105 -72 -16 -88 -89 2 62 -125 -22 -16 11 9 -87 50 30 67 22 152 -80 55 -97 -46 45 -84 -11 -21
7628 -21 55 23 -43 31 31 -76 -79 -51 1 49 54 44 -25 -82 -67 -37 -56 -117 19 -103 11 35 77 19 -49 41 -75 -22 -68
7657 -68 -140 37 30 -22 21 17 -39 86 -39 -17 10 4 28 48 101 3 -5 80 -4 2 23 66 26 -14 46 -40 27 13 73 22 17 26
7689 26 81 40 -5 89 18 44 -43 57 -104 25 -7 -137 -17 -61 55 -2 -47 44 28 -44 104 65 59 -91 42 -16
7715 -16 1 40 -54 -7 5 -19 -87 -100 -8 -55 66 -74 -83 -2 -148 -32 -74 -61 -42 -51 -55 19 -10 -81 28 -57 33 34 22 41
7745 41 47 24 11 -70 70 96 -50 12 24 71 -7 37 -61 59 6 27 -23 106 -4 -14 -9 93 -56 24 -131 -43 92
7772 92 4 -21 -48 -48 -10 -48 9 37 88 -47 43 48 -23 -52 -1 -55 13 2 -8 -51 -13 -63 -36 2 109 -58 -73 42 95
7801 95 70 -21 -59 -24 1 67 114 147 45 -145 -98 -66 108 42 22 -12 -109 -48 111 42 -33 -121 -25 93 7 -55 55
7828 55 -52 19 -33 1 55 34 -56 71 35 -79 16 89 9 29 -80 106 -106 88 -95 -74 -14 -121 212 87 -55
7853 -55 -31 -42 44 107 25 44 -35 106 26 -21 9 25 -5 50 97 -63 77 1 -83 -71 7 5 6 6 -42 13 138 114 -72
7882 -72 9 15 -6 65 -33 51 8 -9 6 14 35 -136 -17 5 3 38 11 16 -85 46 9 43 28 -85 -63 80 -31 58 24
7911 24 17 -66 34 55 42 18 16 15 163 -16 18 113 -75 -15 -86 68 109 -102 -4 13 -91 10 26 -13 45 9 -22 83
7939 83 57 -84 -91 -98 -33 -21 10 107 -49 -83 -15 53 -24 162 -89 -27 -28 -25 25 24 -103 -37 70 -10 -48 -13 29 29 96 29
7969 29 -15 -48 -11 56 -48 20 7 111 55 102 -44 7 -32 8 25 -44 -78 -66 30 -84 42 33 103 15 5 -53 -104 8
7997 8 49 -34 6 48 -12 -21 73 13 102 185 -75 -9 60 37 4 46 16 10 147 2 54 79 -16 11 8 38 -6 -32 23 45 -50
8028 -50 123 63 -20 -89 -113 38 -22 84 15 116 -65 -19 -17 86 7 -2 -11 159 -48 -24 46 -23 51 -38 55 47 -64 41
8056 41 48 -16 -20 45 -38 -21 -2 48 -58 -28 -26 -73 -7 52 -37 78 -51 -13 -46 2 60 -2 -5 75 -2 -63 -16 9 -6 -37 -30
8087 -30 26 59 -22 -31 115 2 49 -13 41 -34 -98 109 -33 180 75 9 -1 -106 60 5 -4 92 72 38 114 104 -59
8114 -59 -41 15 -29 -13 -25 -41 46 45 1 47 -50 15 0 -25 39 -14 43 -55 -14 33 -8 4 26 -57 -31 -67 -16 59 -3 -12 27
8145 27 -54 19 -69 38 -25 17 -42 16 43 26 -58 -17 -11 -88 -43 -32 -27 -17 -14 21 49 -28 -24 -38 -12 80 -42 -49 -86 61 -9
8176 -9 -27 44 129 46 15 -82 -14 15 1 19 94 -35 79 -33 -4
8191d
##END NTUPLES=NMR FID
##END=
