##TITLE=1H_E3e-4-2
 CDCl3
 8 sc, 
 16.6.2023
##JCAMPDX= 6.0         $$ Bruker NMR JCAMP-DX V2.0
##DATA TYPE= NMR FID
##DATA CLASS= NTUPLES
##ORIGIN= UXNMR, Bruker Analytische Messtechnik GmbH
##OWNER= root
$$ XWIN-NMR		Version 3.5
$$ Fri Jun 16 13:49:57 2023 Russian Standard Time (UT+4h)  she@DPX200
##.OBSERVE FREQUENCY= 200.13135
##.OBSERVE NUCLEUS= ^1H
##.DELAY= (6, 6)
##.ACQUISITION MODE= SIMULTANEOUS
##.ACQUISITION SCHEME= undefined
##.AVERAGES= 8
##.DIGITISER RES= 18
##SPECTROMETER/DATA SYSTEM= spect
##.PULSE SEQUENCE= zg30
##.SOLVENT NAME= CDCl3
##.SHIFT REFERENCE= (INTERNAL, CDCl3, 0, 15.7039)
##AUDIT TRAIL= $$ (NUMBER, WHEN, WHO, WHERE, WHAT)
$$ ##TITLE= Audit trail, XWIN-NMR		Version 3.5
$$ ##JCAMPDX= 5.01
$$ ##ORIGIN= Bruker BioSpin GmbH
$$ ##OWNER= she
$$ F:/spectra/data/she/nmr/H-F/1/audita.txt
$$ ##AUDIT TRAIL=  $$ (NUMBER, WHEN, WHO, WHERE, WHAT)
(   1,<2023-06-16 13:48:34.12 +0400>,<she>,<DPX200>,
      <created by zg, POWCHK disabled, PULCHK disabled
       configuration hash MD5:
       00 E9 B6 7A A2 85 ED C7 34 08 36 98 17 FE 4E 26
       data hash MD5: 16K
       68 EA B2 1A 20 3D 54 21 2E 17 F8 85 1A 40 3E 1F>)
$$ ##END=
$$ 
$$ hash MD5
$$ 09 EA 42 C7 20 F0 69 39 8F D1 36 AB D3 37 FE 34
##$RELAX= 
##$RELAX= 
##$RELAX= 
##$RELAX= 
##$RELAX= 
##$RELAX= 
$$ Bruker specific parameters
$$ --------------------------
##$DU= <F:/spectra>
##$EXPNO= 1
##$NAME= <H-F>
##$PROCNO= 1
##$TYPE= <nmr>
##$USER= <she>
##$AMP= (0..31)
100 100 100 100 100 100 100 100 100 100 100 100 100 100 100 100 100 100 
100 100 100 100 100 100 100 100 100 100 100 100 100 100 
##$AQSEQ= 0
##$AQ_mod= 1
##$AUNM= <au_zg>
##$AUTOPOS= <>
##$BF1= 200.13
##$BF2= 200.13
##$BF3= 200.13
##$BF4= 200.13
##$BF5= 200.13
##$BF6= 200.13
##$BF7= 200.13
##$BF8= 200.13
##$BYTORDA= 1
##$CFDGTYP= 0
##$CFRGTYP= 5
##$CHEMSTR= <none>
##$CNST= (0..31)
1 1 145 1 1 1 1 1 1 1 1 1 1 1 1 1 1 1 1 1 1 1 1 1 1 1 1 1 1 1 1 1 
##$CPDPRG= <>
##$CPDPRG1= <>
##$CPDPRG2= <>
##$CPDPRG3= <>
##$CPDPRG4= <mlev>
##$CPDPRG5= <mlev>
##$CPDPRG6= <mlev>
##$CPDPRG7= <mlev>
##$CPDPRG8= <mlev>
##$CPDPRGB= <>
##$CPDPRGT= <>
##$D= (0..31)
0 1.2 0 0 0 0 0 0 0 0.06 0 0.03 0 0 0 0 0.0002 0 0 0 0 0 0 0 0 0 0 0 0 
0 0 0 
##$DATE= 1686908913
##$DBL= (0..7)
120 120 120 120 120 120 120 120 
##$DBP= (0..7)
150 150 150 150 150 150 150 150 
##$DBP07= 0
##$DBPNAM0= <>
##$DBPNAM1= <>
##$DBPNAM2= <>
##$DBPNAM3= <>
##$DBPNAM4= <>
##$DBPNAM5= <>
##$DBPNAM6= <>
##$DBPNAM7= <>
##$DBPOAL= (0..7)
0.5 0.5 0.5 0.5 0.5 0.5 0.5 0.5 
##$DBPOFFS= (0..7)
0 0 0 0 0 0 0 0 
##$DE= 6
##$DECBNUC= <off>
##$DECIM= 32
##$DECNUC= <off>
##$DECSTAT= 4
##$DIGMOD= 1
##$DIGTYP= 9
##$DL= (0..7)
0 120 120 120 120 120 120 120 
##$DP= (0..7)
150 150 150 150 150 150 150 150 
##$DP07= 0
##$DPNAME0= <>
##$DPNAME1= <>
##$DPNAME2= <>
##$DPNAME3= <>
##$DPNAME4= <>
##$DPNAME5= <>
##$DPNAME6= <>
##$DPNAME7= <>
##$DPOAL= (0..7)
0.5 0.5 0.5 0.5 0.5 0.5 0.5 0.5 
##$DPOFFS= (0..7)
0 0 0 0 0 0 0 0 
##$DQDMODE= 0
##$DR= 18
##$DS= 0
##$DSLIST= <SSSSSSSSSSSSSSS>
$$ [...]
##$SUBNAM2= <"">
##$SUBNAM3= <"">
##$SUBNAM4= <"">
##$SUBNAM5= <"">
##$SUBNAM6= <"">
##$SUBNAM7= <"">
##$SUBNAM8= <"">
##$SUBNAM9= <"">
##$SW= 18.05172834244
##$SWIBOX= (0..15)
0 0 2 0 0 0 0 0 0 0 0 0 0 0 0 0 
##$SW_h= 3612.71676300578
##$TD= 16384
##$TD0= 1
##$TE= 0
##$TE2= 300
##$TE3= 300
##$TEG= 300
##$TL= (0..7)
0 120 120 120 120 120 120 120 
##$TP= (0..7)
150 150 150 150 150 150 150 150 
##$TP07= 0
##$TPNAME0= <>
##$TPNAME1= <>
##$TPNAME2= <>
##$TPNAME3= <>
##$TPNAME4= <>
##$TPNAME5= <>
##$TPNAME6= <>
##$TPNAME7= <>
##$TPOAL= (0..7)
0.5 0.5 0.5 0.5 0.5 0.5 0.5 0.5 
##$TPOFFS= (0..7)
0 0 0 0 0 0 0 0 
##$TUNHIN= 0
##$TUNHOUT= 0
##$TUNXOUT= 0
##$USERA1= <user>
##$USERA2= <user>
##$USERA3= <user>
##$USERA4= <user>
##$USERA5= <user>
##$V9= 5
##$VALIST= <valist>
##$VCLIST= <CCCCCCCCCCCCCCC>
##$VD= 0
##$VDLIST= <DDDDDDDDDDDDDDD>
##$VPLIST= <PPPPPPPPPPPPPPP>
##$VTLIST= <TTTTTTTTTTTTTTT>
##$WBST= 1024
##$WBSW= 4
##$XGAIN= (0..3)
0 0 0 0 
##$XL= 0
##$YL= 0
##$YMAX_a= 387765
##$YMIN_a= -321488
##$ZGOPTNS= <>
##$ZL1= 120
##$ZL2= 120
##$ZL3= 120
##$ZL4= 120
##$ABSF1= 10
##$ABSF2= 0
##$ABSG= 5
##$ABSL= 3
##$ALPHA= 0
##$AQORDER= 0
##$ASSFAC= 0
##$ASSFACI= 0
##$ASSFACX= 0
##$ASSWID= 0
##$AUNMP= <proc_1d>
##$AZFE= 0.1
##$AZFW= 0.1
##$BCFW= 1
##$BC_mod= 2
##$BYTORDP= 1
##$COROFFS= 0
##$CY= 11.3945322036743
##$DATMOD= 1
##$DC= 2
##$DFILT= <>
##$DTYPP= 0
##$F1P= 15.7292609196834
##$F2P= 12.9074282941183
##$FCOR= 0.5
##$FTSIZE= 0
##$FT_mod= 4
##$GAMMA= 1
##$GB= 0.15
##$INTBC= 1
##$INTSCL= 1
##$ISEN= 128
##$LB= 0.24
##$LEV0= 0
##$LPBIN= 0
##$MAXI= 10000
##$MC2= 0
##$MEAN= 0
##$ME_mod= 0
##$MI= 1.114404
##$NCOEF= 0
##$NC_proc= 0
##$NLEV= 6
##$NOISF1= 3.799351
##$NOISF2= 2.8
##$NSP= 1
##$NTH_PI= 0
##$NZP= 0
##$OFFSET= 15.70392
##$PC= 1
##$PHC0= -20781.23
##$PHC1= 9.052721
##$PH_mod= 1
##$PKNL= yes
##$PPARMOD= 0
##$PSCAL= 0
##$PSIGN= 0
##$REVERSE= no
##$SF= 200.130013532006
##$SI= 16384
##$SIGF1= 3
##$SIGF2= 2
##$SINO= 400
##$SIOLD= 16384
##$SREGLST= <1H.CDCl3>
##$SSB= 0
##$STSI= 0
##$STSR= 0
##$SW_p= 3612.71676300578
##$SYMM= 0
##$S_DEV= 0
##$TDeff= 0
##$TDoff= 0
##$TI= <>
##$TILT= no
##$TM1= 0
##$TM2= 0
##$TOPLEV= 0
##$USERP1= <user>
##$USERP2= <user>
##$USERP3= <user>
##$USERP4= <user>
##$USERP5= <user>
##$WDW= 1
##$XDIM= 8192
##$YMAX_p= 0
##$YMIN_p= 0
$$ End of Bruker specific parameters
$$ ---------------------------------
##NTUPLES= NMR FID
##VAR_NAME=  TIME,          FID/REAL,        FID/IMAG
##SYMBOL=    X,             R,               I
##VAR_TYPE=  INDEPENDENT,   DEPENDENT,       DEPENDENT
##VAR_FORM=  AFFN,          ASDF,            ASDF
##VAR_DIM=   8192,          8192,            8192
##UNITS=     SECONDS,       ARBITRARY UNITS, ARBITRARY UNITS
##FACTOR=    0.0002768,     1,               1
##FIRST=     0,             0,               0
##LAST=      2.2672688,     0,               0
##MIN=       0,             -321488,         0
##MAX=       2.2672688,     387765,          0
$$ Real data points
##PAGE= N=1
##DATA TABLE= (X++(R..R)), XYDATA
0 0 0 0 0 0 0 0 0 0 0 0 0 0 0 -4 7 -8 8 -8 8 -16 16 -16 24 -24 32 -38 44 -51 60 -68 78 -92 101 -116 132 -149
36 -149 170 -190 211 -237 265 -295 328 -366 404 -448 495 -547 603 -664 731 -805 888 -977
54 -977 1077 -1188 1312 -1453 1614 -1797 2010 -2259 2558 -2921 3366 -3922 4602 -5331 5204
69 5204 5562 387765 135762 -102643 154110 -167328 -321488 192418 238908 -96887 16371
80 16371 -51910 -249184 79647 257583 -25295 -14179 23413 -182984 -40779 188728 -9081
91 -9081 -91453 37750 -25118 -12487 134079 30777 -105793 -63068 -23408 49804 107897 -14552
103 -14552 -82841 -39102 -45317 64573 181553 -3587 -152918 -70900 -59551 16681 202553
114 202553 74506 -138346 -62378 -36317 -40634 167658 135221 -146790 -110285 9394 -48964
125 -48964 88168 192004 -61501 -145918 19082 -12394 -9547 130941 5464 -145798 -5665
136 -5665 53160 -5488 71331 34461 -120533 -41951 70776 -2734 87 41824 -65744 -70410
148 -70410 81826 80260 -23283 -26075 -32329 -60155 19990 93933 29098 -46825 -43445 -25403
160 -25403 12208 76441 54728 -48946 -77254 -24696 9239 47819 72768 -5163 -80662 -35519
172 -35519 16441 21386 45579 18994 -64787 -50424 25725 29201 19434 24224 -25201 -50779 5598
185 5598 33579 9803 2017 -8814 -23931 2932 32784 14263 -16323 -18997 -6136 3786 16202
198 16202 21724 -8132 -36797 -8611 23089 12148 9405 1620 -38358 -25243 28646 17230 -1321
211 -1321 16705 -18326 -44449 18536 36180 -10318 2886 7821 -34840 -4594 37139 -2016
223 -2016 -6408 19144 -20833 -22673 31652 7986 -22875 15046 5711 -26913 8531 16427 -18389
236 -18389 1898 14575 -17648 -4715 15266 -11715 -6100 18433 -4146 -13544 6644 -1234 -3472
249 -3472 14772 2860 -12113 -374 759 -26 13035 4795 -11239 -5633 -708 4044 15556 2459
263 2459 -17182 -7681 2298 3286 13226 4735 -18980 -13886 3181 8189 15348 5604 -23403 -19193
277 -19193 9212 14870 12514 7384 -18098 -25899 3056 22529 19443 6988 -18964 -28892 834
290 834 25276 18543 4712 -14474 -29935 -9484 24350 26355 4351 -18209 -28561 -9858 21373
303 21373 24946 2548 -18167 -25619 -10042 21269 30939 5624 -23060 -27776 -6675 22788 30430
316 30430 6457 -22915 -28088 -5405 25629 33799 7943 -26323 -34430 -9209 25005 35288 10082
329 10082 -25843 -34982 -9080 24411 32986 9308 -25536 -38581 -13789 25397 38087 12642
341 12642 -23592 -36143 -12181 24319 35052 10461 -22837 -35408 -13996 26185 43198 15710
353 15710 -25551 -38118 -14286 22028 36512 14154 -22084 -36951 -15681 23806 41061 15267
365 15267 -26239 -41615 -18205 21086 37784 15255 -19970 -34714 -17289 21231 41538 14542
377 14542 -26932 -37374 -16056 19984 43403 20741 -23527 -35071 -13575 16218 38362 21544
389 21544 -26744 -42095 -11886 19653 36665 25639 -20465 -45467 -15761 19072 28774 20048
401 20048 -14879 -43574 -17880 25925 34531 16912 -13568 -40705 -23872 22682 36866 14172
413 14172 -12773 -31178 -22180 18123 43008 19077 -21494 -35730 -19377 11527 35510 26003
425 26003 -14011 -36379 -17301 11114 26970 24092 -10888 -42495 -19076 19428 23316 17130 1505
438 1505 -33241 -26950 20543 28173 4947 -4468 -24129 -27109 22011 41934 3815 -14097 -16776
451 -16776 -27502 6886 47081 13407 -26655 -19578 -15646 420 41806 28312 -26163 -32260 -13735
464 -13735 -3981 26439 35887 -9174 -33932 -13541 2034 14984 27189 3125 -28397 -18921 5474
477 5474 13601 15487 7863 -12208 -17536 1714 16327 7167 -6153 -8007 -7090 699 17844 11458
491 11458 -15945 -15543 935 1115 11763 20071 -14957 -33878 1711 16998 7046 18771 2255
504 2255 -39192 -17181 22519 11225 11601 16543 -27959 -33153 20948 20189 -2591 18402 -2356
517 -2356 -42311 -295 30160 -4391 2691 17584 -25178 -19891 25296 1299 -15067 18947 -811
530 -811 -26383 13561 12450 -23710 5411 20486 -15874 -1385 18757 -19337 -16288 23019 6351
543 6351 -6958 14194 -4726 -25337 4811 17116 2478 6813 267 -20217 -10398 9381 11775
556 11775 8885 -720 -11255 -11277 -7521 6665 19457 928 -11717 16 -9557 -12516 20114 13891
570 13891 -14101 6051 4748 -28005 3773 29014 -12437 -3587 25955 -21181 -26552 28747 5810
583 5810 -18003 26975 4285 -40841 8138 20867 -22082 12514 28142 -33340 -17721 27046
595 27046 -11558 -10944 33498 -5108 -30322 15014 4349 -20158 19020 15970 -21477 2385 11412
608 11412 -19588 470 21680 -5705 -3461 12956 -12291 -15000 11899 6650 -761 9164 -3975
621 -3975 -17409 -3881 5361 8209 10698 -2009 -13494 -9487 -3859 8089 16846 2136 -9338
634 -9338 -7588 -10783 2000 22096 5768 -11036 23 -6814 -11549 17613 15994 -13271 -2550
647 -2550 5521 -13773 2616 18989 -10650 -10788 15240 -4099 -12824 14559 -683 -21544 11600
660 11600 17080 -13920 -2413 6921 -18352 -2395 26912 1365 -13363 4206 -9664 -13935 22887
673 22887 19784 -13729 -5888 -703 -16456 6780 28519 -1596 -15553 -268 -8945 -6597 21709
686 21709 11626 -15640 -6673 -1232 -8605 8903 15874 -8011 -10795 2334 -2677 441 11051
699 11051 -994 -10120 1187 4255 967 3736 -1671 -6222 1745 5780 3307 1377 -5738 -7377
713 -7377 2557 6635 5268 2505 -9321 -11677 4030 7049 2088 5751 -4877 -17446 176 12438
727 12438 1615 3277 1258 -16301 -5281 14420 2949 -726 7085 -10568 -12561 14454 9261
740 9261 -7682 4232 -149 -14214 6446 14497 -7358 -3882 4214 -9436 -97 14907 -4129
753 -4129 -10839 3675 -2794 -3418 12904 1548 -13677 -941 2584 -2266 9318 5870 -11493 -5111
767 -5111 4007 308 6804 7608 -8638 -7699 3848 1708 3457 7081 -4791 -8347 1775 2566 1845
782 1845 4616 -4250 -8126 2193 3103 -840 3157 -1725 -8347 1106 6120 139 585 -1725 -7270
797 -7270 1120 8165 1367 -195 56 -6819 -2204 9356 4882 -2288 -1712 -4842 -3496 6649 6320
812 6320 -1391 -2566 -4643 -4745 4149 6625 -967 -3879 -3482 -3690 2022 6032 621 -3467 -2867 -1913
828 -1913 1890 5161 1202 -2967 -2141 -474 1884 4136 1535 -2444 -2453 29 2452 2453 182 -1547 -2301
845 -2301 -1165 2033 2345 -1080 -2250 -1321 -1072 1444 1916 -1735 -1936 -79 -1317 790 3677 -1052
861 -1052 -3317 900 945 168 3207 572 -3164 332 1226 -137 3540 1858 -4310 -1117 2388 -735
877 -735 976 2473 -3165 -2946 1166 -32 677 1415 -2901 -2523 1411 -137 223 2313 -2233 -2328 2291
894 2291 266 33 3135 -1614 -2624 3676 389 -2284 4074 267 -4558 3587 2241 -4996 2346
909 2346 3244 -5575 921 4284 -6186 -1300 6007 -4378 -2536 7013 -3993 -6350 6831 678
923 678 -6387 5552 2526 -7771 2056 5034 -4291 1572 5267 -4109 -1507 4257 -1973 -1007 4699
938 4699 -529 -3007 1120 -274 -1435 1387 1171 15 -1360 -2518 -293 236 -660 2735 766 -4853
954 -4853 -131 1478 -3601 3548 6542 -5789 -3410 5465 -4016 -1990 11386 -395 -9272 4914
968 4914 1151 -7455 8240 7280 -10174 -867 5561 -7950 157 10637 -5576 -6570 6834 -2968
982 -2968 -6589 7636 1796 -7319 3492 2938 -7009 103 4550 -2539 1227 5338 -2670 -5040 1189
997 1189 1913 1119 3848 2907 -4702 -7109 1699 5700 891 2989 2554 -10070 -7476 7616 3624 -1120
1013 -1120 6388 -3964 -14419 2942 8056 -3435 5758 6072 -14515 -5617 11461 -1922 -1849 12352
1027 12352 -4400 -12728 7867 4092 -8194 7704 7299 -10459 13 7122 -8872 -3310 10981
1040 10981 -397 -4443 5221 -4048 -11171 4062 8929 -545 426 198 -10221 -6806 8795 8901
1054 8901 -697 -234 -2647 -11043 -1092 14259 4996 -4932 1895 -4330 -11411 7556 13359 -5276
1068 -5276 -2595 4966 -9781 -5059 13170 237 -8179 7051 -701 -11657 6232 5808 -10858
1081 -10858 2728 10622 -7971 -4262 7531 -6460 -5710 12420 4423 -7155 685 -1799 -7395
1094 -7395 6852 11833 -1697 -4975 -2278 -6338 -525 11803 7101 -6357 -6970 -2417 -2858 3171
1108 3171 11603 1697 -11857 -4861 1526 -2164 5647 9728 -6928 -9235 4083 -387 -1830 10380
1122 10380 725 -10952 3697 4774 -7678 4466 8074 -9438 -815 11434 -6490 -7345 8957
1135 8957 -2557 -6841 12151 2809 -14021 246 4135 -6462 6470 10617 -9706 -9308 2929
1148 2929 -1632 2543 11869 -1510 -11344 -2185 527 1104 9759 5553 -7761 -6880 219 1903 4075
1163 4075 5576 -38 -6411 -4874 2210 4156 452 1081 126 -5494 -2151 4334 -907 -2592 3506
1178 3506 -1014 -3888 4463 569 -7019 2856 5491 -4417 1668 5468 -7843 -4329 8948 1218
1192 1218 -2381 6362 -2782 -9616 4364 5880 -2850 3478 1797 -10077 -1740 7579 -1213 -307 4720
1207 4720 -5971 -7049 5377 2693 -2833 3295 -138 -6787 1434 4736 -1807 498 2647 -3022
1221 -3022 -1181 3807 147 -1426 1600 303 -830 1172 229 -890 42 -15 282 916 -1067 -1423 -27
1238 -27 -558 503 1317 -1412 -1457 666 -1146 -386 3124 -348 -2904 1341 877 -2102 2282 2556 -2702
1255 -2702 -126 2164 -1858 307 3432 -1852 -1792 2923 -1045 -2490 3035 535 -3438 1653 1379 -3505
1271 -3505 290 2127 -2422 -116 2115 -2352 -1435 2276 -608 -783 2656 -654 -2465 1807 1262 -1005
1287 -1005 1410 566 -2111 595 1972 -145 478 -22 -2141 131 2124 -258 -813 -189 -1871 -912
1303 -912 1901 667 -829 -811 -1771 -626 2194 920 -891 -2 -1035 -1184 2053 2124 -890 -667 -113
1320 -113 -445 1537 2019 -540 -1059 -507 -499 1244 2521 -776 -2692 -1040 -138 923 2319 139 -2898
1337 -2898 -2473 -429 1358 2817 974 -2602 -2753 -519 1500 2837 2146 -1517 -3249 -788 1858 2775
1353 2775 1798 -618 -2521 -1338 1522 2431 1137 -1149 -2571 -1560 1692 2467 21 -1728 -2106 -1848
1369 -1848 1158 3404 348 -2891 -2508 -1121 1182 3857 1799 -2491 -2635 -1063 569 3954 3431 -1976
1385 -1976 -3260 -899 439 2559 3441 -657 -3571 -1380 616 1748 2646 -464 -3841 -1871 949
1400 949 1788 1691 -371 -3505 -2510 1135 3220 2080 -1343 -3584 -2037 966 3510 3854 -585 -4452
1416 -4452 -2175 1170 2882 4284 675 -4828 -3097 1134 1583 3413 2338 -4270 -4462 1563 1458 823
1432 823 2816 -2162 -5421 986 2966 -570 1143 15 -4941 -146 5173 235 -1196 1019 -3034
1447 -3034 -2388 5302 3648 -2636 -1331 -768 -2368 2597 5427 -489 -3729 -1782 -1204 653 4249 1659
1463 1659 -4047 -3421 75 701 1871 2874 -1746 -4887 -172 2812 563 1184 823 -3833 -1662 4596
1479 4596 1730 -1621 1225 -1367 -3396 4006 4579 -3153 -1822 850 -2983 919 6410 -889 -5348
1494 -5348 8 -635 -1237 5057 2743 -5771 -3386 1035 -316 2583 4634 -2424 -5671 -47 2064
1509 2064 1265 3242 1402 -4593 -3318 2899 2676 492 1920 -717 -4893 250 4564 -668 -1202 2372
1525 2372 -2838 -3442 4850 1408 -5416 1601 2754 -4627 1124 4795 -5644 -3423 5980 -458 -2443
1540 -2443 5363 -1943 -7466 4413 4726 -3098 3057 2188 -8486 -1319 7367 -305 -351 4280 -4791
1555 -4791 -6499 4490 3573 -1506 2114 -463 -6388 -1024 4056 864 170 1074 -2416 -3368 861 2865
1571 2865 359 -389 1297 -875 -3014 1623 2946 -2046 761 4045 -3173 -3399 3880 -739 -2887
1586 -2887 5896 1344 -6943 1203 2659 -5629 2566 6821 -5854 -3964 4610 -3601 -2728 8113 -212
1601 -212 -6414 3601 439 -6101 4737 5118 -5426 537 4291 -5281 -1529 6331 -704 -1919 4092
1616 4092 -1626 -4821 2158 2183 -874 2323 663 -4479 -2275 1597 1362 1373 1123 -1870 -4040 -1734
1632 -1734 2959 3011 -111 83 -1647 -4909 600 6012 444 -1509 1620 -3335 -3360 5825 3008 -3762
1648 -3762 1504 439 -5521 2576 5538 -4533 -1833 4193 -3350 -2103 5909 -2298 -6063 4103
1662 4103 1889 -3478 3443 862 -7226 793 6075 -1144 2 2183 -5632 -3425 6260 3372 -1056
1677 -1056 631 -3026 -4746 2968 5723 352 -1404 -2260 -4135 -129 5103 2971 -2018 -3421 -2299
1692 -2299 -539 2480 3935 -134 -4645 -2376 1520 1814 2352 1623 -3795 -3680 2628 3282 714 943
1708 943 -2325 -4722 2094 5610 200 -1275 -1107 -4422 -247 6631 2408 -3644 -2413 -2692 -1352 5394
1724 5394 4467 -3537 -4358 -1755 -781 3815 5658 -1761 -6115 -1770 1107 2665 4941 882 -5725 -3798
1740 -3798 1978 3530 3511 1342 -4206 -4782 1089 4298 2667 518 -2864 -5336 -444 4841 2988 -904
1756 -904 -2781 -4109 -1399 4297 4039 -1163 -3479 -3235 -779 4070 4801 -635 -4264 -3100 47 3959
1772 3959 4944 110 -4716 -3875 351 4130 4668 180 -4619 -4440 -401 4105 4738 72 -4573 -4608 -994
1789 -994 3658 5002 483 -4273 -4101 -1082 3062 5350 1172 -4443 -3994 -515 2610 4846 2050 -3815
1805 -3815 -4287 -225 2608 4142 2295 -3554 -4814 -120 2649 3226 2095 -2917 -5151 -638 3006
1820 3006 3103 1485 -2553 -5027 -974 3235 3100 1306 -2062 -4719 -1282 3730 3545 993 -1918 -4083
1836 -4083 -1378 3344 3666 1178 -1836 -4011 -1784 3207 3752 704 -1839 -3648 -2269 2470 3652
1851 3652 710 -1947 -3413 -2220 2102 3648 727 -1773 -2747 -2122 1808 3902 973 -1803 -2350 -1615
1867 -1615 1602 3632 1122 -1651 -1857 -1477 1075 3626 1352 -2171 -2087 -896 576 2668 1594 -1939
1883 -1939 -2477 -816 639 2031 1391 -1626 -2528 -602 1035 1870 1154 -976 -2288 -917 1241 2067
1899 2067 1015 -781 -1545 -703 856 1928 933 -787 -1285 -736 222 1590 1106 -1403 -1071 4 -390
1916 -390 562 1358 -997 -1668 412 88 -502 1149 -129 -1718 543 1175 -672 373 882 -1270 -264
1933 -264 1752 -155 -741 1001 -225 -877 1186 626 -1065 87 437 -733 197 869 -851 -821 555
1950 555 119 -785 115 175 -788 101 1005 -166 -1254 -15 763 -15 763 830 -1500 -1262 1418 996 214
1969 214 1055 -1073 -2755 757 2558 22 271 -159 -3169 -923 3276 1041 -1054 -59 -2175 -2489
1985 -2489 2746 2805 -1396 -829 -385 -2448 1079 4045 -306 -2377 188 -640 -341 3227 1288 -2829
2001 -2829 -1063 1248 171 1467 1502 -2399 -2721 1231 1971 613 496 -1719 -3623 5 3627 1734
2017 1734 -979 -1615 -3168 -1739 3555 4081 -715 -2574 -2000 -1845 1862 5345 1101 -3721 -2132 -716
2033 -716 142 4264 3341 -3358 -3616 283 395 1683 3622 -1431 -4905 -142 2118 280 1782 408
2049 408 -4504 -1607 3711 1314 -677 396 -2654 -2677 3541 3653 -1680 -1524 -1000 -2371 2195 5515
2065 5515 -190 -3981 -1422 -955 725 5063 2257 -4523 -3583 142 912 3126 3360 -2708 -5491 -758
2081 -758 2376 2263 2471 -471 -5145 -2363 3053 2951 1076 204 -2937 -3230 2277 4140 221 -1118
2097 -1118 -930 -2240 396 4591 1190 -3454 -1266 25 -195 3009 2355 -4046 -3650 1200 1119 1415 2757
2114 2757 -2653 -5547 652 3657 1204 1913 -389 -5886 -2128 4765 2902 452 429 -3797 -4180 3295
2130 3295 4883 367 -466 -1988 -4186 577 4937 1313 -1869 -1164 -2437 -1022 3712 2353 -2458
2145 -2458 -2269 -400 -214 1715 2437 -1586 -3329 -6 1894 1504 1098 -730 -3476 -1164 3207 2791
2161 2791 120 -983 -2488 -2381 2477 4431 130 -2202 -1849 -2444 561 4792 1901 -3169 -2192 -1111
2177 -1111 -1115 3111 3639 -2224 -3471 -184 -218 1011 3587 -225 -3720 -509 1271 301 2174 1202 -3073
2194 -3073 -1660 2043 1004 412 1044 -1733 -2665 1608 2235 -455 -380 -630 -1995 125 2796 444 -1729
2211 -1729 -1079 -1030 -133 2305 1474 -1620 -1590 -336 197 1542 2067 -674 -2137 -296 941 934 1251 250
2229 250 -1738 -1325 889 1040 400 160 -820 -1476 137 1222 199 -510 -403 -845 -504 939 724 -871
2247 -871 -526 112 -282 521 1095 -518 -1019 664 470 -77 904 226 -1441 144 1187 -59 -43 616
2265 616 -953 -876 1080 373 -787 218 -240 -1048 505 763 -845 -257 300 -709 28 1072 -420
2282 -420 -879 615 161 -163 701 -100 -649 542 616 -12 508 -77 -752 425 883 -233 -84 -85 -631 74
2302 74 718 -103 -317 -511 -733 269 909 -352 -581 -263 -786 204 1309 158 -608 -190 -345 -165 1305
2321 1305 688 -749 -25 -193 -233 1036 914 -875 -602 -14 -286 613 1009 -859 -932 10 -4 431 898
2340 898 -736 -1471 -43 397 377 1015 -271 -1602 -222 735 570 1014 28 -1483 -441 1012 782 635
2358 635 88 -1319 -903 831 848 426 -45 -1249 -845 554 623 184 -113 -965 -909 641 860 114 -273
2377 -273 -871 -737 662 1087 190 -158 -788 -702 725 1480 299 -270 -722 -867 535 1496 366 -576 -763
2396 -763 -1002 238 1544 537 -783 -957 -897 -144 1196 815 -676 -1098 -581 105 1050 970 -388 -999
2414 -999 -554 248 905 1000 -160 -915 -575 406 887 613 33 -423 -743 50 867 291 -537 -373 -475 -271
2434 -271 855 348 -879 -334 46 -342 690 851 -1036 -859 515 98 369 1265 -510 -1521 387
2451 387 681 230 1049 -18 -1600 -433 992 231 475 533 -1117 -1219 764 660 -73 207 -507 -1190
2469 -1190 30 868 -30 -161 1 -504 -133 765 298 -394 -240 260 34 58 482 27 -744 180 812 -122
2489 -122 -70 441 -771 -688 1127 319 -887 339 -185 -1204 657 1039 -1081 -432 567 -982 -172 1514
2507 1514 -72 -1128 699 84 -855 1164 940 -1217 -186 778 -738 45 1483 -456 -1123 689
2523 689 146 -723 596 540 -1012 -336 666 -506 -663 625 -122 -858 568 389 -1072 -86 804 -480
2541 -480 -258 1019 -416 -1379 819 842 -552 764 816 -1369 -365 1503 -117 -542 1148 -452 -1433
2558 -1433 989 701 -1075 468 693 -1514 -374 1126 -714 -673 1189 -296 -1217 664 243 -1086
2574 -1086 567 1094 -692 -260 726 -591 -516 1151 529 -693 180 161 -933 232 1309 -20 -798
2591 -798 121 -387 -1062 983 1107 -1076 -543 539 -971 -328 1643 178 -1486 599 150 -1206 950
2608 950 1309 -1172 -213 1247 -864 -364 1684 -282 -1284 1193 315 -1397 651 739 -1341 230 1224
2625 1224 -1065 -710 880 -546 -691 1170 110 -1220 205 250 -852 478 1270 -486 -835 459
2641 459 -227 -198 1142 652 -857 -332 368 -355 259 1236 -109 -1077 49 175 -534 569 861 -1051
2659 -1051 -856 492 -142 -396 1020 123 -1157 253 612 -722 357 1088 -775 -562 941 -194 -571
2676 -571 962 150 -947 565 740 -703 11 591 -673 -287 1066 -60 -754 211 -148 -718 528
2693 528 903 -691 -665 225 -378 -151 1009 184 -1242 -244 437 -129 785 980 -824 -886 636 337 117
2712 117 890 -201 -1333 26 963 44 284 267 -1299 -728 972 359 -178 394 -585 -987 520 889
2730 889 -254 -224 -222 -791 105 1277 238 -459 -65 -264 170 1001 611 -470 -547 -115 214 691 451 -320
2750 -320 -890 -463 460 789 388 -262 -939 -829 295 947 304 -369 -702 -899 113 1194 551 -611 -568
2769 -568 -470 -19 1233 1107 -605 -740 -193 40 857 1269 -355 -1177 -218 151 545 1056 -212 -1342 -479
2788 -479 498 406 698 21 -1259 -904 489 661 401 33 -1140 -1026 569 999 599 -19 -895 -1095 498
2807 498 1284 725 -208 -799 -897 211 1291 809 -334 -919 -954 110 1267 743 -383 -993 -1006 -81 1138
2826 1138 799 -233 -1047 -1041 -83 1069 1043 -167 -813 -884 -100 1007 1222 -139 -871 -716 -99 991 1204
2845 1204 -63 -973 -731 -138 845 1140 -25 -1131 -874 -9 614 806 46 -1168 -970 142 812 864
2863 864 249 -1055 -1132 73 915 899 350 -908 -1103 19 1162 971 166 -875 -1188 -196 956 872 108
2882 108 -747 -1039 -277 732 894 21 -807 -924 -227 637 864 192 -620 -754 -118 632 811 271 -439 -806
2902 -806 -175 734 847 312 -235 -770 -326 645 827 220 -393 -794 -379 439 773 105 -528 -733 -479 376
2922 376 693 183 -628 -572 -340 380 682 377 -403 -545 -101 219 588 516 -285 -628 -59 362 350 325 -73
2943 -73 -702 -144 392 237 31 38 -614 -565 222 370 -248 -77 -1 -368 28 542 -22 -224 280 -138 -245 493
2965 493 232 -188 -50 164 -261 165 564 -124 -294 247 -16 -218 369 230 -432 -110 138 -333 -103 282
2985 282 -227 -367 71 5 -330 270 416 -249 -207 155 -202 26 707 208 -320 12 77 -185 373 517 -418
3006 -418 -548 199 -40 1 496 -45 -936 -141 301 -5 128 138 -771 -559 550 331 -235 227 -402 -774
3026 -774 442 940 -140 -434 39 -534 -9 1098 414 -765 -289 -72 -104 727 901 -674 -913 38 42
3045 42 272 960 -206 -1266 -461 430 263 427 377 -1164 -965 554 676 200 414 -455 -1294 244 1117
3064 1117 183 -125 140 -1027 -363 1323 674 -638 -188 -336 -485 966 1020 -774 -828 -84 -212 325 1129
3083 1129 -340 -1455 -308 442 290 794 184 -1247 -917 697 740 448 159 -914 -1095 319 1151 532
3101 532 -140 -498 -947 -268 1233 960 -399 -774 -636 -585 649 1286 -165 -1264 -421 -266 146 1189
3119 1189 491 -1372 -673 457 160 466 817 -1031 -1224 691 743 69 544 -363 -1545 239 1442 117
3137 117 -129 -126 -1395 -411 1436 660 -709 -348 -604 -763 1013 1325 -585 -963 -400 -442 484 1386 75
3156 75 -1064 -573 171 402 977 522 -1026 -864 279 693 669 420 -529 -1200 -57 869 591 -49 -375
3175 -375 -900 -628 959 900 -428 -564 -477 -504 558 1276 -70 -1038 -363 -36 278 1282 387 -1116 -633
3194 -633 195 337 748 666 -787 -1088 279 697 412 519 -401 -1293 -169 866 442 22 -207 -929 -625
3213 -625 647 762 -105 -327 -350 -653 399 1115 3 -608 -229 -264 53 986 403 -765 -404 104 161 642
3233 642 574 -718 -802 112 257 324 448 -257 -902 -16 562 286 149 -76 -750 -328 603 457 51 -111 -477
3254 -477 -403 431 693 223 -215 -383 -323 225 634 243 -270 -447 -3 191 296 343 -202 -451 -163 271 93
3275 93 54 -50 -368 -314 383 210 -87 14 -127 -371 195 534 -23 -138 64 -224 2 540 114 -206 92
3296 92 -177 -200 431 113 -467 -137 7 -239 77 305 -241 -300 8 -41 -93 145 -123 -299 62 55 -38 98 77
3319 77 -66 88 97 64 89 11 -64 93 104 41 -15 -62 -74 -86 48 -33 -42 -91 12 67 -48 -114 43 86 7 -116 64
3346 64 33 -74 46 -5 45 -31 29 -65 162 129 -51 -42 -20 -125 13 177 -12 -199 50 22 -119 7 32 11 -53
3371 -53 -70 47 90 49 -47 -178 51 2 -66 214 -142 -139 -118 314 165 160 -18 -124 12 103 256 65 -93 -85 -143
3396 -143 87 239 75 -30 -113 -397 -43 119 34 -229 -88 -32 88 184 88 -206 -94 114 218 178 203 -28
3418 -28 -137 35 268 215 159 -171 -138 -29 237 222 79 -97 -254 -188 83 246 112 -238 -273 -104 -41 214 68
3441 68 -180 -183 99 37 274 300 -16 -258 62 213 120 67 -93 -200 -73 251 -1 61 46 -354 -32 320 323 -12
3465 -12 -157 -242 -280 387 316 -159 -239 -125 -266 192 422 26 -361 -165 -2 58 336 177 -345 -189 106 81
3487 81 90 149 -170 -350 -12 270 76 109 -103 -402 -229 289 100 -224 -104 -76 -216 146 362 -212 -367 23
3509 23 -200 14 435 128 -405 -19 221 49 286 319 -309 -335 159 189 111 229 -97 -573 137 296 103 109
3531 109 28 -535 -136 335 183 -162 -3 -284 -182 278 337 -95 -178 45 -83 88 416 28 -284 17 179
3552 179 15 183 320 -310 -285 223 150 -1 280 -68 -529 88 251 -71 -57 59 -470 -380 367 122 -257
3573 -257 79 -17 -349 193 518 -176 -112 25 -256 -97 505 157 -240 212 60 -45 182 227 -238 -238 200 -76
3595 -76 18 281 -117 -390 23 225 -174 4 132 -214 -183 288 73 -114 216 11 -190 161 284 -177 -221
3616 -221 113 -179 -127 408 82 -304 -12 45 -208 86 274 -267 -242 163 -101 -141 243 22 -372 4 100 -86
3638 -86 28 391 -144 -253 199 144 -153 222 118 -323 2 156 -177 -78 335 -42 -228 258 93 -130 11
3659 11 138 -210 -136 182 -150 -199 72 -214 -207 223 42 -125 21 40 -213 51 289 -3 -224 8 -79 -58 330
3682 330 232 -183 -54 42 -105 83 180 -199 -416 -4 -19 14 197 -35 -414 -232 216 215 14 92 -203 -374 47
3705 47 293 36 -80 11 -133 38 468 161 -106 -75 -221 55 275 402 -31 -208 -56 -109 69 345 -53
3726 -53 -403 -125 139 8 254 176 -288 -159 125 153 198 157 -277 -323 25 435 38 154 -115 -351 -7 289
3748 289 300 -70 -194 -347 -140 345 393 -197 -213 -173 -96 220 315 -32 -333 -276 -69 348 338 93 -406 -204 -14
3771 -14 225 375 42 -212 -364 -4 388 321 15 -344 -393 -109 367 481 16 -375 -453 -291 163 317 41
3792 41 -487 -338 -202 110 406 122 -376 -351 -78 318 400 160 -287 -269 -2 420 306 290 -215 -464 13 333
3814 333 403 145 -191 -513 -248 327 351 61 -174 -492 -263 337 390 70 -267 -385 -176 206 461 90 -265
3835 -265 -422 -105 169 468 225 -216 -256 -231 240 482 212 -251 -409 -238 265 373 155 -268 -397 -185 251
3856 251 389 159 -303 -400 -128 142 394 156 -191 -371 -153 181 335 295 -48 -320 -208 144 320 192 -204
3877 -204 -350 -300 213 294 156 -29 -438 -209 23 197 206 -109 -348 -263 203 360 196 -102 -209 -184 84 246
3899 246 201 -137 -270 -98 130 287 168 -105 -314 -253 -1 368 138 -149 -241 -83 107 261 129 -144 -323
3920 -323 -176 87 134 195 -45 -302 -231 79 167 155 -23 -132 -191 94 297 144 -82 -71 -126 59 230 42 -67
3943 -67 -102 -22 80 96 60 -47 -184 -78 8 118 103 -33 -155 -121 48 95 -22 -30 -67 -65 91 57 -42 114 62 -66
3969 -66 83 147 0 -65 -2 6 -37 160 113 -38 47 80 -84 -40 120 -160 -82 31 -129 -101 16 26 13 145 22
3994 22 -160 94 19 -8 71 -53 -64 44 -34 37 -48 76 -36 16 34 147 -20 -110 -41 -11 -77 199 154 -50 -121
4019 -121 -76 44 58 167 -87 -221 -100 177 -39 218 69 -205 -146 105 141 109 145 -19 -211 65 199 43
4041 43 80 -84 -198 -3 295 133 -135 -96 -194 -276 207 262 -151 -210 -104 -90 157 317 -80 -288 7 38 108
4064 108 246 105 -141 -259 96 135 120 182 -164 -276 33 234 7 77 -176 -414 -128 280 205 -40 -161 -271
4086 -271 -250 131 274 -77 -180 -73 -186 170 327 -14 -237 -113 -2 125 378 268 -285 -204 132 201 342
4107 342 221 -187 -398 52 193 226 70 -80 -336 -128 305 294 86 -81 -340 -188 270 388 20 -200 -178
4128 -178 -164 187 402 214 -334 -323 -97 38 353 231 -213 -225 -77 122 290 280 -104 -448 -82 197 285 107
4150 107 -69 -398 -158 320 381 66 -54 -279 -198 280 344 157 -89 -247 -208 87 442 147 -285 -200 -107 40
4172 40 365 218 -137 -341 20 16 228 301 -147 -332 -108 49 156 237 62 -220 -219 223 266 149 42 -253 -285
4195 -285 196 292 149 -62 -46 -178 10 328 230 -197 -252 -134 -93 243 288 -77 -241 -222 42 157 148 -24 -292
4218 -292 -149 58 97 253 81 -250 -82 85 231 205 56 -44 -310 38 304 164 33 -101 -330 -69 180
4239 180 183 -115 -109 -156 -39 192 175 -44 -189 -100 -80 109 278 64 -137 -73 49 24 71 65 -114 -159 -13 114 118
4264 118 51 -150 -136 48 138 24 -80 -84 -141 -88 37 49 -27 -149 -41 10 135 46 -91 -43 -56 -95 86 111 101
4289 101 -84 -54 -20 89 162 86 5 -68 83 -33 15 17 -119 -58 -22 9 9 -37 -67 -69 41 70 18 -56 1 -37 -9 25
4317 25 81 95 -10 -54 -23 46 47 57 103 -47 -58 143 -34 5 104 -99 52 30 -140 -41 32 -109 -2 -192 -21
4342 -21 -68 -11 -18 -1 35 -101 -148 4 0 102 -17 -29 92 23 72 13 -13 -53 -7 24 116 99 46 -90 53 53 34 48
4370 48 -85 -101 15 72 114 107 17 -73 -18 52 40 53 -68 -60 -104 111 81 35 -80 -100 -103 81 147 49 46 -24 50 44 26 62
4400 62 -108 -166 11 -22 -33 162 -71 -101 -95 -4 129 -40 -41 -77 -96 -9 142 74 44 -68 -156 60 96 101 -29 -137
4426 -137 -70 24 52 142 -10 -104 -159 -52 95 115 -108 -138 -160 -31 19 37 27 -168 -240 74 37 79 -8 -94 -91 3 190
4453 190 169 92 -10 -172 80 39 146 79 -22 -185 8 95 213 -10 -8 -204 -125 118 80 -79 -125 -315 -68
4476 -68 197 127 100 -174 -116 -48 125 123 53 -206 -126 -37 119 70 167 23 -154 -135 -16 97 -12 -25 -120 -172 153
4501 153 132 18 26 -110 -80 76 121 6 -38 -48 -8 132 119 26 -117 -117 -11 -70 64 6 -66 -177 -60 36 100 40
4527 40 -152 -190 -53 124 92 103 -18 -182 -113 152 176 -11 90 -98 -131 -57 24 38 -34 2 -34 111 94 48 -101
4552 -101 135 -19 -42 -21 -15 -19 -66 -22 8 90 57 -64 -183 -33 20 83 -27 83 58 -54 26 22 79 77 -117 18 1
4579 1 106 31 -39 -2 -41 -138 146 8 -132 26 -38 -67 34 39 48 9 48 138 -45 83 -46 -73 -28 12 4 0 40 -92
4607 -92 -2 98 -60 -133 63 -7 -150 -7 89 3 -34 -73 -10 -23 2 68 34 84 -20 -20 -35 58 47 -64 16 34 -23
4634 -23 58 -68 -36 98 -6 -97 -54 79 13 -101 150 -14 -65 99 25 -8 -77 21 30 -128 10 27 -24 -2 57 16
4660 16 -21 -23 -9 70 9 -174 -21 30 111 35 -20 58 -80 20 142 39 -14 24 -5 7 -24 22 -65 -25 -2 26 -14 43
4688 43 -118 -40 -22 -39 -65 23 25 -87 58 66 -47 21 -89 -11 13 16 34 3 35 13 111 92 -101 14 -18 14 69 88
4716 88 90 -51 -44 -2 16 -20 58 100 5 -62 -22 -12 -37 5 62 103 31 57 21 3 2 -104 83 155 -15 31 18 45 -44 142
4746 142 -11 -97 -7 -72 40 -27 14 -96 11 85 54 165 14 123 -122 38 56 35 -24 -10 -71 26 -17 57 -15
4771 -15 -60 -91 60 11 3 129 21 115 -57 70 -51 111 -83 -98 21 5 49 167 44 -13 -54 17 -9 33 -105
4796 -105 -50 -114 -18 119 -10 83 -76 47 -52 30 -23 9 -50 -48 -3 9 39 -38 -30 -51 107 38 55 18 5 -38 -92 -81
4824 -81 42 -12 -71 -22 -53 -123 9 22 -55 85 62 45 78 47 110 -35 -6 36 75 -22 -30 -25 0 20 60 66 -56 -68 7
4853 7 -36 107 -39 -39 -5 -75 35 71 -41 -69 0 66 35 12 52 -88 -12 -58 30 38 -20 -52 -64 35 -2 4 19 -15 -34 -92
4883 -92 -5 75 -27 14 68 5 -29 -6 29 -69 -71 -52 75 141 18 51 31 -58 33 93 -14 5 -75 -29 28 54 21 -52 -103
4912 -103 -40 -34 -15 -74 33 7 21 -30 12 -23 -7 -17 -55 -31 41 -21 97 77 0 111 70 -63 -102 40 -24 17 63 132
4940 132 3 -20 -45 -71 -37 0 -55 -29 119 -13 -87 -54 -30 -7 -71 -12 -34 59 -106 -30 40 15 15 14 74 36 -102 -6
4968 -6 -5 -137 -23 50 67 36 -2 130 -47 -7 66 96 35 24 47 -17 3 -83 -25 75 79 -26 -161 -153 66 -88 41
4995 41 55 -31 11 -35 35 85 115 23 23 -57 113 1 125 -135 -59 17 83 34 -13 5 63 -22 -43 -12 17 -11 47 -45 19
5024 19 -4 -25 -56 -4 -14 -63 65 85 81 42 17 -63 74 47 -94 16 57 117 -10 8 -8 -52 114 10 92 -98 28
5051 28 23 -21 48 55 100 12 -139 -86 4 -39 -12 58 59 -35 -7 135 -44 -159 -96 -113 22 29 -13 14 38 -83 -2 -62 26
5080 26 -1 -27 -5 91 -87 84 46 -76 -26 81 -96 -16 -20 -118 -34 32 140 3 1 41 77 -94 13 64 75 70 -55
5107 -55 2 -26 16 -33 58 7 -45 19 -133 -22 29 34 -30 -16 29 -6 -28 -91 18 76 -116 -45 36 42 -12 0 -10 4 -32
5136 -32 -32 43 -7 -26 10 -30 145 92 -5 42 -20 22 -7 34 -40 1 75 -50 93 5 -75 -32 -106 -84 -75 -134 -122 -43 -120 -46
5166 -46 -24 115 -42 -95 -8 -62 -13 19 18 -92 -89 82 -27 27 41 -48 -66 -8 -15 53 147 117 66 -30 -123 21 27 94 -4
5195 -4 57 17 -5 -1 -19 -74 -54 12 -52 0 -51 -52 -17 21 45 -66 -15 25 91 -36 0 -60 -123 -17 -22 85 20 59 -40 -38 111
5226 111 -25 118 -68 34 -36 72 -3 -21 -8 -8 -58 -24 64 22 97 -20 -52 -91 -62 -34 -8 -53 73 13 20 14 -136
5253 -136 20 6 94 71 49 -8 61 -57 43 -36 47 57 -111 -18 -123 -21 -40 -42 138 -123 -30 20 -131 -23 -24 -59
5279 -59 81 9 -28 -63 20 9 -36 106 -121 56 -76 -39 -143 37 -7 14 26 -118 -13 -126 -16 8 -49 23 125
5304 125 19 -55 28 65 -98 -83 63 -37 -5 43 -3 -19 114 -31 -58 61 -24 23 43 172 -35 82 -6 92 -16
5329 -16 14 -32 -69 -28 -10 -26 -52 -1 5 -81 34 -100 97 69 5 -62 -46 91 -20 22 36 37 -43 20 66 19 45 116 42
5358 42 -15 -33 -63 167 137 74 -68 127 2 36 69 -8 -57 19 -50 -19 -61 46 -32 -34 -26 124 6 -100 21 19 -63
5385 -63 -4 -52 72 80 -44 -36 27 64 23 39 136 -84 -33 -34 47 -21 27 45 -32 40 -23 147 49 53 -85 -19 63 -76 -10
5414 -10 -115 -33 -18 -46 -101 30 -36 -224 -5 39 -55 -19 -6 -49 -82 -20 -67 -24 -1 110 16 48 9 -6 -47 12 -48 14
5442 14 68 44 -4 -15 2 -71 20 -14 -15 -54 21 5 -53 -63 -27 -44 36 46 33 -58 68 56 1 -19 6 64 2 33 67 -64
5472 -64 -17 -49 32 87 -78 74 -10 32 -31 -12 -53 85 9 32 154 11 122 22 -22 -8 -18 21 -19 -11 37 -36 56
5499 56 124 24 22 -2 60 20 -72 -37 -121 -20 -77 44 21 -79 -52 19 40 4 -21 25 -4 -46 -76 -87 -57 50 -14 -59
5527 -59 -72 24 -52 72 -47 28 117 -79 95 -41 69 47 -45 -25 -36 38 -43 11 -122 8 43 0 24 -24 -132 -27
5553 -27 156 55 -8 -11 0 24 22 25 -43 -24 40 29 -47 121 -76 -79 -91 59 -73 36 68 7 39 -19 -41 38 43 23 2
5582 2 -9 25 12 58 -60 -112 -29 87 88 8 2 105 -75 -12 79 6 -122 -113 -94 21 97 44 37 -27 81 -41 -34 37 -2
5611 -2 -63 -53 -5 59 74 59 -65 -75 31 59 -14 62 2 84 34 -10 83 -67 -63 30 -37 -2 1 -24 100 -76 48 59 40
5640 40 -18 -65 3 70 -24 16 -3 67 90 -2 48 43 -47 -16 -28 55 75 -49 -40 -52 2 -34 41 -2 188 -33 -85 -42 63
5669 63 69 -82 -25 -50 -14 -81 -1 -5 6 -152 -39 63 -25 56 37 74 -63 -105 26 -12 56 16 -110 -17 68 -39 33
5696 33 36 70 -58 -90 19 70 29 -12 55 -40 2 4 149 -133 -28 -99 -2 2 -49 24 -54 85 -51 -63 16 -42 -33 -46 -15
5725 -15 -89 46 -52 23 -44 -23 41 51 73 49 -19 50 75 -68 20 63 -24 -28 39 -102 42 -42 29 69 45 -11 -22 4 40
5754 40 -52 -47 33 12 11 16 -120 -8 95 -68 -2 -1 35 -71 54 -31 -123 -73 -21 -41 -69 23 -65 35 -136 -40 -11 -75
5782 -75 -110 -75 -15 18 -12 22 -28 -11 -71 109 36 49 61 -65 74 100 5 88 -70 -111 3 107 59 63 -76 -60 -35
5809 -35 67 -16 -19 12 -106 -43 -19 145 8 -34 -45 -64 -24 -92 5 -20 -65 -67 -45 92 54 -13 -64 -59 66 0 64 -88
5837 -88 -26 -48 40 63 -42 -88 -87 4 8 114 -10 -75 -98 36 87 119 96 -116 -97 -62 -10 62 135 -94 1 -115 119
5864 119 18 40 -41 -22 -93 57 113 -21 -111 -64 -35 121 32 56 55 -175 37 53 51 -17 -54 -60 -35 28 38 9 -26 -173
5892 -173 -53 33 55 -144 -39 -107 -35 -4 74 57 -81 25 -137 29 40 7 57 -41 30 112 -57 60 47 -56 24
5917 24 59 87 -67 47 -130 -112 112 38 86 -62 -28 -17 118 85 74 -6 -36 -31 57 77 21 28 -83 -13 -27 64 42 -56
5945 -56 -96 -147 1 93 35 -112 -1 60 63 -21 10 -38 -84 23 99 133 17 -39 -116 72 47 25 -66 24 -18 -15 45 48 36
5974 36 50 -106 -39 -59 18 -13 -95 19 29 -4 -15 18 -113 12 -122 -142 -2 -84 0 -91 28 -16 -20 75 10 -29 -47
6001 -47 66 -10 84 -9 20 11 -18 64 46 -32 -13 -39 -42 59 51 -6 12 -25 58 3 -10 -6 -34 5 49 129 -6 81 -74 3
6031 3 -47 -95 -94 -48 -57 47 -29 9 -47 -105 51 -38 -6 -55 34 70 -5 28 -16 120 25 6 23 -30 -121 96 28 -22 13 159
6061 159 24 -8 -144 -44 42 -52 -119 48 -142 -124 17 76 13 -101 1 -11 110 57 44 -2 -59 2 7 78 91 -38
6087 -38 85 -34 8 97 -29 0 -56 33 -3 47 33 -86 -19 -52 -37 80 29 -1 38 95 -58 89 36 111 -84 -42
6113 -42 94 35 44 -127 30 -23 16 24 -9 -116 -15 -145 44 58 39 -74 -52 -40 59 -61 23 -57 66 -104 -100 122
6139 122 38 -111 -133 35 119 53 17 -63 -32 -94 96 71 -31 69 -146 -58 37 46 46 0 -29 -117 -48 81 -39 -16 -90
6166 -90 -30 6 78 34 -44 -122 -19 24 10 23 59 -61 -37 28 109 67 0 -69 -28 34 -35 10 28 -66 -61 32 -37 -19 -2 14
6196 14 -34 -111 -46 7 -71 7 -79 -48 -31 5 -76 -58 -11 54 117 73 -43 -153 -29 30 -22 -48 46 -93 -133 25 112 111
6224 111 62 11 -45 87 -13 -71 10 -125 -78 52 62 1 -34 -11 -84 -19 29 9 -48 -109 -11 -62 90 -7 -123 -59 -126
6251 -126 52 79 78 -9 -73 -65 71 81 -44 -60 -21 -33 -39 -28 85 -128 -66 32 54 88 66 -93 -17 -39 5 78 113 83
6279 83 -90 -7 -61 111 29 -56 7 -79 31 18 9 4 132 -60 -56 115 6 -81 8 -21 -7 42 -15 52 29 88 20 29 71
6308 71 -12 16 -80 -44 -48 104 -53 -44 -54 19 -41 3 40 -25 -13 2 -13 84 -131 5 -137 -17 -59 -85 35 -70 -107
6335 -107 -56 -27 23 146 20 57 -96 16 50 2 15 89 77 110 13 54 -60 65 32 92 16 -33 57 -25 4 32 12
6362 12 65 73 55 0 -105 -57 -48 -25 -42 -15 157 -53 1 -17 -20 72 -9 -87 -111 73 -28 -24 -58 -16 0 -64 144 31 -14
6391 -14 -111 -84 17 -44 -25 -1 39 63 -47 21 -49 19 -7 96 -9 -6 24 71 -106 -31 87 -73 -55 -54 16 -89 -72
6418 -72 -41 9 30 -96 -48 54 21 37 138 11 180 23 9 -4 -20 71 -18 29 -105 -59 -5 20 -15 -22 41 30 -54
6445 -54 126 42 35 -57 37 -19 -74 1 -107 72 25 -165 12 -83 44 64 -59 43 55 7 -20 -17 -65 99 -78 159
6471 159 -122 5 96 -106 136 20 88 0 28 -22 -70 -113 121 63 -12 1 -100 97 -47 -22 60 -48 -24 -194
6495 -194 -80 78 27 6 -77 24 -28 -27 77 56 30 43 13 -32 39 -27 -48 -120 34 -17 43 -26 -42 50 -26 25 52 30
6523 30 32 -52 42 -95 65 -124 -23 -113 1 -7 -56 26 -78 -135 -104 -29 -103 -60 -58 -2 -23 100 15 -41 -104 9 -47 -12
6551 -12 -19 54 -90 123 99 104 -16 -56 34 27 4 51 -6 58 -41 85 12 -31 -60 -40 -50 -95 -57 17 0 57 22 -73 11 -40
6581 -40 -34 -61 -51 -48 77 -24 -67 -1 -25 -87 -100 -4 -42 29 -34 29 48 26 -68 50 46 -72 66 35 78 10 70 90 49
6610 49 -60 -60 14 -77 43 29 25 82 -131 -28 -14 77 -92 52 68 -15 65 -71 -74 66 -40 -77 -15 14 97 -77 -53
6637 -53 -25 10 -39 8 -29 9 78 90 -55 -158 -5 -51 -40 12 6 -76 19 -52 -32 139 104 -17 -53 -5 -33 29 89 -28
6665 -28 -62 0 60 35 51 53 -11 -57 10 -11 97 -146 -40 28 -98 7 -49 -31 48 -93 14 18 48 -28 11 36 -87
6692 -87 57 -48 -130 18 -62 -68 -3 116 100 -18 -111 -65 -31 -4 8 -43 -29 -45 -21 -67 -44 57 66 -4 -48 72 -49
6719 -49 -25 -2 19 1 -20 54 8 -9 -55 131 -32 6 99 -49 73 -82 104 106 1 -57 -33 -44 -15 92 -58 -96
6745 -96 -14 6 2 -8 -25 -128 9 -68 44 -82 -18 -77 21 5 -17 77 42 64 14 -32 -31 -10 49 105 -89 -2 36 -75
6773 -75 -61 -17 17 31 -104 -116 96 88 54 -33 -31 53 19 84 80 74 -13 13 67 -42 -28 29 -25 -113 59 -47 -22 42 -99
6802 -99 -124 16 39 -47 -82 -83 -114 -27 1 -51 -4 -15 -35 77 6 37 -112 -6 -46 -26 53 -53 56 65 39 11 37 -94
6830 -94 -6 14 -55 25 28 -44 -112 -41 -30 -121 -22 -118 -5 -27 51 21 -136 -58 29 -94 -15 40 -46 14 47 -130 43 -7
6858 -7 59 91 -66 148 1 171 -4 -31 98 -4 11 52 -77 -25 -1 -27 -43 108 -24 29 69 -31 16 -10 13
6883 13 -68 -156 -5 -84 -9 18 -72 -21 -2 -69 -39 64 19 77 -79 7 -28 3 11 63 -138 -15 1 48 10 -26 -55 139
6911 139 -48 -13 -6 -14 -36 -78 61 15 29 -75 30 42 63 -15 15 -75 19 -74 63 -25 -54 -69 -124 -54 -15 84 0 50
6939 50 -10 -18 25 33 57 -37 2 32 -35 30 -50 0 0 -85 97 76 -62 -124 -32 14 15 71 -8 -50 -22 44 -12 60 6 -181 -127
6970 -127 -78 55 -76 48 -98 41 -42 -47 47 -20 34 0 -25 -25 18 -53 -12 84 64 35 -68 -23 38 118 3 31 -93
6997 -93 13 -102 -74 6 -32 0 -41 48 5 -138 23 64 115 62 26 -2 -19 -53 4 -4 2 70 -74 -90 -58 19 128 -155
7025 -155 22 -65 25 -70 -9 46 -14 -60 41 -12 27 13 11 27 -1 -3 -13 71 -72 -19 -93 -105 4 75 4 28 -5 83 -7
7054 -7 -14 -29 -129 -48 19 6 22 19 105 16 65 3 -99 -44 -67 52 -21 -32 -120 83 -7 61 134 -15 -5 -58 -12 7 32
7083 32 29 -67 -147 -14 -124 -45 -61 -122 31 -19 70 -104 28 46 -30 84 51 -90 -50 -28 28 -17 -108 -21 59 3 48
7110 48 -32 -18 24 -68 34 17 -91 12 54 -84 46 19 71 -26 -28 69 -24 -20 -94 13 16 26 116 32 53 -47 -14 47
7138 47 -18 57 12 17 104 68 11 34 8 -73 -6 47 -1 37 83 -15 -32 5 29 -68 50 51 66 101 105 -78 -4 -39 27 -83
7168 -83 27 -4 10 2 38 45 -113 9 96 -27 -129 7 -57 17 21 -3 6 1 -32 56 -58 58 -25 62 -123 28 73 -59
7196 -59 42 55 70 1 -24 -87 -27 -60 49 -24 39 11 43 -43 -117 11 54 41 95 -21 35 28 -19 -28 -28 32 42 -25 -52 10
7226 10 -55 19 -92 69 -37 -65 -59 -4 -115 -32 -37 -7 -24 8 -61 62 54 -92 -89 -68 79 5 -34 20 -102 15 -26 -45
7254 -45 -62 10 -50 -53 -72 -14 1 -6 -121 9 -3 -56 -26 25 -60 38 -105 -81 46 -69 11 0 -11 -57 -10 45 53 -49 -56
7283 -56 6 27 28 42 -13 40 39 83 -14 85 -93 -51 -39 69 70 -40 32 -42 28 19 45 -110 4 -52 2 -118 -17 -80 45
7312 45 6 -44 -3 -9 -36 34 104 -87 40 46 -12 -76 -29 38 -24 13 45 -54 -29 12 -99 -17 -80 67 42 61 69 -61 41
7341 41 1 -16 21 124 -33 -37 80 86 10 -2 13 -37 10 131 72 -60 -17 -24 -13 -36 -94 -8 -25 -26 -54 -64 -35 -37 9 -68
7371 -68 68 10 -1 39 -33 65 37 39 66 -5 -115 105 -7 0 98 -44 -33 -67 2 93 -62 -30 45 59 8 44 -24 57
7399 57 64 -4 -155 87 15 51 -88 -1 50 -27 31 95 -133 -71 -13 -79 -42 23 -47 -90 14 136 -2 34 -2 22 24 -45
7427 -45 31 -71 44 -12 -6 -66 7 17 3 -80 82 12 -38 30 -47 -73 12 -40 -87 -28 9 18 12 -40 -34 -33 -34 -2 2 8 -15 -57 9
7460 9 -37 1 -66 -91 28 37 7 40 -6 -140 -85 93 18 -12 -21 34 -7 51 -38 59 -63 67 53 70 -75 -20 71 -26 1
7489 1 -78 -128 -54 -97 26 -59 45 -97 37 81 100 52 -32 58 -41 60 -85 75 1 -20 -48 -55 30 31 -87 -24 12 -4
7517 -4 88 25 18 -51 61 73 37 -6 -36 61 -79 -78 33 -22 -53 -73 65 104 -53 -68 106 -73 -33 69 14 52 98 -3
7545 -3 3 8 39 10 -91 28 35 -76 52 -57 138 48 10 16 33 -54 38 12 -57 -38 -42 75 29 27 -121 -7 120 43 -67
7574 -67 49 -2 -43 -152 -84 -2 -81 -80 -14 40 62 26 -8 52 -48 -36 59 33 7 66 -60 51 30 57 -5 -38 75 -30
7602 -30 -74 39 76 -51 13 -76 17 -140 33 -163 -59 49 -58 9 -78 -122 31 -84 -101 1 43 -121 -5 -24
7626 -24 -27 126 -36 2 -25 62 -78 50 22 3 21 110 90 -7 -11 87 18 79 -54 -12 48 -58 -30 7 24 -212 -25
7653 -25 38 37 -26 -13 -15 89 116 -76 3 60 37 20 105 36 10 91 -2 -42 -3 -37 -11 -36 44 39 49 78 36 -36 44 -68
7683 -68 -49 -63 10 -12 -60 25 -63 97 -18 -71 34 25 -56 -73 -125 5 -3 -8 7 14 -151 29 24 -10 -58 5 34 -96 -17
7712 -17 -34 -53 -31 -17 -61 82 43 -108 76 -91 10 -23 -23 -3 -151 -34 -34 -7 -30 -33 34 -121 -2 1 48 -48 54
7739 54 -14 -52 100 -96 17 40 -47 63 -26 11 -2 46 50 -24 -22 53 -30 -75 43 14 7 -91 15 -23 24 -64 -17 -74 1
7768 1 -21 28 57 7 61 36 -23 -34 11 36 -65 63 -40 26 -65 -11 -77 5 -15 55 110 -24 63 -29 -24 -33 -138 -118 -54
7797 -54 87 75 16 162 -12 21 21 -39 54 -88 -110 -95 -12 36 29 -79 -17 -44 -124 0 0 -9 52 -38 -59 97 28 -29 6
7826 6 5 10 29 29 28 16 2 -94 73 -62 -33 3 -46 -70 25 -78 34 -106 46 88 56 -75 3 10 -38 23 53 59 110 -38
7856 -38 -84 90 -37 15 -19 52 32 91 95 36 -78 -81 49 -57 14 28 -106 39 -21 -46 -15 37 58 -61 17 29 15
7883 15 -113 -45 -42 -30 -37 117 -41 -58 -12 -85 -73 73 2 24 -90 68 84 -6 26 -23 -17 111 37 -48 -84 -76 -37 -59 -19
7912 -19 -100 -132 31 69 -18 2 -69 -18 15 -75 31 -17 8 11 8 -23 2 -23 127 -14 -63 35 -81 -102 -104 -84 18 -3 -29
7941 -29 -16 -97 33 -160 -23 -117 -42 -17 46 -33 -64 55 16 -77 3 -35 -45 9 -38 -94 -55 -3 -137 117 7 -20 5
7968 5 -129 14 -17 43 38 -19 -4 87 -56 44 23 -90 9 -29 -21 -6 37 -120 -84 -30 21 -18 27 0 31 61 -48 -7
7996 -7 14 86 -8 -32 59 -28 17 -76 -5 -43 -87 -5 -94 -33 15 -44 64 -30 -21 23 33 -47 16 -110 -7 -38 -24 -15 90 38
8026 38 29 56 -50 -2 -44 -24 17 56 -79 34 29 -48 70 46 -54 12 -24 24 -66 5 -5 51 50 7 -36 -12 -32 64 -5
8055 -5 -2 111 -56 81 -28 15 -76 104 -35 17 58 31 -51 21 -96 97 -64 -4 -17 99 -44 40 153 -2 98
8080 98 -19 52 57 -59 -36 9 -12 -3 -45 2 -29 -9 34 -4 -54 -45 9 -41 18 -19 48 -173 -77 -86 49 -39 26 19 -28 68 34
8111 34 77 34 76 -15 -30 41 -17 89 -74 -10 97 -190 42 -48 38 23 -10 19 25 88 -1 -43 -73 -5 -19 44 -39 -31 59
8140 59 42 -118 55 -14 76 45 -5 -73 -72 -32 73 43 -11 -13 -17 38 76 73 18 39 -9 -6 -57 -74 -4 -135 11 62 -47 1
8170 1 2 -117 38 21 -53 -41 -47 -149 -82 97 -40 7 48 -18 -31 73 35 103 -74 56 159
8191A59
$$ Imaginary data points
##PAGE= N=2
##DATA TABLE= (X++(I..I)), XYDATA
0 0 0 0 0 0 0 0 0 0 0 8 -8 8 -8 16 -16 24 -24 32 -40 48 -56 72 -82 97 -118 136 -159 183 -208 240 -274 313
32 313 -355 402 -451 510 -571 642 -715 798 -891 987 -1096 1212 -1340 1480 -1634 1800 -1984
49 -1984 2186 -2407 2652 -2923 3227 -3567 3950 -4385 4887 -5473 6162 -6995 8016 -9307
63 -9307 10998 -13315 16697 -22117 32172 -57021 245499 231654 -295642 23711 -75790 -254022
75 -254022 192175 319924 -165782 -115467 10036 -144354 77924 294298 -59375 -151012
85 -151012 8579 -106582 -43435 208086 18207 -143130 31061 38072 -26338 91109 14079
96 14079 -137835 -50313 47294 62992 81127 -32312 -106978 -9613 30595 61125 124115 -45201
108 -45201 -196628 -44606 55932 58532 153965 34032 -195612 -86503 52705 14465 114240
119 114240 94883 -179498 -143456 83536 41779 55062 137785 -84875 -192400 37022 71408
130 71408 -9958 84744 9566 -150740 -3255 111830 4300 13279 19568 -109989 -45194
141 -45194 102945 22315 -36240 23592 -36724 -58148 81774 78979 -60773 -63567 -12563 -19670
153 -19670 34031 87271 4930 -77597 -41671 11662 35005 59080 21950 -71722 -75487 13204
165 13204 53837 48259 38610 -30212 -87607 -19835 53400 34530 17839 -2985 -63378 -40391
177 -40391 49012 45516 -1432 -4355 -29169 -44971 15223 45530 3168 -16098 -10861 -14826 7317
190 7317 31543 6311 -26130 -18149 5632 15047 14936 10479 -12732 -30866 580 34549 13294
203 13294 -7941 -7630 -27442 -15406 37173 25012 -16299 -2939 -12034 -35324 19009 44065 -15488
216 -15488 -19393 7478 -22553 -6802 40795 2846 -23298 11218 -8237 -22442 29913 18641
228 18641 -27813 5094 15928 -22399 3120 24827 -14024 -7192 17976 -11684 -10985 17646 -4314
241 -4314 -12015 15612 -777 -18758 4963 5515 -6373 8279 2315 -15979 -2007 6979 486
254 486 7464 2779 -13559 -4768 7347 6479 10141 85 -17389 -4771 12121 7301 6763 824
268 824 -18093 -10254 12582 12313 6070 -2831 -22829 -14734 17365 18609 971 -6175 -19323 -19420 12093
283 12093 27537 9207 -9316 -22294 -20159 12003 31761 11329 -10956 -18816 -18772 4784 32590
296 32590 21535 -10619 -25276 -18883 4862 28678 20033 -10841 -25250 -16722 4612 26272 22054
309 22054 -10386 -32078 -20395 8332 28330 20618 -9929 -30856 -19636 10520 31434 22659
321 22659 -10359 -34595 -23638 11036 35778 27016 -7397 -34147 -25055 10077 34567 24394
333 24394 -9027 -34278 -27699 7055 36848 29473 -7985 -36571 -29446 4959 33313 26170 -8784
346 -8784 -34003 -26528 5692 36000 32922 -6317 -39576 -31102 6430 35306 30585 -3216 -32593
359 -32593 -28021 5122 36039 33038 -5129 -39120 -33127 4323 36104 32760 -2920 -33574 -29497
372 -29497 769 30959 31961 -5398 -40570 -31031 5843 33378 34438 529 -38498 -32612 5441
385 5441 29906 30039 3032 -36570 -35295 9854 37407 29634 3956 -32726 -40861 2127 36748
398 36748 26179 723 -25379 -36324 -1726 39235 29665 -6036 -29612 -34860 -6881 35430
410 35430 34472 -4425 -28723 -26679 -4890 28813 36883 330 -36728 -31781 1506 28971 33576
423 33576 9591 -27407 -35242 -1939 27563 26008 7109 -21926 -37711 -4987 35110 25214 -1027
436 -1027 -14002 -29992 -17216 28678 30152 -9041 -19435 -17068 -12009 26292 38716 -9970 -32294
449 -32294 -13101 -7080 15027 42702 4494 -40443 -18356 7019 13729 34039 15441 -38983
461 -38983 -35174 5830 17046 24770 22791 -20641 -40491 -4361 19122 16563 13992 -8286 -32799
474 -32799 -13709 17932 18893 7168 -3223 -16250 -14476 7138 18563 4064 -11446 -7990 582
487 582 6389 14477 6190 -18222 -14894 9741 10650 6419 9202 -15472 -29976 9087 28997 4075
501 4075 -408 -5566 -34100 -11734 34254 17018 -5793 1166 -23491 -28289 26959 31145 -11098
514 -11098 -1447 -1462 -33636 1667 41565 565 -13445 12006 -15760 -20765 27985 12852 -20745
527 -20745 9916 7296 -25456 7174 20707 -20187 -3710 23350 -12709 -13243 17105 -10951 -18800
540 -18800 23520 12500 -16466 3466 -406 -21733 6698 24473 -240 -4988 -1961 -15556 -4466
553 -4466 18249 13703 1308 -6763 -12772 -6380 3209 10836 15662 -2793 -18777 -2887 408 -6869
567 -6869 16465 15157 -19293 -6681 8623 -18867 -641 31968 -7682 -18244 19556 -10182
579 -10182 -28366 28312 19501 -24090 11699 11618 -37247 2737 35135 -14559 -3573 27120 -25918
592 -25918 -25635 32882 4096 -19802 24304 1575 -36337 10011 18052 -19163 8598 19220 -23266
605 -23266 -8446 16810 -12437 -4937 23537 -3185 -13559 9778 -5449 -14314 15019 13069 -5875
618 -5875 1944 -2516 -14922 1332 13831 7496 3445 -6592 -15092 -4822 5592 10248 11705 -4053
632 -4053 -16606 -6959 -1144 5174 18333 2382 -19120 -4821 1868 -5787 14197 16052 -16279
645 -16279 -10334 10079 -5577 -794 18827 -5988 -15803 14144 3906 -15040 10167 6875 -18930
658 -18930 6934 20579 -14604 -11650 10226 -8921 -4682 24501 1264 -23183 51 1241 -9136
671 -9136 18653 18493 -20448 -14963 6232 -4972 5850 25786 -4064 -24181 230 3948 -1887
684 -1887 18356 10636 -20458 -10500 7317 -746 6376 13606 -9758 -15262 4570 3500 -1144 7375
698 7375 -1394 -12217 609 7040 -714 -207 -1572 -5479 2235 6880 726 -2234 -4559 -4328 5631
713 5631 8865 1907 -2118 -7787 -7623 8062 11364 -593 -1230 -4545 -13278 2585 16688 924
727 924 -5831 -1342 -11725 -4485 16749 4828 -8718 1504 -5995 -11139 13703 12461 -11849 -2687
741 -2687 4221 -9681 4240 16539 -6803 -9500 6662 -2570 -1616 13848 -2033 -14070 4320
754 4320 4371 -3688 8667 2145 -15483 -2011 8498 -1014 3429 3600 -12510 -6695 8245 2978
768 2978 1702 3975 -8944 -8580 7116 5698 660 3622 -4338 -8292 4198 6710 577 1927 -3023
783 -3023 -6936 3785 6554 -1512 -115 -874 -6714 1302 7482 -1128 -3785 -1741 -4835 1257 8202
798 8202 -330 -5316 -1355 -3809 -1007 9279 4031 -6257 -3541 -1207 -276 7216 6332 -3833 -4786
813 -4786 -1628 -772 5437 6802 -2654 -6051 -1685 -127 3001 5231 -1161 -5913 -2667 164 2256
828 2256 3626 -977 -5091 -2167 1010 2114 2681 -110 -3491 -2057 1651 3244 1895 -776 -1812
843 -1812 -932 704 2875 2463 -1397 -2298 -63 640 1476 1496 -1879 -2532 418 46 3 2212 -1548 -4362
861 -4362 450 1989 -671 1080 26 -3782 -179 2728 -37 1448 1287 -4006 -1201 4242 762
876 762 -158 2197 -2106 -2630 2757 1901 -190 977 -2231 -2696 2197 965 -1125 992 -1970 -3151
892 -3151 2019 1078 -1829 1335 -1147 -3507 2737 1671 -3096 2217 1768 -4514 2054 4351 -4123 527
908 527 5055 -3952 -1044 5956 -3568 -2889 6963 -1522 -4791 6061 -939 -7618 5525 3448 -7600
923 -7600 2184 4120 -7759 -479 6653 -3793 -1791 5112 -3580 -3788 4867 -110 -2522 4190 449
938 449 -3855 1425 1734 -742 1820 1703 -747 -1008 -1347 590 1801 -162 1194 533 -4720 -1246 3235
955 3235 -2012 641 5063 -5518 -6223 5650 -158 -3968 8303 754 -11427 2838 5997 -6046
969 -6046 4485 8468 -9824 -4330 8968 -3237 -2278 10678 -2976 -9292 6625 1755 -7037 5880
983 5880 4268 -8377 575 4631 -6406 -1516 5917 -1803 -1868 3683 -2893 -5854 2133 3942 495
998 495 1239 376 -4727 -4991 4075 8041 611 -1435 647 -7044 -5223 10238 7237 -4327 884 -2168
1014 -2168 -11847 3628 12649 -3137 -1784 4087 -11950 -7289 13765 2275 -7079 7353 -2154
1027 -2154 -14175 6565 9488 -8049 2729 8569 -9955 -3905 9641 -4255 -4518 11554 1998
1040 1998 -8148 2832 -141 -8570 5080 11188 -2541 -5130 -861 -6616 -3479 10611 8584 -5296
1054 -5296 -6126 -2511 -6217 1075 13953 3761 -10623 -2700 -105 -6783 7236 14536 -6263 -8678
1068 -8678 5189 -3839 -4930 13406 3650 -11067 3591 3967 -10323 3854 9868 -8993 -1806
1081 -1806 11143 -6477 -8816 7774 -1366 -6929 10032 4879 -11345 -2555 2515 -4015 5559 10582
1095 10582 -4873 -9487 -787 -400 2279 10961 4522 -9690 -8056 1868 3067 4173 8148 -934
1109 -934 -13201 -4357 7059 2127 2593 6158 -7507 -11296 5134 4597 -3247 5649 1187 -12106
1123 -12106 958 8323 -5989 11 8980 -7173 -4810 11354 -2838 -9720 9058 3282 -7841
1136 -7841 8288 5031 -14221 -1244 10296 -3036 1612 8818 -9721 -11306 6583 4213 51
1149 51 7060 -3190 -13807 -990 6369 2288 5434 2054 -10261 -7153 4129 5141 3241 2468
1163 2468 -2402 -6577 -2488 5093 5832 -9 -1430 -345 -3595 -1297 5347 1000 -3621 2250 695
1178 695 -4596 2477 2053 -6449 871 6514 -4119 -2638 4743 -5444 -5232 9161 3238 -5961 2563
1193 2563 -316 -8601 4472 9131 -3258 -940 2509 -7298 -1582 10276 877 -3991 3028 -3376
1207 -3376 -6623 6242 5383 -4648 35 779 -6032 394 5848 -1880 -2425 2013 -2463 -2300 3747
1222 3747 692 -2611 966 908 -1051 845 876 -925 428 818 422 874 -633 -1104 780 717 303 937
1240 937 -1085 -1865 967 132 -784 1926 -275 -3745 489 1822 -1987 702 2326 -2878 -1551 2673
1256 2673 -876 -891 3313 -856 -2617 2815 781 -2575 2647 2046 -3140 858 2550 -2787 -396 3119
1272 3119 -1535 -1358 2193 -1633 -2287 2363 84 -1994 1404 -418 -3160 1081 1931 -1620 -41 746
1288 746 -1926 209 2447 -171 -631 476 -1130 324 2649 106 -1318 312 -576 -127 2447 800
1304 800 -1733 -972 -735 -248 1966 613 -1866 -947 -595 -870 1518 1590 -1804 -1798 171 142 1030 1655 -947
1323 -947 -1655 351 745 1335 1971 -847 -2709 115 1641 1439 1542 -404 -3056 -1561 1304 2138 1678
1340 1678 -526 -3337 -2556 819 2039 1740 -64 -2811 -3266 103 2825 2097 46 -1811 -2294 -218
1356 -218 2488 2441 102 -1682 -1775 60 2646 2410 -617 -2301 -1239 5 1958 2703 -804 -3720 -1912
1373 -1912 663 1880 2557 -16 -3976 -2951 426 1923 2837 1357 -3400 -3826 698 2319 2272 1986
1389 1986 -1617 -3810 -239 2559 2060 1595 -1017 -3564 -636 2892 2211 423 -1247 -3110 -1301 2532
1405 2532 2893 176 -3016 -3673 -849 2297 2957 1522 -2552 -4851 -1052 3215 3240 1987 -1082 -5070
1421 -5070 -2097 3615 3271 1837 577 -4021 -3636 3490 3665 64 765 -1841 -4669 1667 4580 -869
1437 -869 -1258 -26 -3816 -411 5261 37 -3847 -65 -1258 -1942 4583 3268 -4250 -2749 984 -214
1453 -214 2388 4520 -1506 -4803 -549 1710 1848 3367 789 -4479 -2791 2114 2483 1052 1043 -2361
1469 -2361 -4589 425 4082 231 -1179 -219 -3039 -1524 4469 1830 -3608 -522 6 -2356 3060
1484 3060 4534 -3732 -3398 2390 -188 632 5255 -915 -6381 515 2872 -245 3353 2001 -6267
1499 -6267 -3466 3565 1673 865 2336 -3323 -6116 991 4093 832 570 -300 -4694 -2780 4108 3738
1515 3738 -945 -346 -652 -3421 747 5450 121 -2899 1647 -598 -3048 4197 3055 -5333 -16
1530 -16 4317 -3420 -1230 4876 -3753 -4637 6162 1498 -4868 2882 -320 -7303 3444 6635 -4105
1545 -4105 -1087 2471 -6284 -1537 9138 944 -3840 2466 -2518 -5449 5561 6037 -2792 -581 245
1560 245 -4770 55 5941 1208 -2039 -341 -1938 -2764 1525 3232 -206 -1951 11 -738 -2484 1081
1576 1081 3337 -1655 -1356 3011 -2104 -3999 3964 1873 -3233 3832 2529 -6974 -136 5435 -3227
1591 -3227 305 6811 -4673 -6195 5470 233 -3829 6418 1139 -8232 1670 3329 -5314 2303
1605 2303 5993 -5702 -2924 4826 -3412 -2800 6545 547 -4388 2557 53 -4601 2611 4264 -1255
1620 -1255 194 728 -3765 -1403 3563 2202 227 -390 -2267 -3112 -139 3782 2661 -1804 -2272 -1338
1636 -1338 -2939 1165 5957 0 -4330 221 -1119 -2720 5223 3862 -4987 -757 2387 -3649 1435
1651 1435 6534 -3515 -3822 4855 -796 -3355 5131 -39 -6390 3493 4328 -4437 483 2014 -5987
1666 -5987 -80 7242 -1229 -3632 1242 -3422 -2906 6667 3865 -4123 -1725 -1369 -2818 3850 6215
1681 6215 -1215 -3877 -1511 -1250 1678 5546 1934 -3864 -3645 -346 1727 2799 2373 -1596 -4980 -1647
1697 -1647 3175 2273 338 -493 -3694 -3055 3334 3783 -1049 -1414 -1720 -3126 2614 5939 -764 -3692
1713 -3692 -709 -1445 917 6347 1613 -5578 -2661 667 1001 4567 3160 -5055 -5134 852 2051 3112
1729 3112 3553 -3436 -6889 -371 3786 2579 2072 -1266 -6188 -2721 4346 4171 1181 -1207 -4377 -3361
1745 -3361 3271 5557 1156 -1996 -3035 -3063 1607 5878 2110 -3179 -3390 -1855 801 4659 2881 -3256
1761 -3256 -4647 -1659 1277 3964 3041 -2908 -5405 -1517 2227 3956 2858 -2204 -5527 -2084 2999
1776 2999 4884 2757 -2107 -5080 -2423 2639 5193 3199 -2029 -5369 -2788 2229 4789 3426 -1928
1791 -1928 -5499 -3063 1670 4061 3452 -1380 -5822 -3247 1953 3723 2979 -366 -4919 -3719 1990
1806 1990 3985 2645 95 -4225 -3854 2129 4451 2309 -84 -3430 -3944 1239 4839 2218 -970
1821 -970 -3290 -3817 675 4617 2180 -1347 -3174 -3556 220 4501 2675 -1597 -3420 -3128 289 4244
1837 4244 2998 -1188 -3060 -2834 226 4388 3408 -1189 -3035 -2294 28 3814 3540 -958 -3216 -2377
1853 -2377 -111 3231 3242 -943 -3305 -2288 -365 2399 3017 -609 -3235 -2005 -63 2141 2985 -339
1869 -339 -2997 -1702 229 1758 3049 309 -3101 -1726 941 1612 2221 736 -2516 -2235 618 1858
1885 1858 1631 488 -2244 -2432 345 1913 1299 -42 -1674 -2145 -116 1762 1601 -72 -1709 -1511
1901 -1511 88 1533 1564 325 -1544 -1290 323 918 1463 748 -1495 -1039 761 562 472 1122 -920 -1799
1919 -1799 779 942 -576 355 20 -1760 56 1364 -731 -590 711 -969 -772 1563 18 -1239
1935 -1239 624 309 -897 1040 1008 -1240 -119 1086 -276 53 1051 -307 -673 785 444 -717 -71
1952 -71 385 -483 -149 719 -452 -1393 -205 1010 -197 -160 248 -1406 -1224 1562 1359 -475 -112 -713
1970 -713 -1923 1216 3215 -165 -1151 -53 -1726 -262 3722 1280 -2318 -732 -666 -1332 2721 2946
1986 2946 -2312 -2219 224 -1127 816 3340 -904 -3648 -5 818 -252 2027 920 -3358 -1255 2339
2002 2339 882 438 779 -2049 -2135 2199 2788 -106 -785 -1306 -2241 975 4034 980 -2626 -2156 -1469
2019 -1469 -78 3594 3028 -2504 -3935 -1126 259 2303 4059 -586 -5252 -2027 1730 1676 2904 1878
2035 1878 -4138 -3693 2133 2692 1120 1912 -1750 -4724 836 3961 379 -184 -159 -3483 -1004 4298
2051 4298 1451 -2429 -844 -1383 -1621 3373 3324 -3024 -3187 55 -412 1948 4288 -1329 -5135 -643
2067 -643 2074 1498 3543 1053 -5189 -3264 2909 2993 1883 1289 -3401 -5121 1067 4425 1753 2
2083 2 -1875 -4567 -1107 4325 2950 -1139 -1822 -2586 -1973 2759 4057 -977 -3057 -753 -611 884 3886
2100 3886 552 -4307 -1204 2026 936 1830 1410 -3761 -3101 3103 2812 107 650 -2582 -4741 1732
2116 1732 5133 229 -1244 -1281 -4548 -1078 5891 2893 -2559 -1739 -2671 -2419 3994 5179 -1506 -3057
2132 -3057 -1381 -1966 1782 5323 622 -3637 -1302 -309 397 3516 1882 -3358 -2505 982 1041 1294 1277
2149 1277 -2090 -3265 559 2796 759 -669 -1505 -2632 -141 3649 2200 -1702 -2314 -1526 -511 3074
2165 3074 3899 -1115 -3696 -1167 209 1592 4226 915 -4314 -2492 1061 779 2423 2472 -3220 -4119
2181 -4119 855 1758 825 2012 -1047 -4288 -437 2674 591 549 337 -3061 -1519 2948 1527 -804
2197 -804 267 -1086 -1772 2017 2808 -997 -1387 -79 -805 739 2777 134 -2426 -994 242 559
2213 559 1717 667 -2315 -1907 378 905 997 787 -1393 -2219 15 1713 951 329 -367 -1774 -729
2230 -729 1530 1534 11 -435 -573 -705 718 1806 227 -944 -191 -215 -266 935 649 -1159 -798 419
2248 419 -7 32 503 -644 -1322 413 742 -365 299 83 -1139 -81 1484 32 -588 535 -376 -649
2266 -649 1166 736 -879 23 365 -633 491 960 -782 -661 717 -344 -367 867 -496 -1041 622
2283 622 368 -546 303 -21 -854 329 684 -276 -32 96 -491 241 1023 -115 -359 352 -129 361 903
2302 903 -146 -583 -90 -262 475 900 -364 -874 -228 -227 -106 1019 -37 -1261 -327 -1 -118 895 318
2321 318 -1141 -344 393 57 893 834 -966 -735 576 386 483 844 -718 -1007 555 576 133 484 -726
2340 -726 -1491 340 936 52 132 -640 -1552 -10 1201 352 -55 -475 -1449 -313 1420 780 -91 -295 -1103
2359 -1103 -418 1406 1069 -111 -315 -824 -406 1035 882 -173 -435 -797 -450 947 909 -359 -762 -735
2377 -735 -339 840 944 -423 -898 -698 -418 851 1377 -362 -1059 -550 -246 804 1385 2 -1185 -566
2395 -566 -24 798 1489 384 -1239 -844 -6 446 1195 462 -1261 -1184 40 531 898 395 -1040 -1280 -221
2414 -221 548 886 333 -595 -989 -287 740 1017 332 -337 -488 -222 467 1006 284 -603 -166 -12 52 709
2434 709 378 -932 -399 341 -122 245 517 -1208 -1155 761 571 -225 410 -532 -1526 492 1147 39 233
2453 233 2 -1516 -202 1688 607 -259 357 -763 -757 1164 1094 -381 -104 -306 -827 361 1068 -94
2471 -94 -685 -63 -306 -145 436 182 -697 -476 255 105 -102 204 10 -651 130 985 -47 -417 449 -162
2491 -162 -449 976 697 -972 113 500 -806 387 1182 -934 -961 837 -352 -553 1240 91 -1615
2508 -1615 319 508 -832 477 871 -1439 -771 1147 -206 -392 1285 -208 -1240 640 825 -519
2524 -519 523 724 -912 -330 1068 -118 -627 633 191 -885 372 545 -891 -408 969 -256 -683
2541 -683 608 -228 -1296 579 1177 -736 -140 620 -1056 -546 1632 238 -1004 901 36 -1332 874
2558 874 1315 -978 -62 1064 -1014 -568 1372 -328 -1057 1004 157 -1385 400 589 -1063 112 1049
2575 1049 -756 -793 675 -304 -601 975 509 -958 -198 495 -318 240 1285 -16 -1076 139 296
2592 296 -425 887 1201 -1041 -1046 803 -168 -502 1372 98 -1742 60 868 -936 319 1333 -1302
2609 -1302 -1016 1140 -362 -958 1356 33 -1461 950 878 -1410 315 1375 -901 -207 1442 -593
2625 -593 -1092 1092 148 -975 895 450 -1515 -56 800 -661 86 1028 -771 -1134 448 187 -395
2642 -395 780 490 -1132 -475 677 87 21 844 -103 -1159 82 962 -193 266 829 -702 -941 821
2660 821 354 -450 808 277 -1277 -77 805 -556 -121 817 -775 -837 905 53 -850 574 322 -1058
2678 -1058 277 966 -591 -310 739 -330 -381 916 158 -881 183 477 -416 516 853 -663 -697 427
2696 427 181 -255 654 -16 -1393 -367 633 39 194 467 -896 -1075 772 827 -238 393 -99 -1297
2714 -1297 270 1367 84 -165 342 -707 -489 1335 699 -751 -72 -273 -744 727 1117 -643 -700
2731 -700 -45 -468 18 920 -58 -1105 -244 5 200 654 158 -724 -547 253 496 536 279 -616 -761 46
2751 46 851 691 -106 -560 -745 -244 773 1120 -60 -958 -565 -222 285 1175 100 -1141 -921 -28 182
2770 182 988 515 -1057 -1023 130 393 595 791 -600 -1210 279 881 420 561 -372 -1199 -64 1125
2788 1125 580 209 -252 -1169 -512 1047 842 -45 -547 -1020 -626 826 1087 -135 -675 -853 -549 760
2806 760 1279 228 -826 -753 -433 690 1375 379 -775 -938 -395 700 1306 447 -832 -1120 -391 596
2824 596 1208 505 -924 -1146 -640 403 1158 467 -741 -1254 -506 432 1195 671 -737 -1119 -368 513 980
2843 980 774 -455 -1024 -255 573 837 682 -415 -1263 -473 708 922 575 -398 -1303 -650 678 996 436
2862 436 -372 -1378 -727 573 1153 514 -356 -1113 -896 587 1324 594 -377 -960 -652 408 1285 731 -390
2881 -390 -813 -635 297 1134 767 -423 -992 -640 162 851 591 -294 -891 -721 213 825 561 -270 -687 -711
2901 -711 105 823 591 -253 -693 -597 136 810 715 -176 -675 -515 -56 776 781 -63 -783 -584 26 562 700
2922 700 -123 -830 -491 14 452 473 99 -751 -715 143 397 376 71 -418 -613 150 644 360 121 -101 -411
2943 -411 -155 653 411 -114 26 -213 -338 382 524 -190 -213 46 -274 2 472 -76 -493 -50 103 -229
2963 -229 324 122 -487 -237 191 -95 133 465 -69 -338 208 354 -110 292 321 -212 -49 290 44 1 334
2984 334 47 -478 -9 148 -222 102 264 -392 -344 88 -97 -153 331 29 -648 -135 254 41 290 326 -485
3005 -485 -511 308 469 31 317 -47 -785 18 878 112 -49 52 -525 -374 695 520 -434 -237 -103 -610
3025 -610 224 894 -420 -668 60 -85 47 735 110 -1020 -305 323 220 510 640 -730 -936 507 650
3044 650 122 517 -243 -1263 -126 931 357 61 -85 -1005 -736 968 859 -215 -202 -479 -963 412
3062 412 1329 -94 -690 -97 -473 -121 1355 613 -963 -521 159 -240 798 1116 -838 -1227 402 440
3080 440 222 737 -414 -1499 -36 969 317 26 -194 -1143 -603 1087 871 -51 -408 -740 -722 656
3098 656 1439 173 -695 -564 -370 229 1351 747 -736 -937 -91 265 804 1109 -444 -1337 -251 536
3116 536 168 536 149 -1458 -760 893 391 55 223 -864 -1111 909 1207 -326 -197 -180 -889 401
3134 401 1621 -29 -797 -91 -585 -8 1582 703 -1280 -592 -100 -123 1046 1173 -931 -1327 -52 288
3152 288 553 1028 -358 -1464 -419 618 490 464 55 -1090 -837 693 950 332 -119 -631 -830 308
3170 308 1309 432 -510 -575 -471 5 1102 814 -621 -845 -127 -104 617 931 -500 -1316 -260 410 360
3189 360 628 87 -1196 -598 831 568 286 214 -900 -957 718 1122 195 -74 -370 -945 83 1337 458
3208 458 -445 -281 -404 -387 950 778 -554 -695 -240 -211 504 852 -279 -1004 -150 120 185 694 219 -953
3228 -953 -454 462 407 293 347 -626 -782 376 650 179 61 -320 -662 152 955 323 -253 -240 -490 -204 718
3249 718 477 -420 -451 -358 -243 590 602 -180 -542 -327 99 389 452 41 -411 -263 189 437 326 -22 -251
3270 -251 -362 -58 425 203 -165 -109 -219 -76 437 196 -327 -189 -81 -368 109 470 -157 -441 83 -43
3290 -43 78 400 10 -388 27 113 -55 204 263 -324 -98 254 -39 0 334 -237 -217 153 138 -69 203 -107
3312 -107 -342 40 157 -134 63 -34 -305 -161 152 -34 -99 102 -24 -110 73 115 10 -4 15 22 140 66 189
3335 189 3 -117 0 -77 -103 -57 145 11 -42 -29 -85 -71 141 -35 -52 10 -10 -117 84 181 -75 -10 145 7
3359 7 12 134 67 -65 -1 131 75 155 64 33 -92 -18 75 122 -53 -100 -184 62 134 -31 -70 -160 -287 -43 131 58
3385 58 14 -238 -89 35 138 200 -105 -126 -144 -7 183 170 75 -149 -87 20 123 199 70 -203 -125 31 72 150
3409 150 -91 -352 -151 34 56 77 -116 -344 -111 78 192 109 0 -214 -151 175 270 173 30 -250 -102 81
3431 81 187 281 -41 -111 -168 73 192 223 -12 -308 -259 29 88 145 115 -250 -306 146 256 -1 38 46 -212 28
3455 28 470 110 -129 -86 -223 -43 462 269 -224 -197 -59 -59 206 314 -217 -385 -17 -51 108 214 -51 -495
3477 -495 -45 220 120 155 137 -356 -306 189 215 106 94 -129 -339 223 396 144 -81 -90 -133 -43 350 141 -302
3500 -302 -176 -62 -65 195 286 -179 -389 52 114 -30 252 -33 -532 -12 297 -50 77 124 -477 -313 349 308
3522 308 -30 141 -132 -380 75 456 31 -154 -80 -276 -56 379 142 -275 -44 -121 -172 270 333 -231 -350
3543 -350 -47 -38 -50 310 -134 -310 -32 284 129 104 174 -285 -246 352 278 -99 37 -39 -392 -6 454 94 -236
3566 -236 68 -239 -111 425 285 -362 -161 106 -317 253 541 -101 -431 11 -38 -21 423 191 -369 -88 144
3587 144 -132 232 361 -311 -298 158 169 -137 142 -50 -283 128 197 -90 -116 104 -247 -65 320 53 -349
3608 -349 -64 -38 -302 112 432 -127 -231 103 -40 2 282 217 -296 -14 293 -1 55 398 -152 -341 137
3629 137 51 -86 87 133 -453 -131 247 -155 -142 -4 -175 -318 170 140 -61 91 81 -248 -91 306 -104 -141
3651 -141 187 -76 -227 170 256 -38 101 158 -223 -39 282 19 -81 59 -51 -151 93 219 -173 -152 -29
3672 -29 -28 -53 276 -62 -333 49 55 107 244 116 -223 -97 120 -9 107 173 -110 -374 126 259 48 156 -41
3695 -41 -276 -154 288 158 -51 -102 -60 -313 154 343 11 -133 -77 -130 -75 427 66 -324 -92 4 18 239 274
3718 274 -229 -222 33 137 118 262 -132 -399 -116 208 28 99 -44 -315 -349 252 280 97 -48 -232 -340 210
3740 210 451 137 -224 -198 -228 58 513 229 -308 -226 -60 -12 504 191 -185 -384 -79 -30 251 316 -55 -387
3762 -387 -211 159 311 242 -98 -399 -273 159 360 165 -253 -383 -263 143 320 78 -114 -428 -269 140
3782 140 329 268 -41 -329 -262 163 223 295 -104 -458 -200 46 327 335 -92 -385 -348 186 357 99 13 -323 -402
3805 -402 220 435 240 -92 -226 -398 51 476 93 -50 -190 -287 40 529 263 -80 -267 -232 29 502 263
3826 263 -101 -407 -274 38 333 282 -68 -550 -325 29 292 332 6 -515 -335 7 328 403 12 -249 -272
3847 -272 16 431 326 2 -328 -305 -78 362 367 -33 -312 -373 4 233 237 -30 -449 -413 3 297 329 -14 -385
3870 -385 -263 36 263 194 12 -156 -366 -15 370 381 33 -202 -235 -61 346 273 -41 -220 -350 -19 255
3891 255 311 -117 -250 -283 -178 200 313 11 -232 -294 -84 238 227 -14 -237 -208 47 225 254 95 -152 -203
3913 -203 -7 216 267 46 -150 -378 2 73 188 14 -9 -277 -212 168 149 -121 -131 -258 -95 115 290 171
3935 171 -51 -105 -25 178 136 33 -153 -31 -36 154 134 70 -165 -98 22 76 95 78 7 -111 -69 -10 196 -67 -94
3960 -94 -144 -236 19 138 -25 -66 -140 -116 -31 106 79 -83 61 16 -29 1 98 -72 35 53 -92 26 49 -36 -16
3985 -16 99 -54 -52 57 54 -98 30 42 -123 -79 61 -45 20 45 -136 98 183 86 -15 12 60 -71 54 86 -1
4010 -1 -159 -3 67 136 146 73 -70 -56 42 -46 55 135 -81 -257 11 69 20 123 2 -165 -180 178 147 1 -72
4035 -72 -103 -201 91 272 -6 3 -37 -158 43 292 170 -27 -55 -55 -31 236 272 -231 -153 -5 -7 121 112 -160 -383
4060 -383 -109 200 85 79 62 -330 -159 180 145 117 -70 -308 -365 157 335 85 -177 -160 -122 -125 306 224 -194 -235
4084 -235 -197 -135 267 144 -185 -436 18 -91 168 233 -171 -397 -129 13 80 246 147 -286 -259 212 291 184
4106 184 115 -241 -384 212 359 224 -4 -166 -360 45 299 150 -112 -233 -211 -62 284 330 -257 -323 -139
4127 -139 -17 145 354 -58 -410 -166 8 119 322 131 -292 -240 147 321 188 181 -263 -405 -4 457 86
4148 86 28 -193 -390 -14 506 246 -67 -232 -211 -116 332 397 -108 -288 -166 -63 234 296 -11 -393 -190 127
4170 127 124 299 80 -324 -328 76 252 201 184 -289 -369 -76 237 164 -78 -146 -313 -101 294 261 -28 -156 -297
4193 -297 -124 171 160 -26 -267 -75 -215 86 363 87 -270 -181 -40 -16 272 182 -220 -231 50 82 218 109
4215 109 -216 -291 -113 116 102 85 -65 -191 -148 131 337 141 -150 -280 -104 53 242 112 -110 -225 -135 136
4237 136 176 72 -100 -270 -142 77 280 55 -82 -285 -78 24 23 108 -159 -192 -128 78 201 32 -5 -269
4259 -269 -137 39 115 50 -62 -139 -110 -3 122 94 67 -103 -122 -43 108 88 -39 -37 -1 52 114 104 92 -71 -123 38
4285 38 142 94 -34 -101 -91 116 -25 -17 110 -159 -126 50 48 44 -84 -63 -50 18 122 -47 37 29 -46 -31 23 31 -56 147
4313 147 -5 47 -21 -94 50 60 10 -41 -36 63 50 24 63 5 50 57 43 86 -20 -67 15 -52 -65 -17 -10 -24 -42 27 -60 -4
4343 -4 20 38 -39 -105 -35 -63 58 9 -59 -94 -41 41 117 20 -21 -108 22 88 3 -20 26 -60 85 142 25 135 -177 -68
4371 -68 22 151 7 -2 -6 -56 -1 124 20 6 -149 -117 -180 51 23 56 -70 -18 -31 80 38 -10 -33 -90 11 59 29
4398 29 137 -46 -91 -34 51 73 60 -90 -152 -16 39 113 -74 -41 -173 -111 103 226 2 -159 -221 -167 181 168 106
4423 106 -125 -138 -45 172 172 86 -92 -224 -7 22 191 49 -76 -236 -4 87 -6 78 -43 -135 -94 24 55 118
4447 118 -16 -132 -21 106 173 99 -10 -48 -200 119 4 42 -72 -179 -137 150 203 199 -94 -248 -81 36 154
4470 154 103 -32 -230 -63 107 68 113 85 -105 -132 -1 136 -6 -16 -166 -165 29 77 83 73 -90 -204 54 136
4494 136 38 -42 -167 -47 59 169 163 89 -9 -50 -17 141 19 61 -98 -30 4 139 194 -43 -109 -154 -3 110 158
4519 158 52 -161 -43 59 176 150 56 -3 -97 -67 40 1 -6 35 -187 -2 95 112 -29 -20 -111 -107 34 45 -89 -137
4545 -137 71 -58 -14 125 147 9 -19 -36 -15 37 44 -58 -69 60 72 114 -71 -111 -71 -81 76 38 47 -30 -110 -90 3
4572 3 -67 75 -49 15 -119 39 93 -24 -87 -159 8 16 134 89 52 -19 46 -58 112 142 -35 -25 -5 86 -7 94
4598 94 44 74 87 30 -13 -2 9 83 -28 23 42 -159 42 -22 -20 -24 139 -76 -38 2 -9 20 23 69 -79 -23 -34 47 17
4627 17 35 -72 -100 -20 -25 17 45 -72 -52 -45 61 -11 44 41 -80 4 46 -14 -83 54 21 -79 17 71 105 30 72 128 -81
4656 -81 132 71 -119 -34 35 -6 95 -17 133 56 132 -1 -108 -23 -56 17 33 -40 -150 -56 69 21 -121 -81 43
4681 43 -109 85 78 -23 68 50 23 -104 122 89 -65 45 -3 63 21 81 30 -35 31 -49 76 22 20 21 -102 83 -7
4708 -7 -39 76 2 98 76 -63 9 8 -81 -11 7 71 -90 -52 27 4 -58 75 -18 -89 -59 -58 -94 26 71 -18 -53 -71 12
4737 12 27 13 23 11 -36 24 52 53 77 -124 29 20 24 -72 -38 -36 4 61 22 50 -45 -167 5 6 -12 74 -54 -82 -137 -18
4767 -18 -8 73 -7 30 13 48 24 16 96 29 -33 -89 -70 48 -35 40 -17 64 -15 73 62 8 -127 -24 36 31 33 -13 37 -62
4797 -62 -17 41 0 71 -187 -60 4 121 25 80 -9 -13 89 -3 -4 -26 57 -20 42 -14 53 -97 -55 -25 4 86 92 -29 -73
4826 -73 -28 -57 -1 13 -24 -15 19 -55 27 -9 -44 -86 -5 -121 45 -28 -112 57 -39 37 42 43 -44 -11 -1 13 -31 32 -61 23
4856 23 32 28 50 9 -36 -93 8 72 6 -6 152 -101 -89 -111 -71 -15 71 -60 16 -38 56 86 81 50 -21 66 141 94 89 12
4886 12 65 64 67 101 25 24 -46 -64 -57 -36 -94 84 37 -59 26 -45 -8 28 11 -7 -12 107 3 0 -62 -102 91 49 60 -9 8
4917 8 -2 -37 77 -38 -8 -125 -44 83 5 68 -34 4 24 -87 -88 -57 87 -13 -36 15 -24 27 -110 -48 -60 91
4943 91 14 33 38 15 34 -85 153 6 33 -4 -26 116 110 -24 96 -24 17 106 127 2 10 75 124 -17 32 114 26
4970 26 40 47 -17 -54 60 -48 -3 -28 39 -23 -13 17 14 55 39 37 24 -13 12 -93 26 -5 7 45 -15 13 -64 -8 87 -66
5000 -66 132 -31 -39 38 -31 81 -19 -22 2 68 50 35 49 -23 30 -74 -15 -4 72 58 40 -93 -25 -4 48 -107 -41 67
5028 67 -36 -52 45 84 50 -19 18 13 2 2 -31 88 1 57 -61 -13 2 -165 28 -48 42 99 -2 8 -6 -26 -1 84
5056 84 -115 -8 36 -65 -36 -78 -15 -62 36 97 104 -30 46 -64 51 -54 113 117 -40 2 27 -32 14 77 13 21 -55
5083 -55 -11 -6 8 -5 38 128 -24 -45 -37 57 37 -25 -8 18 -97 34 -32 45 -6 -11 58 -39 96 71 41 37 -125 -22 29
5112 29 -7 83 79 33 40 6 -13 -46 43 -35 -1 76 9 66 64 -5 36 40 -3 95 -56 180 37 55 34 -61 20 7 63 15 54
5143 54 18 40 -22 -14 -9 -35 -10 32 -51 -47 -66 -15 46 -76 -23 -32 -43 -43 -7 21 66 -37 -53 29 -46 26 87 -52 -58 3 -27 -48
5175 -48 -93 48 -31 -33 53 -66 12 7 -107 132 -42 -87 -57 33 -17 -44 -24 106 -65 -18 -96 -1 -19 12 22 -8 100
5202 100 104 19 56 -21 72 -53 7 33 -5 4 44 40 16 -76 -42 43 0 39 18 -16 58 61 30 -34 47 -27 41 50 -48 6 -85 42
5234 42 -92 11 -116 97 -28 38 -74 75 -140 -78 39 -92 64 25 -83 30 -60 -75 118 7 -23 -61 14
5257 14 96 -10 -82 -31 -87 1 -46 -42 -37 -44 38 -80 -16 10 27 -48 -37 -6 23 -37 -106 13 -25 -18 -16 1 79 42 5 -57 -38
5288 -38 -21 -52 6 40 108 -28 -4 -48 -24 -38 -24 96 23 9 -74 -59 -14 17 77 80 -83 -21 4 72 -61 102 -91 -33
5316 -33 57 55 66 -36 77 -95 21 -51 -66 27 -53 104 -15 116 7 -1 -67 8 2 24 53 -69 -65 -25 89 60 1
5343 1 100 -12 -58 -101 -16 40 110 -47 12 61 -104 -49 -14 79 62 -113 -54 -145 -130 59 -28 46 7 1 19 -66 -57 -41 4
5372 4 96 -19 -54 -31 -2 -32 49 18 42 52 15 1 98 50 52 -24 -24 116 -15 68 -23 28 26 -52 73 -26 -12 -14 -45 90
5402 90 -7 -14 -13 -35 -26 -70 26 -25 62 57 31 44 -6 62 -10 -60 20 93 52 23 12 -15 -51 42 -14 14 28 -68 18 -26 101 -76
5434 -76 95 122 6 -34 14 38 8 -7 -122 -96 -31 35 28 -8 -69 -7 -4 113 -105 -32 -84 -94 47 78 71 26 -101 -37
5462 -37 29 38 -57 4 -13 -55 -38 178 3 -15 -113 87 44 10 -18 13 28 66 85 -20 -84 45 52 -40 -2 17 -87 -63
5490 -63 4 -93 60 -32 17 25 -67 66 -6 83 -57 -39 -22 151 32 22 -102 -46 43 -69 40 11 1 -36 -50 36 96
5517 96 72 -50 -193 22 -47 53 31 36 -69 -2 -59 -34 50 -20 57 -48 1 6 52 -27 10 -25 -59 107 -7 22 -37
5544 -37 -121 20 83 114 -54 7 -138 3 61 15 62 -44 -73 -7 102 71 37 19 40 7 13 -48 -58 -80 98 36 28 29
5572 29 22 -69 -44 26 -3 43 -37 -23 48 54 -17 66 4 27 -33 -63 58 -80 13 -74 -40 -109 69 34 37 -74 6 -45 -71 18
5602 18 36 -15 18 59 -92 59 -54 -27 -97 82 134 32 127 -71 -93 7 32 109 67 -52 -19 58 -29 68 36 -131
5628 -131 -56 75 19 8 66 -21 28 -60 -58 60 -16 -48 16 -6 91 131 72 28 -35 39 54 -7 83 -133 -157 37 90 -38
5656 -38 -19 -124 3 -16 5 61 29 -51 -140 7 3 35 21 31 33 64 -4 26 -7 -102 -35 -25 3 -20 -19 1 6 -40 -73 68
5686 68 -22 2 -43 -15 -7 -101 -18 -63 -83 42 -32 60 3 -44 -142 84 9 3 -19 -137 -47 -76 -52 -119 30 31 -9 32 42 -20
5716 -20 -56 -136 13 -1 -43 -73 -19 77 46 47 -43 64 7 -120 -41 -169 -32 18 -20 35 28 38 -68 -134 -84 -4 -41 7
5744 7 -27 73 -84 -9 101 54 -72 -53 -49 -66 -49 125 -56 50 36 51 3 68 -67 -39 -71 67 36 -5 70 -14 -92
5771 -92 -61 105 64 -51 -28 -83 -32 85 58 -126 47 -31 120 36 -60 -10 -80 -2 -18 36 22 -81 43 71 31 50
5797 50 23 -11 -26 24 19 133 -23 -44 -44 12 73 71 2 -38 3 -39 78 74 101 -87 -161 34 75 -1 -55 -31 -169 3 97
5826 97 113 -32 -22 2 -11 -90 31 51 -125 -69 -110 143 7 40 26 -21 -171 96 77 116 40 -28 -69 -9 13 84 19
5853 19 -53 1 16 42 202 -65 -52 -43 -59 106 -75 -78 -25 -95 41 82 79 -36 -30 34 35 -3 72 -9 -67 -29 -88 -13 73 -61
5883 -61 -98 -23 13 82 23 -35 -26 -28 91 -46 14 94 -206 -28 -49 77 -7 24 -54 3 125 113 144 -17 -121 -46 43
5910 43 11 60 -13 -120 -106 -131 18 155 -3 -67 -75 -28 54 46 -21 -137 -16 21 -41 63 -22 -65 6 -31 24 76 55 -58
5938 -58 -32 31 142 103 12 0 -146 -18 70 -54 12 -48 -87 -102 -1 105 33 -114 -29 -43 3 26 31 -48 -17 -119 40
5965 40 27 -21 -90 -59 25 24 29 -75 49 88 -77 33 120 29 -18 -24 -12 44 47 -57 2 -1 9 -76 -104 -61 -73 -101 -12 48
5995 48 68 -76 45 -69 -59 100 49 3 26 -95 -75 -111 29 -17 16 -4 -73 -101 39 5 -75 -64 3 -41 -41 -59 -39
6022 -39 -84 -28 -38 113 37 97 67 108 -48 -102 22 -48 -122 25 32 -126 61 -42 49 38 -8 69 -13 53 -39 -17 55
6049 55 -12 14 -86 -13 34 126 81 -49 -74 -24 61 -67 4 -73 34 89 33 43 -25 31 100 52 -35 54 -112 -45 86
6076 86 65 -77 -64 4 3 60 -82 55 -94 -67 0 13 -45 76 13 11 -1 -2 23 77 5 -14 49 -14 141 52 -9 34 -74
6105 -74 -24 120 -50 -81 -73 -106 23 98 -33 22 36 -39 3 111 44 54 -144 -113 -49 46 69 21 -21 -50 -118 -31 198
6132 198 84 50 9 -15 64 -29 74 -104 -233 -108 55 -62 51 -6 -83 -11 87 75 -25 -189 -3 -8 145 132
6156 132 -94 44 57 -59 22 -80 3 -41 -88 -89 53 98 93 -59 22 -40 -19 73 -17 44 -127 -15 47 -34 -7 3 -111
6183 -111 50 9 98 -8 -86 -94 -5 146 83 -1 -26 -58 -70 -3 150 36 -23 -31 142 86 58 -45 0 0 8 18 127 -21
6211 -21 -92 -22 -66 10 133 -41 43 -2 -126 125 -71 51 -46 -17 -6 -48 55 -41 29 157 -33 84 39 36 -42 -3
6237 -3 -7 4 171 22 -153 -154 -89 96 -21 96 -9 13 -22 104 -34 122 102 -123 96 -55 78 21 4 -56 43
6262 43 -11 40 -6 -143 -131 42 -46 93 -20 5 -39 84 -98 19 35 -5 -34 -35 -69 -152 185 135 66 -35 117 12
6288 12 -11 35 5 -5 -42 80 -26 50 84 32 28 20 -9 -50 1 12 108 -9 21 18 -47 29 -6 79 16 -12 -38 65 47 27
6318 27 30 -74 -59 -108 5 29 -17 -67 -69 59 -72 -11 40 72 -24 -15 99 9 -67 61 -30 45 45 51 43 -10 29 51 -37 -12
6348 -12 -9 -114 55 77 3 18 62 27 15 73 64 -62 34 39 44 -36 115 -109 -107 42 6 4 31 129 -7 19 -22 22 45 3
6378 3 -88 14 -52 -37 34 -97 -73 -148 -22 -66 108 -7 -73 35 -50 0 66 12 -3 5 6 92 78 11 -57 -56 123 -3
6406 -3 29 -49 -157 20 76 -11 41 12 -47 -15 -123 67 2 -64 7 -37 33 50 42 -54 56 -82 27 45 93 -177 -27
6433 -27 41 -82 38 62 6 -27 -60 73 -50 -89 18 -9 -51 77 -47 95 -23 -75 -80 8 103 94 0 -94 59 2
6459 2 50 11 -1 -31 -3 -7 -88 24 -25 -60 -53 2 120 34 -9 90 9 101 31 32 56 -4 12 47 71 55 8 -8 52 1 3 147
6491 147 21 126 -40 -43 -48 55 -17 -72 -102 23 92 -4 -18 -6 86 107 -41 45 139 6 64 -19 65 -8 -64 -31 -69
6518 -69 4 78 -19 1 -60 -52 49 -25 45 45 6 38 -18 -26 -24 -102 -1 -44 -11 119 87 -97 -35 76 -68 56 123 -18
6546 -18 8 -19 172 45 19 35 -9 37 -104 -101 1 -58 -115 -131 -14 -42 -74 15 -31 29 -60 17 -32 -99 22 73 100 -121
6574 -121 -7 43 6 105 -70 -80 75 -20 -62 -63 34 -16 -48 -15 38 -75 -4 -20 43 31 -34 133 37 -49 -14 30 55 15
6602 15 23 -29 43 59 -15 -84 5 -8 -8 -8 -48 -33 5 77 1 -50 -31 146 -5 -61 4 -10 -52 28 -45 -48 57 -108 -18 45
6632 45 -3 -10 -35 -68 -24 -9 -67 9 -10 -43 -80 -74 1 3 -77 113 15 23 -45 -13 -18 -159 -94 13 37 22 52 -103 -94 -19 -74
6663 -74 -42 28 25 -36 -21 -13 -9 -23 -31 -14 -15 4 -101 64 -12 -8 -8 45 145 -41 -15 50 124 -33 1 58 -174 -44 -64 -7
6693 -7 -49 81 49 57 3 15 -7 -79 -19 -130 42 70 86 37 73 -69 101 -14 107 -5 -119 2 79 3 -14 16
6719 16 -39 83 114 89 -59 -113 -12 22 31 45 16 9 -118 -18 18 -114 -31 13 19 -106 24 62 -1 -78 28 -14 -39
6746 -39 -46 19 12 -126 -85 -27 -27 -41 43 32 69 -88 -12 -3 77 69 47 -5 76 -7 44 -69 -24 50 -58 -39 -75 158 4 64
6776 64 32 62 32 -56 28 -67 -41 -103 -37 -137 33 23 -66 24 -13 -40 -53 -8 -27 26 -53 -17 76 -47 107 11 161 -23
6804 -23 69 38 78 46 -64 -42 149 18 55 -2 -8 80 -78 -49 29 168 9 -61 55 19 -48 -97 34 -92 -77 -154
6830 -154 56 15 43 0 -61 -35 -6 24 -10 -40 -15 -138 -90 -124 -132 106 20 40 -77 -8 39 39 70 -12 -134 -40 28 19 49
6859 49 115 -42 29 176 -103 -93 -46 18 -42 116 -87 75 -19 -6 46 25 -24 -100 -106 25 79 -68 -91 86 23 2
6885 2 103 27 10 37 29 -41 38 172 64 56 90 70 93 51 51 73 98 -63 -4 -34 -26 -1 -14 12 -19 123 16 -9 58 10
6915 10 -123 -16 47 18 26 -54 34 -57 14 92 -43 26 34 81 -29 -68 -93 -55 43 -41 49 28 -52 111 -3 -29 83 -129
6943 -129 -108 -108 60 -26 41 -33 -2 -73 35 29 52 -67 41 33 -25 50 -11 46 -49 -32 -30 -46 -8 73 -53 -38 17 9 14 11 131
6974 131 90 0 87 69 -62 -73 68 -32 145 8 131 -61 -71 -88 16 24 31 22 2 12 74 39 -14 61 -66 -1 -55
7001 -55 46 54 -15 -25 -40 -25 -17 49 -105 29 -45 -2 32 -76 28 3 46 7 -8 32 -8 48 131 39 50 72 79 -96 -26
7030 -26 30 80 -64 25 48 -22 -51 44 31 44 -73 -78 9 19 53 -53 32 44 -20 -18 -18 37 55 -16 69 -15 -79 104 75 -56
7060 -56 11 160 -82 -15 23 -8 30 55 -19 -2 78 68 15 27 77 79 91 79 -13 -133 -51 23 -20 100 -55 -73 24 48
7088 48 -92 24 -16 -52 -25 152 14 36 60 -71 -9 2 -106 -27 25 -38 37 -24 -34 1 -8 -40 -27 -60 18 -11 -44 -8
7116 -8 -91 -13 -13 -54 -16 -30 80 -150 -60 13 -151 54 -60 46 -41 -30 -95 113 -77 -15 41 -64 -50 -72 -5 -38 10
7143 10 1 -31 -6 -10 122 64 58 -25 -20 34 14 27 67 15 -53 2 35 35 49 -47 120 6 -41 46 2 -6 14 -2 -117 3 -53
7174 -53 81 -9 -61 -34 115 -7 -61 60 -24 26 -60 -4 -45 -34 -21 -100 5 -30 10 77 86 47 -27 -35 133 -52 1 -26
7202 -26 43 64 -104 -40 12 -31 -112 -16 -67 -76 23 -127 15 -12 0 -7 -111 7 -65 -14 44 30 -26 55 83 -105 -40 -139
7230 -139 11 -45 6 61 -104 40 -60 83 -23 -5 84 15 78 -29 -9 -68 3 -2 92 74 -61 10 -8 -35 -27 -2 13
7257 13 123 111 -30 26 -52 35 -30 -64 95 27 19 -23 -15 -54 35 -59 4 11 2 64 -73 -6 -1 26 -69 -74 8 -97 57 -41
7287 -41 -117 69 -61 67 -132 81 41 -43 -10 87 100 32 2 -5 -59 8 -95 1 -14 -73 113 -59 34 -26 -24 20 -143
7314 -143 53 55 50 53 56 78 42 186 61 -5 -10 -25 -13 -20 88 26 36 -93 -37 -34 -5 -39 27 88 103 -79 25 91 27 -28
7344 -28 -35 -63 -42 -10 -1 -22 -120 -22 -11 -81 -57 -29 2 -15 -95 -51 -94 89 -26 3 8 54 22 -35 4 -22 -81 0 -13 4 82
7375 82 36 -29 0 17 -5 125 -6 6 -74 19 -55 33 -90 12 -121 104 67 27 -23 89 49 -74 -24 -21 -10 -35 -37
7402 -37 119 61 -25 -23 -24 41 104 -59 -55 -38 45 97 88 32 51 -12 38 97 -37 54 40 -50 -66 -7 13 1 23 -7 -2 15 -68
7433 -68 -73 -123 -67 -88 9 140 -24 -125 1 81 -20 3 -9 -41 -15 -45 -15 99 -13 -65 -37 -40 -25 35 -48 49 -4 94
7461 94 -6 -3 10 -37 163 -37 -110 -53 92 -1 -2 -52 41 50 5 22 -2 60 20 -33 -47 -84 -8 22 76 37 28 -131 -57 2
7491 2 26 40 -56 53 -15 37 64 -14 -6 -35 66 7 20 8 22 114 -141 -99 34 49 -82 -20 -41 42 8 -54 -48 29 -99
7520 -99 -119 -21 -93 0 -36 52 6 98 -85 -5 -34 -67 -94 13 -12 11 -16 -43 32 100 126 -17 54 1 2 153 -56 2
7548 2 -82 0 26 -25 -72 -19 -3 -86 74 -51 24 14 27 14 8 17 13 -28 36 -14 -46 25 -56 65 79 -3 123 47 68 -87
7578 -87 -87 38 -103 -48 2 -20 -24 -32 86 -3 17 7 23 -158 -29 -84 85 -28 -16 -44 -8 -31 -45 -28 83 -3 -100 49
7606 49 -49 53 -98 25 16 -42 -37 -57 112 19 5 45 24 57 -31 -92 -4 43 -37 86 -3 6 -127 55 -15 9 -174 -21
7634 -21 108 -21 -7 -33 1 -60 -120 32 62 24 -43 -8 -114 -22 -75 12 -79 27 44 59 63 -4 34 27 -37 69 1 -41
7662 -41 -47 83 -6 -11 -81 1 -36 -88 -63 7 -72 43 -59 -119 -12 59 5 14 -43 -49 -58 -93 21 -8 -106 -23 -23 7 -39 -44 19
7693 19 -45 20 42 -17 54 14 -94 48 33 77 16 58 54 76 106 74 20 -18 13 25 3 -24 -47 166 32 -142 49 30
7721 30 -34 -38 73 -92 -36 -44 -32 -15 -22 -62 49 -7 -132 -54 -67 47 -74 -27 -8 -63 -37 -72 47 -4 100 -13 47
7748 47 -5 -26 70 6 71 66 53 69 52 49 -56 -38 -40 -26 -37 69 29 58 -16 -9 58 36 68 -100 15 -17 -17 -25 59 13 29
7779 29 -47 -14 -73 -12 44 -71 125 -20 -65 44 8 -19 -62 121 -19 -66 11 -43 -35 -40 -49 -34 86 25 -31 -19 -93 -65
7807 -65 112 -92 -63 91 -20 -89 -75 37 0 25 -71 68 -22 46 19 76 66 -42 31 -47 9 25 6 -67 -6 56 -36
7834 -36 112 17 51 -75 -26 82 91 -68 71 36 131 60 9 -62 85 -8 -23 -27 11 11 -78 -111 62 -13 -79 -96 -98 -76 63
7863 63 15 85 -82 -36 33 54 -5 -32 61 -1 -27 -22 104 18 -31 33 35 -17 109 -23 -62 95 -15 33 2 80 -15 -8 -12
7892 -12 -62 -7 7 91 43 -42 51 42 -30 15 0 16 84 -21 75 -39 2 -38 -48 6 51 44 -34 -16 -68 1 -41 -24 -59 56
7922 56 25 109 -68 -2 -32 -8 11 25 -21 37 94 -69 -43 45 -19 -104 76 28 26 -52 16 -60 -30 -8 10 32 -16 18 -23
7951 -23 -95 93 -58 -12 -2 22 -72 -24 -5 46 -47 -27 27 80 -22 86 71 -8 46 -71 42 -75 29 -44 -39 32 8
7978 8 -77 -120 -119 35 -31 98 4 -54 -35 47 -92 69 41 -85 -76 140 -16 39 31 11 108 -42 -54 -1 10 -56 -43 54
8006 54 -31 30 65 72 20 -57 -45 -56 96 120 12 -3 -51 46 -20 20 7 103 -30 86 -1 -21 83 -52 38 13 -23 99
8034 99 16 21 36 12 -106 12 -127 -25 -49 15 -50 -42 -3 -25 48 -91 -10 108 -53 15 -19 -62 84 -36 -29 67 82
8061 82 25 41 44 30 -16 -52 5 12 -6 36 -10 93 126 8 -69 0 -43 68 -70 59 -55 -5 57 48 -43 -48 -16 32 4
8090 4 30 -15 -24 125 8 76 27 28 54 46 167 76 -58 -75 -44 -1 -18 -4 -25 48 -54 0 -7 -50 101 64 -21 -22 13 68
8120 68 7 -12 -60 -65 -52 -2 -9 1 -42 19 -51 56 -45 -24 -5 -10 110 7 79 -74 3 -4 -66 171 60 -44 -40 -76 28
8149 28 -47 73 -64 66 20 -64 37 25 -42 4 -41 37 19 12 63 -82 -43 3 28 -8 -64 -49 -15 -122 65 27 -41
8176 -41 -29 43 -38 -13 73 81 15 -6 -40 60 -37 84 46 46 90
8191I0
##END NTUPLES=NMR FID
##END=
