##TITLE=1H_E3e-4-1
 CDCl3
 8 sc, 
 16.6.2023
##JCAMPDX= 6.0         $$ Bruker NMR JCAMP-DX V2.0
##DATA TYPE= NMR FID
##DATA CLASS= NTUPLES
##ORIGIN= UXNMR, Bruker Analytische Messtechnik GmbH
##OWNER= root
$$ XWIN-NMR		Version 3.5
$$ Fri Jun 16 13:58:51 2023 Russian Standard Time (UT+4h)  she@DPX200
##.OBSERVE FREQUENCY= 200.13135
##.OBSERVE NUCLEUS= ^1H
##.DELAY= (6, 6)
##.ACQUISITION MODE= SIMULTANEOUS
##.ACQUISITION SCHEME= undefined
##.AVERAGES= 8
##.DIGITISER RES= 18
##SPECTROMETER/DATA SYSTEM= spect
##.PULSE SEQUENCE= zg30
##.SOLVENT NAME= CDCl3
##.SHIFT REFERENCE= (INTERNAL, CDCl3, 0, 15.7039)
##AUDIT TRAIL= $$ (NUMBER, WHEN, WHO, WHERE, WHAT)
$$ ##TITLE= Audit trail, XWIN-NMR		Version 3.5
$$ ##JCAMPDX= 5.01
$$ ##ORIGIN= Bruker BioSpin GmbH
$$ ##OWNER= she
$$ F:/spectra/data/she/nmr/H-F/1/audita.txt
$$ ##AUDIT TRAIL=  $$ (NUMBER, WHEN, WHO, WHERE, WHAT)
(   1,<2023-06-16 13:57:21.56 +0400>,<she>,<DPX200>,
      <created by zg, POWCHK disabled, PULCHK disabled
       configuration hash MD5:
       00 E9 B6 7A A2 85 ED C7 34 08 36 98 17 FE 4E 26
       data hash MD5: 16K
       87 4E 97 7F 0D 3B 77 14 62 5C 10 3D 1A 7F 50 B8>)
$$ ##END=
$$ 
$$ hash MD5
$$ 3D C9 74 15 70 9D 4D 97 79 C0 DA AC 0A 06 00 E5
##$RELAX= 
##$RELAX= 
##$RELAX= 
##$RELAX= 
##$RELAX= 
##$RELAX= 
$$ Bruker specific parameters
$$ --------------------------
##$DU= <F:/spectra>
##$EXPNO= 1
##$NAME= <H-F>
##$PROCNO= 1
##$TYPE= <nmr>
##$USER= <she>
##$AMP= (0..31)
100 100 100 100 100 100 100 100 100 100 100 100 100 100 100 100 100 100 
100 100 100 100 100 100 100 100 100 100 100 100 100 100 
##$AQSEQ= 0
##$AQ_mod= 1
##$AUNM= <au_zg>
##$AUTOPOS= <>
##$BF1= 200.13
##$BF2= 200.13
##$BF3= 200.13
##$BF4= 200.13
##$BF5= 200.13
##$BF6= 200.13
##$BF7= 200.13
##$BF8= 200.13
##$BYTORDA= 1
##$CFDGTYP= 0
##$CFRGTYP= 5
##$CHEMSTR= <none>
##$CNST= (0..31)
1 1 145 1 1 1 1 1 1 1 1 1 1 1 1 1 1 1 1 1 1 1 1 1 1 1 1 1 1 1 1 1 
##$CPDPRG= <>
##$CPDPRG1= <>
##$CPDPRG2= <>
##$CPDPRG3= <>
##$CPDPRG4= <mlev>
##$CPDPRG5= <mlev>
##$CPDPRG6= <mlev>
##$CPDPRG7= <mlev>
##$CPDPRG8= <mlev>
##$CPDPRGB= <>
##$CPDPRGT= <>
##$D= (0..31)
0 1.2 0 0 0 0 0 0 0 0.06 0 0.03 0 0 0 0 0.0002 0 0 0 0 0 0 0 0 0 0 0 0 
0 0 0 
##$DATE= 1686909441
##$DBL= (0..7)
120 120 120 120 120 120 120 120 
##$DBP= (0..7)
150 150 150 150 150 150 150 150 
##$DBP07= 0
##$DBPNAM0= <>
##$DBPNAM1= <>
##$DBPNAM2= <>
##$DBPNAM3= <>
##$DBPNAM4= <>
##$DBPNAM5= <>
##$DBPNAM6= <>
##$DBPNAM7= <>
##$DBPOAL= (0..7)
0.5 0.5 0.5 0.5 0.5 0.5 0.5 0.5 
##$DBPOFFS= (0..7)
0 0 0 0 0 0 0 0 
##$DE= 6
##$DECBNUC= <off>
##$DECIM= 32
##$DECNUC= <off>
##$DECSTAT= 4
##$DIGMOD= 1
##$DIGTYP= 9
##$DL= (0..7)
0 120 120 120 120 120 120 120 
##$DP= (0..7)
150 150 150 150 150 150 150 150 
##$DP07= 0
##$DPNAME0= <>
##$DPNAME1= <>
##$DPNAME2= <>
##$DPNAME3= <>
##$DPNAME4= <>
##$DPNAME5= <>
##$DPNAME6= <>
##$DPNAME7= <>
##$DPOAL= (0..7)
0.5 0.5 0.5 0.5 0.5 0.5 0.5 0.5 
##$DPOFFS= (0..7)
0 0 0 0 0 0 0 0 
##$DQDMODE= 0
##$DR= 18
##$DS= 0
##$DSLIST= <SSSSSSSSSSSSSSS>
$$ [...]
##$SUBNAM2= <"">
##$SUBNAM3= <"">
##$SUBNAM4= <"">
##$SUBNAM5= <"">
##$SUBNAM6= <"">
##$SUBNAM7= <"">
##$SUBNAM8= <"">
##$SUBNAM9= <"">
##$SW= 18.05172834244
##$SWIBOX= (0..15)
0 0 2 0 0 0 0 0 0 0 0 0 0 0 0 0 
##$SW_h= 3612.71676300578
##$TD= 16384
##$TD0= 1
##$TE= 0
##$TE2= 300
##$TE3= 300
##$TEG= 300
##$TL= (0..7)
0 120 120 120 120 120 120 120 
##$TP= (0..7)
150 150 150 150 150 150 150 150 
##$TP07= 0
##$TPNAME0= <>
##$TPNAME1= <>
##$TPNAME2= <>
##$TPNAME3= <>
##$TPNAME4= <>
##$TPNAME5= <>
##$TPNAME6= <>
##$TPNAME7= <>
##$TPOAL= (0..7)
0.5 0.5 0.5 0.5 0.5 0.5 0.5 0.5 
##$TPOFFS= (0..7)
0 0 0 0 0 0 0 0 
##$TUNHIN= 0
##$TUNHOUT= 0
##$TUNXOUT= 0
##$USERA1= <user>
##$USERA2= <user>
##$USERA3= <user>
##$USERA4= <user>
##$USERA5= <user>
##$V9= 5
##$VALIST= <valist>
##$VCLIST= <CCCCCCCCCCCCCCC>
##$VD= 0
##$VDLIST= <DDDDDDDDDDDDDDD>
##$VPLIST= <PPPPPPPPPPPPPPP>
##$VTLIST= <TTTTTTTTTTTTTTT>
##$WBST= 1024
##$WBSW= 4
##$XGAIN= (0..3)
0 0 0 0 
##$XL= 0
##$YL= 0
##$YMAX_a= 328817
##$YMIN_a= -268682
##$ZGOPTNS= <>
##$ZL1= 120
##$ZL2= 120
##$ZL3= 120
##$ZL4= 120
##$ABSF1= 10
##$ABSF2= 0
##$ABSG= 5
##$ABSL= 3
##$ALPHA= 0
##$AQORDER= 0
##$ASSFAC= 0
##$ASSFACI= 0
##$ASSFACX= 0
##$ASSWID= 0
##$AUNMP= <proc_1d>
##$AZFE= 0.1
##$AZFW= 0.1
##$BCFW= 1
##$BC_mod= 2
##$BYTORDP= 1
##$COROFFS= 0
##$CY= 11.3945322036743
##$DATMOD= 1
##$DC= 2
##$DFILT= <>
##$DTYPP= 0
##$F1P= 15.7292609196834
##$F2P= 12.9074282941183
##$FCOR= 0.5
##$FTSIZE= 0
##$FT_mod= 4
##$GAMMA= 1
##$GB= 0.15
##$INTBC= 1
##$INTSCL= 1
##$ISEN= 128
##$LB= 0.24
##$LEV0= 0
##$LPBIN= 0
##$MAXI= 10000
##$MC2= 0
##$MEAN= 0
##$ME_mod= 0
##$MI= 1.114404
##$NCOEF= 0
##$NC_proc= 0
##$NLEV= 6
##$NOISF1= 3.799351
##$NOISF2= 2.8
##$NSP= 1
##$NTH_PI= 0
##$NZP= 0
##$OFFSET= 15.70392
##$PC= 1
##$PHC0= -20782.63
##$PHC1= 9.052721
##$PH_mod= 1
##$PKNL= yes
##$PPARMOD= 0
##$PSCAL= 0
##$PSIGN= 0
##$REVERSE= no
##$SF= 200.130013532006
##$SI= 16384
##$SIGF1= 3
##$SIGF2= 2
##$SINO= 400
##$SIOLD= 16384
##$SREGLST= <1H.CDCl3>
##$SSB= 0
##$STSI= 0
##$STSR= 0
##$SW_p= 3612.71676300578
##$SYMM= 0
##$S_DEV= 0
##$TDeff= 0
##$TDoff= 0
##$TI= <>
##$TILT= no
##$TM1= 0
##$TM2= 0
##$TOPLEV= 0
##$USERP1= <user>
##$USERP2= <user>
##$USERP3= <user>
##$USERP4= <user>
##$USERP5= <user>
##$WDW= 1
##$XDIM= 8192
##$YMAX_p= 0
##$YMIN_p= 0
$$ End of Bruker specific parameters
$$ ---------------------------------
##NTUPLES= NMR FID
##VAR_NAME=  TIME,          FID/REAL,        FID/IMAG
##SYMBOL=    X,             R,               I
##VAR_TYPE=  INDEPENDENT,   DEPENDENT,       DEPENDENT
##VAR_FORM=  AFFN,          ASDF,            ASDF
##VAR_DIM=   8192,          8192,            8192
##UNITS=     SECONDS,       ARBITRARY UNITS, ARBITRARY UNITS
##FACTOR=    0.0002768,     1,               1
##FIRST=     0,             0,               0
##LAST=      2.2672688,     0,               0
##MIN=       0,             -268682,         0
##MAX=       2.2672688,     328817,          0
$$ Real data points
##PAGE= N=1
##DATA TABLE= (X++(R..R)), XYDATA
$$ plain form
0 0 0 0 0 0 0 0 0 0 0 0 0 0 0 0 0 -6 8 -8 8 -8 12 -16 16 -22 24 -30 32 -40 46 -54 62 -70 79 -92 103 -117 131
37 131 -149 168 -187 209 -233 257 -288 319 -351 389 -428 473 -522 574 -633 698 -769 845 -933
56 -933 1029 -1139 1265 -1408 1573 -1767 1998 -2275 2612 -3025 3513 -3975 3501 8031 328817
71 328817 110286 -88411 126203 -139300 -268682 158082 201667 -77468 11041 -43039 -205375
82 -205375 64716 214370 -21059 -14482 21609 -152688 -40954 160815 3977 -76723 27488
93 27488 -18255 -12251 107843 28557 -84928 -53495 -26184 34160 97653 2658 -68366 -37950
105 -37950 -44550 39108 149027 12820 -121215 -61195 -53476 -2945 164985 87931 -102705
116 -102705 -61847 -35876 -49645 123191 132759 -99009 -95941 6962 -46074 52398 170661
$$ packed form
0@%%%%%%%%%%%%%%%oJ4j6J6j6K0k8L2l8M6n4O2p2Q6j00J16j32J49j71J95k20K48
37A31k80L17l55L96m42M90n45O07o70P40q17R01r95J096j207J331j467J614j778
56i33J962k168K404k673K981l340L765m273M887n637O538p488P476M530L20786
71C28817k18531j98697K14614k65503j29382M26764M3585k79135Q8509n4080j62336
82b05375K70091J49654k35429O577L6091j74297J11734K01769j56838q0700J04211
93B7488m5743O004J20094p9286j13485L1433K7311O0344O3493r4995p1024L0416
105c7950o600Q3658J09919j36207j34035O0020P719N0531J67930p7054j90636
116a02705M0858K5971j3769J72836R568k31768L068J02903n3036R8472J18263
$$ plain form
127 170661 -21231 -129676 -1767 -8902 -18555 105219 30636 -111727 -18941 41021 -9920
138 -9920 51809 44860 -93672 -57690 52083 9615 -261 41190 -38808 -69373 46000 69383
150 69383 -8247 -17854 -22383 -55134 -401 78428 45501 -25904 -38107 -28473 -6051 48873 56895
163 56895 -16506 -59083 -30923 -3846 29890 66561 16890 -62781 -44275 3514 8069 32437
175 32437 35928 -32968 -52590 5028 22825 15979 24434 -10707 -45060 -6466 25989 10894 7949
188 7949 3824 -20538 -11079 23394 20410 -7771 -17808 -9132 727 11131 19827 4717 -24449
201 -24449 -18718 8084 10270 10567 9532 -24216 -31413 12528 18867 -691 14724 2 -38676
214 -38676 -5686 29966 1509 16 13863 -20835 -17823 25477 8631 -8514 16660 -4389
$$ packed form
127A70661j91892j08445J27909p135r653J23774p4583j42363R2786N9962n0941
138i920O1729o949j38532L5982J09773m2468r876M1451p9998l0565J15373K3383
150F9383p7630r607m529l2751N4733P8829l2927p1405j2203R634K2422N4924Q022
163E6895p3401m2577K8160K7077L3736L6671m9671p9671J8506M7789M555K4368
175C2437L491o8896j9622N7618J7797o846Q455l5141l4353L8594L2455j5095k945
188G949m125k4362R459L4473k984k8181j0037Q676R859J0404Q696j5110k9166
201b4449N731K6802K186K97j035l3748p197M3941O339j9558J5415j4722l8678
214c8676L2990L5652k8457j493J3847l4698L012M3300j6846j7145K5174k1049
$$ plain form
226 -4389 -26974 13828 17501 -16177 4551 13081 -20224 -4946 17437 -9728 -7925 14541 -6524
239 -6524 -12279 10337 -2181 -11045 10683 4526 -11269 1958 2342 -6439 8144 10226 -5975 -4503
253 -4503 173 -1590 8059 9174 -3695 -5103 -3446 -2673 10300 11060 -7961 -11258 -3109 -1009 8325
268 8325 11812 -6954 -15385 -5383 639 10206 14697 -6812 -21484 -5984 7428 11845 15178 -1288
282 -1288 -21902 -12616 8244 17039 17516 570 -23171 -16596 8403 17639 15249 3404 -19846 -23607
296 -23607 2311 21119 16206 -225 -18931 -22463 -1047 19360 17051 197 -17787 -22388 -2056
309 -2056 22090 20685 -1371 -19973 -19811 -207 21926 23766 2676 -20982 -23702 -684 25017
322 25017 25010 540 -22568 -24334 -3667 22530 28291 4429 -25322 -29459 -5020 21805 25901 4830
$$ packed form
226d389k2585M0802L673l3678K0728Q530l3305J5278K2383k7165J803K2466k1065
239f524n755K2616j2518q864K1728o157j5795J3227L84q781J4583K082j6201J472
253d503M676j763R649J115j2869j408J657P73J2973P60j9021l297Q149K100R334
268H325L487j8766q431J0002O022R567M491k1509j4672J5500J3412M417L333j6466
282a288k0614R286K0860Q795M77j6946k3741O575K4999R236k390j1845k3250l761
296b3607K5918J8808m913j6431j8706l532K1416K0407k309j6854j7984m601K0332
309b056K4146j405k2056j8602J62J9604K2133J840k1090k3658k720K3018K5701
322B5017pk4470k3108j766K0667K6197N761k3862k9751m137K4439K6825M096k1071
$$ plain form
336 4830 -22283 -28747 -6886 21648 28676 7295 -22654 -30974 -7215 23471 29073 8536 -17894
349 -17894 -28100 -9607 22082 32181 8882 -21745 -30161 -9412 21062 31491 11823 -18893
361 -18893 -31987 -13975 18121 29816 10150 -19574 -31415 -13128 18789 31043 12364 -17164
373 -17164 -32196 -16774 18223 32504 11570 -15444 -26310 -15254 16778 36339 14361 -19179
385 -19179 -29021 -16038 13012 35786 18202 -18088 -27759 -14494 8102 31502 21155 -20335
397 -20335 -34699 -12694 10515 26796 22956 -12035 -34529 -15587 11558 24168 20090 -8911
409 -8911 -33985 -16712 17774 28359 17428 -5122 -28382 -23832 9618 31827 19099 -8880
421 -8880 -25109 -19292 5188 29050 22784 -9644 -28279 -19461 -834 21644 27540 -3846 -30195
$$ packed form
336D830k7113o464K1861K8534P028k1381k9949q320K3759L0686N602k0537k6430
349a7894j0206J8493L1689J0099k3299l0627q416K0749L0474J0429j9668l0716
361a8893j3094J8012L2096J1695j9666k9724j1841J8287L1917J2254j8679k9528
373a7164j5032J5422L4997J4281k0934k7014j0866J1056L2032J9561k1978l3540
385a9179r842J2983K9050K2774j7584l6290r671J3265K2596K3400j0347m1490
397b0335j4364K2005K3209J6281l840l4991k2494J8942K7145J2610m078k9001
409h911k5074J7273L4486J0585j0931k2550k3260M550L3450K2209j2728k7979
421h880j6229N817K4480K3862o266l2428j8635Q818J8627K2478N896l1386k6349
$$ plain form
434 -30195 -14729 5722 13229 20979 2814 -31015 -20203 13352 17543 14999 7500 -24440 -25839
447 -25839 15252 24372 6367 2349 -17127 -31043 8966 37254 10923 -7481 -13237 -28896 -7620
460 -7620 33641 22252 -9905 -15367 -20054 -12220 22926 28714 -3672 -18118 -15308 -11681 9551
473 9551 26722 8504 -14339 -13625 -2960 6185 12526 8256 -6068 -13646 -2597 11280 8529 54
487 54 -3595 -9962 -4790 14400 9827 -11396 -8836 -3651 -7765 12858 24011 -10159 -24235 -1983
501 -1983 -1511 2624 27158 6573 -29448 -10753 6603 -810 20836 22161 -23791 -23160 10159 -32
515 -32 3357 29610 -2586 -32290 2938 10802 -10154 12902 15736 -22615 -10302 14767 -7923
528 -7923 -4395 18394 -7197 -15212 14760 -83 -19321 9364 9878 -12566 7993 14357 -16271
$$ packed form
434c0195J5466K0451P507P750j8165l3829J0812L3555M191k544p499l1940j399
447b5839M1091R120j8005m018j9476j3916M0009K8288k6331j8404n756j5659K1276
460g620M1261j1389l2157n462m687P834L5146N788l2386j4446K810L627K1232
473I551J7171j8218k2843P14J0665R145O341m270j4324p578J1049J3877k751q475
487E4l649o367N172J9190m573k1223K560N185m114K0623J1153l4170j4076K2252
501a983M72M135K4534k0585l6021J8695J7356p413K1646J325m5952O31L3319j0191
515c2L389K6253l2196k9704L5228P864k0956K3056K834l8351J2313K5069k2690
528g923L528K2789k5591q015K9972j4843j9238K8685N14k2444K0559O364l0628
$$ plain form
541 -16271 -9803 11043 -605 2162 15418 -4066 -16432 -164 4211 3314 12147 4745 -11893
554 -11893 -12139 -3521 6119 10009 3484 -913 -7400 -15321 -554 14615 1654 -795 6327 -13938
568 -13938 -14656 15053 6002 -8190 15958 4292 -26164 3631 17202 -14747 5362 26188 -17989
581 -17989 -18107 19298 -6597 -12783 29448 4385 -28916 7996 6076 -23616 14730 24656 -23214
594 -23214 -8508 16242 -18000 -7789 28528 -2630 -17627 13145 -2446 -18029 13907 10420
606 10420 -11773 8260 7681 -17049 -220 11821 -6604 2868 14638 -7768 -12279 2729 -395
619 -395 1476 11295 1362 -8686 -7040 -7139 1851 12672 4681 -3624 -6220 -11622 -2190 12052 6367
634 6367 1925 494 -14614 -8975 14700 7684 -2464 8220 -4903 -18042 8152 13931 -7071
$$ packed form
541a6271O468K0846j1648K767J3256j9484j2366J6268M375q97Q833p402j6638
554a1893k46Q618R640L890o525m397o487p921J4767J5169j2961k449P122k0265
568a3938p18K9709r051j4192K4148j1666l0456K9795J3571l1949K0109K0826m4177
581a7989j18L7405k5895o186M2231k5063l3301L6912j920k9692L8346R926m7870
594b3214J4706K4750l4242J0211L6317l1158j4997L0772j5591j5583L1936l487
606A0420k2193K0033n79k4730J6829J2041j8425R472J1770k2406m511J5008l124
619c95J871R819r933j0048J646r9Q990J0821p991q305k596n402R432J4242n685
634F367m442j431j5108N639K3675p016j0148J0684j3123j3139K6194N779k1002
$$ plain form
647 -7071 2916 6760 -15415 -1989 16574 -7305 -9043 12549 -4696 -11528 14776 1413 -20986
660 -20986 4895 12556 -8913 4141 10480 -18205 -11076 16382 4285 -1099 11312 -8960 -20503
673 -20503 9324 15028 -1930 6301 2678 -20872 -6725 17957 6142 -1490 4431 -10444 -14911
686 -14911 8042 11216 -1699 1080 -2818 -13241 -565 11602 1318 -3448 166 -4797 -3515
699 -3515 6288 4316 -2531 -1951 -872 1588 4835 1087 -2954 -2418 -733 4043 6440 -761 -5269 -3374
715 -3374 -2956 3667 10227 -654 -9655 -3143 -2230 -1198 11019 5795 -11619 -6679 1273 -2439 6941
730 6941 10877 -8023 -9455 4132 -833 1180 13175 -1806 -13954 3918 5975 -4398 6813
743 6813 5865 -12271 -3144 9503 -1425 -738 5123 -8493 -6558 9341 1691 -5026 3405 -3915
$$ packed form
647g071R987L844k2175J3426J8563k3879j738K1592j7245o832K6304j3363k2399
660b0986K5881P661k1469J3054O339k8685P129K7458j2097n384J2411k0272j1543
673b0503K9827N704j6958Q231l623k3550J4147K4682j1815p632N921j4875m467
686a4911K2953L174j2915K779l898j0423J2676J2167j0284m766L614m963J282
699c515R803j972o847N80J079K460L247l748m041N36J685M776K397p201m508J895
715c374M18O623O560j0881r001O512R13J032J2217n224j7414M940P952l712R380
730F941L936j8900j432J3587m965K013J1995j4981j2148J7872K057j0373J1211
743F813r48j8136R127J2647j0928O87N861j3616J935J5899p650o717Q431p320
$$ plain form
757 -3915 -9333 6905 8067 -4501 -1742 -1326 -6780 3881 9373 -1106 -2182 -502 -6051 1448
771 1448 10855 1457 -4592 -768 -3369 -1060 7346 2847 -4026 -1862 -2940 -1487 6224 2214 -5789
786 -5789 -2128 -453 -2164 4058 3395 -5570 -3880 1252 309 3684 4202 -5003 -4986 2100 1653 3095 5976
803 5976 -2738 -7444 844 4036 2230 4133 -255 -6969 -2747 2764 2582 3285 63 -6606 -3835 2213
819 2213 2022 1679 960 -4227 -4762 1078 3162 2036 398 -3051 -3012 1690 3208 1699 819 -1378 -2426
836 -2426 1054 3577 2131 -494 -2220 -1371 1106 1860 920 -321 -2577 -1975 788 1254 284 -893 -2756
853 -2756 -1857 1527 863 -659 411 -1355 -2427 1908 2718 -744 -176 218 -1803 1265 3209 101
869 101 -93 642 -2102 172 3695 -135 -1665 850 -1484 -2013 2175 1252 -1812 -714 -1552 -1418 1683
$$ packed form
757c915n418J6238J162j2568K759M16n454J0661N492j0479j076J680n549P499
771A448R407r398o049L824k601K309Q406m499o873K164j078J453P711m010q003
786e789L661J675j711O222o63q965J690N132r43L375N18r205J7P086m47J442K881
803E976q714m706Q288L192j806J903m388o714M222N511j82P03l222o669K771O048
819B213j91l43p19n187n35N840K084j126j638l449L9M702J518j509q80k197j048
836b426L480K523j446k625j726Q49K477P54r40j241k256O02K763M66r70j177j863
853b756Q99L384o64j522J070j766j072M335Q10l462N68L94k021L068J944l108
869A01j94P35k744K274L523l830j530K515k334n29M188r23l064J098q38J34L101
$$ plain form
886 1683 375 -1762 410 -897 -2269 2186 1930 -1633 140 130 -1187 2551 1840 -2128 1427 1756
902 1756 -3226 1605 4323 -3246 -1121 3918 -2519 -2008 4210 -2246 -3471 4508 -1025 -5216 3731
917 3731 203 -6411 3649 4054 -6381 70 4648 -5010 -754 6712 -2139 -3188 4342 -879 -2762
932 -2762 4739 1416 -2685 2500 830 -3292 1405 2066 -1346 609 841 -1979 -1468 -519 333 1569
948 1569 -804 -1336 25 -2820 -1368 3822 146 -1922 2489 -2548 -4764 5572 3202 -4453 4032
963 4032 2805 -8777 1152 8787 -3871 -818 7267 -6153 -6224 8645 620 -5391 6632 -374
977 -374 -10402 3639 5238 -6791 1624 5572 -7329 -2595 6070 -3259 -2748 6225 -456 -3983 3194
992 3194 -528 -4414 3321 4879 -575 -163 -52 -3239 -1558 4199 5578 -26 -4049 -1843 -2286 -2373
$$ packed form
886A683j308k137K172j307j372M455k56l563J773j0j317L738p11l968L555L29
902A756m982M831K718p569K125N039o437N11O218o456j225P979n533m191Q947
917C731l528o614J0060M05j0435O451M578r658M256P466q851j049P530n221j883
932b762P501l323m101N185j670m122M697O61l412J955K32k820N11R49Q52J236
948A569k373n32J361k845J452N190l676k068M411n037k216J0336k370p655Q485
963D032j227j1582R929P635j2658L053Q085j3420p1J4869q025o011J2023p006
977c74j0028J4041J599j2029Q415L948j2901M734Q665r329N11Q973o681l527P177
992C194l722l886P735J558n454M12J11l187J681N757J379n604m023K206m43q7
$$ plain form
1008 -2373 6199 6540 -5331 -4882 283 -4976 462 10691 -389 -7465 1769 -3468 -6979 9571
1022 9571 7680 -8157 404 4062 -9544 336 12709 -2453 -4502 7292 -3863 -8266 7995
1035 7995 3468 -6448 5875 4631 -9963 -1844 5235 -4859 -277 9559 -1993 -8903 -30 -449
1049 -449 -2832 6997 7262 -5948 -7128 -23 -924 1358 9927 3806 -9294 -4503 3393 -1078 2847
1064 2847 10578 -2339 -10746 2079 2802 -4450 6049 6558 -8973 -3550 6008 -4700 -2996 8867
1078 8867 -2050 -7190 6583 481 -10265 3306 6398 -5615 1999 7538 -6998 -6395 5918
1091 5918 1915 -249 6914 -620 -9476 -982 4430 1483 4943 4472 -7256 -8816 2350 5215 1226
1106 1226 3192 536 -9788 -6689 6656 5297 -1027 2114 -2392 -9877 840 8285 -858 -351
$$ packed form
1008b373Q572L41j1871M49N165n259N438J0229j1080p076R234n237l511J6550
1022I571j891j5837Q561L658j3606R880J2373j5162k049J1794j1155m403J6261
1035G995m527r916J2323j244j4594Q119P079j0094M582R836j1552o910Q873m19
1049d49k383R829K65j3210j180P105r01K282Q569o121j3100M791P896m471L925
1064B847P731j2917q407J2825P23p252J0499N09j5531N423R558j0708J704J1863
1078H867j0917n140J3773o102j0746J3571L092j2013P614N539j4536O03J2313
1091E918m003k164P163p534q856Q494N412k947L460m71j1728j560J1166K865l989
1106A226J966k656j0324L099J3345j359o324L141m506p485J0717P445r143N07
$$ plain form
1120 -351 3709 -6652 -4165 8829 1054 -5072 6023 954 -7723 5170 5272 -8930 657 8620
1134 8620 -4759 -1699 7341 -6789 -8235 8408 3657 -4487 4112 -1498 -11742 1184 8748 -41
1148 -41 909 1279 -8839 -4742 7039 4954 1532 2055 -4865 -7296 2067 6778 3266 700 -1522 -4295
1164 -4295 -3306 2468 6124 1354 -3853 -1504 -739 -2983 2058 3976 -3057 -2216 2463 -2303 -1892 3871
1180 3871 -2171 -3912 5670 2043 -5875 2113 2277 -6271 2590 8766 -3348 -3627 3553 -3523 -2794
1195 -2794 8364 2006 -5314 1429 -972 -5632 4951 5853 -4800 -1645 1554 -5740 -935 6908
1209 6908 -595 -3995 1604 -1497 -3037 3971 2382 -2815 248 679 -2296 1363 3096 -976 -684
1224 -684 1606 -116 -116 949 -127 -193 212 -87 669 9 -1801 -330 935 -564 5 76 -2149 -794
$$ packed form
1120c51M060j0361K487J2994p775o126J1095n069q677J2893J02j4202R587P963
1134H620j3379L060R040j4130j446J6643m751q144Q599n610j0244J2926P564q789
1148d1R50L70j0118M097J1781k085l422N23o920k431R363M711l512k566k222k773
1164d295R89N774L656m770n207K349P65k244N041J918p033Q41M679m766M11N763
1180C871o042j741R582l627p918P988J64q548Q861O176j2114k79P180p076P29
1195b794J1158o358p320O743k401m660J0583R02j0653L155L199p294M805P843
1209F908p503l400N599l101j540P008j589n197L063M31k975L659J733m072K92
1224f84K290j722%J065j076o6M05k99P56o60j810J471J265j499N69P1k225J355
$$ plain form
1242 -794 1238 -904 -12 1709 -2217 -1930 2767 601 -1771 2233 763 -2645 1432 2081 -1726 974
1258 974 2217 -2115 -150 2807 -1736 -1371 3122 -467 -2656 1744 -39 -3006 1385 1345 -2327 -39
1274 -39 812 -2388 0 2172 -1170 -628 1498 -1291 -1000 2596 483 -1303 997 315 -772 1544
1290 1544 1143 -751 141 -188 -1006 1403 1370 -1623 -882 71 -1065 210 1566 -714 -1731 -818 -849 612
1308 612 1756 -814 -1515 35 -333 -22 2284 842 -1928 -597 864 781 1599 831 -1462 -549 880
1325 880 591 1298 795 -2153 -2091 698 1071 654 423 -1711 -2614 -505 1329 1475 653 -1461 -2887 -784
1343 -784 1539 1842 1573 -241 -2404 -1602 1332 2577 1516 -161 -1468 -1330 551 2114 1771 -280
1359 -280 -1859 -1532 330 1973 1055 -1366 -1976 -1135 63 1715 1612 -1469 -3499 -1432 1043 2131
$$ packed form
1242g94K032k142Q92J721l926K87M697k166k372M004j470l408M077O49l807K700
1258I74J243m332J965K957m543L65M493l589k189M400j783k967M391m0l672K288
1274c9Q51l200K388K172l342N42K126k789K91L596k113j786K300o82j087K316
1290A544m01j894Q92l29q18K409l3k993P41R53j136J275J356k280j017R13l1J461
1308F12J144k570p01J550l68L11K306j442k770J331J461q3Q18p68k293R13J429
1325H80k89P07n03k948O2K789L73m17k31k134r03K109J834J46q22k114j426K103
1343g84K323L03k69j814k163Q02K934J245j061j677j307J38J881J563l43k051
1359b80j579L27J862J643r18k421o10Q41J198J652j03l081k030K067K475J088
$$ plain form
1375 2131 2115 -718 -3124 -1715 949 2148 2635 721 -2975 -2383 1512 2490 1958 1115 -1797 -2897 207
1392 207 1993 1367 703 -1725 -2948 -238 2077 1285 -168 -1652 -2646 -941 1975 2137 221 -2186
1408 -2186 -2841 -141 2246 2608 1603 -1576 -3804 -739 2903 2726 1974 -485 -4161 -2064 2793 2452
1424 2452 1250 543 -3535 -3606 2302 2673 -473 333 -1631 -4122 823 3730 -704 -1206 -9 -2727
1440 -2727 -117 4496 86 -3198 470 -250 -1347 4017 3287 -3262 -2259 1197 168 1567 3524
1455 3524 -1114 -3914 -764 865 968 2565 554 -3814 -2795 840 1438 975 899 -1493 -3819 -592
1471 -592 2972 1144 -462 250 -1705 -1820 2962 2871 -1692 -720 505 -1677 1396 4364 -1401 -3362
1487 -3362 1429 262 -627 3881 649 -5685 -1228 2685 -506 1200 2606 -4031 -4599 2211 1997 -31
$$ packed form
1375B131j6k833k406J409K664J199M87j914l696N92L895R78n32q43k912j100L104
1392B07J786o26o64k428j223K710K315p92j453j484r94J705K916J62j916k407
1408b186o55K700K387L62j005l179k228L065L642j77p52k459l676K097M857l41
1424B452j202p07m078p1N908L71l146Q06j964k491M945K907m434n02J197k718
1440b727K610M613m410l284L668p20j097N364p30o549J003L456j029J399J957
1455C524m638k800L150J629J03J597k011m368J019L635N98m63p6k392k326L227
1471e92L564j828j606P12j955j15M782r1m563R72J225k182L073K968n765j961
1487c362M791j167q89M508l232o334M457L913l191J706J406o637n68O810k14k028
$$ plain form
1503 -31 2210 -1070 -5342 -83 3996 856 579 1409 -3008 -3195 2979 3576 -363 269 98 -3127 -575
1520 -575 3961 643 -2098 1029 -500 -3195 2048 2872 -3337 -1367 3036 -2046 -2135 3389 -1114 -4514
1536 -4514 3137 3028 -3050 1121 1628 -5011 101 6260 -560 -1805 2443 -3189 -3694 5752 3843 -2838
1552 -2838 652 -169 -5400 798 5876 -462 -2147 385 -3123 -3015 3397 2796 -1495 -620 -424 -3014
1568 -3014 -746 3368 1226 -1337 535 569 -2834 -11 3777 99 -1385 2749 -417 -4067 1910
1583 1910 2799 -2713 1511 3643 -4575 -2854 4164 -1368 -2373 5247 -376 -6526 1552 1945 -4033
1598 -4033 2804 4338 -5104 -1902 3597 -2902 -948 5999 -736 -4010 2950 145 -3769 3289 3520
1613 3520 -2680 159 1866 -3218 -1317 3118 875 -378 856 -1782 -3113 61 2373 1244 21
$$ packed form
1503c1K241l280m272N259M079l140k77Q30m417j87O174N97l939O32j71l225K552
1520e75M536l318k741L127j529k695N243Q24o209J970M403n082q9N524m503l400
1536d514P651j09o078M171N07o639N112O159o820j245M248n632n05R446j909o681
1552b838L490q21n231O198N078o338j685K532l508J08O412o01m291Q75J96k590
1568c014K268M114k142k563J872L4l403K823L788l678j484M134l166l650N977
1583A910Q89n512M224K132q218J721P018n532j005P620n623o150Q078L93n978
1598d033O837J534r442L202N499o499J954O947o735l274O960k805l914P058K31
1613C520o200K839J707n084J901M435k243j253J234k638j331L174K312j129j223
$$ plain form
1628 21 -1016 -2593 -2693 1283 4115 310 -1746 -163 -2570 -2508 4751 3976 -2874 -612 748 -3721
1644 -3721 1125 6137 -1407 -2625 2641 -2163 -2852 5503 1197 -5283 1841 1992 -4486 1506 3585
1659 3585 -5035 -1675 4731 -1617 -1775 3456 -2853 -4341 4376 2967 -2371 1266 -464 -5090 1668
1674 1668 5867 254 -969 -359 -3883 -1054 5050 3086 -1235 -1982 -2965 -1802 2773 3984 279 -3112
1690 -3112 -3336 -829 1356 2548 2082 -2101 -4573 -494 2719 1346 1248 151 -4068 -1628 3928 1969
1706 1969 -324 538 -2785 -2837 4220 4048 -1987 -1091 -940 -3412 1976 5821 -787 -3983 -1233 -1989 342
1723 342 5570 1344 -4955 -2531 -672 -162 4491 3623 -4068 -4576 280 1472 2935 3897 -1701 -5320
1739 -5320 -1153 2736 3066 2834 -610 -4577 -2516 2486 3527 1770 -815 -3833 -3515 1325 4014 1587
$$ packed form
1628B1j037j577j00L976K832l805k056J583k407O2P259p75o850K262J360m469
1644c721M846N012p544j218N266m804o89Q355m306o480P124J51o478N992K079
1659C585q620L360O406o348j58N231o309j488Q717j409n338L637j730m626O758
1674A668M199n613j223O10l524K829O104j964m321p47r83J163M575J211l705l391
1690c112k24K507K185J192m66m183k472M079L213j373r8j097m219K440N556j959
1706A969k293Q62l323n2P057j72o035Q96J51k472N388L845o608l196K750p56K331
1723C42N228m226o299K424J859N10M653q68p691n08M856J192J463R62n598l619
1739e320M167L889L30k32l444l967K061N002J041j757k585l018L18M840K689k427
$$ plain form
1755 1587 -1701 -3084 -2824 491 3954 2524 -1846 -3591 -2141 820 3648 3031 -1365 -3687 -1875
1770 -1875 1289 3704 3466 -666 -4371 -2806 1542 3981 2983 -657 -3955 -3704 565 4134 3384 -803
1786 -803 -4253 -3812 -83 3725 3447 -602 -3744 -3585 -569 3470 4392 57 -3931 -2918 -25 2872
1802 2872 4099 916 -3456 -2904 310 2633 3721 1207 -3425 -3411 441 2429 2571 983 -3134 -3994
1818 -3994 -212 2670 2449 848 -2633 -3810 -417 2728 2478 846 -1959 -3733 -717 3106 2913 873
1834 873 -1692 -3179 -850 2763 3168 1120 -1513 -3541 -1455 2696 3049 704 -1372 -3084 -1916 1875
1850 1875 3102 673 -1749 -3198 -1962 1769 2931 509 -1225 -2282 -1813 1355 3242 1021 -1374
1865 -1374 -2110 -1355 1509 3017 982 -1155 -1395 -1248 625 3019 1238 -1777 -1741 -785 278 1943 1267
$$ packed form
1755A587l288j383K60L315L463j430m370j745J450K961K828o17m396k322J812
1770a875L164K415k38m132l705J565M348K439r98l640l298K51M269L569p50m187
1786h03l450M41L729L808k78m049l142J59L016M039R22m335l988J013K893K897
1802B872J227l183m372N52L214K323J088k514m632J4L852J988J42j588m117q60
1818c994L782K882k21j601l481j177L393L145k50j632k805j774L016L823j93k040
1834H73k565j487K329L613M05k048k633k028K086M151L53k345k076j712J168L791
1850A875J227k429k422j449J236L731J162k422j734j057M69L168J887k221k395
1865a374p36P55K864J508k035k137k40J47J873K394j781l015L6R56J063J665o76
$$ plain form
1882 1267 -1481 -2025 -827 246 1549 1285 -1213 -2074 -768 458 1353 1155 -478 -1603 -701 795
1898 795 1720 1110 -334 -1073 -760 417 1598 1181 -519 -1043 -771 -74 1250 1015 -889 -1125 -346 -527
1916 -527 369 1344 -712 -1750 163 346 -313 742 178 -1392 43 1097 -325 105 844 -916 -378
1933 -378 1735 406 -765 570 199 -611 847 738 -910 -312 388 -460 -71 632 -524 -1005 398
1950 398 270 -766 -328 -16 -587 -234 672 215 -1035 -175 678 118 683 1267 -781 -1404 819 972 178
1969 178 1295 30 -2425 -359 1958 359 157 598 -2490 -2148 1876 1595 -429 398 -1480 -3063
1985 -3063 859 2810 -102 -460 -209 -2547 -704 3493 1351 -1551 -191 -537 -1045 2319 2561 -1364
2001 -1364 -1760 117 155 1164 2178 -801 -2965 -616 1340 930 976 -338 -3009 -2176 1902 2552 347
$$ packed form
1882A267k748n44J198J073J303k64k498q61J306J226Q95j98j633j125R02J496
1898G95R25o10j444p39L13J177J181m17j700n24K72O97J324k35j904k36P79j81
1916e27Q96R75k056j038J913J83o59J055n64j570J435J054j422M30P39j760N38
1933c78K113j329j171J335l71q10J458j09j648N98P00q48L89P03j156m81J403
1950C98j28j036M38L12n71L53R06m57j250Q60Q53n60N65N84k048o23K223J53p94
1969A78J117j265k455K066K317j599k02M41l088L42M024k81k024Q27j878j583
1985c063L922J951k912l58K51k338J843M197k142k902J360l46n08L364K42l925
2001a364l96J877L8J009J014k979k164K349J956m10M6j314k671Q33M078O50k205
$$ plain form
2018 347 -673 -2156 -3088 689 4100 1414 -1369 -1525 -2367 -728 4118 3549 -1533 -2079 -1142 -1421 2083
2035 2083 4676 -243 -3445 -773 -647 -16 3728 1666 -3965 -2212 804 -99 1436 2259 -2571 -3498
2051 -3498 1405 1717 -56 1369 -1062 -3889 528 3934 813 -555 -414 -2522 -985 4301 2758
2066 2758 -1680 -1816 -1717 -1406 2798 4371 -834 -3713 -1742 -595 1055 3859 1176 -3876 -3280 22
2082 22 1231 2358 2293 -2157 -4171 -320 2319 1479 1661 34 -3593 -1522 2996 1988 -87 406 -1511
2099 -1511 -2394 2071 3176 -1206 -1625 -48 -1525 380 3672 -170 -3858 -753 280 -88 3122 1491
2115 1491 -4302 -2790 1645 996 1713 2866 -2555 -4821 740 3000 1346 2107 -231 -4479 -1394 3308
2131 3308 2112 1002 611 -3048 -3026 2177 2780 167 -294 -1322 -2802 211 2881 565 -1576 -958
$$ packed form
2018C47j020j483r32L777L411k686k783j56q42J639M846n69n082n46R37k79L504
2035B083K593m919l202K672J26O31L744k062n631J753L016r03J535Q23m830r27
2051c498M903L12j773J425k431k827M417L406l121j368J41k108J537N286j543
2066B758m438j36R9L11M204J573n205k879J971J147J650K804k683n052N96L302
2082B2J209J127o5m450k014L851K639q40J82j627l627K071M518j008k075M93j917
2099a511q83M465J105m382m19J577j477J905L292l842l688L105J033l68L210j631
2115A491n793J512M435o49P17J153n421k266N561K260j654P61k338m248L085M702
2131C308j196j110l91l659K2N203O03k613m61j028j480L013K670k316k141O18
$$ plain form
2147 -958 -941 -253 2057 1300 -1747 -1833 323 1119 1327 1314 -1048 -2872 -262 2635 1769 706 -432 -2954
2165 -2954 -1886 2796 3038 -179 -768 -1978 -3063 1071 4045 326 -1824 -1122 -2473 -887 3775 2136
2181 2136 -2226 -1229 -783 -1433 2083 3167 -1208 -2057 135 -493 560 2780 64 -2394 -62 842
2197 842 -50 1533 809 -2366 -1326 1393 752 -92 257 -1293 -1865 674 1533 186 -536 -939 -1322 110
2215 110 1782 1151 -811 -1110 -759 -30 1482 1750 -123 -1572 -746 181 737 1465 722 -1482 -1339 600
2233 600 670 477 749 -810 -1794 192 1057 -63 6 -80 -1368 -613 1288 324 -751 128 -258 -518 1143
2252 1143 969 -735 -318 493 -253 432 1255 -371 -952 563 528 -263 615 285 -1057 -401 521 -239 -151
2271 -151 256 -724 -528 631 -84 -538 298 -73 -716 438 508 -402 3 280 -128 279 589 8 -112 214
$$ packed form
2147i58J7O88K310p57l047q6K156P96K08j3k362j824K610K897q66j063j138k522
2165b954J068M682K42l217n89j210j085M134K974l719k150P02j351J586M662j639
2181B136m362R97M46o50L516J084m375q49K192o28J053K220k716k458K332R04
2197H42q92J583p24l175J040K719o41q44L49j550n72K539Q59j347p22m03l83J432
2215A10J672o31j962k99L51P29J512K68j873j449Q26R27N56P28p43k204J43J939
2233F00P0j93K72j559r84J986Q65j120O9q6j288P55J901r64j075Q79l86k60J661
2252A143j74j704M17Q11p46O85Q23j626n81J515l5p91Q78l30j342O56R22p60Q8
2271a51M07r80J96J159p15m54Q36l71o43J154P0r10M05K77m08M07L10n81j20L26
$$ plain form
2291 214 76 225 558 -110 -276 2 195 63 87 -289 -636 -87 155 173 142 -655 -879 168 422 54 379
2312 379 -191 -1094 -16 938 392 214 9 -651 -101 1107 496 35 305 -707 -557 984 694 -449
2330 -449 -153 -378 -733 573 804 -499 -429 -296 -776 256 886 -312 -852 -224 -404 169 1169 74
2348 74 -763 -268 -156 239 1270 600 -783 -374 32 11 983 924 -705 -795 -103 94 674 659 -788 -1116
2368 -1116 -100 16 540 528 -816 -1189 -39 395 484 629 -515 -1128 86 679 711 752 -283 -1164 3
2387 3 992 785 548 -66 -1238 -509 762 674 226 -194 -1181 -709 769 580 -18 -71 -750 -999 439 816
2407 816 105 -196 -581 -666 271 946 309 22 -226 -593 67 950 691 -55 -501 -349 107 556 540 95 -637
2428 -637 -599 105 242 76 44 -572 -707 272 464 -236 -156 -283 -728 272 1099 -118 -621 150 -320 48
$$ packed form
2291B14j38J49L33o68j66K78J93j32K4l76l47N49K42J8l1p97k24J047K54l68L25
2312C79n70r03J078R54n46j78k05o60N50J208o11m61K70j012J50J541k90j143
2330d49K96k25l55J306K31j303P0J33m80J032O30j198n40O28j80N73J000j095
2348G4q37M95J12L95J031o70j383M09M06k1R72n9j629r0O92J97N80j5j447l28
2368a116J016J16N24j2j344l73J150M34Q9J45j144o13J214N93L2M1j035q81J167
2387CR89k07k37o14j172P29J271q8m48m20r87M72J478j89n98n3o79k49J438L77
2407H16p11l01l85q5R37O75o37k87k48l67O60Q83k59p46m46J52M56M49j6m45p32
2428f37L8P04J37j66l2o16j35R79J92p00Q0j27m45J000Q27j217n03P71m70L68
$$ plain form
2448 48 1423 496 -799 -144 100 -129 1093 838 -751 -676 181 -392 186 1014 -314 -1232 -15 -35 -320
2467 -320 581 169 -723 -371 180 -92 71 303 -148 -242 255 533 -13 -170 227 192 -223 368 496 -488 -158
2488 -158 581 12 -128 707 -366 -950 519 387 -863 299 336 -1442 -210 1178 -527 -563 701 -712
2506 -712 -1065 1190 557 -864 456 352 -1160 469 1595 -536 -238 896 -670 -500 1345 257
2522 257 -884 348 204 -971 292 802 -657 -522 542 -374 -708 480 150 -800 188 763 -651
2539 -651 -538 631 -81 -479 910 643 -1024 -22 809 -461 183 1457 -359 -1165 688 143 -865
2556 -865 1049 826 -1612 -225 873 -959 -149 1364 -611 -1223 847 -83 -1156 790 605 -1170
2572 -1170 277 1027 -923 -307 1189 -178 -431 1048 139 -1118 357 921 -221 220 709 -797 -924
$$ packed form
2448D8J375r27j295O55K44k29J222k55j589P5Q57n73N78Q28j328r18J217k0k85
2467c20R01m12q92L52N51k72J63K32m51r4M97K78n46j57L97l5m15N91J28r84L30
2488a58P39n69j40Q35j073n84J469j32j250J162L7j778J232J388j705l6J264j413
2506g12l53K255o33j421J320j04j512J629J126k131K98J134j566J70J845j088
2522B57j141J232j44j175J263N10j459J35J064r16l34J188l30r50R88N75j414
2539f51J13J169p12l98J389k67j667J002Q31j270O44J274j816q06J853n45j008
2556h65J914k23k438J387J098j832Q10J513j975o12K070r30j073J946j85j775
2572a170J447P50j950O16J496j367k53J479r09j257J475N64j142M41M89j506j27
$$ plain form
2589 -924 764 484 -367 323 156 -1436 -558 1161 11 -602 643 -333 -1549 604 1078 -638 156
2606 156 851 -1245 -524 1577 33 -778 1187 14 -1381 852 1036 -1122 259 1168 -1133 -420 1373
2623 1373 -612 -1112 1030 191 -1101 734 122 -1474 116 1039 -621 -191 802 -858 -821 1162 685
2640 685 -369 353 177 -986 137 1332 366 -216 300 -476 -995 574 1021 -318 -196 231 -793 -658
2658 -658 880 381 -820 82 15 -1107 222 1090 -447 -360 541 -545 -603 1113 383 -866 373 599
2676 599 -621 317 1000 -631 -537 768 45 -464 694 -25 -1033 127 682 -493 -61 383 -887 -823
2694 -823 776 325 -477 317 -116 -1113 315 1113 -6 -187 159 -634 -326 1113 753 -498 69 88 -676
2713 -676 453 1464 -291 -927 179 -426 -273 1113 340 -1066 -431 3 -253 700 773 -935 -1088 289
$$ packed form
2589i24J688k80q51O90j67j592Q78J719j150o13J245r76j216K153M74j716P94
2606A56O95k096P21K101j544q11J965j173j395K233J84k158J381R09k301P13J793
2623A373j985n00K142q39j292J835o12j596J590R23j660M30R93j660L7J983m77
2640F85j054P22j76j163J123J195r66n82N16p76n19J569M47j339J22M27j024J35
2658f58J538m99j201R02o7j122J329Q68j537Q7R01j086n8J716p30j249J239K26
2676E99j220R38O83j631R4J305p23n09J158p19j008J160N55j175M32M44j270O4
2694h23J599m51q02P94m33r97J428P98j119j81L46p93L08J439l60j251N67J9p64
2713f76J129J011j755o36J106o05J53J386p73j406O35M34k56R53P3j708j53J377
$$ plain form
2731 289 223 195 725 -66 -1081 -64 767 413 379 5 -675 -249 641 739 357 -233 -483 -354 386 814 325
2752 325 -668 -698 -360 70 627 642 -580 -1114 -232 151 390 728 52 -1196 -532 560 511 603 383 -971
2772 -971 -863 825 826 416 445 -511 -1249 416 1192 175 -145 -371 -1198 -54 1199 347 -621 -603 -885 -266
2792 -266 1214 731 -671 -748 -664 -205 1070 950 -391 -953 -460 38 993 1109 -246 -955 -522 92 749
2811 749 995 -99 -1026 -588 -42 641 910 -63 -1178 -881 -95 623 861 71 -927 -992 -97 623 1076 347
2831 347 -916 -1027 73 755 1043 646 -630 -1101 32 777 829 573 -683 -1207 -98 761 737 371 -612
2850 -612 -1201 -324 880 668 92 -590 -1241 -468 816 900 93 -592 -1019 -430 810 1108 206 -450 -889
2869 -889 -446 698 1209 378 -582 -742 -359 455 1072 359 -619 -804 -567 266 863 473 -583 -1010 -532
$$ packed form
2731B89o6k8N30p91j015J017Q31l54l4l74o80M26Q90R8l82n90k50J29P40M28m89
2752C25r93l0L38M30N57J5j222n34Q82L83K39L38o76j248O64J092m9R2k20j354
2772i71J08J688Jm10K9r56p38J665P76j017l20k26q27J144J253q52r68J8k82O19
2792b66J480m83j402p7Q4M59J275j20j341n62M93M98R55J16j355p09M33O14O57
2811G49K46j094r27M38N46O83K69r73j115K97P86P18K38p90r98o5Q95P20M53p29
2831C47j263j11J100O82K88l97j276m71J133P45N2k56j256n24J109Q59k4l66r83
2850f12n89Q77J204k12n76o82o51P73J284Q4q07o85m27N89J240K98r02o56m39
2869h89M43J144N11q31r60j60L83Q14O17p13r78j85K37Q33N97l90j056m27M78
$$ plain form
2888 -532 267 628 419 -467 -866 -519 223 864 551 -310 -678 -417 191 879 676 -293 -644 -354 101 788
2908 788 639 -228 -649 -439 111 648 581 -233 -885 -517 140 386 338 -36 -865 -658 176 402 306 -15 -526
2929 -526 -512 214 634 273 161 -161 -502 6 578 428 -8 -101 -218 -266 311 361 -194 -346 -314 -281 65 543
2951 543 -117 -423 -186 -124 -73 190 155 -375 -222 174 192 101 404 -148 -345 310 326 -30 129 310 -201 -17
2973 -17 343 33 -168 118 -151 -330 140 124 -255 -31 149 -323 -327 131 -106 -172 304 0 -416 -128 254 -18
2995 -18 130 421 -313 -320 293 462 98 157 1 -477 -164 615 155 -142 85 -398 -580 332 449 -267 -308 -182
3017 -182 -516 -68 768 -26 -532 -54 -131 -176 696 484 -563 -334 227 60 301 871 -252 -969 85 398
3037 398 312 569 55 -949 -417 743 357 158 155 -779 -974 491 945 71 -213 -398 -954 -139 1167 452
$$ packed form
2888e32P99L61k09q86l99L47P42O41l13q61l68K61O08O88k03r69l51K90M55O87
2908G88j49q67m21K10N50N37o7q14o52L68O57K46m8l74q29K07Q34K26r6l21n11
2929e26J4P26M20l61j12l22l41N08N72j50m36r3j17m8N77N0n55j52L2L3L46M78
2951E43o60l06K37O2N1K63l5n30J53L96J8r1L03n52j97O55J6l56J59J81n11J84
2973a7L60l10k01K86k69j79M70j6l79K24J80m72mM58k37o6M76l04m16K88L82k72
2995a8J48K91p34pO13J69l64N9j56m78L13P79m60k97K27m83j82R12J17p16m1J26
3017a82l34M48Q36p94n06M78p7m5Q72k12j047K29N61j67K41N70j123p17J054L13
3037C98q6K57n14j004N32J160l86j99lr34j95J465M54q74k84j85n56Q15J306p15
$$ plain form
3057 452 -367 -253 -583 -376 987 1008 -359 -678 -133 -190 530 1141 -142 -1129 -111 279 184 765 333 -1265
3077 -1265 -755 462 351 330 305 -756 -1227 341 814 237 -91 -363 -996 -107 1298 715 -184 -501 -621
3096 -621 -364 1006 1240 -165 -829 -475 -136 595 1319 203 -1274 -715 127 268 726 636 -1022 -1296 138
3115 138 552 212 519 -274 -1407 -138 1240 295 110 108 -942 -584 1105 1000 -366 -59 -343 -665 736
3134 736 1351 -328 -804 -99 -411 156 1333 76 -1322 -486 -29 -24 940 592 -1082 -1165 196 410 526
3153 526 740 -510 -1268 -109 712 721 447 -126 -938 -508 917 1028 190 -257 -596 -631 451 1197 203 -767
3173 -767 -612 -441 131 929 483 -839 -1010 -58 206 515 665 -528 -1244 121 700 371 630 -112 -1048
3192 -1048 -353 826 651 180 97 -788 -771 729 1006 42 -127 -475 -940 148 1020 183 -562 -525 -533 -170
$$ packed form
3057D52q19J14l30K07J363K1j367l19N45n7P20O11j283r87J018L90r5N81m32j598
3077a265N10J217j11k1k5j061m71J568M73n77l28k72o33Q89J405n83q99l17j20
3096f21K57J370K34j405o64L54L39P31P24j116j477N59Q42J41M58r0j658k74J434
3115A38M14l40L07p93j133J269J378r45j85kj050L58J689j05j366L07k84l22J401
3134G36O15j679m76P05l12N67J177j257j398Q36M57NR64l48j674q3J361K14J16
3153E26K14j250p58J159Q21Rk74n73q12M30J425J11q38m47l39l5J082P46r94r70
3173g67J55J71N72P98m46j322j71R52K64L09J50j193p16J365N79l29K59p42r36
3192a048O95J179j75m71q3q85J7J500K77r64j69l48m65J088Q72q37p45L7qL63
$$ plain form
3212 -170 750 692 -526 -721 -255 -215 522 929 -197 -879 -129 230 348 629 158 -801 -433 483 512 366
3232 366 46 -500 -696 393 721 77 -120 -461 -855 22 684 157 -367 -224 -444 -244 611 500 -232 -460
3252 -460 -258 -68 305 598 50 -385 -283 12 397 562 191 -406 -353 -92 305 266 153 -231 -614 -247 348
3273 348 170 -94 -147 -292 -346 230 365 -125 -229 25 -336 81 630 101 -268 79 133 119 462 217 -306
3294 -306 -163 103 -65 215 272 -371 -317 223 21 -58 106 -34 -400 -82 54 -156 88 55 -254 101 86 -52
3316 -52 18 -5 -115 -11 195 72 -11 189 1 -47 76 63 126 90 -119 -56 73 -96 -140 138 74 -183 39 -76
3340 -76 -118 -26 -61 -208 -72 19 -239 89 144 -69 59 150 -110 55 203 47 -40 159 -40 56 226 -51 -123
3363 -123 -52 20 -116 -11 77 -162 -156 -145 -93 89 203 -195 -128 30 -7 113 -15 -108 -115 11 -20 301 196 -7
$$ packed form
3212a70R20n8j218j95M66M0P37M07j126o82P50L59J18K81m71r59L68R16K9j46
3232C66l20n46j96J089L28o44j97l41l94Q77O62n27n24J43k20K00Q55j11p32k28
3252d60K02J90L73K93n48m35J02K95L85J65l71n97N3K61L97l9j13l84l83L67N95
3273C48j78k64n3j45n4N76J35m90j04K54l61M17N49n29l69L47N4j4L43k45n23
3294c06J43K66j68K80N7o43N4N40k02p9J64j40l66L18J36k10K44l3l09L55j5j38
3316e2P0k3j10J04K06j23q3K00j88m8J23j3O3l6k09O3J29j69m4K78o4k57K22j15
3340g6m2R2l5j47J36R1k58L28N5k13J28R1k60J65J48j56q7J99j99R6J70k77p2
3363a23P1P2j36J05Q8k39OJ1N2J82J14l98O7J58l7J20j28r3pJ26l1L21j05k03
$$ plain form
3387 -7 -177 -22 84 268 94 1 -234 -161 6 97 -1 -206 -202 -200 -36 19 62 -177 -207 48 -32 95 20 -75 -205
3412 -205 39 180 61 136 47 -215 29 296 78 109 -12 -157 -73 135 231 75 -97 -255 -153 24 232 71
3434 71 -214 -210 -202 -10 -7 126 -215 -355 -164 107 81 70 -69 -164 -84 197 236 135 46 -168 -163 293 270 -65 -73 -163
3460 -163 -292 99 409 -88 -275 -203 -218 26 304 -6 -398 -188 -114 -65 386 289 -164 -237 115 161 278 405
3482 405 -125 -459 -7 283 299 359 30 -323 -131 244 384 77 -19 -360 -323 -5 352 88 -275 -210 -269 -21
3504 -21 217 289 -327 -402 131 46 130 410 -162 -480 167 267 70 304 69 -448 -106 426 40 -13 103 -469
3526 -469 -400 354 329 -34 68 -151 -574 8 480 -24 -186 4 -342 -270 464 349 -182 -51 117 13 179
3547 179 369 -55 -289 78 252 -13 231 175 -461 -208 280 91 64 93 -323 -555 123 369 -127 -144 -48 -435
$$ packed form
3387gj70J55J06J84j74r3k35P3J67R1r8k05MKJ64N5M3k39l0K55q0J27p5r5j30
3412b05K44J41j19P5q9k62K44K67k18L1j21j45Q4K08R6j56j72j58J02J77K08j61
3434G1k85MQJ92LJ33l41j40J91K71k6j1j39r5Q0K81L9j01q9k14NM56k3l35qr0
3460a63j29L91L10m97j87P2j5K44K78l10l92K10P4M9M51r7m53p3L52M6J17J27
3482D05n30l34M52K90J6O0l29l53J92L75J40l07r6l41L7L18L57k64l63O5n9K48
3504b1K38P2o16p5N33q5Q4K80n72l18O47J00j97K34k35n17L42N32l86n3J16n72
3526d69O9P54k5l63J02k19m23N82M72n04j62J90l46P2P34j15n31J31J68j04J66
3547A79J90m24k34L67J74k65K44n6o36K53M88j89k7K9m16k32O78K46m96j7R6l87
$$ plain form
3569 -435 -191 485 99 -320 61 -236 -312 531 405 -303 -49 136 -196 222 559 -61 -367 197 48 -78
3589 -78 355 198 -378 -106 158 -115 -5 284 -200 -391 168 131 -218 60 116 -371 -131 299 90 -94 96
3610 96 42 -254 171 352 -216 -93 133 -111 -118 371 0 -376 37 193 -311 159 250 -318 -246 98 -224 -110
3632 -110 301 3 -426 -45 105 -187 29 348 -123 -219 305 18 -141 393 184 -209 77 249 -120 71
3652 71 183 -194 -269 178 133 -215 176 28 -339 10 274 -234 -111 145 -150 -307 208 84 -184 114 26
3673 26 -215 0 423 -38 -55 208 -17 -157 357 194 -299 -149 161 -76 186 277 -156 -383 -97 -7 -50 174
3695 174 -12 -469 -278 160 97 87 158 -123 -245 65 299 64 18 -90 -200 -26 353 179 -88 -114 -253 -157
3717 -157 294 383 -146 -202 -105 -110 99 257 -47 -454 -202 44 -32 250 287 -399 -248 206 41 81 224 -253 -423
$$ packed form
3569d35K44O76l86m19L81k97p6Q43j26p08K54J85l32M18L37o20l06N64j49j26
3589g8M33j57n76K72K64k73J10K89m84j91N59l7l49K78N6m87K40M30k09j84J90
3610I6n4k96M25J81n68J23K26k44pM89l71l76M13J56n04M70R1n68P2L44l22J14
3632a10M11k98m29L81J50k92K16L19m71r6N24k87j59N34k09l93K86J72l69J91
3652G1J12l77p5M47m5l48L91j48l67L49K64n08J23K56k95j57N15j24k68K98q8
3673B6k41K15M23m61j7K63k25j40N14j63m93J50L10k37K62R1m33k27K86R0m3K24
3695A74j86m57J91M38o3j0P1k81j22L10K34k35m6j08j10J74L79j74k67k6j39R6
3717a57M51Q9n29n6R7nK09J58l04m07K52K46p6K82L7o86J51M54j65M0J43m77j70
$$ plain form
3740 -423 -30 317 206 179 -102 -406 46 304 322 54 -167 -381 -330 195 304 -39 -219 -344 -312 102 383
3761 383 107 -269 -300 -261 164 433 214 -290 -307 -147 168 359 296 -102 -496 -249 281 504 327 -134 -454
3782 -454 -283 167 318 143 -192 -426 -332 72 440 181 -227 -413 -298 -77 297 242 -190 -414 -236 67 423
3803 423 409 -145 -550 -173 153 358 475 -47 -560 -204 182 365 338 -5 -472 -487 132 422 331 -60 -420
3824 -420 -332 56 391 207 42 -405 -463 92 406 313 -40 -410 -312 22 403 382 39 -381 -279 181 414 323
3846 323 -24 -247 -269 -11 358 226 -29 -426 -410 -29 265 265 16 -328 -453 -73 214 437 12 -259 -382
3867 -382 12 282 351 65 -252 -297 5 314 413 100 -293 -300 -57 222 314 111 -212 -247 -214 264 202 120 -211
3890 -211 -454 -165 195 277 127 -253 -368 -15 118 301 208 -202 -171 -97 237 378 105 -137 -307 -75 100
$$ packed form
3740d23L93L47j11k7k81l04M52K58J8k68k21k14N1N25J09l43j80j25L2M14K81
3761C83k76l76l1L9M25K69k19n04j7J60L15J91o3l98l94K47N30K23j77m61l20
3782d54J71M50J51j75l35k34R4M04L68k59m08j86J15K21L74n5m32k24J78L03L56
3803D23j4n54m05L77L26K05J17n22n13L56L86J83k7l43m67j5O19K90r1l91l60
3824d20Q8L88L35j84j65m47n8N55L14r3l53l70R8L34L81k1l43m20J02M60K33r1
3846C23l47k23k2K58L69j32k55l97J6L81K94%k49l44j25L80K87K23m25k71j23
3867c82L94K70O9k86l17m5L02L09R9l13l93pK43K79R2k03l23l5L3M78o2q2l31
3890b11k43K89L60Q2j50l80j15L53J33J83r3m10L1P4L34J41k73k42j70K32J75
$$ plain form
3911 100 310 139 -233 -210 -28 148 192 109 -157 -240 -192 107 139 110 -163 -226 -102 41 121 128 46 -207 -116 54
3935 54 213 206 82 -128 -143 141 208 64 -60 -111 -174 9 218 153 -33 -120 -14 -156 123 131 -71 -188 -31 31
3959 31 81 103 -25 -156 -82 115 -7 28 26 -40 -86 170 130 12 160 25 -223 8 88 -47 -44 154 -32 -94 31
3984 31 -47 -144 53 101 -49 64 -9 -62 -55 170 24 -65 36 45 -21 124 74 -7 64 52 39 88 124 -50 -199 5
4010 5 68 90 -52 46 -192 -64 186 60 -100 -37 -176 -160 182 231 78 -118 39 -7 97 234 181 -202 -99
4033 -99 91 139 197 199 -127 -220 141 131 82 136 -85 -354 -55 200 126 -31 -1 -384 -50 357 108 6 -129 -116
4057 -116 -167 199 407 -37 -205 -20 -6 7 278 102 -182 -94 -22 100 217 237 -145 -453 47 179 201 177 -80
4080 -80 -407 -232 188 172 178 -11 -431 -283 293 363 -23 -170 -254 -272 192 549 214 -222 -105 -205 16 508
$$ packed form
3911A00K10j71l72K3J82J76M4q3k66q3M8K99L2k9k73o3J24J43Q0Pq2k53R1J70
3935E4J59pj24k10j5K84O7j44j24n1o3J83K09o5j86q7J06j42K79Qk02j17J57O2
3959C1N0K2j28j31P4J97j22L5ko6m6K56m0j18J48j35k48K31Q0j35LJ98j86o2J25
3984C1p8r7J97M8j50J13p3n3PK25j46q9J01Ro6J45n0q1P1j2j3M9L6j74j49K04
4010EO3K2j42R8k38J28K50j26j60O3j39J6L42M9j53j96J57m6J04J37n3l83J03
4033i9J90M8N8Kl26r3L61j0m9N4k21k69K99K55p4j57L0l83L34M07k49j02j35J3
4057a16n1L66K08m44j68J85J4J3K71j76k84Q8P2J22J17K0l82l08N00J32K2k4k57
4080h0l27J75M20j6Oj89m20J48N76P0l86j47q4j8M64L57l35m36J17j00K21M92
$$ plain form
4102 508 221 -241 -312 -43 106 264 287 -242 -432 -54 98 231 216 -41 -523 -173 105 157 111 -9 -344 -409
4124 -409 81 436 176 -46 -193 -414 113 469 255 -212 -204 -243 -46 424 375 -165 -366 -164 -51 239 461
4145 461 -197 -438 -336 -101 81 355 103 -484 -311 74 322 189 111 -379 -297 115 415 181 157 -198 -390
4166 -390 16 368 241 -101 -359 -268 -113 298 300 -53 -321 -362 -52 264 443 71 -460 -291 -14 139 386
4187 386 254 -339 -470 -13 191 293 205 -168 -361 60 370 343 194 -115 -415 -74 247 349 55 -145 -300
4208 -300 -281 188 373 42 -222 -271 -190 65 449 75 -311 -182 -73 66 304 212 -262 -238 -157 229 288 240 -145
4231 -145 -362 -137 208 315 98 -202 -247 -285 67 199 60 -57 -227 -246 50 268 85 -183 -167 -273 76
4252 76 183 186 -102 -192 -75 99 198 129 -42 -128 -119 163 127 204 1 -300 -252 18 122 214 -22 -262 -223 -70 135
$$ packed form
4102E08k87m62p1K69J49J58K3n29j90L78J52J33j5k57m82L50K78N2m6j20l35o5
4124d09M90L55k60k22j47k21N27L56k14m67Ql9J97M70m9n40k01K02J13K90K22
4145D61o58k41J02K35J82K74k52n87J73L85K48j33p8m90Q2M12L00k34k4l55j92
4166c90M06L52j27l42k58R1J55M11Kl53k68m1L10L16J79l72n31J69K77J53K47
4187C86j32n93j31M57K04J02q8l73j93M21L10k7j49l09l00L41L21J02k94k00j55
4208c00J9M69J85l31k64m9Q1K55L84l74l86J29J09J39K38r2m74K4Q1L86N9m8l85
4231a45k17K25L45J07k17l00m5l8L52J32j39j17j70j9K96K18j83k68J6j06L49
4252G6J07Lk88r0J17J74R9o9j71q6RK82l6P7k03l01M8K70J04R2k36k40L9J53K05
$$ plain form
4277 135 73 12 -150 -227 102 167 171 36 -137 -134 -21 188 135 46 44 -23 -62 18 117 101 -64 37 97 148 52 105 -44
4304 -44 -57 5 -20 -2 -71 -62 -165 -56 44 117 -48 -55 -37 -60 4 -20 131 2 -37 -63 64 131 -7 15 27 30 -3 130
4332 130 10 39 21 -114 26 30 -99 1 27 21 -118 -65 -78 -30 24 -64 -19 -145 -23 43 118 7 92 -47 -40 82
4358 82 65 108 140 -49 -116 -59 103 152 -52 -91 -137 32 91 99 -81 -140 -164 -34 41 133 -61 -94 -17 22 46 101 38
4385 38 -165 -51 -12 167 135 18 -123 -54 55 267 213 -25 -4 -119 -54 104 42 -29 -71 -30 -150 166 126 -150
4409 -150 -137 -90 11 145 260 -36 -212 -124 61 47 215 8 -119 -169 -38 202 266 103 -124 -306 -13 97
4431 97 216 2 -75 -260 -70 27 131 44 -187 -144 -133 102 274 51 -151 -218 -87 104 233 145 -105 -67 -104
4454 -104 107 273 78 -129 -153 -142 149 125 168 -86 -171 -179 -41 270 37 43 -369 -190 178 252 40 -117 -190 -147
$$ packed form
4277A35o2o1j62p7L29O5Mj35j73LJ13K09n3q9ko7l9Q0R9j6j65J01O0N1r6N3j49
4304d4j3O2k5J8o9Rj03J09J00P3j65pJ8k3O4k4J51j29l9k6J27O7j38K2J2Ll3J33
4332A30j20K9j8j35J40Mj29J00K6oj39N3j3M8N4q8M5j26J22O6P5j11Q5j39PJ22
4358H2j7M3L2j89o7N7J62M9k04l9m6J69N9Qj80n9k4J30P5R2j94l3P7L9K4N5o3
4385C8k03J14L9J79l2j17j41O9J09K12n4k38K1j15O5J58o2p1m2M1j20L16m0k76
4409a50J3M7J01J34J15k96j76Q8J85j4J68k07j27n0J31K40O4j63k27j82K93J10
4431I7J19k14p7j85J90R7J04q7k31M3J1K35J72k23k02o7J31J91J29q8k50L8l7
4454a04K11J66j95k07k4J1K91k4M3k54q5qJ38L11k33Om12J79L68P4k12j57p3M3
$$ plain form
4478 -147 140 291 145 63 -122 -95 -12 223 138 -27 -140 -119 58 147 162 -67 -142 -127 8 219 125 -61 -201
4501 -201 -121 -48 166 132 -18 -209 -340 -114 131 133 122 -111 -272 33 208 164 3 -103 -182 23 242 299 -79
4524 -79 -76 -236 -70 229 273 -69 -87 -154 -99 78 189 126 -207 -144 -68 81 221 26 -33 -105 -165 126 183 147 -100
4549 -100 -320 -52 151 145 100 -54 -137 -181 120 180 32 -157 -156 -153 11 221 -2 -120 -61 -142 30 87 246 -144
4573 -144 -112 44 -42 88 225 -54 -262 -37 74 146 215 52 -23 28 48 126 172 154 -271 -67 97 87 -37 -11
4597 -11 -46 5 -112 145 12 -79 -142 -172 -5 164 83 -20 -77 -14 -153 117 163 -45 -93 13 1 6 59 4 -139
4622 -139 -137 105 57 -51 72 -124 -184 49 133 46 26 -41 -142 -12 69 35 -23 92 -80 -46 136 45 14 -43 -55
4647 -55 -127 -89 130 51 -115 49 -44 -51 113 33 -24 -60 9 -54 -41 79 -157 -100 42 13 -30 89 0 -39 -42 80 -22
$$ packed form
4478a47K87J51j46q2j85K7Q3K35q5j65j13K1J77Q9J5k29p5J5J35K11r4j86j40
4501b01Q0P3K14l4j50j91j31K26K45Kj1k33j61L05J75m4j61j06p9K05K19N7l78
4524g9Lj60J66K99M4l42j8o7N5J77J11o3l33O3P6J49J40j95n9p2o0K91N7l6k47
4549a00k20K68K03om5j54q3m4L01O0j48j89JLJ64K10k23j18N9q1J72N7J59l90
4573a44L2J56q6J30J37k79k08K25J11P2O9j63p5N1K0P8M6j8m25K04J64j0j24K6
4597a1l5N1j17K57j33r1o3l0J67J69q1j03n7O3j39K70M6k08m8J06j2NN3n5j43
4622a39KK42m8j08J23j96o0K33Q4q7k0o7j01J30Q1l4n8J15j72L4J82r1l1n7j2
4647e5p2L8K19p9j66J64r3pJ64q0n7l6O9o3J3J20k36N7J42k9m3J19q9l9lJ22j02
$$ plain form
4674 -22 -90 155 -115 -90 53 100 -15 -1 74 -82 46 20 24 -98 85 -52 -117 21 0 70 131 61 -5 -68 -70 95
4700 95 -60 -89 41 -84 5 -14 51 69 46 87 -80 28 147 -37 -90 101 16 75 62 145 73 31 34 -63 74 -43
4726 -43 -128 -86 -42 -29 30 -1 -106 -183 -41 4 30 158 -77 -159 -7 30 -16 127 -83 -20 -126 27 228 30 50
4751 50 -20 34 35 117 -39 -9 -143 -61 82 92 21 31 -132 -72 -75 18 158 129 13 -53 49 45 119 9 -15 -150 0
4778 0 137 -2 112 14 -81 -12 54 117 136 -80 -91 13 119 210 110 -163 -94 -90 72 194 23 -36 -174 -65 31
4803 31 188 42 -112 -159 -60 75 122 115 -140 -129 -84 7 150 81 -50 -199 -54 145 144 -24 -64 -144 -28 -9 132
4828 132 80 -93 -169 -85 41 76 104 -41 -224 -202 -3 76 65 -26 -69 -139 43 257 89 -4 -158 -43 74 66 174
4853 174 -24 -121 -69 -89 163 13 83 -73 -189 -21 33 76 -71 -21 -85 -30 120 130 113 -119 -110 -50 -63 192 72
$$ packed form
4674b2o8K45k70K5J43M7j15J4P5j56J28k6Mj22J83j37o5J38k1P0O1p0o6o3kJ65
4700I5j55k9J30j25Q9j9O5J8k3M1j67J08J19j84n3J91q5N9j3Q3p2m2Lr7J37j17
4726d3q5M2M4J3N9l1j05p7J42M5K6J28k35q2J52L7m6J43k10O3j06J53K01j98K0
4751E0p0N4JQ2j56L0j34Q2J43J0p1J0j63O0lR3J40k9j16o6J02mP4j10k4j35J50
4778@J37j39J14r8r5O9O6O3J9k16j1J04J06R1j00k73O9MJ62J22j71n9j38J09R6
4803C1J57j46j54m7R9J35M7pk55J1M5R1J43o9j31j49J45J99jj68m0q0J16J9J41
4828A32n2j73p6Q4J26L5K8j45j83K2J99P9j1r1m3p0J82K14j68r3j54J15J17qJ08
4853A74j98r7N2k0K52j50P0j56j16J68N4M3j47N0o4N5J50J0j7k32RO0j3K55j20
$$ plain form
4878 72 -107 -86 -56 101 163 128 -67 -174 -99 -50 153 24 -143 -156 -85 -2 118 47 -76 -129 -20 -18 64 68 -22 -155
4904 -155 62 49 207 49 -42 -39 -139 -36 102 -19 40 -118 -40 4 138 31 -40 -167 -41 -3 19 127 -27
4927 -27 -50 75 -13 100 104 -5 -106 -69 -48 103 84 -82 32 -68 81 53 81 16 -25 -5 -23 -21 -10 -113 -30 -79
4953 -79 17 81 21 -2 -35 77 -38 44 -17 20 -50 11 98 17 -15 -60 -138 7 20 -2 74 -15 -72 43 14 56 118 1
4981 1 -48 -29 -131 37 -20 84 -52 -75 1 21 33 -48 -136 -64 -3 -6 -4 -7 -19 -15 20 39 144 83 102 -16 -75 2 45 -24
5011 -24 -21 39 -1 23 121 52 -52 -13 -62 -41 18 -28 -22 45 -59 9 -16 15 -31 -26 -60 -20 53 -124 -49 51 24 -24 -109 28
5041 28 -109 -76 49 -49 9 35 -17 32 -40 31 -117 -10 58 -125 -32 -80 -31 -33 27 20 25 26 2 -54 10 100 -7 10 124
5070 124 20 34 69 -20 55 -43 -51 5 22 -58 -92 37 -23 40 39 131 -12 -133 -4 118 0 -13 40 -85 -76 112 60
$$ packed form
4878G2j79K1L0J57O2l5j95j07P5M9K03j29j67j3P1Q3J20p1j23n3J09KQ2Mr0j33
4904a55K17j3J58j58r1Lj00J03J38j21N9j58P8M4J34j07p1j27J26L8K2J08j54
4927b7k3J25q8J13Mj09j01L7K1J51j9j66J14j00J49k8K8o5m1K0j8KJ1j03Q3m9
4953g9R6O4o0k3l3J12j15Q2o1L7p0O1Q7q1l2m5p8J45J3k2P6q9n7J15k9M2O2j17
4981Am9J9j02J68n7J04j36k3P6K0J2q1q8P2O1lKlj2ML5J9J05o1J9j18n9P7M3o9
5011b4LO0m0K4R8o9j04L9m9K1N9m6OO7j04O8k5L1m6Nl4M0P3j77P5J00k7m8q5J37
5041B8j37L3J25r8N8K6n2M9p2P1j48J07O8j83R3m8M9kO0pNJk4n6O4R0j07J7J14
5070A24j04J4L5q9P5r8qN6J7q0l4J29o0O3jR2j43j21J29J22j18j3N3j25RJ88n2
$$ plain form
5097 60 -54 -2 -66 -55 2 107 -24 -20 -47 -9 70 82 -28 35 84 119 -35 -28 -10 74 -94 27 56 20 37 -8 -134
5124 -134 78 191 2 -20 41 -2 -115 86 27 -28 -39 37 -23 138 217 -42 -12 -109 -31 2 99 71 -100 -55 -94 -83
5150 -83 73 -32 56 -57 -28 -33 29 52 20 -49 -93 -5 41 52 -20 -7 14 149 41 -56 -38 -30 -82 -27 25 98 142 -151
5178 -151 -52 -31 8 -8 -21 -72 3 -22 -78 -40 -21 -92 -24 1 75 -2 4 -78 57 54 73 35 133 57 14 40 155 50 -21
5207 -21 19 26 45 18 29 -80 92 -190 -85 71 -79 -106 -142 -86 -59 22 145 -10 -48 15 51 -34 -5 105 -26 30
5233 30 62 -30 50 12 -59 -49 50 48 31 74 -63 -40 -65 49 -48 8 -133 -34 1 -66 109 58 118 -101 -56 32 17 -72
5261 -72 -23 -25 -34 3 41 26 40 -52 -62 -15 13 75 40 140 82 -18 -17 19 -103 -63 15 148 76 -21 59 -53 -21 11 48
5290 48 -44 -30 -56 -6 -64 35 30 15 -73 -52 37 58 137 81 120 90 18 -45 -16 -18 -42 -5 45 20 69 42 -26 -103 -28 -13 -28
$$ packed form
5097F0j14N2o4J1N7J05j31Mk7L8P9J2j10O3M9L5j54PJ8Q4j68J21K9l6J7m5j26
5124a34K12J13j89k2O1m3j13K01n9n5j1P6o0J61P9k59L0r7P8L3R7k8j71M5l9J1
5150h3J56j05Q8j13K9nO2K3l2o9m4Q8M6J1p2J3K1J35j08r7J8Qn2N5N2P3M4k93
5178a51R9K1L9j6j3n1P5k5n6L8J9p1O8K5P4p7Oq2J35lJ9l8R8p6m3K6J15j05p1
5207b1M0PJ9k7J1j09J72k82J05J56j50k7l6N6K7Q1J23j55l8O3L6q5K9J10j31N6
5233C0L2r2Q0l8p1J0R9kj7M3j37K3k5J14r7N6j41R9L5o7J75n1O0k19M5Q8j5q9
5261g2M9krL7L8j5J4r2j0M7K8O2l5J00n8j00JL6j22M0P8J33p2r7Q0j12L2L2L7
5290D8r2J4k6N0n8R9nj5q8K1Q9K1P9n6L9l0p2o3K9kk4L7N0k5M9k7o8p7P5J5j5
$$ plain form
5321 -28 31 31 104 -46 0 62 -117 56 24 57 2 41 49 -90 11 5 83 -101 -64 3 2 -2 -13 75 72 3 79 -75 -80 84
5351 84 25 3 4 48 -22 -23 58 74 -16 51 8 87 59 81 69 57 -115 -29 58 -62 62 -115 28 -71 8 111 -73 56
5379 56 -24 -27 85 -64 -55 35 41 -3 55 32 -21 51 -145 88 -12 8 -42 54 -135 51 120 47 19 -68 -179 32 92
5406 92 -98 77 13 -40 52 54 15 116 -51 -7 34 39 -27 10 -56 -15 124 158 13 -27 -60 0 -12 75 89 98 -38 13
5434 13 11 1 -39 85 -10 -37 9 -5 99 -10 -66 -103 -17 4 43 110 -63 13 12 81 142 -37 2 90 73 -4 32 -80
5462 -80 21 50 -8 151 22 79 -3 -161 1 -29 101 -2 15 -65 -24 -79 53 -64 -63 -42 -60 12 15 10 -8 -47 -29
5489 -29 17 28 43 48 -66 28 -1 -41 68 -24 22 18 10 -45 58 66 -83 -18 -65 -30 -20 -83 -72 -66 10 -41 0 -18 -62 -2 75
5520 75 14 49 -4 16 86 96 40 7 -33 -54 18 -17 103 -24 -111 34 99 32 -55 -30 47 -91 69 18 27 -7 -41 -55
$$ packed form
5321b8N9%P3j50M6O2j79J73l2L3n5L9Qj39J01oP8j84L7O7jmj1Q8lo9P6j54nJ64
5351H4n9k2JM4p0jQ1J6r0O7m3P9k8K2j2j2j72Q6Q7j20J24j77J43r9P9J03j84J29
5379E6q0lJ12j49RR0Om4N8k3n3P2j96K33j00K0n0R6j89J86O9p3k8q7j11K11O0
5406I2j90J75o4n3R2Kl9J01j67M4M1No6L7o6M1J39L4j45m0l3O0j2Q7J4Rj36N1
5434A3kj0m0J24r5k7M6j4J04j09n6l7Q6K1L9O7j73P6jO9O1j79L9Q8j7p7L6j12
5462h0J01K9n8J59j29N7q2j58J62l0J30j03J7q0M1n5J32j17JK1j8P2Lnj8l9J8
5489b9M6J1J5Nj14R4k9m0J09r2M6mqn5J03Qj49O5m7L5J0o3J1OP6n1M1j8m4O0P7
5520G5o1L5n3K0P0J0n6l3m0k1P2l5J20j27q7J45O5o7q7K5P7j38J60n1Rl4l4j4
$$ plain form
5548 -55 -41 -22 136 -11 113 0 -76 -28 56 51 -9 13 -69 -48 47 77 -28 -73 6 -35 54 60 -20 -37 43 21 134 84
5576 84 79 -70 -40 59 26 -85 -45 -65 -46 -60 -19 74 -38 -43 -25 36 83 68 93 -30 -26 64 18 117 -18 -48 32 10 -5
5605 -5 36 3 -98 -19 -18 108 43 -33 -13 9 -12 128 25 -41 -36 -14 20 51 40 -23 -38 -73 18 24 -10 9 -91 -21 134
5634 134 -3 -2 13 -32 -23 -78 73 35 35 -8 -13 -43 -20 14 -153 -114 -29 -29 11 -12 -114 26 -49 36 65 137 -3 -6 15 15
5664 15 4 -8 -15 -51 -81 -6 5 -1 -67 27 13 57 63 70 -11 -13 40 -49 57 26 8 -32 -17 -49 -10 11 73 102 -42 32 -13 -6
5696 -6 53 13 26 66 119 -31 -75 0 52 118 24 -12 -4 98 104 98 -38 -71 112 7 -70 48 -65 88 -21 -84 -46 12
5724 12 -65 3 -5 92 -4 -9 -45 -2 97 -18 87 -9 26 26 -49 70 27 74 48 -89 1 -54 100 -52 26 61 -9 -4 67
5753 67 100 120 69 -99 59 -37 18 20 13 -72 19 41 96 -43 39 13 -59 -26 -30 -68 -48 -23 2 -15 74 12 -95 -90 -37 24
$$ packed form
5548e5J4J9J58j47J24j13p6M8Q4no0K2q2K1R5L0j05m5P9m1Q9Oq0j7Q0k2J13n0
5576H4nj49L0R9l3j11M0k0J9j4M1R3j12nJ8O1M7j5K5j23MR0m6R9j35l0Q0k2j5
5605eM1l3j01P9JJ26o5p6K0K2k1J40j03o6NK2L4L1j1o3j5l5R1Ol4J9j00P0J55
5634A34j37JJ5m5Rn5J51l8%m3nl0K3L4j67L9Q5%M0k3j02J40p5Q5K9P2j40lK1%
5664A5j1j2pl6l0P5J1oo6R4j4M4OPq1kN3q9J06l1j8m0J5l2L9K1O2K9j44P4m5P
5696fN9m0J3M0N3j50m4P5N2O6r4l6QJ02Ooj36l3J83j05p7J18j13J53j09o3L8N8
5724A2p7O8qR7r6nl6M3R9j15J05r6L5%p5J19m3M7k6j37R0n5J54j52P8L5p0NP1
5753F7L3K0n1j68J58r6N5Kpq5R1K2N5j39Q2k6p2L3ml8K0K5K5j7Q9o2j07NN3O1
$$ plain form
5783 24 -29 108 -75 -68 -114 -34 -41 -55 -104 -28 -40 92 -22 -84 2 5 54 35 19 -1 34 -55 59 58 -45 9 -45 -123 -67
5812 -67 50 -25 -1 67 30 -66 153 31 -29 -29 -27 -22 -5 79 40 -97 -27 147 16 15 10 -84 -40 83 118 86 -81 -106 -107
5841 -107 103 70 29 18 -117 8 -24 11 116 56 53 42 -91 61 40 -59 -61 -104 73 130 -45 6 -53 -27 -35 14 19 34
5869 34 -51 -50 67 -39 51 -38 -94 -102 -94 -75 119 31 -63 56 -17 55 147 -32 -98 5 -38 115 101 -32 -155 -96 -44
5896 -44 58 31 -45 23 -15 -69 153 -17 16 -47 -124 -31 54 83 6 -11 -47 47 91 73 129 -14 -48 -58 56 -71 58
5923 58 73 -55 -16 59 10 -10 -123 -95 52 -14 68 64 -42 -39 59 27 69 13 -140 -21 -146 50 41 -57 -69 -10 -33 59
5951 59 69 63 -56 -159 -78 -31 61 30 -29 -24 -26 -44 -34 22 84 9 -45 -9 -14 60 32 -42 -67 51 -20 66 -25 -43 -47 73 147
5982 147 39 31 81 33 -23 22 -28 -11 11 -52 -31 -60 -31 72 -12 35 25 82 -43 -15 12 -64 66 92 57 -58 8 73
$$ packed form
5783B4n3J37j83Pm6Q0pj4m9P6j2J32j14o2Q6LM9j9j6k0L5q9J14jj03N4n4p8N6
5812f7J17p5K4O8l7r6K19j22o0%KNJ7Q4l9j37P0J74j31jnr4M4J23L5l2j67k5j
5841a07K10l3m1j1j35J25l2L5J05o0lj1j33J52k1r9km3J77N7j75N1n9K6qM9NJ5
5869C4q5JJ17j06R0q9n6qQJ9J94q8r4J19p3P2R2j79o6J03m3J53j4j33j23N9N2
5896d4J02k7p6O8l8n4K22j70L3o3p7R3Q5K9p7j7l6R4M4j8N6j43l4j0J14j27J29
5923E8J5j28L9P5m9k0j13K8J47o6Q2mj06LR8l2M2n6j53J19j25J96rr8j2N9k3R2
5951E9J0oj19j03Q1M7R2l1n9Nkj8J0N6O2p5n4L6nP4k8p4k5J18p1Q6r1j8mJ20P4
5982A47j08qN0m8n6M5n0J7K2o3K1k9K9J03q4M7j0N7j25K8K7p6J30K6l5j15O6O5
$$ plain form
6010 73 4 -74 29 -15 65 -49 52 92 -116 -67 95 16 -91 116 61 86 47 -27 -4 5 20 -39 -54 -44 -23 -50 -74
6037 -74 -7 -11 45 49 36 23 -58 10 73 14 37 -95 -46 -5 -6 13 -22 25 -27 -14 -7 25 -48 -31 -81 25 5 73 -2 26 29 -91
6069 -91 14 -54 -41 -54 -12 -20 43 18 44 -21 -38 -102 41 57 -116 -66 -33 135 38 -18 62 -27 11 4 26 107 43 -20 -58
6098 -58 -72 6 -67 -34 46 119 2 -24 7 105 71 -124 86 80 -88 52 -78 81 -38 8 82 -50 44 35 -64 0 -32
6125 -32 -43 -33 30 -46 61 -17 -1 -32 54 -97 -35 -2 -20 -48 -9 -6 52 34 -11 48 -9 -49 32 187 -13 7 55 98 3
6154 3 26 43 30 6 64 -15 71 -39 -8 -9 -71 -2 99 11 19 -68 -7 -13 -62 48 -70 27 7 -69 -49 -59 -85 -26 -34 141
6184 141 -19 -6 -27 -4 75 -2 -51 -8 -16 76 -189 -66 58 64 83 -93 -93 -57 -65 28 10 -70 -12 10 -2 72 61 -176 -104
6213 -104 10 109 78 -95 -12 -24 10 34 18 -87 61 -3 -88 74 -97 88 43 28 44 34 10 -80 21 38 -80
$$ packed form
6010G3o9p8J03m4Q0j14J01M0k08M9J62p9j07K07n5K5l9p4K3RJ5n9j5J0K1k7k4
6037g4O7mN6Mj3j3q1O8O3n9K3j32M9M1jJ9l5M7n2J3PL2p3J7n0J06k0O8p5K8Lj20
6069i1J05o8J3j3M2qO3k5K6o5j7o4J43J6j73N0L3J68r7n6Q0q9L8pK2Q1o4o3l8
6098e8j4P8p3L3Q0P3j17k6L1R8l4j95K10oj68J40j30J59j19M6P4j32R4rr9O4l2
6125c2j1J0O3p6J07p8J6l1Q6j51O2L3j8k8L9LN8j8m5N9n7m0Q1J55k00K0M8M3r5
6154CK3J7j3k4N8p9Q6j10L1jo2O9J01q8Qq7O1om9J10j18R7k0p6K0j0k6N9qJ75
6184A41j60J3k1K3P9p7m9M3qR2k65J23J24OJ9j76%L6qR3j8q0N8K2j2P4j1k37P2
6213a04J14R9l1j73Q3j2L4K4j6j05J48o4q5J62j71J85m5j5J6j0k4r0J01J7j18
$$ plain form
6238 -80 -17 43 -92 61 -30 47 49 62 22 -44 59 -53 33 -16 25 -149 -4 -14 -63 -124 -19 -16 23 21 -18 136 85 11
6266 11 19 9 -4 50 -24 -41 77 -2 -27 106 3 -43 -110 38 1 26 21 13 57 74 28 38 -88 -44 31 -2 14 85 16
6295 16 -75 -94 -60 82 -59 -109 -3 -63 26 -55 22 71 58 7 -20 93 117 -39 -21 30 66 89 -8 -3 -72 21 -21 7
6323 7 0 -10 36 -69 11 10 48 -9 -38 74 -16 14 -22 -57 -9 43 55 31 42 -15 -73 -98 93 30 -10 -2 -29 28 -31 4 4
6354 4 -33 21 5 -37 -4 -12 95 111 72 0 162 43 56 -13 91 25 -59 -18 77 86 119 58 -77 20 14 -43 -67 23 -12 -28
6384 -28 -65 123 15 146 -107 -3 140 -22 -17 -74 -86 30 33 21 -43 45 -41 13 4 3 64 97 25 85 11 17 -1 26 -50
6413 -50 25 3 -128 7 -23 21 54 17 -78 -7 -63 6 35 -78 8 -24 43 20 126 81 31 -19 14 4 -83 21 4 -16
6441 -16 -45 53 -21 71 17 62 -70 -47 4 -10 95 -30 50 1 -51 -74 -37 -59 -60 -40 45 -25 18 -53 157 2 94 -25
$$ packed form
6238h0O3O0j35J53r1P7KJ3m0o6J03j12Q6m9M1j74J45j0m9o1J05LL9kl9J54n1p4
6266A1Qj0j3N4p4j7J18p9k5J33j03m6o7J48l7K5nqM4J7m6J0j26M4P5l3J6P1o9
6295A6r1j9L4J42j41n0J06o0Q9q1P7M9j3n1k7J13K4j56J8N1L6K3r7No9R3m2K8
6323Gpj0M6j05Q0jL8n7k9J12r0L0l6l5M8N2J2k4J1n7n8k5J91o3m0Qk7N7n9L5%
6354Dl7N4j6m2L3qJ07J6l9p2J62j19J3o9J04o6q4M1R5RL3o1j35R7on7k4R0l5j6
6384b8l7J88j08J31k53J04J43j62Nn7j2J16Lj2o4Q8q6N4rjO1L3p2O0p4Oj8K7p6
6413e0P5k2j31J35l0M4L3l7r5P1n6O9K9j13Q6l2O7k3J06m5n0n0L3j0q7J04j7k0
6441a6k9R8p4R2n4M5j32K3N1j4J05j25Q0m9n2k3L7k2jK0Q5p0M3p1K10j55R2j19
$$ plain form
6469 -25 28 94 37 -71 26 -34 9 -30 25 -45 40 -51 82 17 -93 -32 -20 -4 -39 -41 21 -43 -34 90 -85 20 81 67
6497 67 -29 -54 -24 98 -10 57 -81 -23 90 97 60 -84 36 40 85 12 14 17 -14 38 4 -10 84 26 -67 67 -9 41 12
6526 12 15 -35 -52 26 -24 -13 -32 -8 0 -24 -37 6 30 56 -79 -26 -6 -14 -12 -87 42 -62 84 -48 75 -55 -6 32 -5
6555 -5 -77 -1 -37 11 -31 68 -10 99 11 84 -117 -21 -13 75 -22 77 -14 124 -13 -120 124 2 -108 -72 -42 -41 82
6582 82 0 -21 66 11 -52 168 -62 114 51 -52 -93 -28 -82 -37 65 8 33 23 -25 31 6 46 172 -2 -20 22 -45
6609 -45 -2 -36 -84 37 106 67 -11 59 45 68 95 12 35 71 -23 -32 -34 -63 -12 63 148 75 44 18 12 172 -3 74 -52 37
6639 37 7 3 -4 19 37 -82 158 -98 -53 -16 37 15 9 15 -58 23 115 92 60 0 80 -106 -66 -72 141 -122 5 -64 9
6668 9 -3 4 5 -49 74 87 81 -51 34 -34 5 -94 46 -24 18 56 9 -9 16 -22 58 -20 -97 0 36 18 89 1 -30 6 -52
$$ packed form
6469b5N3O6n7j08R7o0M3l9N5p0Q5r1J33o5j10O1J2J6l5kO2o4RJ24j75J05O1j4
6497F7r6k5L0J22j08O7j38N8J13Pl7j44J20MM5p3KLl1N2l4j4R4n8r3J34p6N0k9
6526A2Ln0j7P8n0J1j9K4Qk4j3M3K4K6j35N3K0qKp5J29j04J46j32J23j30M9L8l7
6555ep2P6l6M8m2R9p8J09q8P3k01R6QQ8r7R9r1J38j37j07K44j22j10L6L0JJ23
6582H2q2k1Q7n5o3K20k30J76o3j03m1O5n4M5J02n7K5j0m8N6k5M0J26j74j8M2o7
6609d5M3l4m8J21O9l9p8P0j4K3K7q3K3L6r4rkk9N1P5Q5p3l1k6oJ60j75P7j26Q9
6639C7l0mpK3J8j19K40k56M5L7N3k2oOp3Q1R2k3l2o0Q0j86M0oK13k63J27o9P3
6668Ij2PJn4J23J3oj32Q5o8L9r9J40p0M2L8m7j8K5l8Q0p8p7R7L6j8P1q8l1L6n8
$$ plain form
6699 -52 -39 -48 40 4 33 -34 34 1 -58 133 -18 80 -44 -3 27 -78 -13 66 -4 84 11 46 24 79 -48 -2 -45 -91
6727 -91 60 79 28 -44 -17 -19 135 29 -6 62 -37 11 24 30 -37 21 -57 -4 41 18 -44 75 -78 82 -16 -31 -5 -62
6755 -62 14 59 95 5 85 0 48 -47 4 42 -11 -34 75 -159 77 25 -43 9 -11 125 -65 78 50 85 -5 -38 87
6782 87 93 -14 -14 86 36 60 45 19 -5 23 -14 -5 58 2 32 -48 -106 62 -37 -54 72 6 -63 -49 43 -45 58 -13 -73
6811 -73 -36 27 36 22 -7 12 86 -29 -64 59 64 -2 -15 5 -15 100 30 -38 17 22 -64 -11 4 -84 -10 -26 39 4 -83 100
6841 100 -1 45 -8 40 175 21 -3 47 -18 60 116 38 18 -55 -12 -35 6 27 20 75 5 39 2 -90 -10 76 22 -129
6869 -129 -74 44 14 -95 -19 -17 -94 89 85 -63 25 15 34 -2 -9 -18 50 147 -44 -64 62 78 45 -56 -69 36 25 16
6897 16 -38 23 -51 -67 -67 -71 75 -33 -16 -27 -16 110 -23 125 35 95 -103 -7 -82 20 -3 31 1 33 5 -10 62 -59
$$ packed form
6699e2J3rQ8l6K9o7O8l3n9J91j51R8j24M1L0j05O5P9p0Q8p3L5k2N5j27M6m3m6
6727i1J51J9n1p2K7kJ54j06l5O8r9M8J3Oo7N8p8N3M5k3o2J19j53J60r8j5K6n7
6755f2P6M5L6r0Q0q5M8r5N1L8n3k3J09k34K36n2o8N2k0J36j90J43k8L5r0l3J25
6782H7Oj07%J00n0K4j5k6k4K8l7RO3n6L0q0n8J68r9j7J26o6o9J4R2q8J03p1o0
6811g3L7O3Rj4k9J9P4j15l5J23No6j3K0k0J15p0o8N5Nq6N3J5q8P4j6O5l5q7J83
6841A00j01M6n3M8J35j54k4N0o5P8N6p8k0p3M3k3M1K1pN5p0L4l7r2Q0Q6n4j51
6869a29N5J18l0j09P6Kp7J83mj48Q8j0J9l6prO8R7j91k0J26J6l3j01j3J05j1r
6897A6n4O1p4j6%mJ46j08J7j1J1J26j33J48r0O0j98R6p5J02k3L4l0L2k8j5P2j21
$$ plain form
6925 -59 63 28 -27 -13 -55 23 -72 16 -65 16 4 -69 -23 -118 -13 -17 -18 -14 25 99 -16 -66 -13 49 32 2 61 -27 98 52
6955 52 83 -8 -5 25 53 -30 -64 -49 10 56 -30 -38 -18 75 -42 -91 15 -27 90 -34 -80 39 -28 -53 -48 -10 -83 0 104
6984 104 -23 22 6 -41 -67 56 -64 -33 -18 10 -73 138 92 -97 37 -24 -155 27 123 -94 92 -62 25 -10
7008 -10 -28 44 13 74 79 1 9 24 25 11 -4 -77 8 -59 16 -33 -86 19 30 -9 -47 80 -103 -21 43 113 -41 -44 -36 29 -94
7039 -94 -92 39 -11 65 -19 6 4 -111 2 -11 -94 -22 123 -53 -21 -18 -17 -64 -80 -118 19 100 22 116 -49 -33 -46 52 -99
7068 -99 -26 111 6 -114 -52 11 -63 -23 14 34 -50 8 84 44 -42 29 -58 105 20 -16 -8 46 75 35 -42 55 -88 -8
7096 -8 63 -74 81 11 -28 12 15 -18 -77 53 20 -15 24 -65 -44 -38 -1 65 87 -61 -81 78 -18 77 70 91 41 0 3 -6 30
7127 30 59 45 -90 -107 5 62 16 -40 9 4 -18 27 -75 -65 -92 46 32 91 -6 96 -26 39 62 -33 17 -53 -32 32
$$ packed form
6925e9J22l5n5J4m2P8r5Q8q1Q1j2p3M6r5J05mjML9P4j15n0N3O2j7l0N9q8J25m6
6955E2L1r1LL0K8q3l4J5N9M6q6qK0R3j17m9J06m2J17j24m6J19o7k5NL8p3Q3J04
6984A04j27M5j6m7k6J23j20L1J5K8q3K11m6j89J34o1j31J82R6k17J86j54Q7l5
7008a0j8P2l1O1Np8QJ5Jj4j5p3Q5o7P5m9n3J05J1l9l8J27j83Q2O4P0j54lQO5j23
7039i4KJ31n0P6q4K5kj15J13j3q3P2J45j76L2LJm7j6l8J37Q1p8R4j65J6j3R8j51
7068i9P3J37j05j20O2O3p4M0L7K0q4N8P6m0q6P1q7J63q5l6QN4K9m0p7R7j43Q0
7096hP1j37J55p0l9M0Ll3n9J30l3l5L9q9K1OL7O6K2j48k0J59r6R5pK1n0m1LrL6
7127C0K9j4j35j7J12N7m6n6M9nk2M5j02J0k7J38j4N9r7J02j22O5K3r5N0p0K1O4
$$ plain form
7155 32 0 3 -8 2 -61 20 33 4 23 18 5 0 51 78 82 25 1 -9 46 -49 83 -6 -37 -15 2 60 -22 21 92 63 -51
7186 -51 12 61 89 -51 16 18 58 -25 92 -108 -4 -42 -58 -36 -50 -4 -2 -30 -48 20 82 -73 48 47 96 -3 19 -58 29
7215 29 -49 82 36 0 -58 -49 21 47 35 36 -55 -6 88 26 2 -117 -47 -130 73 -24 24 -35 -20 -69 -45 45 28 -54 12 108
7245 108 -14 6 46 23 -50 41 -20 78 -5 59 -28 22 -12 22 31 0 37 -2 -33 -22 42 64 -143 -23 16 -50 -57 43 87
7274 87 -6 -16 82 -71 64 -59 23 -87 -59 151 -40 -67 2 55 -15 -52 -195 8 -16 32 -83 159 40 73 13
7299 13 -39 -24 55 -1 59 -44 -57 6 -171 -62 48 -103 96 16 -46 94 6 -97 -36 85 11 3 149 34 121
7324 121 47 14 -48 -98 -54 11 -58 23 90 -62 -88 26 -61 -41 38 17 11 8 -33 55 -113 0 -64 -97 38 70 93 59
7352 59 17 -27 28 69 29 -19 -62 -18 46 38 -8 26 -142 -38 -27 -6 -25 -20 -103 39 18 66 113 29 -18 57 -34 72 120
$$ packed form
7155C2l2Lj1J0o3Q1J3k9J9nj3nN1K7Mn7k4j0N5r5J32q9l1K2J7N8q2M3P1k9j14
7186e1O3M9K8j40O7KM0q3J17k00J04l8j6K2j4M6Kk8j8O8O2j55J21jM9r9K2p7Q7
7215B9p8J31m6l6n8RP0K6j2Jr1M9R4o2k4j19P0q3K03r7M8n9J5m9K4R0j7q2O6R6
7245A08j22K0M0k3p3R1o1R8q3O4q7N0l4L4Rl1L7l9l1J1O4K2k07J20L9o6pJ00M4
7274H7r3j0R8j53J35j23Q2j10K8K10j91k7O9N3p0l7j43K03k4M8j15K42j19L3o0
7299A3n2J5P9n6O0j03j3O3j77J09J10j51J99q0o2J40q8j03O1J21p4qJ46j15Q7
7324A21p4l3o2n0M4O5o9Q1O7j52k6J14q7K0P9k1olm1Q8j68J13o4l3J35L2K3l4
7352E9m2m4N5M1m0m8m3M4O4qm6L4j68J04J1K1j9Nq3J42k1M8M7q4m7P5r1J06M8
$$ plain form
7381 120 94 13 -91 -53 59 16 -30 -97 -37 -1 -67 38 -4 -61 68 14 -160 56 14 44 -35 4 33 102 -85 -68
7407 -68 34 66 -59 -25 -4 -31 -109 57 -80 55 -15 -1 -70 -44 60 -117 -41 17 -49 -16 10 -47 -12 20 92 14 9
7434 9 -7 -14 18 -44 -9 -49 -7 56 0 39 -20 -16 -19 -8 -12 40 6 33 -36 20 12 59 110 16 9 -36 -65 -50 65 -20 23 5 19
7467 19 69 -33 94 66 -83 -33 -39 -50 5 8 109 -4 -64 33 -52 -48 72 3 -179 0 11 112 48 -53 -19 -12 -57
7494 -57 -72 46 -33 -95 -67 70 -7 2 75 -18 -62 1 41 -97 102 49 14 113 -4 108 57 -15 16 2 7 19 -120 9
7522 9 37 -98 -53 -6 60 5 33 -27 77 110 -71 29 62 46 59 -72 -57 17 47 133 -25 32 22 -131 -62 -8 36
7549 36 97 -49 -26 32 79 12 -50 40 -71 -34 140 -17 31 101 91 44 -95 8 -77 69 -26 -46 20 -72 10 44 4
7576 4 -16 12 -116 -80 -23 87 30 39 47 27 -14 -9 -9 21 -5 -3 21 15 43 63 33 36 -64 -45 -58 -83 9 27 55 -109 -8 -20
$$ packed form
7381A20k6q1j04L8J12m3m6o7O0L6o6J05m2n7J29n4j74K16m2L0p9L9K9O9j87J7
7407f8J02L2j25L4K1k7p8J66j37J35p0J4o9K6J04j77P6N8o6L3K6n7L5L2P2p8n
7434Ij6pL2o2L5m0M2O3n6L9n9MlJ1mN2l4K7o9N6qM7N1r4pm5k9J5J15q5M3j8J4
7467A9N0j02J27k8j49N0oj1N5LJ01j13o0R7q5MJ20o9j82J79J1J01o4j01L4Pm5
7494e7j5J18p9o2K8J37p7RP3r3m4O3M0j38J99n3l5R9j17J12n1p2L1j4NJ2j39J29
7522IK8j35M5M7O6n5K8o0J04L3j81J00L3j6J3j31J5P4L0Q6j58N7j0j53O9N4M4
7549C6O1j46K3N8M7o7o2R0j11L7J74j57M8P0j0m7j39J03q5J46r5k0O6r2Q2L4m0
7576Dk0K8j28L6N7J10n7RQk0m1N%L0k6KK4oK8K0l0Lj00J9j3k5R2J8K8j64J01j2
$$ plain form
7608 -20 -20 -28 13 92 -1 38 7 -10 -35 68 -8 -109 -120 40 -46 1 28 64 -14 -31 7 50 21 8 6 -47 -52 -54 -183 140
7638 140 170 54 71 -67 30 -142 46 44 -20 60 67 -71 51 17 16 5 11 21 -16 66 -28 1 -24 7 20 57 52 -5 -65
7667 -65 -10 30 56 41 -2 -29 -69 142 -11 122 -72 -45 -85 41 23 117 137 -26 107 -4 66 33 -23 -65 1 63
7693 63 62 74 -22 57 -53 -46 -3 -13 104 130 12 -70 -31 -5 -11 88 -51 -34 28 -18 2 -2 110 50 72 -51 -33 18 57
7722 57 15 20 2 -1 -50 -30 26 8 81 70 99 60 3 -85 27 41 -26 -101 13 0 -131 21 -70 75 29 11 2 -52 37
7751 37 84 -30 36 152 -34 -30 39 109 45 -21 31 -73 31 -48 33 134 -4 57 37 100 98 58 7 -6 -53 -57 28 46
7779 46 80 -18 -153 -17 -16 -14 -81 19 66 -63 -123 -93 -21 -21 107 92 -89 -11 -2 -17 -132 61 58 36 38 -80 10 -104
7807 -104 -12 10 26 36 -10 -43 -8 -16 -84 16 94 7 -110 64 30 13 110 -2 84 8 -21 55 50 12 -59 -37 52 17 -20
$$ packed form
7608b0%qM1P9r3L9l1j7k5J03p6j01j1J60q6M7K7L6p8j7L8M3k9j3kn3nkj29L23
7638A40L0j16J7j38R7j72J88ko4Q0Pj38J22l4jj1OJ0l7Q2r4K9k5L1J3L7nn7o0
7667f5N5M0K6j5m3k7m0K11j53J33j94K7m0J26j8R4K0j63J33j11P0l3n6m2O6O2
7693F3jJ2r6P9j10PM3j0J17K6j18q2L9K6oR9j39J7O2m6K0mJ12o0K2j23J8N1L9
7722E7m2Nj8lm9K0N6j8P3j1K9l9n7q8J12J4o7p5J14j3j31J52r1J45m6j8rn4Q9
7751C7M7j14O6J16j86MO9P0o4o6N2j04J04p9Q1J01j38O1k0O3km0n1j3m7mQ5J8
7779D6L4r8j35J36JKo7J00M7j29o0L0P2%J28j5j81P8Rj5j15J93lk2Kj18R0j14
7807a04R2K2J6J0m6l3L5qo8J00P8q7j17J74l4j7R7j12Q6p6k9P6nl8p1K2Q9l5l7
$$ plain form
7836 -20 3 10 27 57 63 23 35 -1 57 3 17 -46 55 11 43 -87 73 -77 -4 -44 -1 -79 7 -60 147 -78 -80 50
7864 50 91 57 -33 -122 -131 86 0 -68 57 101 -30 -101 48 -90 94 190 -107 -73 0 79 88 -38 69 -70 -63 41
7890 41 -47 75 -97 59 -39 -32 -15 18 -81 -33 44 -227 5 29 30 66 -49 69 -26 -44 116 79 87 61 44 -87 8
7917 8 60 52 -12 -38 -15 11 -3 32 75 -17 40 -56 52 -48 -79 -11 -38 -38 45 -79 9 43 11 -22 -65 28 53 86 -63 -63
7947 -63 -69 -1 -40 58 -22 -99 73 23 11 -51 68 -56 -42 -11 8 105 -72 56 -15 9 82 -13 -84 -38 40 0 -163 -72
7975 -72 -42 50 -119 45 100 117 56 130 13 59 -17 28 33 117 67 67 62 -103 19 -36 -31 44 -33 77 -17 9 -17 8 34
8004 34 -15 -21 -6 69 36 142 63 -13 -13 -41 22 60 -38 -31 -81 76 -89 -106 26 8 2 73 -10 31 -44 -12 5 9 -78 -28 65
8035 65 44 -47 -5 28 54 86 27 62 3 29 -52 -53 -46 -24 -142 41 23 -73 -90 -12 -102 -63 22 -54 15 20 47 31 -26 -13 -105
$$ packed form
7836b0K3PJ7L0Om0J2l6N8n4J4o3J01m4L2j30J60j50P3m0M3p8Q6o7K07k25kJ30
7864E0M1l4r0q9rK17q6o8J25M4j31p1J49j38J84R6k97L4P3P9Rj26J07j39PJ04
7890D1q8J22j72J56r8PJ7L3r9M8P7k71K32K4JL6j15J18r5j8J60l7Qk6j7j31R5
7917HN2qo4k6K3K6j4L5M3r2N7r6J08j00l1O8k7%Q3j24Q8L4l2l3m3R3K5L3j49%
7947f3oO8l9R8q0p7J72n0j2o2J19j24J4L1J9R7j77J28p1K4P3r5p1M6P8m0j63R1
7975g2L0R2j69J64N5J7o1P4j17M6p6M5NQ4n0%nj65J22n5NP5p7J10r4K6k6K5K6
8004C4m9oJ5P5l3J06p9p6%k8O3L8r8Pn0J57j65j7J32j8oP1q3M1p5L2J7Mq7N0R3
8035F5k1r1M2L3K6L2n9L5n9K6q1jPK2j18J83j8r6j7P8r0L9Q5p6O9NK7j6n7J3r2
$$ plain form
8066 -105 -3 95 -9 29 -100 52 -23 64 -6 53 105 -17 167 52 36 18 -47 12 26 -19 -8 20 40 -1 -28 -119
8092 -119 -41 102 -27 92 -122 -35 45 -2 -22 -29 11 -19 72 40 11 -50 -8 16 28 -7 -44 -77 -103 10 9 -20 44 -5
8120 -5 4 28 28 -8 -77 -54 -27 3 108 -45 57 70 -59 -44 -103 -65 -19 -48 66 -12 2 -16 17 59 78 -32 -19 -33 -23
8149 -23 -60 -18 48 -22 -13 11 -73 -23 -139 4 14 -57 91 -44 35 14 -66 -57 -18 -9 78 -6 85 0 -3 -5 -26 -130 -84 -50
8179 -50 7 -101 73 39 -54 29 22 96 -76 -20 -27 34
$$ packed form
8066a05J02R8j04L8j29J52p5Q7p0N9N2j22J84j15j6j8o5N9J4m5J1K8K0m1k7r1
8092a19P8J43j29J19k14Q7Q0m7k0pM0l0R1l2k9o1M2K4J2l5l7l3k6J13jk9O4m9
8120eRK4%l6o9K3K7L0J05j53J02J3j29J5n9L8M6k9J14p8J4j8L3M2J9j10J3j4J0
8149b3l7M2O6p0RK4q4N0j16J43J0p1J48j35P9k1q0RL9RQ7q4R1q5lkk1j04M6L4
8179e0N7j08J74l4r3Q3pP4j72N6pO1
8191C4
$$ Imaginary data points
##PAGE= N=2
##DATA TABLE= (X++(I..I)), XYDATA
$$ plain form
0 0 0 0 0 0 0 0 0 0 0 1 -8 8 -8 9 -16 16 -24 32 -32 40 -48 59 -72 83 -96 112 -133 152 -176 202 -232 264
32 264 -299 339 -385 433 -484 544 -605 676 -754 836 -925 1028 -1134 1253 -1383 1526 -1681
49 -1681 1849 -2038 2246 -2475 2732 -3020 3343 -3712 4140 -4635 5218 -5922 6785 -7878 9308
64 9308 -11266 14126 -18698 27181 -48134 207764 190576 -250364 20140 -61723 -209977 159464
76 159464 269063 -134806 -98821 6334 -118414 62741 242774 -49677 -128585 6664
86 6664 -87974 -41042 175439 25237 -121662 16790 32488 -21770 72204 14796 -110998
97 -110998 -43628 35800 51017 77074 -13961 -92885 -20110 20484 45839 106970 -19028 -157960
109 -157960 -47354 40799 41017 128355 51515 -154903 -93724 31166 7361 89675 100107 -126391
$$ packed form
0@%%%%%%%%%JrJ6j6J7k5L2m0N6o4P2q8J07j31J55j79K08k45K85l28L78m34M96
32B64n63O38p24Q18r17J028j149J281j430J590j761J953k162K387k636K909l207
49a681L530l887M284m721N207n752O363p055P852q775R853j1140J2707j4663J7186
64I308k0574K5392l2824M5879p5315K55898j7188m40940K70504q1863j48254L69441
76A59464J09599m03869L5985J05155j24748J81155J80033k92451p8908J35249
86F664r4638M6932K16481j50202j46899J38452J5698n4258R3974n7408j25794
97a10998O7370P9428J5217K6057r1035p8924P2775M0594K5355O1131j25998j38932
109a57960J10606Q8153K18Q7338p6840k06418O1179J24890k3805Q2314J0432k26498
$$ plain form
121 -126391 -132626 55022 32616 34006 123312 -42879 -170414 4780 64304 -3903 69976
132 69976 30295 -117281 -25107 85483 7748 8498 28311 -83312 -58093 79064 38127 -25748
144 -25748 17063 -23208 -60150 46190 72430 -33093 -52068 -14060 -21765 16650 76329 25417
156 25417 -57940 -48737 -3678 19957 46144 35647 -36490 -64975 -7853 35179 40265 42111 -7281
169 -7281 -73557 -37153 35293 31959 19440 15434 -38249 -50911 19083 40817 6505 -279 -18313
182 -18313 -41717 399 38363 10503 -8600 -4461 -16795 -7978 24132 16890 -16225 -19842 -165
195 -165 12342 14397 12253 -2972 -23452 -12156 18988 17726 1652 -1520 -19891 -23219 19844
208 19844 28809 -6604 -4242 -2830 -31809 -4821 36888 3960 -17016 5030 -13213 -17974 25880
$$ packed form
121a26391o235J87648k2406J390Q9306j66191j27535J75194N9524o8207P3879
132F9976l9681j47576R2174J10590p7735P50J9813j11623K5219J37157m0937o3875
144b5748M2811m0271l6942J06340K6240j05523j8975L8008p705L8415N9679n0912
156B5417q3357R203M5059K3635K6187j0497p2137k8485N7122M3032N086J846m9392
169g281o6276L6404P2446l334j2519m006n3683j2662O9994K1734l4312o784j8034
182a8313k3404M2116L7964k7860j9103M139j2334Q817L2110p242l3115l617J9677
195a65J2507K055k144j5225k0480J1296L1144j262j6074l172j8371l328M3063
208A9844Q965l5413K362J412k8979K6988M1709l2928k0976K2046j8243m761M3854
$$ plain form
221 25880 15718 -17615 4461 2236 -23469 10991 26235 -14258 -5267 16897 -12859 -8667 21862
234 21862 -1799 -13175 13449 -176 -15307 8780 4804 -12388 6334 6969 -13869 -2654 6008
247 6008 -5727 2502 7899 -9026 -8450 3459 1751 5045 6768 -6135 -7454 1493 2932 9111
261 9111 8770 -9050 -11382 3959 6961 7481 7640 -8804 -15581 693 9159 8372 6507 -11104 -21637
276 -21637 -835 15373 9384 2972 -9459 -22443 -6932 17107 17114 5180 -9810 -23211 -9111
289 -9111 19012 21194 5452 -7409 -19282 -13876 14229 26845 9165 -11263 -19949 -12725 10532
302 10532 24152 10094 -11563 -20974 -13828 8092 23996 11525 -14726 -24528 -11743 10612 23531
315 23531 13069 -12014 -26146 -15038 12109 28537 15491 -13224 -26539 -13210 12546 28704
$$ packed form
221B5880j0162l3333K2076k225k5705L4460J5244m0493Q991K2164k9756M192L0529
234B1862k3661j1376K6624j3625j5131K4087l976j7192J8722O35k0838J1215Q662
247F008j1735Q229N397j6925N76J1909j708L294J723j2903j319Q947J439O179
261I111l41j7820k332J5341L002N20J59j6444o777J6274Q466p87j865j7611j0533
276b1637K0802J6208n989o412j2431j2984J5511K4039Pj1934j4990j3401J4100
289i111K8123K182j5742j2861j1873N406K8105J2616j7680k0428q686P224K3257
302A0532J3620j4058k1657r411P146K1920J5904j2471k6251r802J2785K2355J2919
315B3531j0462k5083j4132J1108K7147J6428j3046k8715j3315J3329K5756J6158
$$ plain form
327 28704 19415 -9764 -30027 -18798 12104 30159 18523 -9610 -28244 -19764 8250 28198
339 28198 19454 -9698 -31022 -23252 7822 30433 20268 -9179 -28074 -21676 4696 28811 23752
352 23752 -7438 -30313 -21559 8266 31271 25142 -4415 -28294 -24693 3565 29681 26076 -3861
365 -3861 -28025 -23695 3768 28785 25088 -4919 -29394 -27006 -776 27890 27457 -4266 -28392
378 -28392 -22898 -416 24456 28860 -1933 -32161 -24927 2497 25628 31249 4223 -29837 -25745
391 -25745 2730 21891 27316 7851 -29026 -31412 4355 26635 23663 6837 -23188 -33949 -3459
404 -3459 25127 22093 3769 -20279 -31654 -5004 28916 25607 -350 -20547 -27439 -10588 22311
417 22311 32472 6593 -22282 -24723 -4994 18860 28873 10857 -21640 -29181 -5587 16873
$$ packed form
327B8704r289k9179k0263J1229L0902J8055j1636k8133j8634Q480K8014J9948
339B8198q744k9152k1324P770L1074K2611j0165k9447j8895O398K6372K4115n059
352B3752l1190k2875Q754K9825K3005o129k9557k3879L601K8258K6116l605k9937
365c861k4164M330K7463K5017l697l0007k4475K388K6230K8666m33l1723k4126
378b8392N494K2482K4872M404l0793l0228P234K7424K3131N621k7026l4060M092
391b5745K8475J9161N425j9465l6877k386L5767K2280k972j6826l0025j0761L0490
404c459K8586l034j8324k4048j1375K6650L3920l309k5957k0197o892J6851L2899
417B2311J0161k5879k8875k441J9729K3854J0013j8016l2497p541K3594K2460
$$ plain form
429 16873 24756 16614 -14140 -32892 -7517 19343 15602 7565 -7569 -30440 -14023 24157 21308
442 21308 582 -6950 -23372 -19105 21812 28341 -4393 -12605 -13579 -16984 16634 39613 2545
455 2545 -24753 -14451 -11747 5060 36737 17647 -23768 -21907 -6758 2163 25021 22881 -15753
468 -15753 -28104 -9070 2594 14426 21667 -1176 -23989 -14163 4603 10761 9284 1169 -10400
481 -10400 -11913 2008 14452 7570 -5130 -6049 -4456 308 13911 8746 -13738 -10293 5036 2232
495 2232 9742 16817 -13669 -27930 3165 12655 3169 15279 543 -33055 -11182 19400 6452
508 6452 8143 11572 -25861 -26436 18017 14323 -1368 17153 -3378 -33980 2807 24467 -5053
521 -5053 3023 14715 -19476 -14288 20496 1973 -9380 14802 -1857 -19219 10491 7158 -18946
$$ packed form
429A6873P883q142l0754j8752K5375K6860l741q037j5134k2871J6417L8180k849
442B1308k0726p532j6422M267M0917O529l2734q212r74l405L3618K2979l7068
455B545k7298J0302K704J6807L1677j9090m1415J861J5149Q921K2858k140l8634
468a5753j2351J9034J1664J1832P241k2843k2813R826J8766O158j477q115j1569
481a0400j513J3921J2444o882j2700r19J593M764J3603n165k2484L445J5329k804
495B232P510P075l0486j4261L1095R490r486J2110j4736l3598K1873L0582j2948
508F452J691L429l7433n75M4453l694j5691J8521k0531l0602L6787K1660k9520
521e053Q076J1692l4191N188L4784j8523j1353K4182j6659j7362K9710l333k6104
$$ plain form
534 -18946 4892 15446 -12326 -2026 12868 -14758 -13621 14765 5157 -4301 8561 -4466 -17605
547 -17605 3163 12522 3706 5859 650 -13680 -8746 5636 11680 9319 -384 -6905 -6926 -7915 3736
562 3736 17124 1999 -9399 531 -8543 -12757 15252 11971 -12715 3881 5498 -24019 -1373
575 -1373 24061 -8697 -5851 22022 -12939 -24176 20770 7727 -15397 20936 9894 -31868
587 -31868 1713 19618 -15850 6181 26769 -21032 -18896 20501 -5656 -12606 25598 2085
599 2085 -26165 7149 6569 -17679 9168 15347 -14344 -1712 9478 -14660 -4046 16685 -2444
612 -2444 -3922 11853 -6190 -14285 6829 7729 1103 7946 -243 -11707 -4386 1363 5616 11914
626 11914 1476 -10237 -7202 -5389 1715 13518 4665 -6892 -4844 -10192 -6031 15957 9859 -9255
$$ packed form
534a8946K3838J0554k7772J0300J4894k7626J137K8386r608r458J2862j3027j3139
547a7605K0768R359q816K153n209j4330M934J4382O044k361r703o521k1r89J1651
562C736J3388j5125j1398R930r074m214K8009l281k4686J6596J617k9517K2646
575a373K5434l2758K846K7873l4961j1237M4946j3043k3124L6333j1042m1762
587c1868L3581J7905l5468K2031K0588m7801K136L9397k6157o950L8204k3513
599B085k8250L3314n80k4248K6847O179k9691J2632J1190k4138J0614K0731j9129
612b444j478J5775j8043q095K1114R00o626O843q189j1464P321N749M253O298
626A1914j0438j1713L035J813P104J1803q853j1557K048n348M161K1988o098j9114
$$ plain form
640 -9255 -669 -2143 -14457 7576 18476 -6986 -5382 7914 -9387 -4243 18238 -1716 -12973
653 -12973 11242 2733 -12832 10166 6738 -19324 2021 18108 -7746 -5553 8955 -13416 -11978
666 -11978 18660 8275 -10050 2489 -5469 -17812 10053 20149 -5192 -4828 1674 -14934 -3988
679 -3988 22710 8463 -9555 -936 -5356 -10086 11389 15371 -4449 -5599 -1373 -8443 1311 13758
693 13758 900 -8641 -1590 -2060 -2815 5638 3468 -5385 -3749 391 1389 2851 -413 -4306 -1473
708 -1473 1967 4089 4355 -2258 -6143 -733 2442 4919 7985 -1928 -11001 -1446 4611 1831 7437
723 7437 3479 -13113 -7791 6466 2259 2838 6651 -9143 -12338 5710 4584 -1717 7479 -2077
737 -2077 -15173 2745 11045 -3798 1302 6063 -10158 -4437 12544 1593 -4885 4141 -3707 -5877
$$ packed form
640i255Q586j474j2314K2033J0900k5462J604J3296j7301N144K2481j9954j1257
653a2973K4215q509j5565K2998l428k6062K1345J6087k5854K193J4508k2371J438
666a1978L0638j0385j8325J2539p958j2343K7865J0096k5341L64O502j6608J0946
679c988K6698j4247j8018Q619m420m730K1475L982j9820j150M226p070R754J2447
693A3758j2858r541P051m70p55Q453k170q853J636M140R98J462l264l893K833
708a473L440K122K66o613l885N410L175K477L066r913r073R555O057k780N606
723G437l958j6592N322J4257m207N79L813j5794l195J8048j126o301R196r556
737b077j3096J7918Q300j4843N100M761j6221N721J6981j0951o478R026p848k170
$$ plain form
751 -5877 10120 4869 -7728 725 210 -7015 5840 9071 -6958 -6182 731 -3483 2520 8631 -3424
766 -3424 -7143 -304 -2442 1299 9525 208 -8347 -1100 949 526 6863 2877 -5806 -1923 1204
781 1204 768 5589 2467 -6351 -2400 2804 -147 2493 2775 -5847 -4485 3417 1747 835 1332 -5771
797 -5771 -5772 3348 3608 495 2220 -3651 -7307 2275 6780 1512 795 -1041 -5915 -691 6287 3651
813 3651 1004 -936 -5312 -2095 5220 3473 -207 -821 -3949 -3790 2391 3820 -80 -2062 -3511 -2676
829 -2676 1975 3074 -410 -1747 -2164 -1856 1439 3555 958 -1822 -1985 128 2556 2552 641 -571 -1422
846 -1422 -545 2308 2098 -90 -1018 -1714 -733 2193 1291 -1627 -862 -1025 -2210 1216 2075 -2099 -2054 41
864 41 -1209 454 2689 -629 -1792 421 -806 213 3726 473 -2265 905 591 -916 2706 2284
$$ packed form
751e877J5997n251j2597Q453n15p225J2855L231j6029P76O913m214O003O111j2055
766c424l719O839k138L741Q226r317q555P247K049m23O337l986q683L883L127
781A204m36M821l122q818L951N204k951K640K82q622J362P902j670r12M97p103
797e771jR120K60l113J725n871l656R582M505n268p17j836m874N224O978k636
813C651k647j940m376L217P315j747l680o14l128J59O181J429l900j982j449Q35
829b676M651J099l484j337m17L08L295K116k597k780j63K113K428mj911j212q51
846a422Q77K853k10k188r28o96R81K926r02k918P65j63j185L426Q59m174M5K095
864D1j250J663K235l318j163K213j227J019L513l253k738L170l14j507L622m22
$$ plain form
880 2284 -1932 -819 202 -407 1858 900 -2268 -534 95 -1923 1193 1663 -2773 -1483 454 -1378
896 -1378 974 1748 -2765 -584 2142 -2443 139 4636 -1988 -2468 4525 -148 -2614 4253 578 -3766
912 -3766 3966 1595 -5283 2480 2948 -5605 1712 5309 -5964 -2799 5185 -3365 -3315 5701 -1325 -5829
928 -5829 3119 836 -3837 3378 2304 -3981 1072 2169 -2817 1140 3601 -956 -153 1688 -1198
943 -1198 -572 1354 1123 1432 -450 -1913 286 -875 -1080 3312 555 -3942 387 -784 -4504 3882
959 3882 4070 -5664 -188 3514 -7115 -987 9879 -2294 -5065 6248 -2601 -6873 8828 4604
973 4604 -6896 3763 3028 -9061 2462 8860 -5328 -1735 6405 -5384 -4848 7023 -756 -5025
987 -5025 4852 404 -6334 1349 1316 -4384 2219 4818 -2424 -2851 -53 -1639 -141 4794 4286 -1990
$$ packed form
880B284m216J113J021o09K265r58l168J734O29k018L116M70m436J290J937j832
896a378K352P74m513K181K726m585K582M497o624m80O993m673k466O867l675m344
912c766P732k371o878P763M68q553P317L597j1273L165P984q550N0R016p026m504
928e829Q948k283m673P215j074o285N053J097m986L957K461m557Q03J841k886
943a198O26J926k31L09j882j463K199j161k05M392k757m497M329j171l720Q386
959C882J88r734N476L702j0629O128J0866j2173k771J1313q849m272J5701m224
973D604j1500J0659p35j2089J1523O398j4188L593Q140j1789N36J1871p779m269
987e025R877m448o738P683l3n700O603K599p242m27K798j586J498M935n08o276
$$ plain form
1003 -1990 -5157 -1003 1650 819 5336 5235 -6119 -6492 2957 454 458 8594 -528 -10717 -91 1696
1019 1696 -4842 6857 7800 -10123 -4823 5640 -5869 -2060 12353 -1455 -9457 5157 127
1032 127 -8177 7118 7209 -6973 1876 6040 -8513 -3221 8741 -821 -2189 7917 -1402 -10314
1046 -10314 836 4507 -975 4155 4497 -8023 -8686 2277 3203 1207 5692 516 -11051 -5131
1060 -5131 6656 2646 496 6424 -2872 -11676 2394 7824 -2372 2501 6522 -7798 -5385 8291
1074 8291 -151 -4308 7755 593 -8922 4084 3601 -9398 1387 8738 -5081 -2688 6124 -5774
1088 -5774 -8055 6836 4473 -3141 2422 -1002 -9164 107 8261 2145 973 1519 -6793 -6906 5742
1103 5742 8613 567 -982 -890 -7109 -3697 9167 7047 -3909 -2435 -1683 -7119 1344 9778 -966
$$ packed form
1003a990l167M154K653q31M517j01j1354l73R449k503MQ136r122j0189J0626J787
1019A696o538J1699R43j7923N300J0463j1509L809J4413j3808q002J4614n030
1032A27q304J5295R1j4182Q849M164j4553N292J1962r562j368J0106r319q912
1046a0314J1150L671n482N130L42j2520o63J0963R26j996M485n176j1567N920
1060e131J1787m010k150N928r296q804J4070N430j0196M873M021j4320K413J3676
1074H291q442m157J2063p162r515J3006m83j2999J0785P351j3819K393Q812j1898
1088e774k281J4891k363p614N563l424q162R271Q154o116j172N46q312j13J2648
1103E742K871q046j549R2o219L412J2864k120j0956J474P52n436Q463Q434j0744
$$ plain form
1118 -966 -5069 1722 -4128 -4826 8290 3005 -7346 2510 3168 -7554 2329 7448 -7081 -1806 10033
1133 10033 -2435 -5238 6676 -2367 -7859 8799 6912 -6999 21 1156 -8777 1784 11181
1146 11181 -856 -4904 -353 -6411 -3549 8650 5133 -3199 -2281 -4428 -5443 4062 8060 1179
1160 1179 -3085 -3033 -2950 -435 4383 5839 141 -5025 -1633 1826 -286 2053 4274 -2561 -3497 2797
1176 2797 -308 -2855 3019 -248 -4665 3612 2773 -6794 -386 4135 -4675 226 8038 -3522 -6989
1191 -6989 3465 119 -2822 7214 3040 -7322 -207 2708 -3189 3994 6727 -5071 -4133 3371
1205 3371 -2039 -1039 6992 14 -6212 653 595 -3062 2984 2684 -4235 -1714 1325 -1920 352 2923
1221 2923 -1511 -2019 1439 373 -616 990 339 -205 698 422 576 603 -903 225 1908 35 -354
$$ packed form
1118i66m103O791n850o98J3116n285j0351R856O58j0722R883N119j4529N275J1839
1133A0033j2468k803J1914r043n492J6658j887j3911P020J135r933J0561R397
1146A1181j2037m048M551o058K862J2199l517q332R18k147j015R505L998o881
1160A179m264N2Q3K515M818J456n698n166L392L459k112K339K221o835r36O294
1176B797l105k547N874l267m417Q277q39r567O408M521q810M901P812j1560l467
1191f989J0454l346k941J0036m174j0362P115K915n897P183K733j1798R38P504
1205C371n410J000Q031o978o226O865n8l657O046l00o919K521L039l245K272K571
1221B923m434n08L458j066r89J606o51n44R03k76J54K7j506J128J683j873l89
$$ plain form
1238 -354 366 -1334 -528 1769 -328 -1018 1017 -1547 -2467 2290 1003 -2756 426 1038 -2953 18
1254 18 2645 -1666 -512 2384 -1576 -1202 3031 -368 -1647 2985 785 -2750 1580 1677 -2323 929
1270 929 2450 -2079 -958 1568 -1558 -545 2115 -1087 -2007 1080 -761 -1654 1797 535 -2272 130
1286 130 677 -904 864 1308 -1133 -325 764 -131 1226 1687 -1213 -853 1092 165 384 1678 -541
1303 -541 -1964 -124 355 563 1130 -1184 -2234 -33 319 -428 1062 141 -2713 -1039 1387 628 373
1320 373 87 -1477 -428 1540 1060 638 490 -1519 -1284 2028 2289 361 -247 -1198 -1607 820 2412
1337 2412 1089 -513 -2101 -2474 -50 2249 1204 -335 -1653 -2612 -1050 1902 2232 -71 -1549 -1904
1353 -1904 -681 1388 2332 993 -1032 -1596 -283 1685 2457 730 -1640 -1569 219 1389 1618 884 -1878
$$ packed form
1238c54P20j700Q06K297k097o90K035k564r20M757j287l759L182O12l991K971
1254A8K627m311J154K896l960L74M233l399j279M632k200l535M330R7m000L252
1270I29J521m529J121K526l126J013K660l202r20L087j841q93L451j262k807K402
1286A30N47j581J768M44k441Q08J089q95J357M61k900L60J945r27K19J294k219
1303e41j423J840M79K08N67k314j050K201L52p47J490r21k854J674K426p59k55
1320C73k86j564J049J968m80m22j48k009K35L312K61j928o08r51m09K427J592
1337B412j323j602j588l73K424K299j045j539j318r59J562K952L30k303j478l55
1353a904J223K069R44j339k025n64J313J968P72j727k370P1J788J170K29p34k762
$$ plain form
1370 -1878 -3081 -212 2303 1789 97 -2028 -3329 -960 2245 1973 459 -1191 -3379 -1665 2489
1385 2489 2889 553 -568 -1947 -2025 1558 3138 1183 -337 -1419 -1811 1221 3164 1189 -1149 -1733
1401 -1733 -1566 319 2561 1422 -1346 -2772 -2131 763 2583 1364 -796 -2686 -3331 465 3867 2094
1417 2094 -553 -1808 -3269 -598 4218 3021 -502 -924 -2585 -2067 3633 3956 -1198 -1310 -555 -2560
1433 -2560 1178 4181 -892 -2941 -9 -1170 -376 3525 -252 -4665 -290 1284 -1113 2359 2364 -4047
1449 -4047 -2959 2529 1568 761 2091 -1498 -3850 612 3079 1618 1444 -79 -3378 -1726 2605 2553
1465 2553 78 -498 -1674 -2875 177 3553 842 -2297 -1126 -1136 -1392 2321 2306 -2709 -2192 1069 -391
1482 -391 561 3364 -1288 -4027 1691 2520 -606 2266 1036 -4955 -876 4867 738 -543 1607 -3062
$$ packed form
1370a878j203K869K515n14j692k125j301K369L205k72j514j650k188J714M154
1385B489M00k336j121j379p8L583J580j955j520j082l92L032J943j975k338n84
1401a733J67J885K242j139k768j426O41K894J820j219k160j890o45L796L402j773
1417B094k647j255j461K671M816j197l523m22j661N18N700L23n154j12P55k005
1433b560L738L003n073k049K932j161P94L901l777m413M375J574k397L472No411
1449d047J088N488r61q07J330l589k352M462K467j461j74j523l299J652M331n2
1465B553k475n76j176j201L052L376k711l139J171j0k56L713j5n015N17L261j460
1482c91R52K803m652k739N718Q29l126K872j230n991M079N743m129j281K150m669
$$ plain form
1498 -3062 -3821 3442 3541 -1328 -204 -1170 -4620 243 4832 458 -2071 -118 -2378 -2541 3280 3739
1514 3739 -1632 -1921 161 -1748 31 4411 1171 -2890 344 1080 -1926 1606 3643 -2611 -2346 3303
1530 3303 -280 -3028 2675 330 -4502 2160 3625 -3794 -1410 2140 -3676 -854 5991 -507 -4666
1545 -4666 1261 -694 -2989 5259 4407 -4400 -1692 1401 -2904 1196 6566 -470 -4200 451 -585
1560 -585 -1642 3727 3154 -2666 -2211 -29 -1711 -317 3297 817 -2931 -850 559 -2033 -406 3570
1576 3570 171 -2981 1187 417 -3475 1410 4142 -1981 -466 3523 -3030 -3395 5089 1330 -3152
1591 -3152 3642 1026 -6468 940 4544 -2904 569 4197 -4832 -4046 4331 -802 -2500 4636 -369
1606 -369 -5820 1703 2056 -3538 1879 4044 -3147 -1679 2336 -1647 -1178 4051 1463 -1663 50 -917
$$ packed form
1498c062p59P263R9m869J124r66l450M863M589m374k529J953k260j63N821M59
1514C739n371k89K082j909J779M380l240m061L234P36l006L532K037o254K65N649
1530C303l583k748N703k345m832O662J465p419K384L550n816K822O845o498m159
1545d666N927j955k295Q248q52q807K708L093m305M100N370p036l730M651j036
1560e85j057N369n73n820M55K182j682J394L614k480l748K081J409k592J627L976
1576C570l399l152M168p70l892M885K732o123J515L989o553l65Q484l759m482
1591c152O794k616p494P408L604p448L473L628r029P86Q377n133j698P136n005
1606c69n451P523L53n594N417K165p191J468M015l983M69N229k588l126J713r67
$$ plain form
1622 -917 -2025 1495 3356 917 -1274 -1569 -1596 -994 2121 3683 -632 -3711 -1013 -721 -1393 3665 3419
1639 3419 -4176 -2892 1558 -1750 454 5561 -1202 -4716 2209 451 -2625 4530 2568 -5483 460
1654 460 4050 -3242 -142 4374 -3660 -2794 5340 -132 -3821 2476 -887 -4418 3969 3712 -4182 -1425
1670 -1425 577 -3636 1339 6047 -783 -3913 -582 -1581 136 5395 2458 -3167 -2706 -901 445
1685 445 3675 3534 -1224 -3951 -2192 1083 2839 2059 276 -2857 -3970 407 3825 799 -1180 -1047
1701 -1047 -3156 -1182 4290 1917 -2499 -1070 -1377 -1731 4006 3938 -3159 -2632 558 -924 2272 5521
1717 5521 -1286 -5314 -213 1400 1209 4230 355 -5927 -2313 2254 1443 2779 1660 -5189 -4955 2097
1733 2097 3248 1543 1064 -3060 -5478 177 4571 2494 180 -2053 -4023 -778 4286 3740 -81
$$ packed form
1622i17j108L520J861k439k191k95k7O02L115J562m315l079K698K92o72N058k46
1639C419p595J284M450l308K204N107o763l514O925j758l076P155j962q051N943
1654D60L590p292L100M516q034Q66Q134n472l689O297l363l531Q387k57p894K757
1670a425K002m213M975M708o830l130L331r99J717N259k937n625M61J805J346
1685D45L230j41m758k727J759L275J756p80j783l133j113M377L418l026j979J33
1701a047k109J974N472k373m416J429l07l54N737o8p097N27L190j482L196L249
1717E521o807m028N101J613j91L021l875o282L614M567q11J336j119o849K34P052
1733B097J151j705m79m124k418N655M394k077k314k233j970L245N064n46l821
$$ plain form
1748 -81 -2132 -3038 -1263 3118 4456 261 -3233 -2661 -610 2031 3755 1032 -3560 -3890 -611 2259
1764 2259 3125 955 -3265 -3977 -557 2771 3129 1279 -2648 -4487 -933 3620 4111 1069 -2401 -3762
1780 -3762 -1420 3009 4711 1928 -2623 -4352 -1810 2402 4364 1963 -2601 -4349 -1957 1598 3850
1795 3850 2612 -2261 -4969 -2141 1854 3298 2254 -1268 -4444 -2285 2363 3427 2085 -674 -3951
1810 -3951 -2456 2444 3647 1527 -574 -3129 -2676 1757 3812 1486 -1109 -3109 -2811 1033 3581
1825 3581 1470 -1314 -2828 -2937 465 3688 1866 -1451 -2816 -2557 328 3486 2486 -900 -2579
1840 -2579 -2418 210 3776 2991 -910 -2340 -1979 -195 3174 3137 -602 -2625 -2161 -252 2766 2668 -705
1857 -705 -2732 -2079 -525 1920 2700 -490 -3043 -2078 -252 1869 2517 -293 -2415 -1453 108 1397
$$ packed form
1748h1k051r06J775M381J338m195l494N72K051K641J724k723m592l30L279K870
1764B259Q66k170m220p12L420L328L58j850l927j839L554M553M91l042l470j361
1780c762K342M429J702k783m551j729K542M212J962k401m564j748K392L555K252
1795C850j238m873k708K828L995J444j044l522l176K159M648J064j342k759l277
1810c951J495M900J203k120k101k555M53M433K055k326k595k000K98L844K548
1825C581k111k784j514j09L402L223j822l317j365K59K885L158j000l386j679
1840b579J61K628L566p85l901j430L61J784L369l7l739k023M64J909L018r8l373
1857g05k027O53J554K445P80l190k553R65J826K121O48k810k122R62J561J289
$$ plain form
1873 1397 2565 457 -2448 -1512 788 1399 1772 767 -1883 -1780 521 1283 1302 524 -1705 -2080 -108
1890 -108 1197 929 130 -1278 -1864 -480 1193 1282 12 -1216 -1257 -170 955 1492 638 -968 -1139 151
1908 151 868 1369 814 -970 -1024 375 408 451 992 -452 -1686 333 898 -352 8 123 -1453 -376
1926 -376 1074 -491 -681 433 -764 -794 1259 376 -1274 145 641 -524 595 860 -625 -367 967
1943 967 158 1 704 -106 -775 483 707 -659 -373 239 -304 -383 628 -85 -1359 -513 689 0 -221
1962 -221 246 -913 -1586 1008 1543 -221 169 43 -1853 221 2737 657 -669 227 -1334 -1349 2700
1979 2700 2215 -1227 -789 -680 -1937 1153 3121 -599 -2093 -385 -1395 -334 3085 834 -2901 -1149
1995 -1149 201 -390 1566 1980 -1862 -2178 916 1265 865 1159 -824 -2538 457 2563 1107 -39
$$ packed form
1873A397J168k108k905R36K300O11L73j005k650J03K301P62J9p78k229l75J972
1890a08J305k68p99j408n86J384J673Q9j270j228m1J087J125N37q54j606j71J290
1908A51P17N01n55j784n4J399L3M3N41j444j234K019N65j250L60J15j576J077
1926c76J450j565j90J114j197l0K053q83j650J419M96j165J119K65j485K58J334
1943I67q09j57P03q10o69J258K24j366K86O12n43p9J011p13j274Q46J202o89k21
1962b21M67j159o73K594N35j764L90j26j896K074K516k080j326Q96j561j5M049
1979B700m85l442M38J09j257L090J968l720j494J708j010J061L419k251l735J752
1995a149J350n91J956M14l842l16L094L49m00K94j983j714K995K106j456j146
$$ plain form
2011 -39 -763 -2221 -1008 2826 2650 -1000 -2206 -1690 -1427 1681 3748 160 -3353 -1977 -894 415
2027 415 3605 2406 -3163 -3335 63 424 2098 3723 -1115 -4495 -321 1770 904 2660 1025 -4100
2043 -4100 -2156 2589 1405 438 1258 -2498 -3343 2063 2659 -1079 -425 -864 -3118 740 4186 6
2059 6 -2536 -790 -1228 -85 3881 2015 -3197 -2406 190 499 2837 3420 -1785 -4475 -463 1969 2082
2076 2082 2627 -17 -4385 -2653 2020 2594 1397 297 -2696 -3874 750 3504 924 -649 -1119 -3033
2092 -3033 -908 3515 2100 -1542 -954 -798 -1346 2136 3266 -1615 -2477 782 203 528 3034 -303
2108 -303 -4024 -223 2314 500 1446 652 -4312 -2619 3110 2075 -37 654 -2757 -4529 1717 4247
2124 4247 310 -560 -1196 -3948 -604 4557 2263 -1044 -826 -2155 -1823 3139 3472 -709 -1448 -707 -1386
$$ packed form
2011c9p24j458J213L834j76l650j206N16K63L108K067l588l513J376J083J309
2027D15L190j199n569j72L398L61J674J625m838l380M174K091q66J756j635n125
2043d100J944M745j184r67Q20l756q45N406N96l738O54m39k254L858L446m180
2059Fk542J746m38J143L966j866n212P91K596L09K338N83n205k690M012K432J13
2076B082N45k644m368J732M673N74j197j100k993j178M624K754k580j573m70j914
2092c033K125M423j415l642N88J56n48L482J130m881q62L259n79L25K506l337
2108c03l721L801K537j814R46p94m964J693N729j035k112O91l411j772O246K530
2124D247l937q70o36k752L344N161k294l307K18j329L32M962L33m181p39P41o79
$$ plain form
2141 -1386 1056 3175 192 -2277 -1020 -13 365 1481 547 -2234 -1971 861 1405 535 -185 -1558
2157 -1558 -2369 418 3020 1226 -944 -1319 -1959 -568 3368 2897 -1437 -2023 -1009 -1167 2009 4237
2173 4237 -173 -3220 -972 -432 138 3511 1462 -3449 -2270 507 -160 1558 2360 -2044 -3127 427
2189 427 879 336 1790 -233 -2891 101 1819 268 529 658 -1878 -960 2158 1275 -623 -151 -673
2206 -673 -1105 1240 1915 -285 -1281 -949 -736 465 1613 336 -1633 -1516 -252 502 1108 866 -1007
2223 -1007 -1851 -361 1165 928 753 126 -1463 -1039 1475 1452 280 247 -595 -1278 515 1585 -37 -484
2241 -484 -89 -914 -319 1270 293 -1309 -318 82 -659 454 608 -1027 -740 593 -20 -57 822 -509
2259 -509 -1124 619 969 -231 400 461 -783 -75 1089 251 -244 261 -255 -457 721 185 -665 -44 73
$$ packed form
2141a386K442K119k983k469J257J007L78J116r34k781K63K832N44q70p20j373
2157a558q11K787K602j794k170l75o40J391L936m71m334n86J014j58L176K228
2173D237m410l047K248N40N70L373k049m911J179K777o67J718Q02m404j083L554
2189D27M52n43J454k023k658K992J718j551K61J29k536R18L118q83j898M72n22
2206f73m32K345O75k200r96L32K13J201J148j277j969J17J264P54O06k42j873
2223a007q44J490J526k37j75o27j589M24K514k3j172l3q42o83J793J070j622m47
2241d84L95q25N95J589r77j602R91M00p41J113J54j635K87J333o13l7Q79j331
2259e09o15J743L50j200O31O1j244P08J164q38m95N05n16k02J178n36q50O21J17
$$ plain form
2278 73 -794 207 449 -580 -523 131 -145 -162 348 -402 -448 222 208 -68 453 -94 -379 356 408 88 174 -86
2300 -86 -451 220 618 184 14 -396 -628 285 645 -134 -156 -367 -906 10 1010 -37 -577 -305 -662 -85
2320 -85 1012 308 -503 -87 -261 -343 1087 974 -703 -253 193 -159 690 906 -636 -526 204 -144 380
2339 380 900 -527 -1245 -40 175 63 761 -212 -1346 -336 178 280 737 91 -1260 -551 520 366
2357 366 595 516 -775 -803 540 583 586 548 -735 -819 343 628 251 352 -674 -1013 303 737 65 -173
2377 -173 -759 -1124 153 882 114 -197 -593 -1090 240 1273 561 -219 -423 -919 -36 1394 842 -82 -314
2396 -314 -796 -165 1301 749 -307 -376 -503 -644 568 1012 -308 -840 -461 -497 300 779 -9 -777 -516
2415 -516 -306 107 867 329 -503 -579 -62 470 592 368 52 -383 -209 386 608 25 -123 -259 -502 431
$$ packed form
2278G3q67J001K42j029N7O54k76j7N10p50m6O70j4k76N21n47k85P35N2l20Q6k60
2300h6l65O71L98m34j70m10k32R13L60p79k2k11n39R16J000j047n40K72l57N77
2320h5J097p04q11M16j74q2J430j13j677M50M46l52Q49K16j542J10P30l48N24
2339C80N20j427p18J205K15j12O98r73j134J010N14J02M57o46j351P09J071j54
2357C66K29p9j291k8J343M3Ll8j283q4J162K85l77J01j026l39J316M34o72k38
2377a73n86l65J277P29p68l11l96m97J330J033p12p80k04m96Q83J430n52r24k32
2396c14m82O31J466n52j056o9j27j41J212M44j320n32L79l6P97M79p88p68K61
2415e16K10M13P60n38q32p6N17N32J22k24l16m35J74N95K22n83j48j36k43R33
$$ plain form
2435 431 587 -403 -358 -207 -458 176 782 -354 -1206 -175 3 -66 984 154 -1298 -449 505 19 692
2454 692 885 -934 -826 656 331 277 946 -224 -990 253 621 38 261 268 -727 -396 433 80 -261 -33
2474 -33 -265 -519 109 152 -179 -370 -62 118 -202 189 477 -318 -212 849 263 -149 572 151 -817 627
2494 627 940 -637 -82 625 -837 -198 1269 -142 -1055 455 -215 -1230 779 749 -1222 -325 437 -875
2512 -875 111 1377 -641 -1073 756 -175 -593 1235 600 -1125 141 718 -518 129 1034 -381 -610
2529 -610 566 42 -797 313 440 -558 33 597 -524 -795 437 192 -763 384 539 -1237 -493 918
2547 918 -71 -338 1094 -143 -1367 584 893 -573 728 1082 -1312 -567 1377 -351 -432 1326 -381
2564 -381 -1460 766 562 -1060 406 855 -1131 -320 975 -702 -730 1032 53 -979 512 160 -1077
$$ packed form
2435D31J56r90M5J51k51O34O06j136q52J031J78o9J050q30j452Q49R54m86O73
2454F92J93j819J08J482l25n4O69j170p66J243L68n83K23Pr95L31Q29l53l41K28
2474c3k32k54O28M3l31j91L08J80l20L91K88p95J06J061n86m12P21m21r68J444
2494F27L13j577N55P07j462O39J467j411r13J510o70j015K009l0j971Q97P62j312
2512h75R86J266k018m32J829r31m18J828o35j725J266N77j236O47R05j415k29
2529f10J176n24q39J110J27r98N91N64j121k71J232k45r55J147J55j776P44J411
2547I18r89k67J432j237j224J951L09j466J301L54k394P45J944j728q1J758j707
2564c81j079K226k04j622J466M49j986Q11J295j677k8J762r79j032J491l52j237
$$ plain form
2581 -1077 141 1063 -251 -251 555 -478 -605 954 1023 -456 -26 262 -855 -255 1367 364 -926 258
2599 258 -114 -1248 414 1305 -828 -637 721 -872 -957 1378 296 -1122 583 370 -1340 559 1475
2616 1475 -987 -214 1387 -683 -671 1410 -79 -1155 1250 795 -1046 150 672 -1152 -60 1298
2632 1298 -414 -779 510 -487 -1010 815 721 -1061 -259 202 -813 -57 1214 257 -720 46 55 -506 648
2651 648 1229 -349 -625 293 -119 -353 1145 614 -951 -212 331 -659 94 1022 -528 -847 346 -263
2669 -263 -771 787 441 -1129 -123 667 -582 -218 908 -493 -899 791 392 -529 567 358 -815
2686 -815 252 1156 -62 -316 497 -507 -617 834 540 -732 -193 4 -817 -25 1131 -248 -832 -38
2704 -38 -167 -455 994 678 -951 -458 270 -202 519 1429 -286 -1135 321 386 39 1062 468 -1215 -494
$$ packed form
2581a077J218R22j314%Q06j033j27J559O9j479M30K88j117O00J622j003j290J184
2599B58l72j134J662Q91k133J91J358j593q5K335j082j418J705k13j710J899R16
2616A475k462P73J601k070J2K081j489j076K405m55j841J196N22j824J092J358
2632A298j712l65J289r97n23J825r4j782Q02M61j015P56J271r57r77P66Rn61J154
2651F48N81j578k76R18m12k34J498n31j565P39N43r90P53R28j550l19J193o09
2669b63n08J558l46j570J006P90j249L64J126j401m06J690l99r21J096k09j173
2686h15J067R04j218k54Q13j004j10J451k94j272N39J97q21P92J156j379n84P94
2704c8j29k88J449l16j629M93P28m72P21R10j715q49J456O5l47J023n94j683P21
$$ plain form
2723 -494 731 136 371 513 -977 -1003 470 538 -46 145 -437 -1091 -59 824 241 -239 -303 -644 -23 961
2743 961 743 -204 -433 -334 57 658 804 100 -677 -538 255 607 641 306 -709 -986 192 863 294 196
2763 196 -418 -1278 -400 983 521 -75 -176 -999 -696 1024 881 -191 -331 -531 -745 701 1439 -3
2781 -3 -596 -276 -440 432 1475 312 -997 -567 -182 162 1184 461 -1097 -994 -9 282 732 451 -934
2800 -934 -1255 -198 429 737 576 -724 -1137 -75 825 792 511 -350 -1080 -256 720 880 665 -335 -1059
2819 -1059 -379 731 917 499 -272 -1160 -645 498 702 519 -314 -1274 -782 529 865 533 -240 -992 -977
2838 -977 393 1009 634 -104 -805 -851 390 1214 776 -193 -707 -871 188 1251 649 -470 -758 -689 15
$$ packed form
2723d94J225n95K35J42j490k6J473O8n84J91n82o54J032Q83n83m80o4l41O21R84
2743I61k18r47k29R9L91O01J46p04p77J39P93L52L4l35j015k77J178O71n69r8
2763A96o14q60Q78J383m62n96j01q23L03J720j43j072j40k00k14J446P38j442
2781cn93L20j64Q72J043j163j309M30L85L44J022p23j558J03R85K91M50k81j385
2800i34l21J057O27L08j61j300m13J062R00l3k81q61p30Q24R76J60k15j000p24
2819a059O80J110J86m18p71q88N15J143K04j83q33r60M92J311L36l32p73p52J5
2838i77J370O16l75p38p01m6J241Q24m38r69n14j64J059J063o02j119k88O9P04
$$ [...]
8191d
##END NTUPLES=NMR FID
##END=
