##TITLE=1H_E3e-3
 CDCl3
 8 sc, 
 15.6.2023
##JCAMPDX= 6.0         $$ Bruker NMR JCAMP-DX V2.0
##DATA TYPE= NMR FID
##DATA CLASS= NTUPLES
##ORIGIN= UXNMR, Bruker Analytische Messtechnik GmbH
##OWNER= root
$$ XWIN-NMR		Version 3.5
$$ Thu Jun 15 09:18:41 2023 Russian Standard Time (UT+4h)  she@DPX200
##.OBSERVE FREQUENCY= 200.13135
##.OBSERVE NUCLEUS= ^1H
##.DELAY= (6, 6)
##.ACQUISITION MODE= SIMULTANEOUS
##.ACQUISITION SCHEME= undefined
##.AVERAGES= 8
##.DIGITISER RES= 18
##SPECTROMETER/DATA SYSTEM= spect
##.PULSE SEQUENCE= zg30
##.SOLVENT NAME= CDCl3
##.SHIFT REFERENCE= (INTERNAL, CDCl3, 0, 15.7039)
##AUDIT TRAIL= $$ (NUMBER, WHEN, WHO, WHERE, WHAT)
$$ ##TITLE= Audit trail, XWIN-NMR		Version 3.5
$$ ##JCAMPDX= 5.01
$$ ##ORIGIN= Bruker BioSpin GmbH
$$ ##OWNER= she
$$ F:/spectra/data/she/nmr/H-F/1/audita.txt
$$ ##AUDIT TRAIL=  $$ (NUMBER, WHEN, WHO, WHERE, WHAT)
(   1,<2023-06-15 09:17:15.01 +0400>,<she>,<DPX200>,
      <created by zg, POWCHK disabled, PULCHK disabled
       configuration hash MD5:
       00 E9 B6 7A A2 85 ED C7 34 08 36 98 17 FE 4E 26
       data hash MD5: 16K
       FA BC 4E 1E 15 6E 78 53 1A 47 5E 0F EC D4 E0 CA>)
$$ ##END=
$$ 
$$ hash MD5
$$ 2A 13 01 71 45 96 CC F6 C4 44 90 84 6A B9 08 26
##$RELAX= 
##$RELAX= 
##$RELAX= 
##$RELAX= 
##$RELAX= 
##$RELAX= 
$$ Bruker specific parameters
$$ --------------------------
##$DU= <F:/spectra>
##$EXPNO= 1
##$NAME= <H-F>
##$PROCNO= 1
##$TYPE= <nmr>
##$USER= <she>
##$AMP= (0..31)
100 100 100 100 100 100 100 100 100 100 100 100 100 100 100 100 100 100 
100 100 100 100 100 100 100 100 100 100 100 100 100 100 
##$AQSEQ= 0
##$AQ_mod= 1
##$AUNM= <au_zg>
##$AUTOPOS= <>
##$BF1= 200.13
##$BF2= 200.13
##$BF3= 200.13
##$BF4= 200.13
##$BF5= 200.13
##$BF6= 200.13
##$BF7= 200.13
##$BF8= 200.13
##$BYTORDA= 1
##$CFDGTYP= 0
##$CFRGTYP= 5
##$CHEMSTR= <none>
##$CNST= (0..31)
1 1 145 1 1 1 1 1 1 1 1 1 1 1 1 1 1 1 1 1 1 1 1 1 1 1 1 1 1 1 1 1 
##$CPDPRG= <>
##$CPDPRG1= <>
##$CPDPRG2= <>
##$CPDPRG3= <>
##$CPDPRG4= <mlev>
##$CPDPRG5= <mlev>
##$CPDPRG6= <mlev>
##$CPDPRG7= <mlev>
##$CPDPRG8= <mlev>
##$CPDPRGB= <>
##$CPDPRGT= <>
##$D= (0..31)
0 1.2 0 0 0 0 0 0 0 0.06 0 0.03 0 0 0 0 0.0002 0 0 0 0 0 0 0 0 0 0 0 0 
0 0 0 
##$DATE= 1686806234
##$DBL= (0..7)
120 120 120 120 120 120 120 120 
##$DBP= (0..7)
150 150 150 150 150 150 150 150 
##$DBP07= 0
##$DBPNAM0= <>
##$DBPNAM1= <>
##$DBPNAM2= <>
##$DBPNAM3= <>
##$DBPNAM4= <>
##$DBPNAM5= <>
##$DBPNAM6= <>
##$DBPNAM7= <>
##$DBPOAL= (0..7)
0.5 0.5 0.5 0.5 0.5 0.5 0.5 0.5 
##$DBPOFFS= (0..7)
0 0 0 0 0 0 0 0 
##$DE= 6
##$DECBNUC= <off>
##$DECIM= 32
##$DECNUC= <off>
##$DECSTAT= 4
##$DIGMOD= 1
##$DIGTYP= 9
##$DL= (0..7)
0 120 120 120 120 120 120 120 
##$DP= (0..7)
150 150 150 150 150 150 150 150 
##$DP07= 0
##$DPNAME0= <>
##$DPNAME1= <>
##$DPNAME2= <>
##$DPNAME3= <>
##$DPNAME4= <>
##$DPNAME5= <>
##$DPNAME6= <>
##$DPNAME7= <>
##$DPOAL= (0..7)
0.5 0.5 0.5 0.5 0.5 0.5 0.5 0.5 
##$DPOFFS= (0..7)
0 0 0 0 0 0 0 0 
##$DQDMODE= 0
##$DR= 18
##$DS= 0
##$DSLIST= <SSSSSSSSSSSSSSS>
$$ [...]
##$SUBNAM2= <"">
##$SUBNAM3= <"">
##$SUBNAM4= <"">
##$SUBNAM5= <"">
##$SUBNAM6= <"">
##$SUBNAM7= <"">
##$SUBNAM8= <"">
##$SUBNAM9= <"">
##$SW= 18.05172834244
##$SWIBOX= (0..15)
0 0 2 0 0 0 0 0 0 0 0 0 0 0 0 0 
##$SW_h= 3612.71676300578
##$TD= 16384
##$TD0= 1
##$TE= 0
##$TE2= 300
##$TE3= 300
##$TEG= 300
##$TL= (0..7)
0 120 120 120 120 120 120 120 
##$TP= (0..7)
150 150 150 150 150 150 150 150 
##$TP07= 0
##$TPNAME0= <>
##$TPNAME1= <>
##$TPNAME2= <>
##$TPNAME3= <>
##$TPNAME4= <>
##$TPNAME5= <>
##$TPNAME6= <>
##$TPNAME7= <>
##$TPOAL= (0..7)
0.5 0.5 0.5 0.5 0.5 0.5 0.5 0.5 
##$TPOFFS= (0..7)
0 0 0 0 0 0 0 0 
##$TUNHIN= 0
##$TUNHOUT= 0
##$TUNXOUT= 0
##$USERA1= <user>
##$USERA2= <user>
##$USERA3= <user>
##$USERA4= <user>
##$USERA5= <user>
##$V9= 5
##$VALIST= <valist>
##$VCLIST= <CCCCCCCCCCCCCCC>
##$VD= 0
##$VDLIST= <DDDDDDDDDDDDDDD>
##$VPLIST= <PPPPPPPPPPPPPPP>
##$VTLIST= <TTTTTTTTTTTTTTT>
##$WBST= 1024
##$WBSW= 4
##$XGAIN= (0..3)
0 0 0 0 
##$XL= 0
##$YL= 0
##$YMAX_a= 195302
##$YMIN_a= -158772
##$ZGOPTNS= <>
##$ZL1= 120
##$ZL2= 120
##$ZL3= 120
##$ZL4= 120
##$ABSF1= 10
##$ABSF2= 0
##$ABSG= 5
##$ABSL= 3
##$ALPHA= 0
##$AQORDER= 0
##$ASSFAC= 0
##$ASSFACI= 0
##$ASSFACX= 0
##$ASSWID= 0
##$AUNMP= <proc_1d>
##$AZFE= 0.1
##$AZFW= 0.1
##$BCFW= 1
##$BC_mod= 2
##$BYTORDP= 1
##$COROFFS= 0
##$CY= 11.3945322036743
##$DATMOD= 1
##$DC= 2
##$DFILT= <>
##$DTYPP= 0
##$F1P= 15.7292609196834
##$F2P= 12.9074282941183
##$FCOR= 0.5
##$FTSIZE= 0
##$FT_mod= 4
##$GAMMA= 1
##$GB= 0.15
##$INTBC= 1
##$INTSCL= 1
##$ISEN= 128
##$LB= 0.24
##$LEV0= 0
##$LPBIN= 0
##$MAXI= 10000
##$MC2= 0
##$MEAN= 0
##$ME_mod= 0
##$MI= 1.114404
##$NCOEF= 0
##$NC_proc= 0
##$NLEV= 6
##$NOISF1= 3.799351
##$NOISF2= 2.8
##$NSP= 1
##$NTH_PI= 0
##$NZP= 0
##$OFFSET= 15.70392
##$PC= 1
##$PHC0= -20781.71
##$PHC1= 9.652721
##$PH_mod= 1
##$PKNL= yes
##$PPARMOD= 0
##$PSCAL= 0
##$PSIGN= 0
##$REVERSE= no
##$SF= 200.130013532006
##$SI= 16384
##$SIGF1= 3
##$SIGF2= 2
##$SINO= 400
##$SIOLD= 16384
##$SREGLST= <1H.CDCl3>
##$SSB= 0
##$STSI= 0
##$STSR= 0
##$SW_p= 3612.71676300578
##$SYMM= 0
##$S_DEV= 0
##$TDeff= 0
##$TDoff= 0
##$TI= <>
##$TILT= no
##$TM1= 0
##$TM2= 0
##$TOPLEV= 0
##$USERP1= <user>
##$USERP2= <user>
##$USERP3= <user>
##$USERP4= <user>
##$USERP5= <user>
##$WDW= 1
##$XDIM= 8192
##$YMAX_p= 0
##$YMIN_p= 0
$$ End of Bruker specific parameters
$$ ---------------------------------
##NTUPLES= NMR FID
##VAR_NAME=  TIME,          FID/REAL,        FID/IMAG
##SYMBOL=    X,             R,               I
##VAR_TYPE=  INDEPENDENT,   DEPENDENT,       DEPENDENT
##VAR_FORM=  AFFN,          ASDF,            ASDF
##VAR_DIM=   8192,          8192,            8192
##UNITS=     SECONDS,       ARBITRARY UNITS, ARBITRARY UNITS
##FACTOR=    0.0002768,     1,               1
##FIRST=     0,             0,               0
##LAST=      2.2672688,     0,               0
##MIN=       0,             -158772,         0
##MAX=       2.2672688,     195302,          0
$$ Real data points
##PAGE= N=1
##DATA TABLE= (X++(R..R)), XYDATA
$$ plain form
0 0 0 0 0 0 0 0 0 0 0 0 0 0 0 0 0 0 0 -1 8 -8 8 -8 8 -16 16 -16 24 -24 32 -32 40 -46 52 -60 68 -76 84 -96 108
39 108 -120 134 -148 166 -186 204 -227 251 -276 304 -336 369 -407 448 -494 545 -600 665 -735
58 -735 816 -910 1017 -1143 1296 -1480 1708 -1991 2345 -2729 2714 2272 195302 64519 -74250
73 -74250 64588 -51485 -136259 73697 107058 -26409 22236 -30520 -140648 19613 126934
84 126934 -13105 -18228 42746 -37796 -35297 47085 -2440 -37510 2577 -10069 -688 55968
96 55968 20636 -46801 -34093 20566 50770 14558 -40018 -26272 -22428 -39087 46787 105052
108 105052 284 -65571 -36749 -36528 21963 92838 -288 -66901 -130 -23139 -40080 89837
120 89837 81187 -68705 -52601 9593 -19583 29981 63056 -38256 -43294 31021 -12870 -16554
$$ packed form
0@%%%%%%%%%%%%%%%%%jRj6J6j6J6k4L2l2M0m8N6o4P2q6R8j12J28j44J60j80K04
39A08k28K54k82L14l52L90m31M78n27N80o40P05p76Q55r42J039j145J265j400
58g35J551j726J927k160K439k776L188l699M336n074N443m42J93030j30783j38769
73g4250J38838j16073q4774K09956L3361j33467M8645n2756j10128J60261J07321
84A26934j40039n123O0974q0542K499Q2382m9525l5070M0087j2646R381N6656
96E5968l5332o7437J2708N4659L0204l6212n4576J3746L844j6659Q5874N8265
108A05052j04768o5855K8822K21N8491P0875r3126o6613O6771k3009j6941J29917
120H9837q650j49892J6104O2194k9176M9564L3075j01312n038P4315m3891l684
$$ plain form
132 -16554 65968 9594 -74652 -4076 44027 1694 539 -5347 -38986 -2360 34842 3574
144 3574 2427 15623 -33271 -41833 33652 52089 -9797 -35007 -14314 -4250 9452 31406 19758
157 19758 -12395 -22623 -18666 -2563 33067 30426 -26184 -39278 7062 20373 4810 12330 5369
170 5369 -24042 -21242 3697 16749 18697 -3410 -31259 -11095 25455 15875 -6974 -3346 -2407
183 -2407 -13808 -6676 17103 21023 -4039 -21975 -8341 13100 16324 2188 -12708 -7261 6115
196 6115 -2479 -5326 17931 10605 -25843 -15246 19117 12212 -5120 -6382 -8556 1056 9754 -5815
210 -5815 -2035 16200 -8647 -25941 11929 25077 -6130 -11460 -216 -1001 4759 3567 -5056 7145
224 7145 6427 -18189 -6262 21504 5758 -13088 -2472 2093 285 1341 -5440 42 12128 -4697
$$ packed form
132a6554Q2522n6374q4246P0576M8103m2333j155n886l3639L6626L7202l1268
144C574j147J3196m8894q562P5485J8437o1886k5210K0693J0064J3702K1954j1648
157A9758l2153j0228L957J6103L5630k641n6610j3094M6340J3311j5563P520o961
170E369k9411K800K4939J3052J948k2107k7849K0164L6550r580k2849L628R39
183b407j1401P132K3779L920k5062j7936J3634K1441L224j4136j4896N447J3376
196F115q594k847K3257p326l6448J0597L4363o905j7332j262k174R612Q698j5569
210e815L780J8235k4847j7294L7870J3148l1207n330J1244p85N760j192q623J2201
224G145p18k4616J1927K7766j5746j8846J0616M565j808J056o781N482J2086j6825
$$ plain form
238 -4697 -16293 6212 11804 -7258 -6091 4569 2912 -645 -6384 -4494 12179 8593 -13660 -6733
252 -6733 11663 2132 -7452 2615 7019 227 -6771 -6212 7808 12493 -7724 -14553 5349 10146
266 10146 -3857 -4401 3282 660 -6006 -5670 5594 12571 -3267 -18246 -2869 14757 6112 -5288
280 -5288 -2423 14 -3647 -3934 5038 13934 2937 -17471 -11492 12748 14281 -2411 -6595 -1767
294 -1767 -2626 -3399 3255 10692 4795 -12974 -15636 5773 17517 2206 -11307 -6367 371 776 3589
309 3589 7541 2757 -9774 -13340 2166 17931 10110 -10020 -14252 -1195 8331 7239 3973 626
323 626 -7079 -12536 -2487 15790 15777 -6603 -20147 -6682 11326 10392 499 -2612 -4781 -10562 -5867
338 -5867 11994 17710 -2098 -21047 -11008 12616 15685 386 -6340 -3571 -6366 -5453 10120 18465
$$ packed form
238d697j1596K2505N592j9062J167J0660j657l557n739J890J6673l586k2253O927
252f733J8396r531r584J0067M404o792o998N59J4020M685k0217o829J9902M797
266A0146j4003n44P683k622o666L36J1264O977j5838j4979J5377J7626q645j1400
280e288K865K437l661k87Q972Q896j0997k0408N979K4240J533j6692m184M828
294a767q59p73O654P437n897j7769k662K1409J1744j5311j3513M940O738M05K813
309C589L952m784j2531l566J5506J5765p821k0130m232J3057R526j092l266l347
323F26p705n457J0049J8277j3k2380j3544J3465J8008r34r893l111k169n781M695
338e867J7861N716j9808j8949J0039K3624L069j5299o726K769k795R13J5573Q345
$$ plain form
352 18465 853 -19554 -13129 9995 17945 4137 -8812 -8511 -4766 -1857 6962 13463 2952 -15667
366 -15667 -15757 5235 18729 7460 -10017 -12656 -4796 3005 8492 8675 1337 -8983 -13546 -1323
380 -1323 18912 15694 -10117 -18551 -2968 7086 7504 7837 1711 -8660 -10654 -3148 11373 17939
394 17939 -2582 -23699 -8916 13211 8153 -141 2310 -4351 -12058 -2281 11125 11808 -331 -16826
408 -16826 -14121 10479 18363 245 -7753 -1610 -4736 -5475 10187 16147 -1849 -17129 -11309 5148
422 5148 15935 9930 -7078 -12139 -2242 974 393 10554 9187 -14183 -18869 5207 15113 4201
436 4201 -2518 -6434 -7439 3212 6786 -920 2434 1890 -13487 -5193 19857 9838 -13987 -7680
450 -7680 2868 1139 7415 6998 -7988 -7975 -611 -3731 7000 19606 -3461 -24684 -5148 11843
$$ packed form
352A8465j7612k0407O425K3124P950j3808j2949L01L745K909Q819O501j0511j8619
366a5667r0K0992J3494j1269j7477k639P860P801N487J83p338j0320m563J2223
380a323K0235l218k5811q434J5583J0054M18L33o126j0371j994P506J4521O566
394A7939k0521k1117J4783K2127n058q294K451o661p707R777J3406O83j2139j6495
408a6826K705K4600P884j8118p998O143l126p39J5662N960j7996j5280N820J6457
422E148J0787o005j7008n061R897L216n81J0161j367k3370m686K4076R906j0912
436D201o719l916j005J0651L574p706L354n44j5377Q294K5050j0019k3825O307
450g680J0548j729O276m17j4986J3P364l120J0731J2606k3067k1223J9536J6991
$$ plain form
464 11843 4456 3549 3634 -9158 -11046 -13 4876 10190 10070 -9651 -18033 3480 13278 -1603 -3062
479 -3062 6900 -1004 -10028 776 8940 1823 -3545 -2688 -93 5425 2712 -10188 -6534 10447 5682
494 5682 -6860 2581 4624 -13485 -8994 12908 10544 -1169 -3465 -11161 -8807 11323 10651 -2815
508 -2815 3947 715 -18937 -5915 19173 9064 -4266 -1097 -7065 -7155 7362 4575 -1589 8274
522 8274 187 -16770 -2320 12149 -741 -4567 4963 1710 -4179 -4123 -4051 3329 8540 -886 -4458
537 -4458 2379 -1798 -8090 299 9892 8333 -1995 -10427 -4168 4725 1175 1552 8474 1073 -10111
552 -10111 -6978 434 7573 9234 -3463 -8258 2859 -1291 -9661 5909 12570 -3971 -6908 -472
566 -472 -2741 1756 4664 -3318 2421 7825 -9191 -9976 9694 5664 -5051 3299 2818 -5134 -906
$$ packed form
464A1843p387r07Q5j2792j888J1033M889N314j20j9721q382K1513R798j4881j459
479c062R962p904r024J0804Q164p117n368Q57K595N518k713j2900L654J6981m765
494E682j2542R441K043j8109M491K1902k364j1713k296p696K354K0130o72j3466
508b815O762l232j9652J3022K5088j0109j3330L169n968r0J4517k787o164R863
522H274q087j6957J4450J4469j2890l826R530l253n889N6P2P380N211r426l572
537d458O837m177o292Q389R593j559j0328q432O259Q893l550L77O922p401j1184
552a0111L133P412P139J661j2697m795J1117m150q370J5570O661j6541k937O436
566d72k269M497K908p982N739N404j7016p85J9670m030j0715Q350m81p952M228
$$ plain form
581 -906 -1043 -1316 9489 3290 -11279 -1231 6460 -4372 -1837 6065 -272 -1990 -705 -5640 1842
596 1842 8002 -5299 -5548 8048 988 -7727 1428 3074 -789 2753 -1478 -3653 6275 983 -9868
611 -9868 3720 10972 -5265 -6880 4852 1852 -2728 372 -414 938 2645 -4683 -3905 6950 2232
626 2232 -8763 -1804 7150 1470 -4787 -1715 2128 50 -2790 1083 5337 798 -5132 -3520 1426
641 1426 5413 3644 -3495 -3177 2817 -1598 -4573 6097 7071 -5600 -5568 1777 -167 925 3638 -3430
657 -3430 -2866 5179 -2325 -7755 6017 6558 -8292 -2467 8663 -1227 -6549 1576 887 581 5902
672 5902 -2011 -6948 4656 2420 -8341 4873 12622 -6867 -11043 4300 3084 -1555 4681 508
686 508 -5631 700 -1276 -4927 7617 7399 -9869 -6377 6873 629 -4136 3223 2159 -2300 -387
$$ packed form
581i06j37k73J0805o199j4569J0048P691j0832K535P902o337j718J285m935P482
596A842O160j3301k49J3596p060q715R155J646l863L542m231k175R928n292j0851
611i868J3588P252j6237j615J1732l000m580L100p86J352J707p328P78J0855m718
626B232j0995O959Q954n680o257L072L843k078k840L873M254m539n930J612M946
641A426L987j769p139L18N994m415k975J0670R74j2671L2P345j944J092K713p068
657c430N64Q045p504n430J3772N41j4850N825J1130r890n322Q125o89l06N321
672E902p913m937J1604k236j0761J3214P749j9489m176J5343j216m639O236m173
686E08o139O331j976l651J2544k18j7268L492J3250o244m765P359j064m459J913
$$ plain form
701 -387 -1027 -479 4046 46 -4754 2089 5730 -1688 -5125 13 3806 1553 -1632 491 1676 -3580
717 -3580 -4193 2894 4642 846 -2255 -5417 -1884 5650 1173 -3874 3708 1895 -8807 -1657 8317
732 8317 1052 -2555 351 -3120 126 5973 -2348 -3510 6785 -54 -8546 3878 7317 -4908
746 -4908 -3594 2885 38 1329 1385 -5016 -432 4997 -3581 -3538 6538 973 -7751 -855 4680 1528
762 1528 -380 -2174 -1655 2756 451 -3068 2712 3947 -3820 -3572 3380 3553 -188 -2370 -1514 2451
778 2451 1828 -2738 -525 3018 -1411 -3518 1362 2950 390 -2126 -3355 437 4135 -581 -3461
793 -3461 1562 1446 -3303 -785 3633 1961 -1227 -2800 -1084 3613 2466 -3152 -1019 3447 -607
808 -607 -3303 1669 3638 -471 -3072 -1320 2288 2294 -2403 -2954 2120 1947 -2832 -1437 2625 1026 -2695
$$ packed form
701c87o40N48M525m000m800O843L641p418l437N138L793k253l185K123J185n256
717c580o13P087J748l796l101l162L533P534m477n047P582j813j0702P150R974
732H317p265l607K906l471L246N847q321j162J0295o839q492J2424L439j2225
746d908J314O479k847J291N6o401M584N429q578M3J0076n565q724O896N535l152
762A528j908j794N19M411k305l519N780J235p767K48O952J73l741k182Q56L965
778B451o23m566K213L543m429k107M880J588k560k516j229L792L698m716k880
793c461N023j16m749K518M418j672l188j573J716M697j147n618K133M466m054
808f07k696M972J969m109k601J752L608Om697n51N074j73m779J395M062j599l721
$$ plain form
825 -2695 -1845 1953 2747 -1097 -3310 583 3250 -140 -2346 948 2590 -840 -2397 1083 3250 -175
841 -175 -3400 -703 2850 1262 -2100 -1407 1587 879 -2236 -1131 2631 1067 -3323 -2114 2099 2035
857 2035 -1002 -1791 344 1691 -488 -1788 1334 2631 -1121 -2545 803 2455 548 -1466 -815 1829
873 1829 1409 -2172 -1186 2500 746 -2680 -835 1822 855 -1564 -2342 684 2923 -1153 -3473 1359
889 1359 2469 -2334 -1954 2238 1846 -1075 -2227 -232 3114 1237 -3233 -149 3889 -660 -3373 1397
905 1397 2766 -634 -1656 -411 1349 1110 -2201 -1836 2781 1412 -2994 -1041 1459 -279 -983 -121
921 -121 388 1478 -511 -3202 418 3441 -165 -1879 850 832 -848 -769 259 2119 1799 -2152 -2302
938 -2302 2088 1537 -1947 -397 2322 537 -2625 -2106 1318 2343 -656 -1808 872 941 -2238 -2291 1594
$$ packed form
825b695Q50L798P94l844k213L893K667l390k206L294J642l430j557L480K167l425
841a75l225K697L553j588l362O93K994p08l115J105L762j564m390J209M213o4
857B035l037p89K135J347k179j300L122J297l752j424L348J652j907k014O51K644
873A829m20l581R86L686j754l426J845K657r67k419p78L026K239m076k320M832
889A359J110m803L80M192l92k921j152J995L346j877m470L084M038m549k713M770
905A397J369l400j022J245J760k39l311L65M617j369m406J953K500j738p04Q62
921a21N09J090j989k691L620L023l606j714K729j8j680P9J028J860l20l951j50
938b302M390n51l484J550K719j785l162N19L424J025k999j152K680O9l179n3L885
$$ plain form
955 1594 3584 -48 -3675 -472 2514 -1080 -1608 3444 2488 -2506 -2178 -120 1030 2607 406 -2243
971 -2243 1228 1176 -4180 -968 4978 840 -3170 -83 230 -1490 102 277 220 2359 -214 -4505 -842
988 -842 3388 129 -1291 2474 1561 -3405 -2676 1787 2719 1515 427 -1931 -1928 1057 228 -841 3793
1005 3793 3035 -5432 -3920 3894 1095 -2230 2453 887 -3484 13 234 -2415 3321 3259 -5453 -1429
1021 -1429 5425 -2367 -4586 4623 2845 -3133 759 819 -2652 1350 2022 -2256 1975 3802 -4720 -4361
1037 -4361 4894 2818 -3366 591 2476 -2994 -2757 2203 1394 -416 535 -1771 -2776 2734 2717 -3792
1053 -3792 -732 4349 -2047 -3756 4637 2116 -4865 348 2607 -2073 2215 3484 -5314 -1889 5846
1068 5846 -1925 -3639 6411 1119 -8007 581 4593 -2217 543 2749 -4062 -1477 3643 -2564 -2117
$$ packed form
955A594J990l632l627L203K986l594n28N052r56m994L28K058J150J577k201k649
971b243L471n2n356L212N946m138m010L087L13j720J592J75n7K139k573m291L663
988h42M230l259j420L765r13m966P29M463R32j204j088k358LK985q29j069M634
1005C793p58q467J512P814k799l325M683j566m371L497K21k649N736o2q712M024
1021a429O854p792k219R209j778n978L892O0l471M002O72m278M231J827q522L59
1037d361R255k076o184L957J885n470K37M960q09j810R51k306j005N510j7o509
1053c792L060N081o396j709Q393k521o981N213K259m680M288J269q798L425P735
1068E846p771j714J0050n292r126Q588M012o810K760K206o811K585N120o207M47
$$ plain form
1083 -2117 5669 23 -6161 1909 4058 -3411 -1631 3701 508 -1063 1089 -1369 -2173 2220 1607
1098 1607 -1580 2129 2598 -5081 -4215 4859 3636 -2621 280 895 -4581 -1864 3774 1190 513 1740
1114 1740 -4625 -4609 4837 2816 -3730 2202 3321 -5597 -2680 4816 659 -973 2800 -1336 -2833
1129 -2833 2877 -116 -3580 3651 3963 -4267 -1684 3039 -2025 -2210 3372 1508 -1337 83 -2512
1144 -2512 -3290 3187 3576 -2096 -666 1505 -3194 -3093 3593 4028 -748 -1732 -1110 -1239 829 2103 441
1161 441 356 886 -2267 -2768 2647 3440 -1802 -1678 1810 -370 -2571 320 1523 97 166 -777 -1589 1023
1179 1023 684 -2517 447 3811 -985 -3703 906 1612 -1136 651 1889 -456 -795 -532 -1153 1599
1195 1599 2943 -1180 -2159 1059 268 -1473 893 1769 -444 -1122 -1028 -616 1272 1009 -1425 -654 1164
$$ packed form
1083b117P786n646o184Q070K149p469J780N332l193j571K152k458q04M393o13
1098A607l187L709M69p679Q66R074j223o257K901O15n476K717N638k584o77J227
1114A740o365J6R446k021o546N932J119q918K917P496m157j632L773m136j497
1129b833N710k993l464P231L12q230K583M723n064j85N582j864k845J420k595
1144b512p78O477L89n672J430K171m699J01O686M35m776r84O22j29K068J274j662
1161D41q5N30l153n01N415P93n242J24L488k180k201K891J203j426O9r43q12K612
1179A023l39l201K964L364m796k718M609P06k748J787J238k345l39K63o21K752
1195A599J344m123r79L218p91j741K366Q76k213o78R4M12J888k63k434P71J818
$$ plain form
1212 1164 -375 -1596 321 1572 141 -1356 -453 1356 623 -1306 -328 1647 768 -1060 -737 812
1228 812 973 -672 -1100 1150 1399 -1670 -1693 1437 1107 -1166 -707 503 196 -448 -1023 -10 1521 38
1246 38 -1888 -47 1591 -334 -1122 562 923 89 -615 -391 948 1124 -925 -770 1340 555 -1102
1263 -1102 -333 805 490 -426 -1009 -23 1170 -284 -1644 306 1149 -879 -1104 535 672 -245 -908
1280 -908 -490 1040 874 -1155 -663 1409 436 -1225 182 1358 304 -863 -665 756 1320 -370 -1320
1297 -1320 503 1016 -836 -878 873 737 -945 -1278 248 1263 -83 -1560 -357 1101 -56 -970
1313 -970 364 1046 -322 -1257 83 1512 813 -1032 -785 847 655 -590 -91 927 106 -1057 -575
1330 -575 811 1046 -448 -1235 -32 782 -199 -767 112 498 -476 -837 312 1062 -35 -1282 -482 1104
$$ packed form
1212A164j539j221J917J251j431j497R03J809p33j929R78J975q79j828L23J549
1228H12J61j645m28K250K49l069k3L130l30k273M59J210l07o44n75J013J531j483
1246C8j926J841J638j925p88J684L61q34p04K24J339J76k049J55K110p85j657
1263a102P69J138l15r16n83R86J193j454j360J950Q43k028k25J639J37r17o63
1280i08M18J530j66k029M92K072r73j661J407J176j054j167J98J421N64j690r50
1297a320J823N13j852m2J751j36j682l33J526J015j346j477J203J458j157r14
1313i70J334O82j368r35J340J429o99j845K47J632j92j245M99J018q21j163M82
1330e75J386K35j494p87J203Q14r81n68Q79L86r74l61J149P50j097j247Q00J586
$$ plain form
1348 1104 999 -489 -685 611 376 -730 22 1505 641 -1235 -1063 560 1268 156 -989 -131 591
1365 591 -669 -1073 987 1214 -1047 -1481 175 864 164 -607 -517 507 406 -841 -95 1422 -4 -1471
1383 -1471 19 1547 620 -598 -752 37 712 206 -172 544 299 -1303 -1128 1034 1621 -178 -1528
1400 -1528 -625 426 -81 -281 853 413 -1034 -1110 -115 1047 1197 -581 -1315 675 894 -1018 22
1417 22 1636 -150 -1060 410 560 99 292 -752 -486 1529 461 -1873 -143 1161 -880 -767 1376
1434 1376 520 -1265 -1034 -252 640 1343 -172 -1573 -12 632 -870 132 2343 441 -2497 -745
1450 -745 1670 753 -12 504 -450 -723 300 -72 164 1758 -308 -2656 402 2187 -1150 -1155 1344 -384
1468 -384 -1415 887 421 -790 689 -326 -1463 1441 1686 -1857 -957 1528 -51 -558 1210 392
$$ packed form
1348A104j05j488j96J296k35j106P52J483q64j876J72J623P08j112j145Q58P22
1365E91j260m04K060K27k261m34J656O89p00p71R0J024j01j247P46J517j426j467
1383a471J490J528r27j218j54P89O75n06l78P16k45j602J75K162N87j799j350
1400a528R03J051n07k00J134m40j447p6R95J162J50j778p34J990K19j912J040
1417B2J614j786r10J470J50m61J93j044K66K015j068k334J730J304k041J13K143
1434A376q56j785K31P82Q92P03j515j401J561O44j502J002K211j902k938J752
1450g45K415r17p65N16r54k73J023l72K36J594k066k348L058J785l337nK499j728
1468c84j031K302m66j211J479j015j137K904K45l543R00K485j579n07J768q18
$$ plain form
1484 392 -862 -147 -131 68 1495 385 -1797 -641 1296 221 -1063 362 972 -1180 -1368 1082 1056
1501 1056 -928 -659 -83 -302 983 546 -1572 111 1550 -1456 -650 3142 168 -2988 491 1430
1517 1430 -601 1074 976 -1954 -103 1112 -1522 548 2901 -1541 -2838 1221 654 -1109 947 472
1533 472 -1356 50 -37 -1212 1015 1442 -1372 -688 1231 -160 -1080 154 927 821 59 -611 -142 43
1551 43 -517 355 1169 627 -369 -1572 -1216 1378 1445 -736 93 583 -2019 -1560 1455 1292 207 102 -1504
1570 -1504 -1234 1110 191 -507 1942 793 -2515 -880 1177 223 480 1032 -221 -296 -361 -1488 391
1587 391 2398 265 -1140 -105 -580 -1045 189 997 1097 329 -1873 -1652 781 737 -81 1003 462 -1331
1605 -1331 -1010 -238 460 1716 580 -1283 -139 494 -1177 -129 1962 794 -645 -497 -729 -446 719
$$ packed form
1484C92j254P15J6J99J427j110k182J156J937j075j284J425O10k152j88K450k6
1501A056j984K69N76k19J285m37k118J683J439l006Q06L792k974l156L479R39
1517A430k031J675r8k930J851J215k634K070K353m442j297M059n67j763K056m75
1533D72j828J406q7j175K227M27k814O84J919j391r20J234P73j06p62o70M69J85
1551D3n60Q72Q14n42r96j203L56K594O7k181Q29M90k602M59L015j63j085j05j606
1570a504K70K344r19o98K449j149l308J635K057r54K57N52j253p5o5j127J879
1587C91K007k133j405J035m75m65J234Q08J00p68k202K21K433m4q18J084n41j793
1605a331L21P72O98J256j136j863J144O33j671J048K091j168j439J48k32K83J165
$$ plain form
1622 719 445 268 852 -432 -2157 -758 1451 1105 -174 -352 -228 -1055 -1005 807 1732 543 -693 -1128
1640 -1128 -544 814 921 -183 304 891 -1158 -1384 1489 1186 -1091 -95 753 -493 -234 140 -868
1657 -868 200 1318 -647 -919 1022 -470 -2025 803 2030 -441 -847 -228 -843 155 1567 249
1673 249 -416 432 -920 -1429 1563 2279 -784 -1251 400 -58 -283 1084 615 -847 -406 -236 -425 1092
1691 1092 1029 -1617 -1263 1195 508 -841 365 191 -1330 -292 1072 426 169 -246 -1511 -214 2036
1708 2036 722 -1118 -81 267 -935 154 1804 436 -1211 -852 -163 569 1211 -152 -1470 -208
1724 -208 541 -558 253 1483 -701 -2166 223 1582 230 -265 -350 -958 163 1225 209 53 398
1741 398 -1244 -1190 1788 1776 -746 -1070 -245 -443 600 1301 -124 -719 -385 -967 -17 1855 540 -1779
$$ packed form
1622G19k74j77N84j284j725J399K209l46j279j78J24q27N0J812R25j189j236m35
1640a128N84J358J07j104M87N87k049k26K873l03k277R96Q48j246K59L74j008
1657h68J068J118j965k72J941j492j555K828J227k471m06O19o15R98J412j318
1673B49o65Q48j352n09K992P16l063m67J651m58k25J367m69j462M41J70j89J517
1691A092o3k646L54K458o87j349J206j74j521J038J364o46k57m15j265J297K250
1708B036j314j840J037L48j202J089J650j368j647L59O89P32O42j363j318J262
1724b08P49j099Q11J230k184j465K389J359j352m95q5o08J121J062j016j56L45
1741C98j642N4K978j2k522l24Q25j98J043P01j425n95L34n82R50J872j315k319
$$ plain form
1759 -1779 -1130 290 564 559 285 -550 -633 -392 124 1154 938 -871 -1485 163 1437 801 -323 -385 -115
1778 -115 -449 -18 1203 842 -1038 -1407 -247 936 1040 -148 -1132 -439 101 -303 414 1090 -599 -1765
1796 -1765 -200 1079 863 202 -783 -914 223 645 241 615 213 -1293 -726 1055 1219 131 -721 -923
1814 -923 44 799 270 -24 17 -765 -1013 396 1306 261 -968 -1065 -112 804 494 -209 -140 -331 -748 92
1834 92 1178 714 -593 -988 -110 945 743 -247 -289 -16 -463 -133 758 750 -395 -1056 -412 733 804 -299
1854 -299 -785 -131 -80 -233 340 749 -128 -923 -571 609 994 4 -752 -246 314 92 80 545 218 -620
1874 -620 -548 362 914 202 -689 -484 161 243 2 -10 98 -236 -669 -126 703 374 -615 -654 151 380 118
1895 118 -101 44 83 -203 -312 423 809 -139 -742 77 699 153 -273 -3 270 -63 -328 0 522 175
$$ packed form
1759a779O49J420K74nk74q35q3K41N16J030k16j809o14J648J274o36j124o2K70
1778a15l34M31J221l61j880l69J160J183J04j188r84O93N40m04P17O76j689j166
1796a765J565J279k16o61r85j31J137M22m04L74m02j506N67J781J64j088q52k02
1814i23R67P55n29k94M1p82k48J409R10j045j229r7R53R16l10p03O9j91m17Q40
1834I2J086m64j307l95Q78J055k02r90m2K73m47L30Q91qj145o61O44J145P1j103
1854b99m86O54N1j53N73M09q77p95L52J180L85r90p56N06N60k22j2M65l27q38
1874f20P2R10N52p12q91K05O45Q2k41j2J08l34m33N43Q29l29r89l9Q05K29k62
1895A18k19J45L9k86j09P35L86r48o03Q19O22n46m26K70K73l33k65L28N22l47
$$ plain form
1915 175 -748 -320 469 196 -495 -391 246 225 -312 -312 288 332 -422 -358 319 414 -182 -300 77 505 83 -344
1937 -344 98 632 115 -517 49 435 -93 -284 101 326 8 -473 -416 290 535 -296 -564 62 175 -425
1957 -425 -205 578 346 -516 -439 244 495 113 -252 -49 288 93 -201 0 479 68 -613 3 798 19
1977 19 -726 -214 280 194 161 25 -344 -199 -259 -336 594 1014 -632 -1331 159 656 -28 381 528 -505 -627
1998 -627 22 197 782 763 -779 -935 742 496 -692 386 773 -667 -642 584 112 -342 45 -256 -77
2017 -77 748 -93 -1267 -117 757 -166 23 880 -343 -1335 -120 838 688 719 -62 -1360 -511 929 385
2036 385 247 990 -291 -1971 -203 1503 326 -185 222 -839 -903 616 184 -327 868 -57 -1603
2053 -1603 320 1341 -1019 -894 1302 293 -693 545 -125 -1091 533 876 -208 723 474 -1894 -919
$$ packed form
1915A75r23M28P89k73o91J04O37k1n37%O00M4p54O4O77R5n96j18L77M28m22m27
1937c44M42N34n17o32N66L86n28j91L85K25l18m81N7P06K45q31k68O26J13o00
1957d25K20P83k32q62P7O83K51l82l65K03L37j95k94K01M79m11o81O16P95p79
1977A9p45N12M94q6l3j36l69J45o0p7R30M20j646o99J490M97o84M09J47j033j22
1998f27O49J75N85j9j542j56J677k46j188J078L87j440K5J226m72m54L87l01J79
2017g7Q25q41j174J150Q74r23J89Q57j223r92J215R58j50L1p81j298Q49J440n44
2036C85j38P43j281j680J768J706j177n11M07j061o4J519m32n11J195r25j546
2053a603J923J021k360J25K196j009r86J238o70r66J624L43j084R31k49k368R75
$$ plain form
2070 -919 1935 883 -595 453 -322 -1739 57 1412 351 77 -116 -1644 -849 1544 785 -858
2086 -858 241 272 -1425 -358 1488 164 -652 345 -67 -503 845 228 -1133 426 1284 -750 -540
2103 -540 1160 -425 -1387 961 1260 -546 -192 -185 -1212 272 1492 -416 -540 624 -911 -1481 1470
2120 1470 1548 -985 -608 337 -685 -98 1200 23 -536 514 -261 -869 1153 951 -1289 -423 1216
2137 1216 -119 -770 557 -7 -856 359 552 -431 227 -19 -1377 -79 1537 5 -984 330 -9
2154 -9 -988 388 1158 -176 -305 -30 -622 125 1205 -64 -749 455 271 -888 160 939 -274 -634
2172 -634 247 75 -191 157 -199 -486 499 394 -768 -212 577 -430 -594 856 705 -757 -452 87 -45
2191 -45 414 550 -226 -228 278 -502 -290 1168 537 -859 -188 425 -221 -40 491 -2 -197 15 -452 -182
$$ packed form
2070i19K854j052j478J048p75j417J796J355j061k74j93j528P95K393p59j643
2086h58J099L1j697J067J846j324q16R97m12m36J348o17j361J559Q58k034K10
2103e40J700j585r62K348K99j806L54Pj027J484J220j908j24J164j535n70K951
2120A470P8k533L77R45j022N87J298j177n59J050p75o08K022k02k240Q66J639
2137A216j335o51J327n64q49J215J93r83O58k46j358J298J616j532r89J314l39
2154ir79J376P70j334j29K75n92P47J080j269o85J204j84j159J048P79j213l60
2172f34Q81j72k66L48l56k87R85j05j162N56P89j007j64J450j51j462L05N39j32
2191d5M59J36p76kN06p80K12J458o31j396O71O13o46J81N31m93j95K12m67K70
$$ plain form
2211 -182 578 -7 -603 152 359 -452 -339 285 206 21 -36 -31 66 17 -197 -17 520 380 -325 -410 186 309
2233 309 -175 57 428 -29 -514 -164 207 201 21 -270 -216 152 -61 -420 119 479 -199 -382 123 247 -50
2254 -50 -24 22 180 168 -278 -226 446 373 -208 -99 183 25 -218 -180 242 332 -188 -415 161 296 -237 -276 98
2277 98 168 -65 -290 -85 328 18 -360 -19 490 -31 -326 2 169 10 -26 20 147 125 -232 -189 376 304
2299 304 -177 -243 34 68 -30 -143 -64 204 -182 -398 116 338 -132 -386 -79 180 213 -100 -207 186 141 -380
2321 -380 -46 635 220 -419 -122 206 248 156 -165 4 133 -210 -249 382 309 -421 -480 53 200 15 -171 -194
2343 -194 38 -90 -265 73 382 -176 -486 -14 344 184 -45 -192 -44 142 17 61 223 138 -339 -173 305
2364 305 436 39 -433 -179 132 -12 -76 185 62 -403 -366 70 393 198 -439 -403 71 235 -47 26 225
$$ packed form
2211a82P60n85n96P55K07q11J13O24p9j85n7NR7m9k14J80N37j40p05q5N96J23
2233C09m84K32L71m57m85L50L71oj80k91N4L68k13l59N39L60o78j83N05J24k97
2254e0K6M6J58j2m46N2O72p3n81J09K82j58k43L8M22R0n20k27N76J35n33l9L74
2277I8P0k33k25K05M13l10l78L41N09n21k95L28J67j59l6M6J27k2l57M3N65p2
2299C04m81o6K77L4r8j13P9K68l86k16N14K22m70k54L07K59L3l13j07L93m5n21
2321c80L34O81m15o39K97L28M2r2l21J69J29l43l9O31p3p30n9N33J47j85j86k3
2343a94K32j28j75L38L09n58l10M72L58j60k29j47J48J86j25M4J62q5m77J66M78
2364C05J31l97m72K54L11j44o4K61j23m65L7M36L23j95o37L6M74J64k82P3J99
$$ plain form
2385 225 -134 -384 55 482 270 -164 -382 -87 343 210 -69 53 4 -304 -166 382 331 -245 -463 -144 239
2406 239 215 -25 -175 -119 -23 -90 80 475 111 -613 -227 537 297 -68 23 -161 -165 186 232 179 160 -318 -650
2429 -650 227 758 -31 -424 -122 -220 -175 321 336 -165 -284 -389 -298 548 561 -384 -544 104 45 -23 386 291 -298
2452 -298 -322 48 286 455 193 -453 -301 433 283 -232 119 260 -510 -286 566 340 -409 -334 -164 -78 478
2473 478 204 -546 -238 131 -314 99 886 -92 -929 -269 382 233 459 268 -552 -345 291 60 260 711
2493 711 -321 -1056 33 719 14 -10 167 -396 -381 230 110 -92 205 -246 -536 389 630 -469 -382 486
2513 486 94 -177 408 87 -593 -167 235 199 477 278 -888 -572 587 354 -42 401 -54 -928 -315 520
2533 520 363 191 -8 -677 -433 448 240 -194 261 -6 -608 -152 566 156 -202 -21 103 68 187 -9
$$ packed form
2385B25l59k50M39M27k12m34k18K95M30j33k79J22m9l08J38N48n1n76k18L19L83
2406B39k4k40j50N6R6o7J70L95l64p24L86P64k40l65R1j84mL51M6n3j9m78l32
2429f50Q77N31p89l93L02r8M5M96J5n01j19j05R1Q46J3r45j60O48n9o8M09r5n89
2452b98k4L70K38J69k62o46J52P34j50n15L51J41p70K24Q52k26p49P5J70Q6N56
2473D78k74p50L08L69m45M13P87r78q37O60O51j49K26j91q20K07O36k31K00M51
2493G11j032p35J089O86p05k4J77n63J5O11j20k02K97m51k90R25K41j099Q7Q68
2513D86l92k71N85l21o80M26M02l6K78j99j166L16J159k33l96M43m55q74O13Q35
2533E20j57j72j99o69K44Q81k08m34M55k67o02M56P18m10l58J81J24l5J19j96
$$ plain form
2553 -9 -201 103 301 -64 36 314 -307 -710 155 680 -24 -260 -87 -477 -324 344 244 26 78 -428 -703
2574 -703 324 706 -48 -147 73 -343 -312 290 323 16 173 -116 -216 279 237 -234 -8 335 19 -264 -83
2595 -83 29 -119 -146 136 273 12 -411 -407 7 224 179 -30 -127 -74 -241 -260 408 584 -161 -301 14 -90 -93
2618 -93 360 315 -20 -5 -248 -369 263 429 -142 -84 200 -282 -435 177 320 -35 64 -64 -266 24 62 -192
2640 -192 65 367 -62 -386 69 170 -161 -93 358 196 -187 -220 -118 16 279 278 -122 -35 -89 -450 -93 732
2662 732 430 -448 -348 -71 -265 177 525 52 -241 -148 -354 -82 672 320 -516 -61 252 -292 -32 562
2682 562 14 -302 108 108 -23 216 -110 -491 229 535 -223 -265 117 -264 -323 451 504 -271 -413 -282 -151 409
2704 409 651 -158 -460 -94 -112 -56 719 568 -394 -621 27 288 343 387 -186 -478 -26 243 48 297 127
$$ packed form
2553ij92L04J98l65J00K78o21m03Q65N25p04k36J73l90J53O68j00k18N2n06k75
2574g03J027L82p54r9K20m16L1O02L3l07J57k89j00M95m2m71K26L43l16k83J81
2595h3J12j48k7K82J37k61m23MM14K17m5k09r7N3j67j9O68J76p45j40L15j04l
2618i3M53m5l35J5k43j21O32J66n71N8K84m82j53O12J43l55R9j28k02K90L8k54
2640a92K57L02m29l24M55J01l31O8M51j62l83l3J02J34K63jm00Q7n4l61L57Q25
2662G32l02q78J00K77j94M42L48m73k93R3k06K72P54l52q36M55L13n44K60N94
2682E62n48l16M10%j31K39l26l81P20L06p58m2L82l81n9P74N3p75j42J31J31N60
2704D09K42q09l02L66j8N6P75j51r62k27O48K61N5M4n73k92M52K69j95K49j70
$$ plain form
2725 127 -637 -420 493 294 -225 -183 -251 -302 271 442 -56 -283 -233 -342 146 787 119 -724 -351 120 140 458
2747 458 436 -361 -575 -26 267 497 459 -282 -742 -76 459 208 157 -25 -531 -456 390 545 159 -194 -487
2768 -487 -359 344 555 0 -312 -166 -261 61 608 418 -354 -526 -168 303 528 274 -329 -459 -105 186
2788 186 342 400 -164 -690 -332 339 564 81 -264 -467 -240 230 512 303 -179 -444 -312 258 705 283
2808 283 -381 -405 -87 234 402 315 -254 -459 -259 183 498 383 -304 -646 -239 332 370 203 -106 -417 -463
2829 -463 76 518 330 -194 -585 -308 262 440 173 -92 -266 -283 88 534 405 -152 -459 -291 236 446
2849 446 236 -242 -329 -198 97 364 304 -74 -490 -367 126 409 162 -253 -393 -261 129 309 240 -32 -337
2870 -337 -387 163 527 307 -216 -344 -115 145 360 228 4 -285 -264 38 424 323 -204 -421 -156 97 171
$$ packed form
2725A27p64K17R13j99n19M2o8n1N73J71m98k27N0j09M88O41o68q43L73M71K0L18
2747D58k2p97k14N49K93K30l8p41m60O66N35k51n1j82n06P5Q46J55l86l53k93
2768d87J28P03K11n55l12J46r5L22N47j90p72j72L58M71K25k54o03j30L54K91
2788A86J56N8n64n26L58O71K25m83l45k03K27M70K82k09m82k65J32N70M47m22
2808B83o64k4L18L21J68q7n69k05K00M42L15j15o87l42M07N71L8j67l09l11m6
2829d63N39M42j88n24l91K77N70J78k67k65j74j7L71M46j29n57l07J68N27K10
2849D46k10m78q7J31K95K67o0l78m16J23M93K83k47m15j40J32L90J80o9k72l05
2870c37n0N50L64k20n23j28K29K60K15j32k24k89K1L02L86j01n27k17K65K53P4
$$ plain form
2891 171 168 -15 -272 -276 25 295 145 -121 -296 -164 164 258 91 -64 -153 -189 -94 244 214 -12 -292 -196 81
2914 81 234 154 -135 -154 -93 27 64 214 -65 -290 -262 52 233 62 -92 -219 -107 66 75 127 40 -76 -170 39
2938 39 239 162 -40 -90 -15 -31 16 82 38 -44 -27 -63 59 24 -100 -166 -65 110 -71 -88 0 -46 -107 26 22 6 -12
2965 -12 -58 -146 112 165 -32 -34 120 37 -84 85 176 30 -9 -24 -35 -40 21 8 15 97 -140 -193 -142 112 -4 -8 59 -34
2993 -34 -227 -115 175 33 51 -9 -171 -90 159 60 -23 162 66 -214 -11 245 -42 -111 138 38 -55 157 -79
3016 -79 -190 87 116 -78 100 53 -329 -337 252 301 -25 -20 -82 -276 -86 307 83 -33 61 -245 -181 292 286 -146
3040 -146 -20 99 -197 -81 319 -15 -226 100 18 -141 182 125 -476 -127 407 5 -187 201 -185 -314 260
3061 260 412 -86 11 -18 -443 63 534 78 -228 107 -177 -337 305 453 -197 -139 15 -253 -53 265 20
$$ packed form
2891A71lj83k57mL01K70j50k66j75J32L28R4j67j55q9l6R5L38l0k26k80R6K77
2914H1J53q0k89j9O1J20L7J50k79k25K8L14J81j71j54j27J12J73RN2q7j16r4K09
2938C9K00p7k02n0P5j6M7O6m4q2J7l6J22l5j24o6J01J75j81j7Q8m6o1J33mj6j8
2965a2m6q8K58N3j97kJ54q3j21J69R1j46l9j5j1nO1j3PQ2k37n3N1K54j16mO7r3
2993c4j93J12K90j42J8o0j62Q1K49r9q3J85r6k80K03K56k87o9K49j00r3K12k36
3016g9j11K77K9j94J78m7l82qN89M9l26No2j94J90L93k24j16R4l06O4M73om32
3040a46J26J19k96J16M00l34k11L26q2j59L23n7o01L49N34m02j92L88l86j29N74
3061B60J52m98R7k9m25N06M71m56l06L35k84j60O42J48o50N8J54k68K00L18k45
$$ plain form
3082 20 -301 77 63 -219 27 223 -276 -223 271 156 -256 60 -20 -228 313 488 -103 -176 109 -218 -97 649
3104 649 330 -417 -54 6 -306 240 558 -214 -359 31 -272 -111 494 92 -526 -10 117 -274 -26 321
3124 321 -190 -253 255 13 -242 164 41 -318 227 406 -264 -212 128 -47 -24 440 211 -331 -192 26 -105
3145 -105 226 450 -182 -433 6 -16 -20 309 185 -357 -243 149 38 1 248 -76 -224 160 109 -142 126 131
3167 131 -205 6 380 -42 -321 137 64 -79 228 127 -357 -149 148 -30 99 280 -184 -385 76 148 -25
3188 -25 167 115 -281 -144 178 98 66 159 -87 -174 163 175 -119 9 136 -137 -44 102 46 -132 4 5 27 138
3212 138 14 -255 -59 30 -6 41 123 -89 -273 -12 149 159 21 -51 -79 -71 99 147 52 22 -40 -131 74 275 82
3237 82 -67 -38 18 -40 41 87 -118 -44 -24 -51 12 36 -186 -138 31 101 -67 -17 -16 -71 -2 89 48 100 -28 -119 -52 138
$$ packed form
3082B0l21L78j4k82K46J96m99N3M94j15m12L16q0k08N41J75n91p3K85l27J21P46
3104F49l19p47L63O0l12N46L18p72j45L90l03J61O05m02o18N16J27l91K48L47
3124C21n11o3N08k42k55M06j23l59N45J79o70N2L40j75K3M64k29n42J39K18j31
3145a05L31K24o32k51M39k2mL29j24n42J14L92j11l7K47l24j48L84n1k51K68N
3167A31l36K11L74m22k79M58p3j43L07j01m84K08K97j78J29J81m64k01M61P2j73
3188b5J92n2l96J37L22q0l2R3k46q7L37J2k94J28J27k73R3J46n6j78J36JK2J11
3212A38j24k69J96Q9l6M7Q2k12j84K61J61J0j38p2k8QJ70M8r5l0o2r1K05K01j93
3237H2j49K9N6n8Q1M6k05P4K0k7O3K4k22M8J69P0j68N0Jn5O9R1m1N2j28r1O7J90
$$ plain form
3265 138 107 -50 34 18 -44 20 75 78 -11 -74 -35 62 23 -35 -53 -27 -17 -30 -13 -78 49 -75 -108 55 83 -1 -63 -2
3293 -2 68 36 78 -14 -8 9 -68 -34 117 5 -90 -10 27 36 -50 -12 7 4 -3 -63 -41 -12 -67 -81 17 66 -44 -94 77 51 23
3324 23 -30 38 17 14 -31 -26 -14 -65 -61 -32 68 -36 -31 -50 1 -6 -141 -49 -12 -86 5 -10 24 -46 -71 -62 54 81 -38 -44 -25
3355 -25 17 -28 1 150 51 -83 -79 34 90 53 -31 -91 51 53 -23 22 73 -64 -165 -19 71 36 -52 -175 -20 38 29
3382 29 37 -51 -49 -163 -6 149 61 -29 -78 -38 91 50 43 -30 -8 -67 -43 99 163 69 -151 -96 143 114 54 -68 -76 -39
3410 -39 -2 64 72 30 -105 -119 -21 203 82 -73 -36 -53 2 -1 145 -19 7 -121 -40 108 104 -123 -189 48 68 59 86
3437 86 50 -132 -108 12 93 86 -56 -181 -55 92 96 25 24 -24 -159 -70 180 137 -50 -138 -110 45 180 85 -30 -62
3463 -62 -82 -85 101 185 -53 -247 -85 32 68 83 4 -120 -101 -13 17 88 51 -129 -245 106 266 47 -114 -9
$$ packed form
3265A38l1j57Q4j6o2O4N5Lq9o3L9R7l9n8j8K6J0j3J7o5J27j24l3J63K8q4o2O1
3293bP0l2M2r2OJ7p7L4J51j12r5Q0L7Rq6L8J9lpo0K2K9n5j4R8M9j10n0J71k6k8
3324B3n3O8k1lm5NJ2n1MK9J00j04Nj9N1pj35R2L7p4R1j5L4p0k5RJ16K7j19oJ9
3355b5M2m5K9J49r9j34MJ13N6l7q4o0J42Kp6M5N1j37j01J46R0l5q8j23J55N8r
3382B9Qq8Kj14J57J55q8r0m9M0J29m1pp3K2n9K4J42O4r4k20N5K39k9o0j22qL7
3410c9L7O6Qm2j35j4R8K24j21j55L7j7N5lJ46j64K6j28Q1J48mk27o6K37K0rK7
3437H6l6j82K4J20Q1pj42j25J26J47Mp1jm8j35Q9K50m3j87q8K8J55J35r5j15l2
3463f2k0lJ86Q4k38j94J62J17L6J5p9j24J9Q8L0P1l7j80j16L51J60k19j61J05
$$ plain form
3487 -9 -93 8 152 111 -32 -80 -84 16 232 178 -141 -178 0 -20 21 117 17 -189 -138 -33 70 131 -27 -234 -143
3512 -143 71 25 -105 46 43 -201 -57 179 58 -6 -58 -78 39 243 7 -146 -6 -37 -43 87 215 -25 -229
3535 -229 -100 122 96 118 -70 -130 -71 27 -17 73 113 -178 -252 28 160 10 -40 -42 -59 -35 61 41 -42 66 -99 -38
3561 -38 146 84 -163 -98 53 3 57 72 32 -99 -32 13 74 126 -103 -238 -62 174 15 -34 102 21 -195 -93
3585 -93 109 91 50 -50 -112 -23 70 19 -72 129 70 -110 -91 99 -29 -45 25 9 7 21 -21 -68 36 41 -57 -11 82 -96
3613 -96 -105 85 256 52 -26 -11 5 73 52 79 62 13 -138 -104 92 119 -50 -116 44 2 -123 -12 132 -11 -51
3638 -51 -38 -7 -32 -41 -48 20 91 1 -130 -23 76 -24 -3 34 52 -28 7 -12 50 95 2 -43 97 49 -73 -39 113 56
3666 56 -77 -32 -42 -8 -80 -23 2 93 -29 -84 -56 96 26 -58 14 12 -86 -126 140 125 5 -152 -44 43 84 30 -81
$$ packed form
3487iq4J01J44m1j43m8mJ00K16n4l19l7J78k0M1R6j00k06N1J05J03O1j58k07R1
3512a43K14m6j30J51lk44J44K36j21o4n2k0J17K04k36j53J40l1oJ30J28k40k04
3535b29J29K22k6K2j88o0N9R8m4R0M0k91p4K80J32j50n0kj7K4R6k0q3J08j65O1
3561c8J84o2k47O5J51n0N4J5m0j31O7M5O1N2k29j35J76K36j59m9J36q1k16J02
3585i3K02j8m1j00o2Q9R3n1r1K01n9j80J9J90j28j6P0j6kJ4m2m7J04Nr8M6R3j78
3613i6rJ90J71k04p8J5J6O8k1K7j7m9j51L4J96K7j69o6J60m2j25J11J44j43m0
3638e1J3L1k5rpO8P1r0j31J07R9j00K1L7J8q0L5j9O2M5r3m5J40m8j22L4J52n7
3666E6j33M5j0L4p2N7K5R1j22n5K8J52p0q4P2kr8m0K66j5j20j57J08Q7M1n4j11
$$ plain form
3693 -81 4 69 -38 -95 96 83 -131 -62 81 58 12 -7 28 64 94 -28 17 98 63 -181 57 233 16 -122 -4
3718 -4 -30 64 91 -6 -20 24 -23 -88 135 186 -83 -177 22 59 -34 20 83 -97 -78 -88 36 78 7 -126 -41 119 99
3745 99 -29 19 83 -33 -18 65 119 47 -81 -108 65 155 39 -156 -98 -3 -60 24 137 40 -160 -140 -15 113 54
3770 54 -50 -120 -18 30 -77 45 173 1 -124 -16 213 39 -67 -35 -5 70 126 17 66 30 -67 -80 144 158
3794 158 -67 -142 -25 27 48 21 -39 -41 -94 -125 44 163 24 -170 -19 139 151 25 4 -33 -24 -61 60 127 35 -102
3820 -102 -121 36 145 50 -112 -24 1 18 25 111 59 -63 -118 11 188 80 -84 -101 17 30 40 39 61 -40 -125 35
3846 35 154 168 -64 -168 6 109 67 4 -30 13 -93 -39 136 150 -46 -141 -19 120 92 22 -6 -4 -33 -46 118
3871 118 149 16 -138 -8 189 126 0 -56 -42 24 0 15 108 68 -35 -136 22 159 1 -115 -16 29 -45 3
$$ packed form
3693h1Q5O5j07n7J91j3k14O9J43k3m6j9L5L6L0j22M5Q1l5k44K38J76k17j38J18
3718dk6R4K7r7j4M4m7o5K23N1k69r4J99L7r3N4O3j80J9j0J24M2p1j33Q5J60k0
3745I9j28M8O4j16J5Q3N4p2j28k7J73R0j16j95N8R5n7Q4J13r7k00K0J25J28n9
3770E4j04p0J02M8j07J22J28j72j25J08K29j74j06L2L0P5N6j09M9l6r7j3K24J4
3794A58k25p5J17N2K1k7o0kn3l1J69J19j39j94J51J58J2j26k1l7Rl7J21O7r2j37
3820a02j9J57J09r5j62Q8K5J7PQ6n2j22n5J29J77j08j64j7J18J3J0jK2j01q5J60
3846C5J19J4k32j04J74J03m2o3l4M3j06N4J75J4j96r5J22J39k8p0k8Kk9j3J64
3871A18L1j33j54J30J97o3j26n6J4O6k4J5R3m0j03j01J58J37j58j16R9M5p4M8
$$ plain form
3895 3 14 -16 -114 -93 -33 89 58 -99 -68 24 99 5 -39 108 -1 -154 -55 167 109 -39 -102 8 151 -13 -36 27
3921 27 70 -3 -118 38 173 -77 -137 13 104 28 -23 -117 8 31 -69 -29 100 48 -136 -62 93 78 -27 -38 44
3946 44 61 0 -31 57 148 -28 -71 27 148 4 -105 4 84 40 -16 30 47 -42 -42 -18 73 55 -51 -70 56 66 -58
3973 -58 -47 84 16 -115 19 86 61 -8 -50 0 60 84 -93 37 103 -33 -131 -45 64 11 -73 50 66 -19 -29 -65
3999 -65 59 60 10 -84 62 87 -41 -33 167 34 -86 -41 77 25 3 2 -73 31 -6 -97 -64 92 16 -183 6 62
4025 62 -66 -142 19 122 24 -57 -146 15 49 14 -57 63 89 -183 -142 134 107 -13 14 89 -17 1 6 43 144 88
4051 88 -100 -61 127 53 -109 -17 123 -92 -139 -12 42 -68 -10 -54 -19 70 -58 -204 59 208 -15 -79 80 -7
4075 -7 -154 42 152 12 12 -56 -130 67 167 -31 -75 119 -7 -260 61 188 -52 -97 4 -31 14 55 -24 -63
$$ packed form
3895CJ1l0r8K1O0J22l1j57L1R2P5r4m4J47j09j53R9K22n8j48o3J10J43j64k3O3
3921B7M3p3j15J56J35k50o0J50R1p6n1r4J25K3j00M0J29n2j84P4J55j5j05j1Q2
3946D4J7o1l1Q8R1j76m3R8J21j44j09J09Q0m4n6M6J7q9%K4R1j8j06j9J26J0j24
3973e8J1J31o8j31J34O7k5o9m2N0O0K4j77J30O6j36r8Q6J09n3q4J23J6q5j0l6
3999f5J24Jn0r4J46K5j28QK00j33j20M5J18n2k2jp5J04l7r1L3J56p6j99J89N6
4025F2j28p6J61J03r8q1q9J61L4l5p1J20K6k72M1K76k7j20K7P5j06J8NL7J01n6
4051H8j88L9J88p4j62R2J40k15m7J27N4j10N8m4L5Q9j28j46K63J49k23o4J59q7
4075gj47J96J10j40%o8p4J97J00j98m4J94j26k53L21J27k40m5J01l5M5M1p9l9
$$ plain form
4099 -63 151 -4 -168 74 93 -140 -116 196 102 -47 -37 -65 -55 107 74 -93 3 57 -243 -113 263 76 -176
4122 -176 -108 -35 -150 14 111 58 -104 8 -134 -11 231 41 -178 25 129 -158 -70 179 27 -147 -9 22
4144 22 17 48 -64 -134 105 197 -111 -196 35 -18 -97 84 112 -36 -113 -67 -2 120 145 -55 -114 85 -71 -124 127
4169 127 257 -107 -141 70 -4 38 86 18 5 46 -13 -53 81 127 -131 -16 162 -9 -199 -21 46 -45 20 37 -117
4194 -117 -69 -16 -95 17 243 4 -266 18 107 42 27 125 24 -137 -5 51 24 108 -23 -136 47 90 -82 -9
4218 -9 134 12 -138 -18 30 -11 -5 -66 -79 131 73 -174 -60 114 38 -62 84 70 -82 -141 42 30 68 -16 -58
4243 -58 -55 33 51 -25 60 55 -89 -132 142 83 -94 -40 54 51 -44 14 18 11 78 21 7 147 2 -137 27 91 38 -49 11
4272 11 -61 29 -24 6 26 65 -96 -95 97 45 -24 -70 4 21 -118 -46 36 66 -9 -52 -18 32 2 -78 8 94 47 -83 15
$$ packed form
4099f3K14j55j64K42J9k33K4L12r4j49J0k8J0J62l3j67R6N4l00J30L76j87k52
4122a76O8P3j15J64R7n3j62J12j42J23K42j90k19K03J04k87Q8K49j52j74J38L1
4144B2nL1j12p0K39R2l08q5K31n3p9J81K8j48p7M6O5J22K5k00n9J99j56n3K51
4169A27J30l64l4K11p4M2M8o8j3M1n9m0J34M6k58J15J78j71j90J78O7r1O5J7j54
4194a17M8N3p9J12K26k39k70K84Q9o5j5R8j01j61J32N6k7Q4j31j13J83M3j72P3
4218iJ43j22j50J20M8m1Oo1j3K10n8k47J14J74p6j00J46j4j52n9J83j2L8q4m2
4243e8LQ8J8p6Q5nj44m3K74n9j77N4R4lr5N8MpO7n7j4J40j45j39J64O4n3q7O0
4272A1p2R0n3L0K0L9j61JJ92n2o9m6P4J7j39P2Q2L0p5m3L4N0l0q0Q6Q6m7j30R8
$$ plain form
4301 15 94 47 -48 10 151 59 -19 -53 57 90 -63 -27 3 20 -52 -37 46 45 -109 -98 -25 52 -33 -63 -74 -9 -32 -43 -33
4330 -33 86 -24 -88 22 151 81 -117 -35 77 41 -37 26 -13 49 -31 43 54 84 -55 -125 17 188 -27 -44 4
4355 4 30 -16 -37 89 68 -41 -119 8 49 30 -72 -154 13 -4 -73 20 80 -16 -123 -44 95 94 -36 -126 -40 35 -36
4382 -36 -31 -27 12 -58 -146 21 122 -8 -95 -42 78 58 22 2 1 3 -9 -12 130 38 -125 -168 28 56 26 -33 15 -28 -98
4411 -98 -32 99 86 -114 -187 -76 21 -12 48 2 -63 -8 -27 77 49 47 -117 -22 98 158 9 -84 10 86 16 7 52 -26
4439 -26 -136 -121 45 97 64 -106 -92 38 55 10 22 31 -101 -161 35 73 2 -20 -113 -49 16 5 29 76 6 -150 -24
4466 -24 179 84 -124 -83 -37 40 34 -22 -29 -2 -1 -42 145 144 -69 -194 -37 114 76 35 3 -74 -9 50 63 129 108 -230
4494 -230 -154 83 186 17 -94 -10 -99 -55 132 67 -27 -66 -98 -75 127 84 -162 -50 91 17 -86 112 39 -99
$$ packed form
4301A5P9m7r5N8J41r2p8l4J10L3j53L6L0J7p2J5Q3jj54J1P3P7q5l0j1O5k3j1J0
4330c3J19j10o4J10J29p0j98Q2J12l6p8O3l9O2q0P4J1L0j39p0J42J71k15j7M8
4355DK6m6k1J26k1j09p8J27M1j9j02q2J67j7o9R3O0r6j07P9J39jj30r0Q6P5p1
4382c6NML9p0q8J67J01j30q7N3J20k0l6k0jKj2lJ42r2j63m3J96K8l0n9M8m3p0
4411i8O6J31j3k00p3J11R7l3O0m6o5N5j9J04k8kj64R5J20O0j49r3R4P6p0rM5p8
4439b6j10J5J66N2l3j70J4J30J7m5J2Rj32o0J96L8p1k2r3O4O5j1K4M7p0j56J26
4466b4K03r5k08M1M6P7on6pK7Jm1J87jk13j25J57J51l8m1l2p7O5N9J3O6k1l38
4494b30P6K37J03j69j11Q4q9M4J87o5r4l9l2K3K02m3k46J12J41p4j03J98p3j38
$$ plain form
4518 -99 -75 74 123 86 -39 -200 -31 156 -6 -18 108 -71 -202 -37 213 94 -49 -93 -130 2 109 37 -58
4541 -58 -18 -8 -202 56 196 -89 -159 50 59 -13 64 5 -85 39 96 -87 45 73 -107 -146 140 173 -53 -51 -34 -113
4567 -113 52 96 49 2 -45 -164 -111 126 102 -75 -45 66 -106 -66 78 125 -34 -111 -24 -26 84 18 -31 -7 106
4592 106 -41 -66 74 88 -82 43 122 18 -33 -21 -65 -53 126 15 -56 22 16 -108 73 120 -4 -76 -41 -13 -1
4617 -1 93 36 20 12 -54 -99 26 181 -28 -102 -7 7 -38 -59 42 14 23 -9 -60 -77 19 13 4 122 102 -108 -69 118 -8
4646 -8 -16 85 78 -101 10 9 8 93 109 -41 -67 34 -69 -53 105 136 -104 -126 10 -52 6 44 8 -18 -31 -110 -106 63
4674 63 108 -17 -108 -3 -52 -107 46 114 21 27 1 -27 25 14 20 -20 89 75 -109 -17 108 -13 -51 65 70 -95 -37
4701 -37 -32 12 11 60 -115 -94 -24 -88 -7 132 2 -159 -143 -19 21 74 67 -57 -18 12 7 47 134 95 -173 -58 49 -27
$$ packed form
4518i9K4J49M9l7j25j61J69J87j62j2J26j79j31J65K50j19j43m4l7J32J07p2r5
4541e8M0J0j94K58J40k85p0K09Rp2P7n9r0J24N7j83J32K8j80l9K86L3k26KJ7p9
4567a13J65M4m7m7m7j19N3K37k4j77L0J11j72M0J44M7j59p7Q7kJ10o6m9K4J13
4592A06j47k5J40J4j70J25P9j04n1J2m4J2J79j11p1P8oj24J81M7j24p2L5K8J2
4617aR4n7j6qo6m5J25J55k09p4R5J4m5k1J01k8Rl2n1j7R6orJ18k0k10L9J87j26
4646hqJ01pj79J11jjQ5J6j50k6J01j03J6J58L1k40k2J36o2N8L8l6k6j3p9MJ69
4674F3M5j25r1J05m9n5J53O8r3Ok6k8N2j1Om0J09j4j84R2J25j21l8J16Nj65N8
4701c7NM4jM9j75K1P0o4Q1J39j30j61J6J24M0N3pj24L9L0nM0Q7l9k68J15J07p6
$$ plain form
4729 -27 -30 63 -5 -108 18 53 -68 -52 15 -65 -18 158 -70 -110 23 39 -57 42 88 -38 -91 4 67 11 73 -40 -141
4756 -141 20 74 -27 48 14 -119 -23 67 12 6 35 -75 -25 51 58 -88 -19 22 -67 -23 128 46 -119 -25 81 27 82
4783 82 49 -29 -65 83 13 27 96 -20 -111 -31 113 -10 -32 -19 9 -103 17 20 24 42 -54 -71 29 57 -5 -58 48
4810 48 16 -9 42 4 30 -41 2 91 110 98 -60 -38 28 7 27 42 5 -86 -69 -21 39 83 16 -90 -54 1 54 7 -49
4839 -49 1 -68 -47 -21 52 -34 -62 -24 19 32 5 -58 3 -22 61 9 70 73 -56 20 71 49 -1 3 28 4 10 3 44 56 -72
4870 -72 -76 17 68 -14 -17 -60 67 15 -35 28 -3 -7 -6 35 20 29 -54 -50 7 57 -11 -3 23 -38 -65 -19 47 36 9 -77 -19 49 44 24
4904 24 -37 27 -40 -35 52 77 53 10 1 44 20 -9 -43 9 -23 -1 3 25 12 -66 -53 0 -10 -54 -42 34 29 -12 -7 -8 73 -29 -62
4937 -62 20 8 2 -7 41 -46 15 -24 8 55 20 2 -38 65 34 17 -9 3 23 -104 -7 65 30 2 -35 59 -2 45 -6 -51
$$ packed form
4729b7lR3o8j03J26L5j21J6O7q0M7J76k28m0J33J6r6R9M6j26n3R5O3n6O2j13j01
4756a41J61N4j01P5l4j33R6R0n5oK9j10N0P6Pj46O9M1q9M4J51q2j65R4J06n4N5
4783H2l3p8l6J48p0J4O9j16r1Q0J44j23k2J3K8j12J20LMJ8r6j7J00K8o2n3J06
4810D8l2k5N1l8K6p1M3Q9J9j2j58K2O6k1K0J5l7r1J7M8O0M4o7j06L6N5N3m7n6
4839d9N0o9K1K6P3q6k8L8M3J3k7o3O1k5Q3n2O1Lj29P6N1k2n0MK5k4OpM1J2j28
4870g2mR3N1q2lm3J27n2n0O3l1mJM1j5Rq3MN7N0o8QK6o1k7M6O6j1k7q6N8O8nk0
4904B4o1O4o7NQ7K5k4m3rM3k4k9l4N2l2K2MK2j3p8J3N3j0m4J2P6nm1NjQ1j02l3
4937f2Q2j2orM8q7O1l9L2M7l5j8m0J03l1j7k6J2K0j27R7P2l5k8l7R4o1M7n1m5
$$ plain form
4967 -51 -3 -44 -67 -28 32 -21 -67 -38 23 -17 44 14 28 4 -12 21 21 40 6 -49 69 82 -32 19 15 49 -43 -32 47 98
4997 98 25 -59 -58 33 2 -26 -6 76 -30 -64 16 -28 -1 -11 7 20 2 55 26 -3 72 -22 -44 25 67 -42 -9 39 -19 -35
5027 -35 39 -52 -22 10 68 15 116 39 -67 -3 51 -15 9 83 20 -113 7 13 12 0 58 -54 -43 38 22 -60 40 68
5055 68 -92 -62 6 -1 -3 27 -37 -92 14 -39 -34 95 62 -39 -21 38 -80 -45 79 33 -46 12 32 -82 -24 144 16
5082 16 -22 39 -35 -140 -20 44 -88 15 62 -75 -86 46 -43 -32 55 -10 -126 -11 56 -67 15 103 -56 -93 22
5107 22 -3 -33 106 74 -32 -66 130 -73 -32 137 -24 -88 57 22 -123 -18 91 84 -23 57 -65 -49 29 130
5131 130 -83 78 -11 -132 0 118 45 -59 20 -42 -159 -21 85 11 12 34 -89 -54 74 -22 -54 66 4 -93
5155 -93 8 48 -29 -21 80 45 -44 51 27 -94 98 119 -47 -24 63 -13 -26 165 84 -92 -15 -28 -136 31 58 -33
$$ packed form
4967e1M8m1k3L9O0n3m6K9O1m0O1l0J4k4j6L3%J9l4n5J18J3j14N1mL4r2J1P9N1
4997I8p3q4JR1l1k8K0Q2j06l4Q0m4K7j0J8J3j8N3k9k9P5r4k2O9M2j09L3M8n8j6
5027c5P4r1L0L2N8n3J01p7j06O4N4o6K4P4o3j33J20Ojj2N8j12J1Q1j6q2J00K8
5055F8j60L0O8pkL0o4n5J06n3NJ29l3j01J8N9j18L5J24m6p9N8K0j14N8J68j28
5082A6l8O1p4j05J20O4j32J03M7j37j1J32q9J1Q7o5j16J15O7j23Q2Q8j59l7J15
5107B2k5l0J39l2j06l4J96k03M1J69j61o4J45l5j45J05J09pj07Q0j22J6P8J01
5131A30k13J61q9j21J32J18p3j04P9o2j17J38J06p4JK2j23L5J28r6l2J20o2r7
5155i3J01M0p7QJ01l5q9R5k4j21J92K1j66K3Q7p6j3J91q1j76P7j3j08J67K7r1
$$ plain form
5181 -33 -55 26 -85 -95 132 91 -105 15 18 -110 -75 67 -13 -8 80 14 -29 -6 59 -122 11 150 38 -45 76 -6
5207 -6 0 88 21 -31 0 24 -63 28 83 44 -111 38 -42 -59 100 102 -37 -25 -68 -80 -49 62 -69 -72 1 48 -93 -2 37
5236 37 -18 -13 53 17 -62 2 6 -13 62 76 -74 -26 15 -50 -45 95 48 -45 -48 9 37 -4 29 -34 -85 43 8 -8 29 23 -59
5267 -59 -31 58 24 -7 19 -34 -20 -23 25 13 14 3 21 0 21 -43 -46 30 5 -5 7 -31 -22 -44 19 30 11 19 -16 -18 3 14 11 40
5301 40 -28 37 -50 5 -6 -39 85 21 -72 -3 53 -19 -20 -39 -88 46 15 -33 -12 -9 -10 63 -10 47 -55 -30 49 30 51 -49
5331 -49 26 -43 16 23 55 29 -54 28 -13 -4 7 3 -7 40 -3 31 61 -26 -38 -36 -26 -6 -27 25 -24 -6 15 4 -14 10 -10 -15 -24
5364 -24 55 28 3 -7 -19 11 38 39 -48 1 44 30 30 33 -2 23 9 27 10 27 16 -27 34 15 21 6 -31 -65 46 31 -37 -30
5396 -30 -47 14 -11 -43 -31 0 -10 -18 18 9 3 -1 2 37 -21 -65 29 44 -51 49 -7 19 8 -7 -7 2 13 2 -5 17 9 -8 -4 -8 68
$$ packed form
5181c3k2Q1j11j0K27m1j96J20Lj28L5J42q0NQ8o6m3K3O5j81J33J39j12q3J21q2
5207fOQ8o7n2L1K4q7R1N5l9j55J49q0j7J59Kj39J2m3j2L1J11j31lP3M7j41R1L9
5236C7n5NO6l6p9O4Mj9P5J4j50M8M1o5NJ40m7r3lN7K8m1L3o3n1J28l5j6L7oq2
5267e9K8Q9l4l1K6n3J4lM8j2Jj1J8k1K1o4lP6k5j0J2l8Rk2O3J1j9Ql5kK1J1lK9
5301D0o8O5q7N5j1l3J24o4r3O9N6p2jj9m9J34l1m8K1LjP3p3N7j02K5P9j9K1j00
5331d9P5o9N9PL2k6q3Q2m1RJ1mj0M7m3L4L0q7j2KJ0K0k1N2m9J8K1j1j8K4k0nr
5364b4P9k7k5j0j2L0K7Jq7M9M3j4%Ll5K5j4J8j7J7j1m3O1j9Oj5l7l4J11j5o8P
5396c0j7O1k5l2J2L1j0qL6romLL5n8m4R4J5r5J00n6K6j1j5%RJ1j1pK2qj7MmP6
$$ plain form
5431 68 37 11 -15 7 5 13 42 10 -36 13 -5 -70 14 -39 6 9 -8 44 6 46 24 31 54 -18 -30 -31 41 29 14 35 -25 12 73
5464 73 71 -30 -6 -20 -45 5 5 -35 -47 -22 -11 -7 28 -28 -21 7 -10 -42 -23 35 -20 -22 55 24 10 44 -42 -5 -60 -22 57 48 41
5497 41 11 -63 41 105 -23 3 -1 -52 0 83 20 15 60 -16 -48 56 12 -27 -20 19 -33 -22 -8 -83 -28 33 68 11 -14 53
5527 53 -61 -43 53 34 16 16 -47 14 6 33 -1 -17 32 -35 4 70 -25 21 30 48 -37 64 38 3 20 -3 -50 -30 -30 -28 24 33
5559 33 79 -84 15 -5 -72 -57 76 39 -82 27 -40 -11 27 52 -13 -57 -90 -29 20 29 80 -47 -43 -10 -64 26 39 -46 -16
5588 -16 26 3 29 56 9 -63 -33 57 -24 -47 -44 -9 5 3 1 -41 -48 -5 -71 18 40 -70 -45 -24 -5 -21 12 15 -36 23 -27 -19 37
5621 37 86 23 -3 24 -1 19 23 93 -13 33 18 -16 -25 66 29 -2 20 37 -85 -67 13 3 59 59 12 -79 -26 11 -2 46 67
5652 67 -100 -69 -12 9 -35 82 -8 5 -53 38 -65 -20 9 -14 -1 -5 23 -37 -18 -55 49 47 28 -11 -3 -5 12 -18 11 -12
$$ packed form
5431F8l1k6k6K2kQK9l2m6M9j8o5Q4n3M5Lj7N2l8M0k2PK3p2j2jP2j2j5K1o0L7O1
5464G3kj01K4j4k5N0%m0j2K5J1ML5n6PK8j7l2J9N8n5kP7l1j4L4q6L7n5L8P9rp
5497D1l0p4J04O4j28K6mn1N2Q3o3nM5p6l2J04m4l9PL9n2J1J4p5N5O1L5n7k5O7
5527E3j14J8R6j9j8%o3O1qK7l4j6M9o7L9O6r5M6RJ8q5J01k6l5J7k3m7K0%KN2R
5559C3M6j63R9k0o7J5J33l7j21J09o7K9L8K5o5m4l3O1M9RN1j27ML3n4R0J3q5L0
5588a6M2k3K6K7m7p2L0R0q1k3LL5J4kkm2pM3o6Q9K2j10K5K1J9j6L3Ln1N9n0QN6
5621C7M9o3k6K7k5K0MP0j06M6j5l4rR1l7l1K2J7j22J8Q0j0N6%m7r1N3L7j3M8K1
5652F7j67L1N7K1m4J17r0J3n8R1j03M5K9k3J3mK8o0J9l7J04kj9l9QkJ7l0K9k3
$$ plain form
5682 -12 -42 -36 61 -3 7 -16 36 -31 4 49 -35 5 18 -17 -27 73 -11 11 -48 18 -41 -37 -5 -53 20 21 -43 -40 11 19 -17 21
5714 21 93 68 11 2 27 46 30 64 -1 29 65 -48 8 6 24 -48 -51 17 -25 -9 66 -3 -20 18 7 4 -30 4 -29 -5 49 -37
5746 -37 -30 -10 -49 10 32 -11 0 -53 22 38 31 -18 -35 16 66 20 -28 94 28 -34 -24 54 -8 -14 -51 18 -11 8 35 8 16 26
5778 26 -12 17 26 -19 17 12 -3 62 44 -29 -42 -43 57 -15 8 74 -29 -57 14 14 23 -35 73 -14 -21 -35 20 26 31 21 32 3 -11
5811 -11 -58 77 50 7 -25 -20 -17 76 6 29 21 6 -30 -34 -94 -5 -38 -11 -21 -34 5 -7 43 -21 6 -2 6 17 5 7 15 -28 1 10
5845 10 9 25 28 -7 -30 45 57 36 79 -56 20 -6 35 -14 40 37 -29 34 -68 -14 -30 -20 4 -32 -29 -11 -57 -7 -34 5 19
5876 19 -40 -90 -5 -10 -69 7 8 32 47 62 28 7 77 -3 -35 -36 53 -7 20 34 17 -8 -29 -19 41 -2 62 -16 40 -1 7 -15
5908 -15 3 6 -61 -12 10 -10 -68 -2 10 23 -52 33 -25 14 40 -14 -11 2 4 -12 -41 38 9 -17 28 11 15 20 11 -49 -25 -29 -4 8
$$ packed form
5682a2l0OR7o4J0k3N2o7L5M5q4M0J3l5j0J00q4K2n9O6n9ML2m8P3Jo4LN1Ql6L8
5714B1P2k5n7rK5J9j6L4o5L0L6j13N6kJ8p2lO8m2J6P5o9j7L8j1ll4L4l3K4N4q6
5746c7PK0l9N9K2m3J1n3P5J6pm9j7N1N0m6m8J22o6o2J0P8o2ol7O9k9J9K7k7QJ0
5778B6l8K9Rm5L6nj5O5j8p3j3jJ00p2K3O6j03k8P1%Rn8J08q7pj4N5ONj0J1k9j4
5811a1m7J35k7m3l2NLR3p0K3qj5l6mo0Q9l3K7j0j3L9j2N0o4K7qQJ1j2KQm3K9R
5845A0jJ6Ll5k3P5J2k1M3j35P6k6M1m9N4lo6O3j02N4j6J0K4l6LJ8m6N0k7L9J4
5876A9n9n0Q5nn9P6JK4J5J5l4k1P0q0l2jQ9o0K7J4j7k5k1J0O0m3O4p8N6m1Qk2
5908a5J8Lo7M9K2k0n8O6J2J3p5Q5n8L9K6n4LJ3Kj6k9P9k9k6M5j7MNro0K4mK5J2
$$ plain form
5942 8 25 39 21 -10 7 12 20 -15 -23 -19 20 4 34 9 -26 25 -10 -53 22 -20 2 -15 -36 -6 -75 -40 39 4 62 -17 -39 -34 30
5975 30 23 27 2 11 39 -36 -10 17 -25 16 1 -56 10 -51 -16 35 58 -40 16 -18 61 9 -21 -16 -14 8 33 -53 2 46 -25 -13 -27
6008 -27 67 -2 44 -4 -16 66 -29 54 3 -69 -5 56 -11 31 -19 2 35 -17 -13 8 -11 14 20 32 0 42 17 -45 -2 43 -22
6039 -22 53 9 -22 -48 63 -94 -35 -39 22 8 -42 31 -11 -25 -12 -17 -26 5 -23 -12 34 37 -18 41 -5 -21 -25 19 10 23 -23 -25 45
6072 45 58 -42 14 -9 0 -14 -15 1 -27 69 -10 -38 7 -28 13 23 -70 -47 41 11 -18 -38 32 43 -10 40 49 -8 -39 27 17
6103 17 40 43 31 17 19 -31 46 -3 -9 68 -21 1 66 12 -51 -79 7 -11 -4 2 31 28 5 25 26 -1 -16 -98 -25 44 43 0 -31 11
6137 11 -72 21 114 -13 9 -15 -61 0 35 47 -1 -4 -43 -41 28 50 41 -39 -5 25 -31 -7 25 -16 13 37 -73 -1 76 -30
6167 -30 -62 19 32 -25 -12 18 21 -2 -8 16 11 2 34 -25 -1 31 -65 -28 5 25 50 64 15 -32 -6 36 45 101 30 7 -4 90 55
$$ packed form
5942HJ7J4j8l1J7NQl5qML9j6L0k5l5N1l5m3P5m2K2j7k1L0o9L5P9l5N8p9k2NO4
5975C0pMk5RK8p5K6K7m2M1j5n7O6o1L5N1K3r8N6l4P9n2l0NKK2K5q6N5M4p1J2j4
6008b7R4o9M6m8j2Q2r5Q3n1p2O4O1o7M2n0K1L3n2MK1j9K5OJ2l2M2k5o2M3M5o5
6039b2P5m4l1k6J11j57N9mO1j4n0P3m2j4J3nrL1k8J1M6Ln5N9m6j6mM4rJ3m6kP0
6072D5J3j00N6k3Rj4jJ6k8R6p9k8M5l5M1J0r3K3Q8l0k9k0P0J1n3N0Rn7l1O6j0
6103A7K3Lj2j4Kn0P7m9oP7q9K2O5n4o3k8Q6j8POK9lk3K0Jk7j5q2P3O9jm3l1M2
6137A1q3R3R3j27K2k4m6O1L5J2m8ll9KO9K2rq0L4L0n6K4L2m1K9K4j10P2P7j06
6167c0l2Q1J3n7J3L0Lk3oK4nrL2n9K4L2r6L7L3K0K5J4m9m7K6M2RN6p1k3j1R4l5
$$ plain form
6200 55 -42 -12 15 33 36 -8 -9 8 -108 -43 -31 59 -8 -60 -38 6 -13 53 64 -43 -43 50 -39 4 61 -6 -93 -51 19 -49 47
6231 47 -25 5 3 8 2 -60 16 -34 54 -10 42 -10 31 12 -18 -8 51 51 -24 10 8 9 44 15 -77 -45 36 43 -13 17 -22 -96 -60 37
6265 37 69 -26 -37 41 -72 -4 55 64 -4 -13 -18 -5 50 3 30 3 -12 41 3 19 61 -4 -22 -52 49 -14 -5 -8 24 15 9 -21 -11
6298 -11 -35 -43 -53 45 9 -15 -24 2 -29 49 -16 22 -7 13 17 -24 60 13 -30 3 7 34 6 7 -50 1 0 45 -26 -59 -50 7 -4 11
6332 11 27 -50 13 -15 -44 -5 21 -5 -3 8 2 32 4 -53 -2 11 -38 -2 70 -41 -39 6 4 8 46 49 12 32 -66 13 24 24 46
6365 46 13 10 0 14 -11 33 33 30 36 -63 11 43 10 -27 -57 45 -12 -7 27 -22 33 6 -41 13 -20 24 14 18 48 17 13 15 41 -4
6399 -4 -28 62 28 -35 -36 4 25 23 26 25 -24 -25 -35 -36 22 -17 -58 35 45 -22 -36 -85 -12 6 15 13 -18 17 7 -1 2 -27 -23 -43 -11 29
6435 29 -41 -53 37 43 -11 17 -13 66 6 -49 -5 -10 -30 25 12 -52 6 -45 14 -27 19 28 -19 -24 50 4 21 -16 25 -44 21 -14
$$ packed form
6200E5r7L0K7J8Lm4jJ7j16O5J2R0o7n2K2M4j9O6J1j07%R3q9M3N7o7q7M2P0o8R6
6231D7p2L0kNoo2P6n0Q8o4N2n2M1j9l0J0N9%p5L4kJL5k9r2L2Q1Pn6L0l9p4L6R7
6265C7L2r5j1P8j13O8N9Ro8rnJ3N5m7K7k7j5N3l8J6M2o5j8l0J01o3RlL2rol0J0
6298a1k4qj0R8l6k4rK6l1P8o5L8k9K0Mm1Q4m7m3L3MK7k8Jn7N1jM5p1l3RN7j1J5
6332A1J6p7O3k8k9L9K6k6KJ1oL0k8n7N1J3m9L6P2j11KM5kML8Ll7K0r8P9J1%K2
6365D6l3lj0J4k5M4%lOr9P4L2l3l7l0J02n7NL4m9N5k7m7N4l3M4j0ML0l1mKK6m5
6399dk4R0l4o3jM0K1kLjm9jj0jN8l9m1R3J0o7j4m9P3J8Rkl1L5j0qLk9Mk0L2M0
6435B9p0j2R0On4K8l0P9o0n5M4nk0N5j3o4N8n1N9m1M6Rm7nP4m6J7l7M1o9O5l5
$$ plain form
6467 -14 -59 9 23 -47 28 -19 -16 -47 -34 -24 25 4 54 -71 9 -26 31 52 54 -53 -3 30 16 41 11 3 -51 -13 42 53 30
6498 30 17 -25 24 -8 24 20 -42 -35 -13 -54 64 12 -19 -61 -17 14 23 74 -44 -38 25 28 -13 -46 7 -37 -17 -57 -46 -15 13 -68
6530 -68 -77 3 -6 72 28 -29 -64 77 31 -33 -20 22 -1 -28 39 -4 -14 0 -31 30 21 98 -56 -12 4 -65 -48 52 23 0
6560 0 -21 44 10 37 -3 -54 -30 34 43 -8 10 -67 -56 -50 28 -14 -47 -59 14 -11 45 73 -4 -6 20 -7 46 95 12 -112 -62 21
6592 21 11 -1 -9 -52 -45 -6 9 -49 18 -31 -63 25 19 -97 -28 3 8 -22 38 -25 -104 -40 -51 12 81 29 2 -12 -14 34 -1 62
6624 62 10 -100 14 62 38 70 7 11 -36 25 -14 -20 10 2 8 -22 46 10 -17 -25 0 -14 28 26 -32 18 31 -16 72 -66 56
6655 56 -61 7 64 52 -19 10 -51 -34 4 37 3 -4 6 -3 81 -5 5 -24 42 -30 -101 -73 30 15 28 73 -34 29 57 -6
6685 -6 -47 37 23 -28 23 16 -25 -2 31 23 11 -41 -28 -32 24 -8 -17 17 16 -18 -38 59 26 -20 -37 26 7 39 23 -13 0 76 -4
$$ packed form
6467a4m5O8J4p0P5m7Ll1J3J0M9k1N0j25Q0l5N7K1Kj07N0L3j4K5l0qn4L8N5J1k3
6498C0j3m2M9l2L2mo2PK2m1J18n2l1m2M4L1RN1j18OO3Lm1l3N3m4K0m0J1L1K8q1
6530f8rQ0rP8m4n7l5J41m6o4J3M2k3k7O7m3j0J4l1O1rP7j54M4J6o9J7J00k9k3
6560@k1O5l4K7m0n1K4O4Rn1J8p7J1OP8m2l3j2P3k5N6K8p7kK6k7N3M9q3j24N0Q3
6592B1j0j2qm3PL9J5n8O7m9l2Q8oj16O9L1Nl0O0o3p9O4j1O3O9n2k7j4kM8l5O3
6624F2n2j10J14M8k4L2o3Mm7O1l9oL0qOl0O8l6k7qK5j4M2kn8N0J3m7Q8j38J22
6655E6j17O8N7j2p1K9o1J7L8L3l4pJ0rQ4q6J0k9O6p2p1K8J03j5J3M5j07O3K8o3
6685fm1Q4j4n1N1pm1K3L3qj2n2J3mN6l2rL4jl4k0R7l3m6j7O3j9L2j6l6J3P6q0
$$ plain form
6718 -4 4 55 -16 -67 6 6 -15 -19 -19 7 -34 3 12 -20 -18 33 -85 -41 10 -45 -42 62 10 -42 -40 1 70 -39 -35 -38 -7 -25 12 -5
6752 -5 22 11 -43 -42 -14 -26 20 73 34 -20 21 35 19 25 -25 -75 -76 -1 -49 -59 -10 -18 -27 9 40 -8 -26 17 -17 -62 28 -1 -22
6785 -22 19 3 -44 -14 60 -10 -9 -12 37 10 -11 -11 -20 10 38 -42 30 27 -46 -11 29 43 -1 -8 -13 5 84 -54 -29 61 30 -68 -1
6818 -1 19 -19 -59 -31 2 -51 7 12 -4 7 62 -41 -29 4 -15 10 -4 72 34 -67 -46 41 -36 -24 66 16 -15 -5 45 -7
6848 -7 12 28 7 -42 3 2 53 -41 15 -24 2 -10 -28 14 1 -11 3 4 -15 -22 -13 -5 -18 4 -4 -12 -33 0 8 49 22 -67 38 -9
6882 -9 -4 19 49 -9 -86 -17 20 43 -54 13 1 -52 -12 26 -17 1 -41 -28 -19 6 -15 -35 -8 12 5 50 25 5 2 25 -24 44 27
6915 27 4 -50 58 6 -35 44 55 27 -32 18 17 3 11 -58 -14 55 24 39 -46 27 -12 10 -22 45 -12 -42 14 32 54 28 -49
6946 -49 1 11 43 27 12 -13 -28 -27 -8 0 31 -25 -58 4 8 -32 20 26 -11 -3 -42 -26 3 -50 -18 18 47 -3 6 -21 -27 -27 24 18 15
$$ packed form
6718dQN1p1n1P3%k1m%K6m1L7Rl2KN1j18M4N1n5LJ04n2n2KM1O9j09MlL1j8L7j7
6752eK7j1n4JK8j2M6N3l9n4M1J4j6On0n0jP5m8j0M9qrL6L1m8j8M3l4m5R0k9k1
6785b2M1j6m7L0P4p0JlM9k7k1%rL0K8q0P2lp3L5M0J4m4pnJ8P9j38K5R0l1r8O7
6818aK0l8m0K8L3n3N8Nj6J1N5j03J2L3j9K5j4P6l8j01K1Q7p7J2R0n0l1J0N0n2
6848gJ9J6k1m9M5jN1r4N6l9K6j2j8M2j3j2J4Jj9pRQj3K2qqk1L3QM1k7q9J05m7
6882iNK3L0n8p7O9L7K3r7O7j2n3M0L8m3J8m2J3RK5k1k0K7K0pM5k5k0lK3m9O8j7
6915B7k3n4J08n2m1P9J1k8n9N0jj4Qo9M4O9l1J5q5P3l9K2l2O7n7l0N6J8K2k6p7
6946d9N0J0L2j6j5k5j5JJ9QL1n6l3O2Mm0N2Ol7Ql9J6K9n3L2L6K9n0Rk7o%N1ol
$$ plain form
6981 15 -16 -50 53 -14 -29 -58 1 31 -25 -1 -8 -16 -38 31 3 -37 -16 -31 19 19 20 12 -39 -3 -25 -4 0 31 88 -31 -56 -6
7013 -6 50 -38 -46 18 38 -2 -57 49 41 -8 12 15 3 64 -30 -2 -13 50 -3 -18 -28 -19 16 -2 55 14 -39 5 7 4 -26 -36 23
7046 23 34 20 -49 -2 -11 24 5 46 -16 54 29 -65 9 49 16 0 -29 52 2 33 28 -24 -4 -11 -29 -28 -8 3 -18 -36 -12 4
7078 4 -20 57 24 12 -57 36 -32 -28 43 -6 37 0 1 3 21 -3 10 -12 22 20 81 46 25 7 2 -11 -33 17 -25 0 7 9 -12 -47
7112 -47 14 65 -27 44 32 -73 -74 27 -18 -14 11 -10 -52 -62 2 -18 25 18 -57 -50 -38 81 -45 57 -8 2 32 70 20 -23
7142 -23 42 -7 1 -4 4 -5 17 35 28 -69 -35 -15 -49 -38 22 -29 -5 -1 -50 5 46 -63 18 38 -45 -1 -41 21 2 -15 3 -27 -2
7175 -2 33 27 16 68 36 -6 27 52 44 44 67 44 7 17 -47 1 -6 -53 66 40 11 -42 -53 -3 -26 -37 -23 32 -29 2 66 22
7207 22 5 -2 -64 9 44 -4 -50 52 22 -84 -35 41 41 18 32 -32 -39 1 -27 -9 34 23 -14 19 -69 122 -19 -1 61 -31
$$ packed form
6981A5l1l4J03o7j5k9N9L0n6K4pqk2O9k8m0K1j5N0%Jqn1L6k2K1ML1N7j19k5N0
7013fN6q8qO4K0m0n5J06qm9K0Lj2O1r4K8j1O3n3j5j0RL5j8N7m1n3M4Kll0j0N9
7046B3J1j4o9M7rL5j9M1o2P0k5r4P4M0l3j6k9Q1n0L1nn2K0pj8JK0J1k1j8K4J6
7078Dk4P7l3j2o9R3o8MP1m9M3l7JKJ8k4J3k2L4kO1l5k1j8nj3k2N0m2K5PKk1l5
7112d7O1N1r2P1j2j05jJ01m5MK5k1m2j0O4k0M3pp5PJ2J19j26J02o5J0L0L8n0m3
7142b3O5m9QnQrK2J8pr7L4K0l4J1O0n1K4Mm9N5M1j09Q1K0q3M4m0O2j9j7J8l0K5
7175bL5oj1N2l2m2L3K5q%K3k3l7J0o4M8pm7J19k6k9n3j1N0k3j1J4N5o1L1O4m4
7207B2j7po2P3L5m8m6J02l0j06M9P6%k3J4o4pM0k8J8M3j1l7L3q8J91j41J8O2r2
$$ plain form
7237 -31 3 19 -19 -41 28 -37 14 20 -14 -59 -72 55 43 -107 4 -13 19 -23 -22 6 9 -24 -14 22 -16 37 -1 -20 34 26 -24
7268 -24 12 57 27 -27 23 -14 13 9 39 59 -15 -4 4 18 67 -10 -60 11 4 41 -4 -19 4 29 -81 -27 19 20 -6 14 53 26
7300 26 -32 34 63 61 -24 68 28 77 -15 -5 54 48 -6 -13 -24 8 -32 -42 22 -26 52 -25 39 62 44 -12 -39 -14 75 1 19 -11
7332 -11 5 37 10 35 -39 -26 33 12 37 -19 -12 -25 21 7 -5 -2 20 -6 -13 22 37 -6 49 -19 0 20 72 -11 20 54 -11 15
7364 15 19 13 1 -47 -5 3 39 39 -36 17 12 26 -22 44 -49 -4 -23 -17 30 60 11 12 33 17 -9 50 47 -7 64 39 90 -9 20 -7
7398 -7 34 27 23 24 6 -40 -13 -9 -2 13 -46 63 28 -19 -19 -20 -7 7 -60 1 -20 -8 -7 -1 -3 -21 17 53 53 12 17 7 74 34 -4 25
7434 25 52 -2 34 31 -44 11 5 16 33 -26 7 28 13 10 13 -18 32 4 -44 -20 -5 -34 1 13 19 17 18 24 -12 -20 -15 55 -12 -31 6
7469 6 22 -7 10 22 6 -29 19 -8 -30 -8 62 -14 -20 -2 -32 70 18 -20 -86 36 23 -11 0 8 -6 41 -45 33 -24 22 -1
$$ packed form
7237c1L4J6l8k2O9o5N1Ol4m5j3J27j2j50J11j7L2m2JK8Ll3J0L6l8N3l8j9N4qn0
7268b4L6M5l0n4N0l7K7mL0K0p4J1QJ4M9p7n0P1pL7m5j5K3K5j10N4M6Jk6K0L9k7
7300B6n8O6K9kq5R2m0M9r2J0N9on4pj1L2m0j0O4m8P8p7O4K3j8n6k7K5Q9p4J8l0
7332a1J6L2k7K5p4J3N9k1K5n6Pj3M6j4j2LK2k6pL5J5m3N5o8J9K0N2q3L1L4o5K6
7364A5Moj2m8M2QL6%p5N3nJ4m8O6r3M5j9OM7L0m9JK1j6k6N9ln4P1k5N1r9K9k7
7398gM1pmJj8m6K7MPJ5n9J09l5m7%jJ3J4o7O1k1J2JOkj8L8L6%m1Nj0O7m0l8K9
7434B5K7n4L6lp5N5oJ1J7n9L3K1j5lLl1N0k8m8K4J5k9L5J2OkJOl6qNP0o7j9L7
7469FJ6k9J7J2j6l5M8k7k2K2P0p6oJ8l0J02n2l8o6J22j3l4J1Qj4M7q6P8n7M6k3
$$ plain form
7500 -1 -13 -30 -41 -39 -7 -44 -21 -8 -43 25 -32 55 -15 38 13 -30 -54 -11 -30 16 -22 27 10 45 3 -2 41 8 18 98 52 -36
7532 -36 -30 -32 -5 -29 -22 4 25 -28 -68 10 -27 44 -25 -9 -9 -50 16 6 24 2 37 -40 33 67 18 8 -15 32 8 -40 4 7 -44
7565 -44 37 -1 -28 33 1 -20 1 -9 2 -43 12 -22 9 -34 -11 -6 -13 -10 -31 -37 33 -45 -15 -12 -4 27 -25 24 -43 -6 -16 4 26
7598 26 -17 28 -48 19 57 15 -9 15 -50 1 54 -3 -40 56 13 19 -41 -3 0 -4 -38 -30 -21 46 -40 15 5 -37 -10 25 46 5 6
7631 6 -13 39 24 -53 11 -14 -4 18 52 58 -30 -30 -26 -4 19 18 28 1 43 -14 30 17 -37 24 -32 -10 -52 10 35 -6 8 -1 -5 -28
7665 -28 -33 -9 -13 -32 10 29 10 33 33 44 -17 -93 -11 7 -16 -66 -4 3 -15 -17 -1 -18 -1 42 -12 -17 22 -55 40 11 12 -5 -20 -9
7699 -9 5 -47 6 7 -33 -7 -7 -25 -10 -5 -31 -43 -18 54 3 4 -22 -47 -7 14 -14 -13 -18 0 -28 27 -31 -4 4 -34 -23 -71 25 -30
7733 -30 39 -6 6 24 -55 37 2 4 22 -43 33 31 34 -17 -6 -46 -33 -13 -14 -15 -22 29 -103 14 -11 1 -44 -39 17 39 17 19 61
$$ packed form
7500aj2j7j1KL2l7K3J3l5O8n7Q7p0N3k5m3k4M3j9M6l8M9j7L5m2nM3l3J0Q0m6q8
7532c6OkK7k4PK6K1n3m0P8l7P1o9J6%m1O6j0J8k2L5p7P3L4m9j0k3M7k4m8M4Ln1
7565d4Q1l8k7O1l2k1K1j0J1m5N5l4L1m3K3NpLk1oP0p8L0LQL1n2M9o7L7j0K0K2
7598B6m3M5p6O7L8m2k4K4o5N1N3n7l7R6m3Oo0L8Lml4QRO7q6N5j0m2K7L5K1m1J
7631Fj9N2j5p7O4k5J0K2L4Oq8%MK2K3jJ0k7M2n7M4j3n4O1n6K2m2O2K5m1J4rmk3
7665b8nK4mj9M2J9j9K3%J1o1p6Q2J8k3n0O2Pj8kJ6j7J7M3n4nL9p7R5k9Jj7j5J1
7699iJ4n2N3Jm0K6%j8J5Nk6j2K5P2n1Jk6k5M0K1k8JnJ8k8N5n8K7Ql8J1m8R6n5
7733c0O9m5J2J8p9R2l5KJ8o5P6kLn1J1m0J3K0jjpN1j32J17k5J2m5NN6K2k2KM2
$$ plain form
7766 61 32 -57 -2 39 17 -40 -6 -73 11 -31 -49 10 -30 7 -8 -38 26 17 -16 11 8 13 -14 23 33 4 2 -3 -37 23 -63 5 -13
7799 -13 3 3 -25 26 -10 -20 -20 22 19 -73 -29 -14 22 8 -3 0 -25 -8 10 -41 -2 41 -15 -10 24 -8 -52 23 21 18 11 28 0 -18
7833 -18 21 44 0 -3 6 -38 -47 0 -24 -12 -45 -11 -53 -23 15 -44 -32 -32 42 -42 17 -9 -14 28 -27 13 9 10 -30 -12 54 24 66 0
7867 0 43 -26 9 34 -50 -15 70 -25 -59 65 25 -30 39 29 -50 -6 35 -3 41 -18 -50 -10 11 -17 -16 -1 -23 -42 -45 -24 -16 18
7899 18 16 -23 -6 26 23 -37 -9 -46 -21 4 -27 4 -47 23 -6 -14 47 -7 -4 38 41 -2 53 32 -46 9 25 39 -41 11 -51 10 -27
7932 -27 -18 -21 -63 -13 -22 -2 13 -27 45 4 -28 13 -5 11 -9 32 -19 -25 -32 38 -27 -13 32 21 57 25 20 0 7 38 -48 49 -26 8
7966 8 -9 -12 8 -26 -10 11 -38 -43 -1 26 -13 -8 -25 -17 26 -5 0 -4 -46 6 -43 -2 54 17 19 100 38 -20 -19 5 12 6 -14 -37 -23 8
8002 8 14 -4 36 29 -1 3 -2 -15 25 -36 4 -16 -22 11 -3 19 41 -27 -77 21 17 15 1 59 3 -52 -22 25 -5 -12 -52 -68 16 18 -6
$$ packed form
7766F1k9q9N5M1k2n7L4o7Q4m2j8N9m0L7j5l0O4rl3K7lNk7L7J0k9knl4O0q6O8j8
7799a3J6%k8N1l6j0%M2lr2M4J5L6j4j1Lk5J7J8n1L9M3n6NL4l2m4P5klpJ7k8j8
7833a8L9K3m4lRm4rM7k4J2l3L4m2L0L8n9J2%P4q4N9k6nM2n5M0mJm0J8O6l0M2o6
7867@M3o9L5K5q4L5Q5r5l4J24m0n5O9j0p9M4M1l8M4n9l2M0K1k8JJ5k2j9lK1QL4
7899A8kl9J7L2lo0K8l7K5K5l1L1n1P0k9qO1n4LM2Lm3N5k1p8N5J6J4q0N2o2O1l7
7932b7Rlm2N0rK0J5m0P2m1l2M1j8J6k0M1n1opP0o5J4M5j1L6l2nk0PL1q6R7p5L4
7966Hj7lK0l4J6K1m9nM2K7l9Nj7QM3l1Nmm2N2m9M1N6l7KQ1o2n8JK4Pok0k3J4L1
8002HOj8M0pl0Mnj3M0o1M0k0oL3j4K2K2o8n0R8mkj4N8n6n5L0M7l0pm0j6Q4Kk4
$$ plain form
8037 -6 -4 -10 -20 -15 9 74 63 21 2 20 31 25 28 41 -29 -2 0 4 54 -13 -24 -33 16 -9 29 15 13 -17 23 -23 32 -9 -17 -35 0 34
8073 34 -32 -8 22 14 44 23 14 38 -32 39 6 -41 -20 38 15 33 -60 -2 70 23 4 25 -33 -22 -1 4 49 -16 12 36 -17 22
8105 22 21 -7 11 24 65 -6 41 19 -13 6 19 -61 20 -8 8 25 39 -2 6 56 5 14 20 -28 31 51 10 17 47 -27 13 -13 22
8138 22 42 4 11 34 15 6 4 -5 -36 -3 -14 -37 79 48 -50 -6 17 5 -3 1 18 35 -1 5 -17 66 -13 32 43 30 36 13 74 53
8172 53 -48 -54 45 21 6 -2 -5 20 21 -57 11 29 -8 -47 -96 11 -19 4 65
$$ packed form
8037fKoj0NK4O5j1m2j9J8J1oLJ3p0K7KMN0o7j1rM9k5L8j4kl0M0m6N5m1qj8L5L4
8073C4o6K4L0qL0k1rK4p0P1l3m7K1N8k3J8r3N8P2m7j9K1n8J1K1NM5o5K8K4n3L9
8105B2jk8J8J3M1p1M7k2l2J9J3q0Q1k8J6J7J4m1QN0n1ROm8N9K0m1PL0p4M0k6L5
8138B2K0l8PK3j9rkrl1L3j1k3J16l1r8M4K3j2qMJ7J7l6Ok2Q3p9M5J1j3Ok3O1k1
8172E3j01oR9k4j5qlK5Jp8O8J8l7l9m9J07l0K3O1
8191F5
$$ Imaginary data points
##PAGE= N=2
##DATA TABLE= (X++(I..I)), XYDATA
$$ plain form
0 0 0 0 0 0 0 0 0 0 0 0 0 8 -8 8 -8 8 -16 16 -24 24 -32 40 -41 49 -61 72 -80 96 -110 125 -144 161 -184 208
34 208 -234 265 -297 332 -371 415 -460 514 -570 628 -696 768 -848 934 -1030 1135 -1250 1376
52 1376 -1516 1676 -1852 2050 -2277 2539 -2842 3198 -3631 4162 -4830 5709 -6912 8668 -11484
67 -11484 16709 -29643 128029 122758 -158772 3198 -18161 -115779 61948 140897 -54547
78 -54547 -36454 -1674 -83970 27551 148281 -23172 -82079 19119 -18934 -43687 53489
89 53489 20594 -40903 5343 14266 -5983 33150 6222 -54800 -23021 42694 49326 1302 -52327
102 -52327 -30943 5933 -2645 42088 81791 -24647 -93978 -20116 17548 32664 70291 -16058
114 -16058 -96605 -8483 24880 -13132 70195 70127 -86857 -77097 36008 12580 10143 46330 -36448
$$ packed form
0@%%%%%%%%%%%Qj6J6j6J6k4L2m0M8n6P2q1R0j10J33j52J76k06K35k69L05l45L92
34B08m42M99n62O29p03P86q75R74j084J198j324J464j616J782j964K165k385K626
52A376k892L192l528L902m327M816n381O040o829P793q992J0539j2621J5580k0152
67a1484K8193m6352J57672n271k81530J61970k1359r7618J77727P8949j95444
78e4547J8093L4780q2296J11521J20730j71453n8907J01198l8053k4753R7176
89E3489l2895o1497M6246Q923k0249L9133k6928o1022L1779O5715O632m8024n3629
102e2327K1384L6876q578M4733L9703j06438o9331P3862L7664J5116L7627q6349
114a6058q0547Q8122L3363l8012Q3327o8j56984R760J13105k3428k437L6187q2778
$$ plain form
127 -36448 -56785 41232 22557 -20285 43698 10550 -79593 -9752 61054 2448 -19853 -361
139 -361 -19604 4377 42628 2969 -21506 294 -23281 -30190 38358 51729 -21940 -46580 -4999
152 -4999 14762 14031 20153 3797 -26729 -24656 -1758 14515 30535 18520 -32262 -39155 16134
165 16134 32670 1777 -1982 -1 -20423 -13416 16512 20547 6758 -12466 -28389 -5017 30911
178 30911 16301 -15807 -11312 -713 -7417 -2209 15837 13174 -12143 -22738 -1378 20096 14486
191 14486 -4983 -15961 -7356 8499 3707 -4203 11639 9257 -21845 -12316 24601 14254 -13360
204 -13360 -10464 -3535 2537 10835 -1841 -6485 10491 -4176 -22853 10234 25908 -10959 -19910
217 -19910 2595 4714 3409 4366 -4878 692 5454 -13555 -6540 21578 6974 -17264 -3234 8028
$$ packed form
127c6448k0337R8017j8675m2842O3983l3148r0143O9841P0806n8606k2301J9492
139c61j9243K3981L8251l9659k4475K1800k3575o909O8548J3371p3669k4640M1581
152d999J9761p31O122j6356l0526K073K2898J6273J6020j2015n0782o893N5289
165A6134J6536l0893l759J981k0422P007K9928M035j3789j9224j5923K3372L5928
178C0911j4610l2108M495J0599o704N208J8046k663k5317j0595K1360K1474n610
191A4486j9469j0978Q605J5855m792p910J5842k382l1102R529L6917j0347k7614
204a3360K896O929O072Q298j2676m644J6976j4667j8677L3087J5674l6867q951
217a9910K2505K119j305R57r244N570M762j9009P015K8118j4604k4238J4030J1262
$$ plain form
231 8028 1413 947 -2052 -1428 8559 -2525 -15030 5896 14990 -6955 -9052 5636 2819 -3894
245 -3894 -4963 -2672 8983 6899 -13542 -8331 12939 4504 -9657 570 6844 -1821 -6335 -2351
259 -2351 8077 10446 -7314 -13774 6963 13129 -4351 -6990 3464 1984 -4383 -2234 6108 8772
273 8772 -5388 -16894 -343 17099 4702 -10655 -5438 1257 -1054 -1098 5142 8676 -2096 -16911
287 -16911 -7411 16586 14691 -6946 -10810 -301 1996 404 4607 7630 259 -12542 -10353 10440
301 10440 18059 -1423 -15555 -5648 5198 4003 2455 3219 -1889 -10338 -8545 6709 16622 3788
315 3788 -15654 -13793 4283 12631 5908 -1720 -4405 -6799 -6467 3954 16304 9994 -11907 -19099
329 -19099 44 17418 10475 -4937 -7761 -4416 -4603 526 12802 12070 -8501 -21271 -5228 17669
$$ packed form
231H028o615m66k999O24R987j1084j2505K0926R094k1945k097J4688k817o713
245c894j069K291J1655k084k0441N211K1270q435j4161J0227O274q665m514L984
259b351J0428K369j7760o460K0737O166j7480k639J0454j480o367K149Q342K664
273H772j4160j1506J6551J7442j2397j5357N217O695k311m4O240L534j0772j4815
287a6911R500K3997j895k1637l864J0509K297j592M203L023p371j2801K189K0793
301A0440P619j9482j4132R907J0846j195j548P64n108q449J793J5254R913j2834
315C788j9442J861J8076Q348o723p628k685k394L32J0421J2350o310k1901p192
329a9099J9143J7374o943j5412k824L345j87N129J2276p32k0571j2770J6043K2897
$$ plain form
343 17669 14539 -6269 -12891 -4147 -752 223 10089 12709 -5630 -20368 -7205 16190 17485 -2179
357 -2179 -14445 -7832 1936 5176 8186 8812 -2726 -16070 -9845 11467 18636 1168 -16119 -12122
371 -12122 1845 8776 8235 3257 -5120 -10882 -8281 4550 17321 8773 -16082 -19203 3364 14477
385 14477 7292 1646 -3567 -9961 -6403 4379 12769 11346 -7568 -22376 -3628 20135 10425 -5992
399 -5992 -3624 -3744 -8359 1675 12733 6706 -7252 -15952 -7764 14490 17874 -5018 -14577 -2566
413 -2566 890 -1239 8981 11255 -7325 -18118 -4705 12885 15960 3700 -12142 -12721 1859
426 1859 7759 3018 5560 3973 -13843 -14982 10628 18639 -84 -9618 -6677 -3992 4564 8013
440 8013 -2158 -3296 681 -8374 -3442 17791 7809 -18280 -9558 8820 5024 3312 3612 -8766
$$ packed form
343A7669l130k0808o622Q744L395R75R866K620j8339j4738J3163K3395J295j9664
357b179j2266O613R768L240L010O26j1538j3344O225K1312P169j7468j7287L997
371a2122J3967O931n41m978q377n762K601J2831J2771q548k4855l121K2567J1113
385A4477p185n646n213o394L558J0782Q390j423j8914j4808J8748K3763r710j6417
399e992K368j20m615J0034J1058o027j3958q700Q188K2254L384k2892r559J2011
413b566L456k129J0220K274j8580j0793J3413J7590L075j2260j5842n79J4580
426A859N900m741K542j587j7816j139K5610Q011j8723r534K941K685Q556L449
440H013j0171j138L977r055M932K1233r982k6089Q722J8378l796j712L00j2378
$$ plain form
454 -8766 -8439 4747 3915 5273 12492 -6240 -24194 -1085 19803 6237 -3613 -1182 -8510 -8642
468 -8642 5438 9412 5593 2024 -11680 -16108 6205 16706 -1691 -8096 3752 181 -8936 1483
482 1483 10349 877 -6054 -1951 1809 4025 1755 -7520 -4341 11406 7268 -8720 -2331 5027 -8724
497 -8724 -6558 14731 10402 -8262 -8550 -6317 -3333 12678 11543 -7550 -5151 224 -12859 -3012
511 -3012 21426 8670 -12397 -5962 -2483 -3510 9004 8030 -3997 1775 415 -13626 -1168 16000
525 16000 1671 -7963 3159 2190 -5728 -3018 126 3972 7020 -2319 -7820 439 397 -5430 2078
540 2078 9827 3819 -6836 -10655 -1971 8333 4214 -558 3977 -941 -10489 -3882 6626 8615
554 8615 5644 -5339 -10082 2320 3873 -5824 4654 12103 -5705 -11096 1252 1547 1103 4716
$$ packed form
454h766L27J3186q32J358P219j8732j7954K3109K0888j3566r850K431p328j32
468h642J4080L974l819l569j3704m428K2313J0501j8397o405J1848l571r117J0419
482A483Q866r472o931M103L760K216k270r275L179J5747m138j5988O389P358j3751
497h724K166K1289m329j8664k88K233K984J6011j135j9093K399N375j3083R847
511c012K4438j2756k1067O435L479j027J2514r74j2027N772j360j4041J2458J7168
525A6000j4329r634J1122r69p918K710L144L846L048r339n501Q259m2n827P508
540B078P749o008j0655l819Q684J0304m119m772M535m918r548O607J0508J989
554H615k971j0983m743J2402J553r697J0478P449j7808n391J2348K95m44L613
$$ plain form
568 4716 -2571 -2160 5024 -6770 -9884 10135 8589 -7586 -1031 3732 -5290 -1692 3089 223 5970
583 5970 2923 -11096 -2608 9628 -1274 -3617 6190 463 -4715 6 -2056 1047 7541 -3591
597 -3591 -7546 6564 2847 -8840 271 5494 -1722 -181 -328 -4067 3659 2669 -8295 1587 11158
612 11158 -4622 -9143 5609 4558 -3704 118 1483 108 1918 -2596 -3384 6073 3258 -8124
626 -8124 -2044 8068 1303 -6394 -1958 2888 711 -2365 391 3743 -730 -5945 -2360 3638 4818
641 4818 1396 -4575 -4085 2998 1367 -3098 4621 6439 -6120 -6720 4087 3170 23 2534 -2176
656 -2176 -3783 4258 419 -6798 4319 7456 -7641 -5075 8426 -34 -8356 1583 3813 -799
670 -799 2690 -1498 -7434 3094 5352 -6208 1605 11006 -6366 -12505 6205 7952 -2389 1697
$$ packed form
568D716p287M11P184j1794l114K0019j546j6175O555M763r022L598M781k866N747
583E970l047j4019Q488J2236j0902k343R807n727n178M721k062L103O494j1132
597c591l955J4110l717j1687R111N223p216J541j47l739P726r90j0964R882R571
612A1158j5780m521J4752j051q262L822J365j375J810m514p88R457k815j1382
626h124O080J0112o765p697M436M846k177l076K756L352m473n215L585N998J180
641D818l422n971M90P083j631m465P719J818j2559o00J0807r17l147K511m710
656b176j607Q041l839p217J1117L137j5097K566J3501q460q322R939K230m612
670g99L489m188n936J0528K258j1560P813R401j7372o139J8710J747j0341M086
$$ plain form
684 1697 1182 -6064 8 2820 -2496 4865 6508 -9560 -7683 8492 3475 -5592 1540 2793 -3611
699 -3611 -1565 468 -472 2615 372 -4602 1039 5331 -2115 -5462 1289 4887 1340 -2327 -643
714 -643 1536 -1897 -2624 4047 5040 -1198 -3729 -3471 -27 5982 2062 -5085 673 2427 -6899 -1893
730 -1893 9152 1248 -6028 -555 -755 -545 5005 -989 -5167 4606 1962 -7867 2397 8621 -4516
745 -4516 -5274 4600 1894 -628 1235 -3268 -1159 5523 -1362 -4447 5219 2076 -7765 -834 6379
760 6379 808 -2809 -2191 -1364 2210 1216 -3029 945 3432 -3554 -3810 3985 3734 -1716 -2793 -620
776 -620 2522 2177 -2278 -1026 3165 -262 -3027 1842 3434 -624 -2603 -1990 1108 3863 -529 -4189
792 -4189 661 2206 -2736 -1189 3559 1070 -2874 -2632 -170 3235 1966 -3400 -1906 3406 373
$$ packed form
684A697n15p246O072K812n316P361J643j6068J877J6175n017r067P132J253o404
699c611K046K033r40L087k243m974N641M292p446l347O751L598l547l667J684
714f43K179l433p27O671R93o238k531K58L444O009l920p147N758J754r326N006
730a893J1045p904p276N473k00K10N550n994m178R773k644r829J0264O224j3137
745d516p58R874k706k522J863m503K109O682o885l085R666l143r841O931P213
760F379n571l617O18Q27L574r94m245L974K487o986k56P795k51n450j077K173
776f20L142l45m455J252M191l427k765M869J592m058j979O13L098K755m392l660
792d189M850J545m942J547M748k489l944K42K462L405j269n366J494N312l033
$$ plain form
807 373 -3188 1569 3761 -992 -3173 -222 2807 2040 -2098 -2721 2212 2586 -2438 -1675 2638 957
823 957 -2993 -1591 2119 1937 -1813 -3318 546 3162 -455 -2922 413 2281 -955 -2432 1037 2976
839 2976 -519 -3225 -42 3441 1271 -2178 -1135 1997 1284 -1737 -935 2518 968 -3189 -1732 2647
855 2647 1960 -1714 -2170 318 1458 -606 -1875 704 1990 -1503 -2802 1048 2569 -148 -1877 -602
871 -602 1718 1325 -1716 -1217 2613 1184 -2463 -520 2449 935 -1574 -1516 1089 2646 -911 -3492
887 -3492 1021 2837 -2014 -2359 2181 1566 -1973 -2154 128 2482 719 -3260 -828 3637 -252 -3587
903 -3587 1294 3355 -906 -1896 506 1632 1033 -1541 -1376 2751 1795 -3009 -1251 2287 243 -1250
919 -1250 89 428 472 -697 -2670 232 3267 -425 -2935 373 1112 -1017 -659 787 1463 878 -2179
$$ packed form
807C73l561M757K192m753k181K951L029p67m138o23M933L74n024P63M313j681
823I57l950J402L710j82l750j505L864K616l617k467L335J868l236j477L469J939
839B976l495k706L183L483k170l449J043L132p13l021Q02L453j550m157J457M379
855B647o87l674m56K488J140k064j269K579J286l493j299L850J521k717j729J275
871f02K320l93l041M99L830j429l647J943K969j514k509N8K605J557l557k581
887c492M513J816m851l45M540o15l539j81K282K354j763l979K432M465l889l335
903c587M881K061m261r90K402J126n99k574J65M127r56m804J758L538k044j493
919a250J339L39M4j169j973K902L035l692k510L308P39k129L58J446O76n85l057
$$ plain form
936 -2179 -2059 2481 2290 -1692 -578 2408 445 -2418 -1108 2213 2553 -850 -2128 646 1080 -1671
952 -1671 -1595 1941 2893 -1057 -4120 -734 2987 -308 -2053 2301 1834 -3374 -2511 1363 1774 1782 97
969 97 -2563 278 1830 -2479 -718 5134 1206 -4173 -492 1605 -758 304 1271 48 834 -537
985 -537 -3966 -525 4116 622 -2428 902 918 -3482 -2269 2824 3039 -38 -1301 -2000 -1369 1675 1706
1002 1706 -448 1995 2031 -4860 -3730 5151 3063 -2819 947 1529 -3510 -559 2165 -1187 1599 2980
1018 2980 -4885 -2945 5351 -709 -5300 3732 3790 -4352 -1280 1895 -2084 355 2868 -1759 -89
1033 -89 3157 -3508 -4103 5338 4178 -3920 -997 2877 -1926 -2514 2993 2254 -1411 -583 -842 -1945 2179
1050 2179 2841 -3522 -2172 3911 -891 -4465 3286 2900 -5262 -951 4133 -1332 -339 3084 -3924 -2964
$$ packed form
936b179J20M540j91l982J114K986j963k863J310L321L40l403j278K774M34k751
952a671P6L536R52l950l063L386L721l295j745M354m67n208Q63L874M11Qj685
969I7k660K841J552m309J761N852l928n379L681K097k363J062R67j223P86j371
985e37l429L441M641l494l050L330J6m400J213N093K15l077j263o99O31L044L1
1002A706k154K443L6o891J130Q881k088n882L766N82n039K951K724l352K786J381
1018B980p865J940Q296o060m591R032N8q142L072L175l979K439K513m627J670
1033h9L246o665n95R441j160q098K923L874m803n88N507p39l665Q28k59j103M124
1050B179O62o363J350O083m802l574P751l86q162M311N084n465R93L423p008R60
$$ plain form
1066 -2964 6097 398 -4776 4564 2484 -7634 31 6957 -1297 -1945 2772 -2676 -2480 4061 -536
1081 -536 -3108 4221 876 -6527 754 5122 -2966 -2981 3641 854 -2717 98 -383 -1751 2102 2301
1097 2301 -1788 226 1979 -3700 -3310 5620 4641 -3707 -1847 1608 -2595 -1163 4911 1819 -1897
1112 -1897 -122 -3113 -3666 4976 4191 -4412 -641 3212 -4616 -3268 5595 1773 -3019 1144 -451
1127 -451 -3310 2333 1746 -3170 2235 4199 -4150 -3059 3853 20 -2303 3290 1999 -2727 -902
1142 -902 -759 -1752 3219 3811 -2867 -2679 1381 -1594 -2417 3696 3683 -2496 -3377 -634 43 1216 2055 -3
1160 -3 -1076 63 -1400 -1719 2849 3586 -2030 -2605 1858 671 -2104 687 2331 -66 -692 -507 -1165
1177 -1165 719 1285 -1819 -240 3105 -984 -4180 817 2669 -1117 -398 1487 -970 -1605 -33 -71
$$ packed form
1066b964R061n699n174R340k080j0118P665O926q254o48M717n448J96O541m597
1081e36k572P329l345p403P281M368q088j5O622k787l571K815m81j368L853J99
1097B301m089K014J753n679L90Q930r79q348J860L455m203J432O074l092l716
1112a897J775k991n53Q642p85q603L771L853p828J348Q863l822m792M163j595
1127d51k859N643n87m916N405J964q349J091O912l833k323N593j291m726J825
1142i02J43r93M971N92o678J88M060k975q23O113j3o179q81K743O77J173Q39k058
1160cj073J139j463l19M568P37n616n75M463j187k775K791J644k397o26J85o58
1177a165J884N66l104J579L345m089l196M997J852l786P19J885k457o35J572l8
$$ plain form
1193 -71 1334 2454 -1411 -2704 1161 1479 -1023 713 1860 -706 -1421 -259 362 1335 983 -1395 -1002
1210 -1002 1112 -3 -1493 276 1438 -289 -1692 -554 1142 450 -1388 -502 1466 435 -1380
1225 -1380 -722 976 945 -518 -902 1047 1424 -1249 -1462 1652 1531 -1230 -827 861 405 -449 -522 113
1243 113 1069 7 -1893 -276 1649 -328 -1573 344 902 -388 -863 -274 716 819 -803 -921 1218
1260 1218 831 -1112 -340 1175 593 -500 -559 282 1252 2 -1417 277 1430 -656 -1223 647 757
1277 757 -623 -913 -245 810 602 -1250 -966 1110 496 -1336 -69 1303 5 -1103 -354 927 1129
1294 1129 -367 -1221 530 1358 -543 -837 994 838 -843 -990 625 1250 -197 -1516 -293 1224
1310 1224 65 -1144 23 806 -536 -1276 110 1322 361 -1337 -891 937 803 -579 -246 862
$$ packed form
1193g1J405J120l865j293L865L18k502J736J147k566p15J162O21R73l52k378L93
1210a002K114j115j490J769J162j727j403J138J696o92j838Q86J968j031j815
1225a380O58J698l1j463l84J949L77k673k13L114j21k761M03J688m56q54p3O35
1243A13R56j062j900J617J925j977j245J917N58j290m75N89R90J03j622j18K139
1260A218l87j943P72J515n82j093n9Q41R70j250j419J694J153k086n67J870J10
1277G57j380k90O68J055k08j852K84K076o14j832J267J372j298j108P49J281K02
1294A129j496q54J751Q28j901k94J831j56j681j47J615O25j447j319J223J517
1310A224j159j209J167P83j342p40J386J212r61j698M46J828j34j382L33J108
$$ plain form
1326 862 189 -873 -201 1146 953 -529 -1028 327 1092 13 -749 142 650 -404 -809 265 831 -395
1344 -395 -1380 -400 1042 612 -912 -948 401 474 -628 -113 1228 346 -1410 -686 1130 1398 -27 -971
1362 -971 -123 835 -136 -660 1032 1240 -1088 -1436 590 1126 -19 -792 -677 347 425 -836 -428 962
1380 962 -85 -1600 12 1476 255 -1154 -748 300 917 301 -330 248 306 -865 -545 1392 1590
1397 1590 -484 -1648 -278 1065 400 -274 462 191 -1149 -936 443 1037 515 -947 -1533 353 1116
1414 1116 -867 -461 1366 -153 -1498 452 933 -106 57 -285 -300 1362 701 -1763 -230 1693 -254
1431 -254 -861 1239 553 -1464 -794 492 811 810 -619 -1767 -142 964 -419 -280 1528 -30 -2624
1448 -2624 -698 2147 844 -766 -103 -275 -606 569 627 104 1112 -149 -2209 496 2700 -694
$$ packed form
1326H62o73j062O72J347j93j482m99J355P65j079p62Q91N08j054m05J074N66j226
1344c95r85R80J442m30j524l6J349P3j102N15J341q82j756P24J816K68j425r44
1362i71Q48R58r71n24J692K08k328l48K026N36j145p73J15J024P8j261M08J390
1380I62j047j515J612J464j221j409M06J048O17o16o31N78N8j171L20J937J98
1397A590k074j164J370J343o65o74P36k71j340K13J379N94n22j462n86J886P63
1414A116j983M06J827j519j345J950M81j039J63l42j5J662o61k464J533J923j947
1431b54o07K100o86k017O70J286L19jj429j148J625J106j383J39J808j558k594
1448b624J926K845j303j610O63j72l31J175N8n23J008j261k060K705K204l394
$$ plain form
1464 -694 -1676 1270 318 -1465 729 890 -1151 34 229 -1297 740 1515 -1968 -1534 1702 413 -1079
1481 -1079 610 361 -1166 -182 507 197 977 204 -1628 -431 1778 642 -1045 177 1015 -768 -1149
1498 -1149 1189 1260 -1076 -952 340 79 453 410 -1510 -489 1547 -878 -1233 2328 347 -3319 86
1515 86 2443 -604 -36 880 -1684 -619 1849 -470 -94 2443 -1119 -3035 1553 1943 -1124 332
1531 332 839 -1440 -430 631 -781 557 1260 -1395 -1290 1169 87 -1241 234 1005 357 -441 -834
1548 -834 -266 420 -65 373 1084 142 -860 -1088 -391 1716 1744 -880 -827 538 -1221 -1131 2046 1622 -748
1567 -748 -725 -1153 -1061 1306 846 -868 761 530 -2663 -1000 1979 667 -216 507 -464 -859 -86 -467
1585 -467 653 2285 58 -1807 -242 295 -312 734 1224 493 -455 -1748 -1240 1382 1429 -434 123
$$ packed form
1464f94r82K946r52j783K194J61k041J185J95j526K037P75l483M34L236j289j492
1481a079J689k49j527R84O89l10P80p73j832J197K209j136j687J222Q38j783l81
1498a149K338P1k336J24J292k61L74m3j920J021K036k425l55L561j981l666L405
1515H6K357l047N68R16k564J065K468k319L76K537l562j916M588L90l067J456
1531C32N07k279J010J061j412J338P03k655J05K459j082j328J475P71o48p98l93
1548h34N68O86m85M38P11r42j002k28O97K107K8k624N3J365j759R0L177m24k370
1567g48K3m28R2K367m60j714J629k31l193J663K979j312q83P23r71l95P73l81
1585d67J120J632k227j865J565N37o07J046M90p31r48j293N08K622M7j863N57
$$ plain form
1602 123 31 -1542 -930 595 773 1053 41 -1799 -651 882 -463 -163 1826 547 -1394 -694 -43
1619 -43 118 1076 724 -61 186 -451 -1598 -88 1992 1082 -777 -914 -271 -512 -374 978 1471 -273
1637 -273 -1491 -1131 -62 954 911 -438 -373 463 -824 -1135 1467 1463 -1199 -581 1004 -227 -442 518
1655 518 -184 140 1274 -359 -1274 829 215 -1556 783 2013 -789 -1689 -83 -101 151 1323 11
1672 11 -1140 -167 -365 -929 1378 1985 -1216 -1930 608 731 -197 845 557 -977 -455 470 72 831
1690 831 841 -1457 -1212 1461 943 -1097 -165 389 -1037 -290 1246 287 -655 -520 -1003 -77 1857 549
1708 549 -1761 -521 787 -341 89 1585 169 -1628 -612 701 921 856 -273 -1365 -31 1110
1724 1110 -57 -100 938 -598 -2028 345 1866 -31 -1079 -540 -541 262 1210 -49 -801 -61 -748 -845
$$ packed form
1602A23r2j573O12J525J78K80j012j840J148J533j345L00J989j279j941P00O51
1619d3J61R58l52p85K47o37j147J510K080r10j859j37O43k41J38J352M93j744
1637b73j218L60J069J016m3j349O5Q36j287l11K602mk662O18J585j231k15R60
1655E18p02L24J134j633r15K103o14j771K339J230k802r00J606j8K52J172j312
1672A1j151R73j98n64K307O07l201p14K538J23r28J042k88j534N22R25l98P59
1690H31J0k298K45K673n18k040R32N54j426P47J536r59r42J35m83R26J934j308
1708E49k310J240J308j128M30J496j416j797J016J313K20o5j129j092J334J141
1724A110j167m3J038j536j430K373J521j897j048N39jQ03R48j259p52P40o87r7
$$ plain form
1742 -845 1676 1677 -1298 -1425 283 431 675 1098 -352 -1093 -86 -45 338 1634 341 -1940 -918 1064
1760 1064 897 157 -245 -791 -644 35 418 791 307 -1220 -1397 486 1548 372 -868 -679 76 110
1778 110 254 996 462 -1147 -1120 568 1369 781 -526 -1132 -227 690 180 234 617 -736 -1609 114 1483
1797 1483 553 -524 -977 -801 493 873 53 -5 -132 -1082 -437 1396 1166 -439 -979 -478 447 1056 389
1816 389 -343 -209 -368 -500 778 1299 -43 -1222 -796 375 1005 338 -602 -532 -197 -409 250 1009 206
1835 206 -1046 -978 212 1062 548 -536 -549 65 27 113 714 599 -556 -841 84 1052 761 -427 -811 -34
1855 -34 309 -3 234 404 -390 -981 -285 747 685 -336 -964 -298 387 153 -67 260 35 -608 -382 642
1875 642 861 -83 -708 -265 540 479 24 -57 68 -81 -336 172 741 173 -769 -606 364 491 -92 -310 -176
$$ packed form
1742h45K521Jk975j27J708J48K44M23j450p41J007M1L83J296j293k281J022J982
1760A064j67p40m02n46J47O79L83L73m84j527j77J883J062j176j240J89P55L4
1778A10J44P42n34j609K7J688Q01n88j307o06R05R17n10N4L83j353q73J723J369
1797A483r30j077m53J76J294L80q20n8j27r50O45J833k30j605n40N01R25O09o67
1816C89p32J34j59j32J278N21j342j179M26J171O30o67r40P0L35k12O59P59q03
1835B06j252O8J190Q50n14j084j3O14l8Q6O01j15j155k85R25R68k91j188l84P77
1855c4L43l12K37J70p94n91O96J032o2j021o28O66O85k34k20L27k25o43K26J024
1875F42K19r44o25M43Q05o1m55q1J25j49k55N08N69n68r42J63R70J27n83k18J34
$$ plain form
1896 -176 -45 -220 -258 226 511 -390 -855 136 790 146 -397 -42 262 26 -249 103 551 132 -559 -158
1916 -158 644 302 -502 -250 384 280 -321 -347 248 197 -472 -394 327 304 -390 -380 88 312 -9 -423 19 487
1938 487 -7 -509 -28 589 50 -274 174 359 -24 -337 -167 466 509 -286 -557 124 315 -317 -240 446 159
1959 159 -661 -513 321 453 -89 -373 -125 218 91 -189 -16 361 66 -496 66 727 42 -772 -78 633
1979 633 277 14 -82 -296 -120 60 26 429 588 -830 -1336 302 1023 -66 -180 154 -663 -672 317 512
1999 512 412 348 -881 -984 831 839 -627 89 850 -448 -694 719 433 -372 58 80 -68 500 -2 -1151
2019 -1151 -66 1020 -40 -396 442 -364 -1294 50 1165 534 -172 -465 -1199 -318 1239 701 -266 343
2037 343 -368 -1553 196 1969 409 -764 -80 -497 -571 833 653 -447 326 127 -1393 52 1448
$$ packed form
1896a76J31j75l8M84K85r01m65R91O54o44n43L55L04k36k75L52M48m19o91M01
1916a58Q02l42q04K52O34j04o01k6N95n1o69P8P21k3o94J0M68K24l21m14M42M68
1938D87m94n02M81O17n39l24M48J85l83l13J70O33M3p95k71O81J91o32P7O86k87
1959A59q20J48Q34J32n42k84K48L43j27k80J73L77k95n62N62O61o85q14O94P11
1979F33l56k63r6k14J76J80l4M03J59j418n06J638P21j089j14L34q17rR89J95
1999E12j00o4j229j03J815Qj466P16P61j298k46J413k86q05M30K2j48N68n02j149
2019a151J085J086j060l56Q38q06r30J344J115o31p06k93p34Q81J557n38r67O09
2037C43p11j185J749J773j560j173O84m17p4J404j80j100P73j99j520J445J396
$$ plain form
2054 1448 -699 -1143 1168 535 -1156 104 218 -913 348 1149 -448 -204 340 -1388 -683 2147 1091
2071 1091 -1242 -310 50 -1059 336 1851 245 -746 -302 -925 -389 1692 945 -1277 -442 379 -994
2088 -994 -390 1516 355 -1228 -64 224 -574 420 515 -966 66 1298 -586 -931 1015 101 -1236
2105 -1236 961 1500 -852 -746 267 -496 377 1623 -312 -1209 392 -241 -1165 1262 1538 -1411 -1238
2122 -1238 590 -196 -239 1073 -4 -1001 144 67 -751 780 985 -1223 -686 1376 267 -905 474
2139 474 369 -678 327 796 -454 -266 217 -774 -56 1551 99 -1437 25 375 -768 215 1059
2156 1059 -456 -895 22 -206 58 1025 -37 -1042 241 524 -708 26 1093 -164 -770 360 390
2173 390 -251 133 44 -295 463 507 -740 -447 679 -141 -660 721 556 -911 -638 361 149 166 367 -446
$$ packed form
2054A448k147m44K311o33j691J260J14j131J261Q01j597K44N44j728P05K830j056
2071A091k333R32L60j109J395J515j606r91M44o23N36K081p47k222Q35Q21j373
2088i94O04J906j161j583J164K88p98R94R5j481J032J232j884l45J946r14j337
2105a236K197N39k352J06J013p63Q73J246j935q97J601o33r24K427K76k949J73
2122a238J828p86m3J312j077r97J145p7q18J531K05k208N37K062j109j172J379
2139D74j05j047J005M69j250J88M83r91P18J607j452j536J462L50j143R83Q44
2156A059j515m39R17k28K64R67j062j005J283K83j232P34J067j257o06J130L0
2173C90o41L84q9l39P58M4j247K93J126q20n19J381j65j467K73R99k12J7K01q13
$$ plain form
2193 -446 -489 272 -105 -238 912 534 -1019 -434 681 89 -108 476 77 -334 7 -146 -25 583 136
2212 136 -672 -22 429 -373 -443 224 301 -177 -156 -72 -54 46 -44 2 358 238 -417 -406 291 397 -98 -55 390
2235 390 43 -429 18 472 274 8 -182 -149 130 58 -315 123 444 -317 -498 66 232 -82 -86 -67 53 23
2257 23 -300 -230 406 334 -313 -182 229 115 -148 -10 261 328 -147 -322 235 410 -141 -191 194 215 -138 -219
2279 -219 48 272 -80 -433 -69 393 -94 -518 -16 239 4 -141 -69 161 44 -241 -153 416 284 -309 -187
2300 -187 256 205 9 -28 12 151 -68 -309 134 360 -161 -437 -75 199 54 -158 -236 44 113 -270 -123 417
2322 417 25 -530 -160 378 269 1 -211 5 173 -15 -164 374 339 -372 -351 266 383 32 -154 -71 36
2343 36 35 -156 32 259 -158 -462 26 352 88 -241 -255 22 221 -12 -55 131 -63 -270 -100 428 383 -96
$$ packed form
2193d46m3P61l77j33J150l78j553N85J115n92j97N84l99m11L41j53J21O08m47
2212A36q08O50M51q02p0O67P7m78K1Q4J8J00r0M6L56j20o55J1O97J06m95M3M45
2235C90l47m72M47M54j98k66j90L3K79p2l73M38L21p61j81N64J66l14mJ9J20l0
2257B3l23P0O36p2o47J31M11j14k63J38K71O7m75j75N57J75n51n0L85K1l53q1
2279b19K67K24l52l53L64M62m87m24N02K55k35j45P2K30j17k85Q8N69j32n93J22
2300a87M43n1j96l7M0J39k19k41M43K26n21k76L62K74j45k12p8K80O9l83J47N40
2322D17l92n55L70N38j09k68k12K16J68j88j49N38l5p11K1O17J17l51j86Q3J07
2343C6jj91J88K27m17l04M88L26k64l29j4K77J99k33m3J86j94k07J70N28m5m79
$$ plain form
2365 -96 -400 -55 346 180 -21 97 91 -337 -292 272 412 -4 -513 -383 158 307 -95 -145 39 -203 -335 131
2387 131 445 86 -346 -345 116 400 183 -159 7 55 -117 -36 432 358 -315 -428 93 372 158 -124 -186 -128
2409 -128 29 -23 15 305 -96 -619 -231 561 253 -323 -207 -37 -83 246 240 -13 23 -189 -401 333 807 -108
2431 -108 -590 -30 175 12 375 255 -314 -286 -142 59 491 448 -460 -695 216 303 -46 190 162 -479 -404 212
2453 212 404 235 -54 -508 -264 467 417 -296 -104 239 -298 -250 622 337 -443 -309 129 92 323 151 -590
2474 -590 -290 335 -20 -17 529 -181 -1038 -143 701 261 36 -35 -648 -403 480 349 75 403 -307 -915 244
2495 244 913 61 -281 58 -190 -253 353 279 -225 27 -109 -401 297 538 -559 -634 396 234 -329 68
2515 68 96 -585 -165 488 230 130 63 -761 -371 826 589 -222 86 -39 -671 -19 830 416 -194 -187 -579
$$ packed form
2365i6l04L45M01j66k01J18om28M5N64J40m16n09J30N41J49m02n0J84k42j32M66
2387A31L14l59m32JM61K84k17l42J66M8j72Q1M68p4o73j13N21K79k14k82o2N8
2409a28J57n2L8K90m01n23L88P92l08n76J16J70m6L29ok53L6k12k12P34M74r15
2431a08m82N60K05j63L63j20n69K8J44K01M32m3r08k35R11Q7l49K36k8o41P5O16
2453B12J92j69k89m54K44P31n0p13J92L43n37M8Q72k85p80J34M38l7K31j72p41
2474e90L00O25l55LN46p10q57Q95Q44m40k25p1o13K45Q83j31k74L28p10o08J159
2495B44O69q52l42L39k48o3O06p4n04K52j36k92O98K41j097p5J030j62n63L97
2515F8K8o81M20O53k58j00o7q24L90J197k37q11L08j25o32O52Q49m14o10Pl92
$$ plain form
2536 -579 -192 557 323 -269 -41 -23 -518 -169 599 170 -463 -128 157 -37 -9 -42 -212 122 333 -24 -96
2557 -96 283 -82 -509 344 812 -72 -441 -117 -145 -57 474 371 -189 -217 -292 -510 347 728 -215 -491 17 -162
2579 -162 -239 377 358 -219 -105 -56 -139 227 272 -242 -96 364 57 -280 7 187 -25 12 103 186 -158 -410 -245
2602 -245 239 285 72 -147 -247 -107 -131 -68 404 452 -312 -526 -17 125 -19 302 261 -236 -161 -116 -190 332 533
2625 533 -174 -284 197 -150 -336 284 383 -112 -125 -35 -241 31 119 -105 -73 261 -156 -454 -39 180 -78 -102
2647 -102 345 119 -301 -262 61 223 309 244 -189 -198 1 -149 99 678 380 -590 -382 151 69 185 521 -100
2669 -100 -487 -158 -53 52 529 184 -715 -240 340 -94 -121 411 -3 -481 92 253 -105 97 44 -315 176
2690 176 560 -269 -428 164 50 -186 430 403 -462 -536 -44 155 337 481 -353 -697 -61 186 63 466 276
$$ packed form
2536e79L87P49k34n92K28J8m95L49P68m29o33L35K85j94K8l3j70L34K11l57p2
2557i6L79l65m27Q53M68q84l69L24k8Q8N31j03n60k8p5k18Q57L81r43k76N08j79
2579a62p7O16j9n77J14M9q3L66M5n14J46M60l07l37K87J80k12L7R1Q3l44k52J65
2602b45M84M6k13k19j00J40k4O3M72M8p64k14N09J42j44L21m1m97P5M5p4N22K01
2625E33p07j10M81l47j86O20R9m95j3R0k06K72Q8k24L2L34m17k98M15K19k58k4
2647a02M47k26m20L9L23J62Q6o5m33rJ99j50K48N79k98r70K08N33q2J16L36o21
2669a00l87L29J05J05M77l45q99M75N80m34k7N32m14m78N73J61l58K02n3l59M91
2690A76L84q29j59N92j14k36O16k7q65p4M92J99J82J44q34l44O36K47j23M03j90
$$ plain form
2711 276 -711 -575 358 437 179 90 -270 -471 16 442 108 109 37 -465 -211 624 425 -360 -312 -42 -106 292
2733 292 396 -215 -444 -120 -69 255 587 -101 -859 -219 440 242 147 106 -448 -576 240 532 342 218 -385
2754 -385 -655 136 727 210 -151 -167 -394 -233 424 529 -116 -417 -436 -140 432 493 -222 -537 -181 4 186
2775 186 509 154 -605 -527 124 546 445 3 -459 -371 168 426 280 193 -290 -591 -91 656 563 -90 -472
2796 -472 -324 -8 375 370 -46 -365 -427 -138 361 536 -26 -637 -484 159 330 337 53 -367 -507 -29 327 467
2818 467 174 -433 -549 61 594 338 -32 -283 -418 -222 391 453 100 -426 -636 -94 548 421 -86 -283
2838 -283 -353 -144 252 434 113 -325 -476 -59 432 441 6 -379 -255 26 261 346 176 -224 -418 -155 380
2859 380 466 45 -378 -398 -48 224 251 -29 -265 -356 -180 181 486 95 -434 -337 27 278 351 56 -175 -272
$$ packed form
2711B76r87J36R33P9k58q9l60k01M87M26l34Jp2n02K54Q35j99p85M8K70o4L98
2733B92J04o11k29L24N1L24L32o88p58O40O59j98r5m1n54j28Q16K92j90j24o03
2754c85k70P91N91n17l61j6k27J61O57J05o45l01j9K96N72O1p15l15L56J85J82
2775A86L23l55p59P8O51M22j01m42m62Q8N39K58j46q7m83l01N00P47r3o53l82
2796d72J48L16L83nm16l19o2K89M99J75n62o11J53O43J71Pk84m20j40M78L56J40
2818D67k93o07j16O10N33k56l70k51j35J96O13O2l53n26k10N42O42j27n07j97
2838b83p0K09L96J82l21m38j51M17M91Rm35l85J24K81K35Q5j70m00j94K63N35
2859C80Q6m21m23k0L50K72K7k80k36r1J76L61L05l91n29R7L64K51P3k95k31r7
$$ plain form
2881 -272 -80 193 422 160 -290 -372 46 302 214 30 -182 -268 -158 112 278 139 -187 -378 -115 252 175
2902 175 -28 -216 -148 -104 120 191 124 -141 -260 -55 216 304 90 -183 -87 13 106 104 128 -55 -246 -103 255
2925 255 257 33 -149 -244 -28 103 84 19 -24 -142 -175 56 180 18 -107 -112 28 86 45 115 -14 -38 -54 8 77
2950 77 131 -34 -75 32 152 46 -22 48 34 -30 -26 65 -5 -71 -176 -68 52 181 -101 -138 60 14 -103 45 160
2975 160 41 -75 -46 38 18 33 46 47 41 -88 -186 -10 198 64 -122 58 28 -174 -89 188 53 -131 -95 -112 -91
3000 -91 162 60 -126 40 69 -175 -27 235 -61 -144 154 115 -32 53 -30 -143 152 265 -68 -23 64 -181 -207
3023 -207 306 261 -197 -134 -108 -164 52 300 35 -237 -83 -150 -192 295 312 -238 -160 179 -96 -85 326 89 -252
3046 -252 110 136 -116 92 181 -266 -79 446 12 -329 86 -55 -281 305 389 -234 -213 -45 -290 23 530
$$ packed form
2881b72J92K73K29k62m50q2M18K56q8j84k12q6J10K70J66j39l26j91K63L67p7
2902A75k03j88O8M4K24P1o7k65j19K05K71Q8k14k73R6J00R3kK4j83j91J43L58
2925B55Kk24j82r5K16J31j9o5m3j18l3K31J24j62j25nJ40N8m1P0j29k4j6O2O9
2950G7N4j65m1J07J20j06o8P0j4o4MR1p0o6j05J08J20J29k82l7J98m6j17J48J15
2975A60j19j16K9Q4k0J5J3Joj29r8J76K08j34j86J80l0k02Q5K77j35j84L6j7K1
3000i1K53j02j86J66K9k44J48K62k96q3K98l9j47Q5q3j13K95J13l33M5Q7k45k6
3023b07N13m5m58O3K6n6K16K48k65k72J54o7m2M87J7n50P8L39k75J1M11k37l41
3046b52L62K6k52K08Q9m47J87N25m34l41M15j41k26N86Q4o23K1J68k45L13N07
$$ plain form
3067 530 68 -392 -2 -28 -253 290 451 -212 -286 75 1 -25 345 44 -304 58 147 -150 36 285 -180 -244
3089 -244 350 179 -398 -74 84 -203 215 413 -258 -390 84 19 -19 529 238 -547 -167 195 -25 303 504
3110 504 -248 -443 86 97 -78 411 186 -552 -80 355 -149 -71 349 -164 -365 166 106 -282 81 86 -233 100
3132 100 294 -310 -376 258 94 -105 296 144 -459 -244 258 132 179 227 -236 -436 101 211 -57 137 139 -426
3154 -426 -248 353 43 -90 113 -116 -308 131 172 -146 48 182 -204 -73 342 -15 -322 188 211 -103 76
3175 76 165 -219 -127 290 148 -4 206 -187 -364 144 321 -15 -11 29 -299 -191 233 155 -41 15 -66 -237 144
3198 144 223 -113 -47 38 -134 -124 219 43 -100 -16 68 72 154 29 -164 -82 179 89 -38 56 -11 -147 -11 209
3222 209 4 -87 -71 -125 -45 116 134 -34 -19 -27 -74 48 164 89 -143 38 136 -27 71 55 -44 -35 85 -13 6 23
$$ packed form
3067E30m62m60L90k6k25N43J61o63p4L61p4k6L70l01l48L62Q9k97J86K49m65o4
3089b44N94j71n77L24J58k87M18J98o71j32M74o5l8N48k91p85L80L62k20L28K01
3110E04p52j95N29J1j75M89k25p38M72M35n04P8M20n13k01N31o0l88L63Nl19L33
3132A00J94o04o6O34j64j99M01j52o03K15N02j26M7M8m63k00N37J10k68J94Kn65
3154d26J78O01l10j33K03k29j92M39M1l18J94J34l86J31M15l57l07N10K3l14J79
3175G6Q9l84R2M17j42j52K10l93j77N08J77l36MM0l28J08M24p8j96N6q1j71L81
3198A44P9l36O6Q5j72J0L43j76j43Q4Q4MQ2j25j93Q2K61r0j27R4o7j36J36K20
3222B09k05r1J6n4Q0J61J8j68J5qm7J22J16p5k32J81R8j63R8j6r9RJ20r8J9J7
$$ plain form
3248 23 -75 -158 139 108 -100 -63 -54 -78 -28 87 21 -36 -42 -99 26 158 11 -27 -25 7 2 45 37 61 -95 -47 -40 48 34 -27
3278 -27 35 23 -14 31 8 -29 -28 -46 -68 61 78 -78 -78 -27 20 -11 -36 -47 1 -15 -26 45 104 -3 -13 34 150 40 -26
3307 -26 39 70 56 36 -48 6 15 -32 -108 17 -3 -54 9 -34 12 -68 -116 36 7 -50 -1 -18 2 -22 -4 24 84 -19 -25 4
3337 4 106 39 -35 -31 7 33 0 35 63 41 -53 -14 34 52 -31 -83 -60 35 -61 -59 44 -47 -97 -39 28 47 63 -142 -54 12
3367 12 38 -9 30 13 -28 -112 10 130 40 -75 -131 10 55 78 12 -56 -99 -83 -30 109 53 -71 -144 19 64 106 -45
3394 -45 -19 -30 31 22 56 74 -21 -235 -10 143 128 -11 -66 -1 -48 18 57 25 -48 -177 -170 71 104 -8 -165 -93 16
3421 16 -5 117 95 46 -226 -130 71 166 23 -73 -123 63 107 42 87 -10 -61 -101 70 144 -43 -120 -149 -68 114 116 -51
3448 -51 -86 -83 -97 -18 133 37 -165 -215 -60 122 111 -24 -107 -50 -10 65 115 169 -32 -191 -17 197 107 56 -52 -56
$$ packed form
3248B3r8q3K97l1k08L7Rk4N0J15o6n7on7J25J32j47l8KL2nM3qK4j56M8PQ8j4o1
3278b7O2j2l7M5k3l7Jj8k2J29J7j56%N1M7l1k5j1M8j6j1P1N9j07j0M7J16j10o6
3307b6O5L1j4k0q4N4Rm7p6J25k0n1O3m3M6q0m8J52k9n7M9j7K0k4J8K8O0j03oK9
3337DJ02o7p4ML8K6l3L5K8k2r4L9M8J8q3n2K3R5r6KJ03r1n0N8O7J9J6k05Q8O6
3367A2K6m7L9j7m1q4J22J20r0j15n6J41M5K3o6o8m3J6N3J39n6j24p3J63M5M2j51
3394d5K6j1O1rL4J8r5k14K25J53j5j39n5O5m7O6L9l2p3j29PK41L3j12j57P2J09
3421A6k1J22k2m9k72R6K01R5j43r6n0J86M4o5M5r7n1m0J71P4j87p7k9Q1J82Kj67
3448e1l5Lj4P9J51r6k02n0J55J82j1j35q3N7M0P5N0N4k01j59J74K14r0n1j08m
$$ plain form
3474 -56 -67 92 68 38 46 -120 -207 106 223 -50 -235 -51 10 -42 104 56 -98 -89 -104 58 225 155 -222 -276 45
3499 45 142 79 91 17 -192 -100 106 121 8 -57 -193 -82 163 107 -151 7 -23 -209 -27 179 29 -146 -56 18
3523 18 40 180 16 -155 0 91 20 93 185 -31 -203 -6 189 80 7 -61 -244 -23 134 -8 33 73 -193
3546 -193 -226 50 209 -50 -113 -10 -45 -9 115 35 1 40 -66 -36 144 62 -201 -62 103 86 6 25 1 -77 -32
3571 -32 96 93 24 -100 -210 -95 182 67 -113 15 -8 -177 -28 110 100 -41 -119 -82 7 104 -2 -38 97 90
3595 90 -95 -4 140 103 -94 -15 69 12 -20 -30 -17 87 49 -59 17 35 -101 -107 73 115 -74 -206 -32 18 24 -64
3621 -64 26 40 27 -122 -21 110 144 -67 -95 -4 -15 -115 -48 79 61 -5 -77 -11 7 -1 -62 69 88 -40 -142 34
3647 34 127 -35 -21 27 37 -50 -82 56 78 31 -106 -117 42 52 -60 -25 140 116 -71 -56 54 57 -51 73 25 38
$$ packed form
3474e6j1J59k4l0Qj66q7L13J17k73j85J84O1n2J46m8j54Rj5J62J67p0l77n4L21
3499D5R7o3J2p4k09R2K06J5j13o5j36J11K45n6k58J58l0j86J82K06j50j75R0P4
3523A8K2J40j64j71J55R1p1P3R2k16j72J97J95j09p3o8j83K21J57j42M1M0k66
3546a93l3K76J59k59o3J03l5L6J24q0l4L9j06L0J80q2k63J39J65j7q0J9k4p8M5
3571c2J28lo9j24j10J15K77j15j80J28k3j69J49J38j0j41p8L7Q9R7j06l6J35p
3595I0j85R1J44l7j97P9Q4n7l2j0J3J04l8j08P6J8j36oJ80M2j89j32J74N0Oq8
3621f4R0J4j3j49J01J31L4k11k8R1j1j00O7J27j8o6p2O6J8qo1J31J9j28j02J76
3647C4R3j62J4M8J0q7l2J38K2m7j37j1J59J0j12L5J65k4j87J5J10Lj08J24m8J3
$$ plain form
3673 38 -25 -102 -29 129 58 -100 -126 -2 -41 -135 66 132 -6 -61 -32 37 78 35 -73 -10 79 -53 -125 75 100 -66
3699 -66 -54 102 13 -63 -82 -43 32 1 -9 -53 -45 -35 -106 -18 156 6 -238 -53 26 45 19 6 -77 -24 -53 -50 159 143
3727 143 -66 -191 -22 91 10 0 109 -50 -62 -19 18 16 1 -180 -100 134 86 -99 -86 37 -60 -37 59 34 -79
3752 -79 -132 -44 98 150 1 -200 -24 97 -5 -56 56 32 -164 -109 99 144 31 -34 -94 -10 41 -80 -17 8 -43
3777 -43 -179 47 184 -12 -95 -113 48 56 59 -30 -37 27 -51 -21 108 121 -135 -125 91 153 -2 -41 -41 -33 -52 -10 24 48
3805 48 -53 -209 -14 122 93 -83 -97 -37 -50 -16 94 66 -74 -128 -67 142 202 -35 -145 6 81 5 13 63 17
3830 17 -150 -103 136 131 -5 -125 -126 40 96 -58 -82 -25 -95 -111 55 140 47 -107 -105 49 109 68 2 20 43 -102 -42
3857 -42 141 91 -116 -143 -18 111 95 -71 -62 27 -21 -83 42 117 -46 -183 -20 82 65 -48 -66 -14 32 2 31
$$ packed form
3673C8o3p7P3J58p1j58k6J24l9r4K01O6j38n5K9O9M1m3j08O3Q9j32p2K00K5j66
3699f6J2J56q9p6j9L9P5l1j0m4QJ0p1Q8J74j50k44J85P9J9k6j3q3N3k9LK09j6
3727A43k09j25J69J13q1j0J09j59j2M3L7kj5j81Q0K34m8j85J3J23r7K3R6k5j13
3752g9n3Q8J42N2j49k01J76J21j02n1J12k4j96N5K08M5j13o5o0Q4N1j21O3K5n1
3777d3j36K26J37j96q3j8J61QLq9pO4p8L0J29J3k56J0K16O2j55l9%Qj9M2L4K4
3805D8j01j56J95J36k9j76j4O0j3L4J10k8j40n4O1K09O0k37j10J51P5p6QN0m6
3830A7j67M7K39nj36j20jJ66N6j54k4N7p0j6J66Q5r3j54KJ54O0m1o6J8K3j45O0
3857d2J83n0k07k7J25J29j6j66RQ9m8o2J25P5j63j37J63J02j7j13j8N2M6l0K9
$$ plain form
3882 31 77 18 -70 -111 79 99 -77 -110 -56 39 29 -13 3 -34 -64 -133 -19 117 75 -153 -102 58 61 -28 -10 -20 -9 -100
3910 -100 -52 78 59 -104 -106 32 86 17 -61 -16 0 -38 -89 128 110 -76 -92 -7 104 35 -90 -81 2 44 -38 -11 52
3937 52 1 -116 -113 96 60 -78 -87 -6 53 50 22 41 61 27 -100 18 167 54 -97 15 109 19 -50 -2 27 -26 -89
3964 -89 1 48 18 -104 -65 85 132 -77 -129 -31 41 -107 -55 32 30 -34 -51 41 126 43 -71 63 62 36 -124 29 151
3991 151 55 -92 32 57 -16 -106 -1 31 34 -73 -62 17 83 -42 -112 83 38 -157 -50 94 -31 -21 2 -7 16 34
$$ packed form
3882C1M6n9q8m1J90K0j76l3N4R5j0m2J6l7l0o9J14J36m2k28N1J60Lq9J8j0J1r1
3910a00M8J30j9j63kJ38N4o9p8M5J6l8n1K17j8j86j6Q5J11o9j25RQ3M2q2K7O3
3937E2n1j17LK09l6j38rQ1N9lk8J9K0l4j27J18J49j13j51J12R4r0o9M8K9n3o3
3964h9R0M7l0j22L9J50M7k09n2R8P2j48N2Q7ko4j7R2Q5q3j14J34jk6j60J53J22
3991A51r6j47J24K5p3r0J05L2Lj07J1P9O6j25p0J95m5j95J07J44j25J0K3rK3J8
$$ [...]
8191b2
##END NTUPLES=NMR FID
##END=
