##TITLE=1H_E3e-2
 aceton-d6
 8 sc, 
 15.6.2023
##JCAMPDX= 6.0         $$ Bruker NMR JCAMP-DX V2.0
##DATA TYPE= NMR FID
##DATA CLASS= NTUPLES
##ORIGIN= UXNMR, Bruker Analytische Messtechnik GmbH
##OWNER= root
$$ XWIN-NMR		Version 3.5
$$ Thu Jun 15 11:01:15 2023 Russian Standard Time (UT+4h)  she@DPX200
##.OBSERVE FREQUENCY= 200.13135
##.OBSERVE NUCLEUS= ^1H
##.DELAY= (6, 6)
##.ACQUISITION MODE= SIMULTANEOUS
##.ACQUISITION SCHEME= undefined
##.AVERAGES= 8
##.DIGITISER RES= 18
##SPECTROMETER/DATA SYSTEM= spect
##.PULSE SEQUENCE= zg30
##.SOLVENT NAME= Acetone
##.SHIFT REFERENCE= (INTERNAL, Acetone, 0, 15.7039)
##AUDIT TRAIL= $$ (NUMBER, WHEN, WHO, WHERE, WHAT)
$$ ##TITLE= Audit trail, XWIN-NMR		Version 3.5
$$ ##JCAMPDX= 5.01
$$ ##ORIGIN= Bruker BioSpin GmbH
$$ ##OWNER= she
$$ F:/spectra/data/she/nmr/H-F/1/audita.txt
$$ ##AUDIT TRAIL=  $$ (NUMBER, WHEN, WHO, WHERE, WHAT)
(   1,<2023-06-15 10:58:02.64 +0400>,<she>,<DPX200>,
      <created by zg, POWCHK disabled, PULCHK disabled
       configuration hash MD5:
       00 E9 B6 7A A2 85 ED C7 34 08 36 98 17 FE 4E 26
       data hash MD5: 16K
       A2 03 8E FF 79 CE 79 E8 A7 71 3F C8 E3 54 E4 88>)
$$ ##END=
$$ 
$$ hash MD5
$$ 70 38 BC E7 B4 63 B2 0D 32 D3 4A 85 D6 00 21 84
##$RELAX= 
##$RELAX= 
##$RELAX= 
##$RELAX= 
##$RELAX= 
##$RELAX= 
$$ Bruker specific parameters
$$ --------------------------
##$DU= <F:/spectra>
##$EXPNO= 1
##$NAME= <H-F>
##$PROCNO= 1
##$TYPE= <nmr>
##$USER= <she>
##$AMP= (0..31)
100 100 100 100 100 100 100 100 100 100 100 100 100 100 100 100 100 100 
100 100 100 100 100 100 100 100 100 100 100 100 100 100 
##$AQSEQ= 0
##$AQ_mod= 1
##$AUNM= <au_zg>
##$AUTOPOS= <>
##$BF1= 200.13
##$BF2= 200.13
##$BF3= 200.13
##$BF4= 200.13
##$BF5= 200.13
##$BF6= 200.13
##$BF7= 200.13
##$BF8= 200.13
##$BYTORDA= 1
##$CFDGTYP= 0
##$CFRGTYP= 5
##$CHEMSTR= <none>
##$CNST= (0..31)
1 1 145 1 1 1 1 1 1 1 1 1 1 1 1 1 1 1 1 1 1 1 1 1 1 1 1 1 1 1 1 1 
##$CPDPRG= <>
##$CPDPRG1= <>
##$CPDPRG2= <>
##$CPDPRG3= <>
##$CPDPRG4= <mlev>
##$CPDPRG5= <mlev>
##$CPDPRG6= <mlev>
##$CPDPRG7= <mlev>
##$CPDPRG8= <mlev>
##$CPDPRGB= <>
##$CPDPRGT= <>
##$D= (0..31)
0 1.2 0 0 0 0 0 0 0 0.06 0 0.03 0 0 0 0 0.0002 0 0 0 0 0 0 0 0 0 0 0 0 
0 0 0 
##$DATE= 1686812282
##$DBL= (0..7)
120 120 120 120 120 120 120 120 
##$DBP= (0..7)
150 150 150 150 150 150 150 150 
##$DBP07= 0
##$DBPNAM0= <>
##$DBPNAM1= <>
##$DBPNAM2= <>
##$DBPNAM3= <>
##$DBPNAM4= <>
##$DBPNAM5= <>
##$DBPNAM6= <>
##$DBPNAM7= <>
##$DBPOAL= (0..7)
0.5 0.5 0.5 0.5 0.5 0.5 0.5 0.5 
##$DBPOFFS= (0..7)
0 0 0 0 0 0 0 0 
##$DE= 6
##$DECBNUC= <off>
##$DECIM= 32
##$DECNUC= <off>
##$DECSTAT= 4
##$DIGMOD= 1
##$DIGTYP= 9
##$DL= (0..7)
0 120 120 120 120 120 120 120 
##$DP= (0..7)
150 150 150 150 150 150 150 150 
##$DP07= 0
##$DPNAME0= <>
##$DPNAME1= <>
##$DPNAME2= <>
##$DPNAME3= <>
##$DPNAME4= <>
##$DPNAME5= <>
##$DPNAME6= <>
##$DPNAME7= <>
##$DPOAL= (0..7)
0.5 0.5 0.5 0.5 0.5 0.5 0.5 0.5 
##$DPOFFS= (0..7)
0 0 0 0 0 0 0 0 
##$DQDMODE= 0
##$DR= 18
##$DS= 0
##$DSLIST= <SSSSSSSSSSSSSSS>
$$ [...]
##$SUBNAM2= <"">
##$SUBNAM3= <"">
##$SUBNAM4= <"">
##$SUBNAM5= <"">
##$SUBNAM6= <"">
##$SUBNAM7= <"">
##$SUBNAM8= <"">
##$SUBNAM9= <"">
##$SW= 18.05172834244
##$SWIBOX= (0..15)
0 0 2 0 0 0 0 0 0 0 0 0 0 0 0 0 
##$SW_h= 3612.71676300578
##$TD= 16384
##$TD0= 1
##$TE= 0
##$TE2= 300
##$TE3= 300
##$TEG= 300
##$TL= (0..7)
0 120 120 120 120 120 120 120 
##$TP= (0..7)
150 150 150 150 150 150 150 150 
##$TP07= 0
##$TPNAME0= <>
##$TPNAME1= <>
##$TPNAME2= <>
##$TPNAME3= <>
##$TPNAME4= <>
##$TPNAME5= <>
##$TPNAME6= <>
##$TPNAME7= <>
##$TPOAL= (0..7)
0.5 0.5 0.5 0.5 0.5 0.5 0.5 0.5 
##$TPOFFS= (0..7)
0 0 0 0 0 0 0 0 
##$TUNHIN= 0
##$TUNHOUT= 0
##$TUNXOUT= 0
##$USERA1= <user>
##$USERA2= <user>
##$USERA3= <user>
##$USERA4= <user>
##$USERA5= <user>
##$V9= 5
##$VALIST= <valist>
##$VCLIST= <CCCCCCCCCCCCCCC>
##$VD= 0
##$VDLIST= <DDDDDDDDDDDDDDD>
##$VPLIST= <PPPPPPPPPPPPPPP>
##$VTLIST= <TTTTTTTTTTTTTTT>
##$WBST= 1024
##$WBSW= 4
##$XGAIN= (0..3)
0 0 0 0 
##$XL= 0
##$YL= 0
##$YMAX_a= 742784
##$YMIN_a= -741628
##$ZGOPTNS= <>
##$ZL1= 120
##$ZL2= 120
##$ZL3= 120
##$ZL4= 120
##$ABSF1= 10
##$ABSF2= 0
##$ABSG= 5
##$ABSL= 3
##$ALPHA= 0
##$AQORDER= 0
##$ASSFAC= 0
##$ASSFACI= 0
##$ASSFACX= 0
##$ASSWID= 0
##$AUNMP= <proc_1d>
##$AZFE= 0.1
##$AZFW= 0.1
##$BCFW= 1
##$BC_mod= 2
##$BYTORDP= 1
##$COROFFS= 0
##$CY= 11.3945322036743
##$DATMOD= 1
##$DC= 2
##$DFILT= <>
##$DTYPP= 0
##$F1P= 15.7292609196834
##$F2P= 12.9074282941183
##$FCOR= 0.5
##$FTSIZE= 0
##$FT_mod= 4
##$GAMMA= 1
##$GB= 0.15
##$INTBC= 1
##$INTSCL= 1
##$ISEN= 128
##$LB= 0.24
##$LEV0= 0
##$LPBIN= 0
##$MAXI= 10000
##$MC2= 0
##$MEAN= 0
##$ME_mod= 0
##$MI= 1.114404
##$NCOEF= 0
##$NC_proc= 0
##$NLEV= 6
##$NOISF1= 3.799351
##$NOISF2= 2.8
##$NSP= 1
##$NTH_PI= 0
##$NZP= 0
##$OFFSET= 15.70392
##$PC= 1
##$PHC0= -20783.86
##$PHC1= 9.452721
##$PH_mod= 1
##$PKNL= yes
##$PPARMOD= 0
##$PSCAL= 0
##$PSIGN= 0
##$REVERSE= no
##$SF= 200.130013532006
##$SI= 16384
##$SIGF1= 3
##$SIGF2= 2
##$SINO= 400
##$SIOLD= 16384
##$SREGLST= <1H.CDCl3>
##$SSB= 0
##$STSI= 0
##$STSR= 0
##$SW_p= 3612.71676300578
##$SYMM= 0
##$S_DEV= 0
##$TDeff= 0
##$TDoff= 0
##$TI= <>
##$TILT= no
##$TM1= 0
##$TM2= 0
##$TOPLEV= 0
##$USERP1= <user>
##$USERP2= <user>
##$USERP3= <user>
##$USERP4= <user>
##$USERP5= <user>
##$WDW= 1
##$XDIM= 8192
##$YMAX_p= 0
##$YMIN_p= 0
$$ End of Bruker specific parameters
$$ ---------------------------------
##NTUPLES= NMR FID
##VAR_NAME=  TIME,          FID/REAL,        FID/IMAG
##SYMBOL=    X,             R,               I
##VAR_TYPE=  INDEPENDENT,   DEPENDENT,       DEPENDENT
##VAR_FORM=  AFFN,          ASDF,            ASDF
##VAR_DIM=   8192,          8192,            8192
##UNITS=     SECONDS,       ARBITRARY UNITS, ARBITRARY UNITS
##FACTOR=    0.0002768,     1,               1
##FIRST=     0,             0,               0
##LAST=      2.2672688,     0,               0
##MIN=       0,             -741628,         0
##MAX=       2.2672688,     742784,          0
$$ Real data points
##PAGE= N=1
##DATA TABLE= (X++(R..R)), XYDATA
$$ [...]
$$ plain form
1516 -5305 9204 440 -9926 4701 4191 -4492 2021 311 -3817 899 573 1918 1213 -6743 -163
1531 -163 6307 -3517 -140 5859 -6908 -3693 9463 -67 -3684 3126 -2909 -1527 4679 -441 469
1546 469 -1585 -5894 6121 3621 -8129 3334 2032 -8944 5887 6835 -8714 -1249 3884 -1526
1560 -1526 2994 905 -3190 532 -2016 2378 7614 -6354 -5823 7569 -2089 -3321 8919 -3737
1574 -3737 -9428 6248 2776 -3468 2435 -1891 -2747 2011 -121 3643 488 -8353 3913 6855 -6826
1589 -6826 1881 5278 -9255 486 10013 -4169 -4351 2263 -1992 1318 2595 -2103 214 -3650 -2438
1604 -2438 9339 -808 -8143 6275 -565 -7128 9965 2891 -10029 2761 3191 -2833 3481 -53
1618 -53 -2733 296 -2455 4135 3871 -9091 -67 7171 -5979 312 7289 -7916 -3876 8785 -562
$$ packed form
1516e305J4509q764j0366J4627n10q683O513j710m128M716l26J345p05p956O580
1531a63O470r824L377N999j2767L215J3156r530l617O810o035J382O206n120R10
1546D69k054m309J2015k500j1750J1463j302j0976J4831R48j5549P465N133n410
1560a526M520k089m095L722k548M394N236j3968N31J3392r658j232J2240j2656
1574c737n691J5676l472o244N903m326q56M758k132L764l155q841J2266K942j3681
1589f826Q707L397j4533R741R527j4182j82O614m255L310J277m698K317l864J212
1604b438J1777j0147p335J4418o840o563J7093p074j2920J2790M30o024O314l534
1618e3k680L029k751O590k64j2962R024P238j3150O291O977j5205M040J2661r347
$$ plain form
1633 -562 -3018 2231 -2324 -324 2870 -122 2380 -2235 -5633 6028 2581 -6013 4414 492 -8716
1648 -8716 4976 5533 -5825 -42 856 -2585 2987 626 -1214 1310 -4068 1012 7459 -4716 -4027
1663 -4027 6226 -2540 -2584 7191 -2186 -6165 3312 1509 -372 829 -2797 -30 327 -1956 4962
1678 4962 460 -7799 3261 4288 -5308 2625 4145 -6213 -729 5429 -528 -1834 345 213 82
1693 82 -960 1405 2000 -4483 -1798 6131 -1097 -4985 3976 73 -5212 4642 3527 -5403 -925 2541
1709 2541 294 620 -229 287 -688 -2773 4016 3308 -6392 -181 5181 -4219 -1406 5498 -2646 -4106
1725 -4106 3591 1357 -2797 -287 1783 327 -2263 554 3779 -2401 -3397 5036 934 -4749 3258
1740 3258 2219 -5550 986 4708 -2283 -2417 1362 153 -1273 367 1960 -1036 -3606 1714 3567
$$ packed form
1633e62k456N249m555K000L194k992K502m615l398J1661l447q594J0427l922r208
1648h716J3692N57j1358N783Q98l441N572k361j840K524n378N080O447j2175O89
1663d027J0253q766m4R775r377l979R477j803j881J201l626K767L57k283O918
1678D962m502q259J1060J027r596P933J520j0358N484O158n957j306K179j32j31
1693H2j042K365N95o483K685P929p228l888Q961l903n285R854j115q930M478L466
1709B541k247L26q49N16r75k085O789p08r700O211N362r400K813O904q144j460
1725d106P697k234m154K510K070j456k590K817L225o180r96Q433m102n683Q007
1740C258j039p769O536L722o991j34L779j209j426J640J593k996k570N320J853
$$ plain form
1755 3567 -2959 -1443 3922 -1445 -2797 3941 935 -3890 1471 2554 -1607 -971 610 963 -756
1770 -756 -1590 2242 397 -4127 1775 2847 -3941 39 3490 -2467 -1724 2542 758 -1309 -78 1462
1786 1462 -305 -2097 1947 2769 -3197 -1614 3701 -762 -3169 2776 1181 -4013 527 3203 -2145
1801 -2145 -2256 2307 1396 -2194 -662 2477 -368 -2536 2641 2204 -3866 -132 3966 -1704 -2369 3116
1817 3116 566 -3366 558 2523 -1788 -1813 2246 858 -3240 -407 3410 -1116 -2873 3140 1296
1832 1296 -4123 1289 3863 -2645 -1675 3302 252 -2837 771 2665 -1576 -2299 2621 615 -4026
1847 -4026 972 3314 -2914 -1975 3384 -395 -3286 2270 2490 -2937 -722 3272 -471 -2354 1833
1862 1833 2170 -2061 -1345 2769 -52 -3239 1945 2419 -3713 -1008 3085 -1172 -1992 1863 595 -2016
$$ packed form
1755C567o526J516N365n367j352O738l006m825N361J083m161O36J581L53j719
1770g56q34L832j845m524N902J072o788L980L451n957P43M266j784k067J231J540
1786A462j767j792M044Q22n966J583N315m463k407N945j595n194M540K676n348
1801b145j11M563r11l590J532L139k845k168N177m37o070L734M098n670o65N485
1817C116k550l932L924J965m311k5M059j388m098K833L817m526j757O013j844
1832A296n419N412K574o508R70M977l050l089L608J894m241p23M920k006m641
1847d026M998K342o228R39N359l779k891N556K20n427K215L994l743j883M187
1862A833L37m231P16M114k821l187N184M74o132K705M093m257q20L855j268k611
$$ plain form
1878 -2016 -384 2056 332 -2065 913 2351 -1932 -1130 3163 -313 -2807 2190 1584 -3024 -230
1893 -230 2155 -959 -1603 903 906 -1600 -1492 2358 906 -3225 1218 2777 -3230 -501 4231 -1084
1909 -1084 -2434 2222 798 -1859 432 1800 -533 -2234 513 2222 -1989 -1872 2912 -473 -3598
1924 -3598 2711 1800 -4109 556 3293 -1678 -1006 1672 62 -744 64 2087 418 -3486 961 3489
1940 3489 -3178 -986 3907 -2723 -3131 3863 370 -3170 965 1072 -1452 -512 1431 1371 -1881 -1450
1956 -1450 3676 280 -3546 3002 1721 -4828 1974 4167 -4283 -1514 3260 -1119 -1182 1163 -299
1971 -299 -1338 -1391 1822 2578 -3384 -1388 3933 -1739 -1711 5003 -1010 -4388 3291 1889 -2334 1073
1987 1073 571 -1513 3 271 1151 -333 -3445 1452 2514 -3575 654 2812 -4262 -164 4801 -1731
$$ packed form
1878b016J632K440j724k397K978J438m283Q02M293l476k494M997o06m608K794
1893b30K385l114o44K506Lk506J08L850j452m131M443J559o007K729M732n315
1909a084j350M656j424k657K291J368k333j701K747J709m211J17M784l385l125
1924c598O309r11n909M665K737m971O72K678j610q06Q08K023j669l904M447K528
1940C489o667K192M893o630m08O994l493l540M135J07k524R40J943o0l252M31
1956a450N126l396l826O548j281o549O802K193q450K769M774m379o3K345j462
1971b99j039n3L213P56n962J996N321n672K8O714o013l378P679j402m223L407
1987A073n02k084J516K68Q80j484l112M897J062o089M229K158p074M098M965o532
$$ plain form
2003 -1731 -1867 1752 -580 405 1418 -211 447 -1810 -1216 4206 -114 -3978 2385 98 -3981 3482
2019 3482 2102 -5035 57 2321 -1335 868 565 -1177 484 -845 1381 3076 -3760 -1188 4621
2034 4621 -2502 -1187 4898 -3177 -3807 4318 432 -1971 837 -1635 -657 1256 -244 1854 -1016
2049 -1016 -4382 3603 3254 -4067 1834 2116 -5055 1988 4925 -3253 -1377 1552 -1199 1005 475 -1031
2065 -1031 705 -2616 -494 4924 -2547 -3714 4279 -1548 -2942 5826 -180 -5321 2285 1965 -770
2080 -770 1737 -791 -1468 512 -531 2935 1135 -5778 739 3937 -3707 1061 3325 -5756 -954
2095 -954 5180 -1513 -1210 959 -1857 1016 1467 -363 1467 -2251 -2007 5024 213 -3749 2721 -622
2111 -622 -3566 4027 1720 -4132 -20 525 -708 1817 -390 -1193 361 -1938 1527 3875 -3403 -1636
$$ packed form
2003a731j36L619k332R85J013j629O58k257N94N422m320l864O363k287m079P463
2019C482j380p137N092K264l656K203l03j742J661j329K226J695o836K572N809
2034D621p123J315O085q075o30Q125l886k403K808k472R78J913j500K098k870
2049a016l366P985l49p321N901K82p171P043K937q178J876K929k751K204n30j506
2065a031J736l321K122N418p471j167P993n827j394Q768o006n141P606l20k735
2080g70K507k528o77J980j043L466j800o913O517L198p644M768K264r081M802
2095i54O134o693L03K169k816K873M51j830J830l718K44P031m811l962O470l343
2111f22k944P593k307n852M112N45j233K525k207q03J554k299L465K348p278J767
$$ plain form
2127 -1636 3663 -2047 -358 4623 -2556 -3323 2886 556 -416 529 -2064 -130 704 -651 2233 -964
2143 -964 -4480 2868 2790 -3509 1273 1610 -3967 1287 3688 -1782 -792 468 -673 1261 96 -402
2159 -402 1316 -2619 -1170 4194 -1309 -2951 2906 -1180 -2702 3712 679 -3277 538 939 199 889
2175 889 -777 26 311 -1411 2470 1841 -4261 142 3414 -2715 -144 3114 -3239 -1896 3010 -170
2191 -170 -940 97 -827 564 -236 -171 2510 -1758 -2453 3835 276 -2879 2783 281 -3402 2063 1846
2208 1846 -2121 -360 382 -166 229 -519 442 48 -2335 1165 2627 -2531 -766 2463 -1558 -652 3046
2225 3046 -741 -2039 1143 720 64 -107 -545 487 -598 -798 2008 -388 -2620 1552 1128 -2296
2241 -2296 687 1503 -1924 -201 1779 -230 -600 228 442 373 -603 542 1214 -1887 -559 2520 -936
$$ packed form
2127a636N299n710J689M981p179p67O209k330r72R45k593J934Q34j355K884l197
2143i64l516P348p8o299M782L37n577N254K401n470R90J260j141J934j165m98
2159d02J718l935J449N364n503j642N857m086j522O414l033l956L815M01p40O90
2175H89j666Q03K85j722L881o29o102M403L272o129K571L258o353J343M906l180
2191a70p70J037r24J391q00O5K681m268o95O288l559l155N662k502l683N465k17
2208A846l967J761P42n48L95p48R61l94k383L500J462n158J765L229m021R06L698
2225C046l787j298L182m23o56j71m38J032j085k00K806k396k232M172m24l424
2241b296K983Q16l427J723J980k009l70Q28K14o9r76J145O72l101J328L079l456
$$ plain form
2258 -936 -1698 1671 -455 -1747 1327 761 -1268 -453 570 459 -492 -334 1079 -336 -1169 1488 828
2275 828 -1845 377 1694 -1129 -714 1447 -271 -1330 613 813 -805 -632 530 326 -1051 -25
2291 -25 1513 -863 -1416 1776 558 -1687 923 1242 -1450 -169 1593 -182 -1045 425 811 -787
2307 -787 -713 1139 170 -1668 440 1366 -1529 -787 1856 -474 -1451 1331 604 -1312 213 1199 -199
2324 -199 -778 545 888 -895 -455 1496 -216 -1492 941 781 -1438 0 1222 -705 -947 918
2340 918 359 -922 88 850 -163 -768 517 859 -793 -328 1392 -399 -1212 1161 513 -1325 306
2357 306 784 -745 -578 516 365 -792 -429 1026 -180 -1166 905 730 -1218 148 1200 -702 -615
2374 -615 1130 221 -900 276 705 -490 -596 555 498 -910 -341 1037 -463 -1027 1117 420 -1451
$$ packed form
2258i36p62L369k126j292L074n66k029Q15J023j11r51J58J413j415q33K657o60
2275H28k673K222J317k823M15K161j718j059J943K00j618J73J162k04j377J026
2291b5J538k376n53L192j218k245K610L19k692J281J762j775q63J470L86j598
2307g87P4J852r69j838K108R26k895P42K643k330r77K782p27j916J525R86j398
2324a99n79J323L43j783M40J951j712j276K433j60k219J438J222j927k42J865
2340I18n59j281J010P62j013o05J285L42j652M65J720j791q13K373o48j838J631
2357C06M78j529J67J094j51j157L63J455j206r86K071j75j948J366J052j902Q7
2374f15J745r09j121J176M29j195j06J151n7j408N69J378j500n64K144o97j871
$$ plain form
2391 -1451 377 878 -643 -257 711 76 -530 147 793 -228 -837 731 772 -1121 -96 1051 -874
2408 -874 -746 1284 -93 -1366 502 613 -625 -202 502 234 -628 -121 1247 -340 -1000 1310 312
2425 312 -1485 942 1099 -1263 -182 1013 -436 -564 397 192 -640 -442 740 307 -1137 -50 1085
2442 1085 -707 -395 1416 -563 -1233 1401 573 -1018 281 324 -352 75 120 258 -445 -926 970 440
2460 440 -1375 531 758 -1477 156 1244 -846 -364 759 -103 -177 258 200 144 -597 -15 1194 -509
2478 -509 -901 1150 -341 -1137 1493 116 -1675 548 550 -525 269 -185 -342 65 -219 799 446 -1499
2496 -1499 447 1241 -1033 131 1108 -1270 -358 1379 -411 -609 307 -278 81 168 -306 463 -551 -859
2514 -859 1416 194 -1419 1076 219 -1422 1221 792 -1111 196 223 -112 624 -234 -99 93 -949
$$ packed form
2391a451J828N01j521L86R68o35o06O77O46j021o09J568M1j893J025J147j925
2408h74J28K030j377j273J868J11j238M23P04k68q62N07J368j587o60K310r98
2425C12j797K427J57k362J081J195j449j28R61k05q32J98J182m33j444J087J135
2442A085j792L12J811j979o70K634q28j591J299M3o76M27M5J38p03m81J896n30
2460D40j815J906K27k235J633J088k090M82J123q62p4M35n8n6p41N82J209j703
2478e09l92K051j491p96K630j377j791K223Kj075P94m54j57M07k84J018l53j945
2496a499J946P94k274J164R77k378R12J737j790j98R16n85L59Q7m74P69j014l08
2514h59K275j222j613K495q57j641K643m29j903J307K7l35P36q58J35J92j042
$$ plain form
2531 -949 659 1142 -1430 -545 1192 -794 -184 1375 -868 -1099 1091 370 -298 187 -323 118 235 -156
2549 -156 831 -266 -1408 1160 720 -1329 660 446 -1546 456 941 -821 -135 25 -306 371 5
2566 5 24 350 -876 -1 1488 -482 -712 1048 -434 -664 1435 -154 -1232 492 45 -156 440 -506
2584 -506 -207 85 -585 880 497 -1560 268 968 -879 449 912 -1216 -208 1125 12 -75 30
2601 30 -421 258 60 -144 514 -624 -984 1225 53 -1119 919 -50 -1169 1128 602 -876 325
2618 325 -105 -131 778 -221 -33 168 -941 605 1102 -1215 -381 814 -806 31 992 -817 -726 546
2636 546 74 138 72 -511 271 96 -280 1010 -93 -1193 922 518 -959 740 306 -1186 454 653
2654 653 -460 -75 -294 -169 356 -195 130 198 -950 13 1224 -585 -457 838 -431 -388 1077 21
$$ packed form
2531i49J608M83k572Q85J737j986O10J559k243k31K190p21o68M85n10M41J17l91
2549a56R87j097j142K568m40k049J989k14j992K002M85j762O86J60l31O77l66
2566EJ9L26j226Q75J489j970k30J760j482k30K099j589j078J724m47k01N96r46
2584e06K99K92o70J465l83k057J828P00j847J328M63k128J008J333j113q7J05
2601C0m51O79j98k04O58j138l60K209j172j172K038r69j119K297n26j478J201
2618C25m30k6R09r99J88K01j109J546M97k317Q34J195j620Q37R61j809R1J272
2636E46m72O4o6n83P82j75l76J290j103j100K115m04j477J699m34j492J640J99
2654F53j113L85k19J25N25n51L25O8j148R63J211j809J28J295j269M3J465j056
$$ plain form
2672 21 -610 239 52 61 188 -349 72 -97 -640 807 298 -1184 323 512 -727 513 453 -817 3
2691 3 536 164 20 -178 12 216 -87 141 454 -600 -428 758 -103 -632 544 -56 -821 436 331
2710 331 -476 -18 11 40 238 -142 260 132 -609 516 622 -771 29 557 -473 4 599 -333 -417 226
2730 226 77 -14 -62 -112 113 -194 -155 634 -127 -631 617 248 -579 527 305 -686 186 296 -149 11 -167
2751 -167 100 72 -382 215 158 -741 100 551 -507 -245 502 -231 -380 515 161 -332 121 255 65 1 -33
2772 -33 270 -137 -383 562 167 -812 284 296 -716 230 339 -538 -75 245 107 -109 -168 314 90 -309
2792 -309 283 344 -430 -64 555 -191 -415 401 38 -447 149 195 -239 -131 48 106 -183 -175 374 -4 -481 434
2814 434 354 -464 176 442 -320 -50 322 -20 -287 16 271 -135 -326 178 74 -347 5 351 -256 -382
$$ packed form
2672B1o31Q49j87RJ27n37M21j69n43J447n09j482J507J89j239J240o0j270Q20
2691CN33l72j44j98J90K04l03K28L13j054J72J186q61n29J176o00p65J257j05
2710C31q07M58K9K9J98l80M02j28p41J125J06j393Q00N28j030M77N95r32q4O43
2730B26j49r1m8n0K25l07L9P89p61n04J248l69q27J106k22r91Q72J10m45J60j78
2751a67K67k8m54N97n7q99Q41M51j058K62P47p33j49Q95l54m93M53J34j90o4l4
2772c3L03m07k46R45l95r79J096J2j012R46J09q77M63L20j38k16n9M82k24l99
2792c09N92O1p74L66O19p46k24Q16l63m85N96M6m34J08J79N8k89QN49l78m77R15
2814D34q0q18O40K66p62K70L72l42k67L03K55m06j91N04j04m21L52L46o07j26
$$ plain form
2834 -382 353 66 -482 290 317 -368 59 280 -31 -130 38 332 -50 -294 371 151 -490 214 266 -480 -70
2855 -70 289 -151 -301 130 283 -227 -121 356 2 -213 158 261 -177 -267 489 174 -449 267 340 -517 -13
2876 -13 313 -296 -216 72 112 -198 -231 342 37 -453 190 268 -399 58 520 -143 -331 437 261 -338 52 269
2898 269 -179 -130 145 45 -256 -207 387 7 -569 301 185 -577 212 346 -337 -12 279 33 -108 -56 288
2919 288 45 -328 218 218 -388 -35 289 -280 -345 392 24 -511 148 186 -322 58 92 4 -89 -65 344 54 -486
2942 -486 415 340 -575 279 321 -501 -9 395 -158 -158 20 87 -103 -161 212 92 -357 32 436 -210 -304 459
2964 459 -23 -468 502 277 -442 129 192 -153 37 -52 54 -78 -413 398 196 -646 73 231 -562 97 459
2985 459 -285 -186 352 141 -43 31 96 7 -62 103 365 -272 -439 467 113 -550 419 105 -750 329 312 -443
$$ packed form
2834c82P35k87n48P72K7o85M27K21l11r9J68K94l82k44O65k20o41P04N2p46M10
2855g0L59m40j50M31J53n10J06M77l54k15L71J03m38r0P56l15o23P16P3q57N04
2876a3L26o09Q0K88M0l10l3N73l05m90O43P8o67M57M62o63j88P68j76n99L90K17
2898B69m48M9K75j00l01M9N94l80n76Q70j16p62P89J34o83L25K91k46j41N2L44
2919B88k43l73N46%o06L53L24n69o5P37l68n35O59L8n08L80L4q8r3K4M09k90n40
2942d86R01p5r15Q54M2q22M92M04n53%J78O7j90n8L73j20m49L89M04o46r4P63
2964D59m82m45R70k25p19N71O3l45J90q9J06j32l35Q11k02q42P19J58p93O59L62
2985D59p44R9N38k11j84P4O5q9o9J65K62o37j67R06l54o63R69l14q55J079j7p55
$$ plain form
3007 -443 43 -10 -123 195 -182 205 177 -483 320 582 -411 -40 454 -443 -85 563 -208 -469 155 7 -169
3028 -169 160 -189 -97 -65 -334 490 179 -756 430 352 -626 529 410 -751 151 415 -189 128 -189 -162
3048 -162 246 -159 132 269 -740 -210 715 -263 -408 543 -352 -464 749 158 -449 178 -52 96 375
3067 375 -202 224 85 -689 531 454 -960 197 382 -824 319 490 -651 -74 168 -91 354 -38
3085 -38 -198 227 -212 149 684 -403 -575 668 82 -515 599 -155 -843 494 220 -328 119 -372 -13
3104 -13 305 -408 293 216 -888 413 784 -660 177 523 -585 84 634 -188 -189 53 -83 209 -15 -227
3124 -227 57 -305 -281 724 -27 -804 488 176 -644 671 330 -721 219 221 63 338 -332 -109 342 -354
3144 -354 249 458 -815 -198 668 -395 -199 381 -395 -353 503 47 -226 -16 -32 169 252 -146 405 -8
$$ packed form
3007d43M86n3j13L18l77L87k8o60Q03K62r93L71M94q97L58O48p71k61O24j48j76
3028a69L29l49R2L2k69Q24l11r35J186p8r78J155j19j161R02K64o04L17l17K7
3048a62M08m05K91J37j009N30R25r78j45R51q95j12J213n91o07O27k30J48K79
3067C75n77M26j39p74J220p7j414J157J85j206J143J71j141N77K42k59M45l92
3085c8j60M25m39L61N35j087j72J243n86n97J114p54o88J337k74n48M47m91L59
3104a3L18p13P01p7j104J301L71j444Q37L46j108O69N50q22jK42j36K92k24k12
3124b27K84l62K4J005p51p77J292l12q20J315l41j051R40Kj58K75o70K23M51o96
3144c54O03K09j273O17Q66j063J96N80p76M2Q56m56k73K10j6K01Q3l98N51m13
$$ plain form
3164 -8 -703 673 462 -829 287 369 -827 286 466 -460 -139 -102 -9 264 -280 -116 158 -354 136 730
3184 730 -430 -496 639 -21 -320 648 -91 -653 409 290 -228 68 -251 -10 146 -467 366 212 -975
3203 -975 344 637 -653 230 455 -565 127 487 -38 -53 -152 49 370 -211 -118 324 -407 -280 552 -114
3223 -114 -662 403 -3 -627 426 207 -563 33 178 85 110 -270 207 178 -495 438 439 -687 46 539 -305
3244 -305 -90 351 -192 -298 127 102 -132 -112 -9 116 -18 -97 382 36 -431 520 318 -556 306 347 -496
3265 -496 159 317 -227 -180 -97 105 62 -387 139 194 -569 6 497 -426 -301 433 54 -261 284 293 -271 13
3287 13 343 -48 -86 14 108 1 -348 310 179 -745 206 462 -611 13 441 -331 -198 305 142 -178 -135
3308 -135 310 227 -276 148 348 -283 -226 439 19 -508 248 238 -511 82 352 -287 -74 91 34 -44 -176 266
$$ packed form
3164ho95J376k11j291J116Q2j196J113J80r26L21L7R3K73n44J64K74n12M90N94
3184G30j160o6J135o60k99R68p39n62J062j19n18K96l19K41J56o13Q33j54j187
3203i75J319K93j290Q83K25j020O92L60n25j5r9K01L21n81R3M42p31J27Q32o66
3223a14n48J065m06o24J053k19p70N96J45r3K5l80M77k9o73R33Jj126P33M93q44
3244c05K15M41n43j06M25k5k34K0J03J25j34p9M79l46m67R51k02q74Q62M1q43
3265d96O55J58n44M7Q3K02m3m49N26N5p63N75M91r23J25P34l79l15N45Rn64K84
3287A3L30l91l8J00R4j07l49O58j31r24R51K56j073O24M28p72J33N03j63l20M3
3308a35M45q3n03M24K00o31N7O65m20n27P56j0p49N93K70o39K13J65n7p8j32M42
$$ plain form
3330 266 145 -474 346 528 -502 45 601 -260 -173 334 36 -253 17 265 -160 -339 122 214 -242 -226 268
3351 268 6 -428 302 312 -520 184 458 -317 -24 316 -86 26 -31 88 -4 -367 254 299 -551 4 493
3372 493 -329 -265 304 -6 -366 149 324 -231 -95 253 171 -122 -121 350 59 -356 286 243 -577 152 463 -521
3394 -521 -184 317 -179 -148 67 50 -38 -263 292 244 -484 78 598 -210 -298 432 149 -393 280 339 -454 -85
3416 -85 364 -101 -194 -7 115 13 -366 204 254 -593 217 545 -619 -2 555 -258 -188 234 26 -6 -1 187
3438 187 81 -456 146 436 -342 -420 347 46 -470 334 190 -676 29 500 -291 -111 103 38 161 -38 132
3459 132 225 -468 238 548 -543 -36 526 -417 -297 418 -143 -349 160 44 -150 -101 112 161 -258 -253 523
3480 523 210 -502 282 362 -586 329 509 -562 -82 309 -121 45 -201 -206 243 -346 37 377 -600 -232 674
$$ packed form
3330B66j21o19Q20J82j030N47N56q61Q7N07k98k89K70K48m25j79M61R2m56J6M94
3351B68k62m34P30J0q32P04K74p75K93L40m02J12n7J19r2l63O21M5q50N55M89
3372D93q22O4N69l10l60N15J75n55J36L48q2k93JM71k91m15O42m3q20P29L11r84
3394e21L37N01m96L1K15j7q8k25N55m8p28N62N20q08q8P30k83n42O73N9p93L69
3416h5M49m65r3J87J22j02l79N70N0q47Q10L28j164O17N57q13P0M22k08l2NJ88
3438A87j06n37O02K90p78p8P67l01n16Q04j44q66P05M71p91J80K14o5J23j99J70
3459A32R3o93P06L10j091N07N62r43J20P15n61k06N09j16j94M9K13M9m19NP76
3480E23l13p12P84Q0r48R15J80j071M80L91m30J66k46nM49n89L83L40r77L68R06
$$ plain form
3501 674 -240 -266 557 -81 -361 367 240 -163 16 91 114 38 -192 251 144 -730 257 553 -783 -24 513
3522 513 -770 -66 552 -351 -128 140 -76 320 -56 -8 359 -380 -12 783 -331 -554 497 36 -502
3541 -502 478 152 -749 41 368 -118 -51 -184 -4 246 -332 353 476 -750 70 893 -516 -67 651 -483
3561 -483 -264 546 32 -161 -63 -152 75 -75 -76 246 -346 -471 646 283 -725 258 390 -580 433 646
3581 646 -591 -51 352 -59 312 -155 -215 287 -430 -7 755 -669 -498 641 -337 -295 693 -219 -538 399
3601 399 232 22 109 -255 46 317 -135 280 224 -843 216 767 -742 -93 486 -748 0 554 -433
3620 -433 -92 -90 -224 521 -112 -275 561 -369 -379 946 -36 -648 566 100 -501 587 245 -572 26 59
3640 59 -8 130 -417 -68 263 -577 251 669 -932 -72 937 -458 -55 692 -478 -206 447 22 59 -141
$$ packed form
3501F74r14k6Q23o38k80P28j27m03J79P5K3p6k30M43j07q74R87K96j336P59N37
3522E13j283P04O18r03K23K68k16L96l76M8L67p39L68P95j114k23J051m61n38
3541e02R80l26r01P90L27m86O7j33J80K50n78O85J23j226Q20Q23j409M49P18j134
3561d83K19Q10n14j93R8q9K27j50jL22n92j25J117l63j008R83J32r70J013K13
3581F46j237N40M03m11L71m67o0N02p17M23P62j424J71J139r78M2R88r12l19R37
3601C99j67k10Q7l64L01K71m52M15n6j067J059N51j509O49N79j234P48N54r87
3620d33L41Kj34P45o33j63Q36r30j0J325r82o12J214m66o01J088l42q17N98L3
3640E9o7J38n47L49L31q40Q28M18j601Q60J009j395M03P47j170K72O53m25L7k00
$$ plain form
3660 -141 -257 347 -54 -266 529 -341 -681 601 212 -707 188 285 -642 298 453 -353 -15 82 68 327 -222
3681 -222 2 427 -600 25 825 -538 -404 528 -405 -213 538 -233 -434 11 155 207 -80 -280 126 72
3701 72 -164 414 161 -582 265 569 -447 31 393 -479 -42 356 -202 -38 -74 -213 264 -182 -45 461
3721 461 -359 -343 682 34 -395 350 94 -310 387 323 -198 -141 98 145 150 -291 -124 164 -386 30 510 -604
3743 -604 -279 615 -315 -183 385 -175 -94 231 3 186 -100 -124 414 -156 -223 511 -89 -541 324 282 -479
3764 -479 65 250 -409 -112 286 -117 -109 -41 82 288 -214 32 473 -435 -118 768 -333 -363 512 -62 -299
3785 -299 230 6 -222 -115 67 156 -224 -190 324 -9 -269 336 242 -367 159 461 -339 -17 474 -172 -207
3806 -207 157 58 40 -162 36 180 -298 15 371 -462 -315 437 -73 -272 148 121 -137 164 250 -39 -245
$$ packed form
3660a41j16O04m01k12P95q70l40J282l89r19Q95R7r27R40J55q06L38R7j4K59n49
3681b22K24M25j027O25Q00j363J34R32r33J92P51p71k01M45J44N2k87k00M06n4
3701G2k36N78k53p43Q47L04j016M78L62q72M37L98n58J64l6j39M77m46J37N06
3721D61q20J6J025o48m29P45k56m04O97o4n21N7K39M7Nm41J67K88n50M16M80j114
3743f04L25Q94r30J32N68n60Q1L25k28J83k86k4N38n70o7P34o00m52Q65m2p61
3764d79N44J85o59K97L98m03QO8J23K06n02K46M41r08L17Q86j101l0Q75n74k37
3785b99N29k24k28J07J82Q9l80L4N14l33k60O05r4o09N26L02q00L22M91o46l5
3806b07L64r9j8k02J98J44m78L13L56q33J47P52n10j99M20k7k58L01Q6k89k06
$$ plain form
3827 -245 146 183 -4 -159 76 153 -201 -34 270 -374 -159 405 -204 -249 224 -36 -69 17 32 171 -80 -17
3849 -17 395 -167 -127 376 36 -313 126 220 -199 -90 149 -72 -223 168 15 -175 -93 89 164 -236 -85 341
3871 341 -237 -180 485 -121 -283 385 147 -194 17 100 80 -147 -42 149 -304 -184 296 24 -332 112 254
3892 254 -238 -105 352 -132 -184 360 33 -158 92 160 102 -140 11 304 -254 -205 423 -246 -329 390 -32 -318
3914 -318 160 111 -156 -44 143 29 -151 79 256 -56 -126 231 245 -204 27 334 -296 -117 372 -202 -304
3935 -304 190 -58 -147 12 -85 69 -176 -89 328 -127 -218 387 49 -213 248 124 -196 -7 152 -17 -53 5
3957 5 -11 -75 -139 101 147 -268 -167 324 -147 -178 345 -194 -174 389 -8 -73 26 -83 230 -32 -132 294 -122
3980 -122 -285 342 54 -336 47 130 -268 -19 253 -194 -126 122 46 62 57 -22 159 -217 -71 457 -207 -327
$$ packed form
3827b45L91L7j87j55K35P7l54J67L04o44K15N64o09m5M73k60l3Q6J5J39k51O3
3849a7M12n62M0N03l40l49M39R4m19J09K39k21j51L91j53j90Q2J82P5m00J51M26
3871C41n78N7O65o06j62O68k38l41K11Q3k0k27J05J91m53J20M80k72l56M44J42
3892B54m92J33M57m84n2N44l27j91K50O8n8k42J51K93n58M9O28o69q3P19m22k86
3914c18M78m9k67J12J87j14j80K30J77l12p0L57J4m49K31L07o30J79M89n74j02
3935c04M94k48q9J59r7J54k45Q7M17m55r1O05l38k62M61j24l20J89J59j69l6N8
3957Ej6o4o4K40M6m15J01M91m71l1N23n39K0N63l97o5R9j09L13k62j00M26m16
3980a22j63O27k88l90L83Q3l98K49K72m47O8K48p6J6np9J81l76J46N28o64j20
$$ plain form
4002 -327 502 -60 -273 302 -67 -321 206 62 -70 -62 -219 169 -46 -163 254 11 -352 184 300 -257 -94
4023 -94 363 -250 -99 445 -96 -191 57 -102 124 -97 -219 207 -214 -230 561 -220 -361 383 -25 -262 340
4044 340 79 -256 150 97 89 19 -24 52 -7 -168 105 237 -403 -135 362 -293 -120 379 -287 -185 325 -90
4066 -90 -2 101 -189 274 65 -158 379 -68 -326 371 110 -354 176 -30 -292 132 164 -87 -54 -85 -9 152
4088 152 -99 -67 184 -229 -84 467 -183 -274 396 -17 -135 340 -173 -159 120 -11 141 -44 -281 184 -15
4109 -15 -312 353 52 -391 141 223 -231 6 185 -169 -55 268 28 -28 -33 -67 180 -62 -94 243 -331 -287 481
4132 481 -81 -444 200 0 -251 283 22 -149 -48 9 246 38 -124 139 36 -197 126 276 -298 -100
4152 -100 331 -202 -115 294 -202 -205 224 -22 33 3 -191 173 1 -151 318 -103 -312 318 88 -247 175 35
$$ packed form
4002c27Q29n62k13N75l69k54N27j44j32Qj57L88k15j17M17k43l63N36J16n57J63
4023i4M57o13J51N44n41r5K48j59K26k21j22M26m21j6P91p81j41P44m08k37O02
4044C40k61l35M06n3qp0m3P6n9j61K73J32o40K68M97o55J73M99o66J02N10m15
4066i0Q8J03k90M63k09k23N37m47k58O97k61m64N30k06k62M24L2k51L3l1P6J61
4088A52k51L2K51m13J45N51o50r1O70m13j18M75n13J4K79j31J52j85k37M65j99
4109a5k97O65l01m43N32Q2m54K37J79l54J14L23k40n6nl4K47k42l2L37n74M4P68
4132D81n62l63O44k00k51N34k61j71J01N7K37k08j62K63j03k33L23J50n74J98
4152a00M31n33Q7M09m96lM29k46N5l0j94L64j72j52M69m21k09O30k30l35M22j40
$$ plain form
4174 35 -195 87 140 -90 -76 -80 -69 96 -145 -168 102 -159 -45 359 -185 -230 378 -7 -139 341 -74 -57 229
4197 229 -78 98 36 -202 179 13 -269 237 44 -404 33 143 -176 45 155 -158 -89 179 99 76 -86
4218 -86 -73 251 -8 -125 246 -206 -242 409 42 -321 272 -59 -119 163 -91 -53 -28 -120 230 51 -203 204
4240 204 80 -193 158 252 -186 -46 241 -69 -165 225 -24 -158 37 28 15 -28 -154 147 -116 -205 300 -70
4262 -70 -325 333 98 -201 153 43 -172 93 96 17 -117 -81 92 -14 -112 32 83 -173 -82 222 -95 -270 229
4285 229 -73 -192 179 45 -34 39 -36 121 1 -73 155 19 -186 212 63 -152 57 111 -140 -36 118 -72
4307 -72 -183 80 93 -65 72 -37 140 -26 -143 194 -34 -167 322 61 -171 159 40 -140 77 -60 2
4328 2 -45 -139 90 -8 -204 122 105 -208 38 172 -94 -13 144 -31 -94 76 105 -59 2 12 52 -121 -104 138
$$ packed form
4174C5k30K82N3k30J4mJ1J65k41k3K70k61J14M04n44m5O08l85j32M80m15J7K86
4197B29l07J76o2k38L81j66k82N06j93m48M37J10l19K21J10l13O9K68q0k3j62
4218h6J3L24k59j17L71m52l6O51l67l63N93l31o0K82k54L8K5r2L50j79k54M07
4240B04j24k73L51R4m38J40K87l10r6L90k49j34J95rj3m3j26L01k63q9N05l70
4262g0k55O58k35k99L54j10k15K65Lp9j34L6J73j06r8J44N1k56R1L04l17j75M99
4285B29l02j19L71j34p9P3p5J57j20p4K28j36k05L98j49k15K09N4k51J04J54j90
4307g2j11K63J3j58J37j09J77j66j17L37k28j33M89k61k32L30j19j80K17j37O2
4328Bm7r4K29r8j96L26j7l13K46J34k66Q1J57j75o3J70K9j64O1J0M0j73J7K42
$$ plain form
4352 138 -26 -232 172 2 -275 175 114 -163 35 39 20 -22 -29 102 -52 -64 212 70 -110 47 136 -109 -133
4375 -133 103 -30 -187 134 9 -203 20 77 -42 -90 -12 164 39 -114 217 49 -174 186 37 -217 103
4396 103 81 -57 -34 12 8 -112 -46 92 -136 -53 77 77 -15 -35 158 30 -154 220 38 -120 116 57 -110 68
4420 68 1 61 21 -128 84 33 -140 80 15 -124 -6 95 -85 -17 97 40 -71 23 47 -52 42 31 99 49 -80
4445 -80 138 29 -231 162 78 -194 97 52 -166 61 1 98 44 -47 134 23 -128 134 151 -134 58 165 -42
4468 -42 -116 139 -3 -211 72 45 -70 -26 42 13 -37 -98 130 85 -174 171 126 -212 152 133 -151 25 140 -13
4492 -13 -22 -31 97 -16 -76 67 6 -85 66 129 -108 -111 172 -36 -178 209 50 -134 135 -26 -68 33 -9 53 33
4517 33 -91 134 47 -222 61 69 -194 105 13 -101 -22 98 20 -63 -21 46 54 13 45 40 -42 -82 185 65 -103 45
$$ packed form
4352A38j64k06M04j70k77M50o1k77J98Mj9m2pJ31j54j2K76j42j80J57Q9k45k4
4375a33K36j33j57L21j25k12K23N7j19m8P8J76j25j53L31j68k23L60j49k54L20
4396A03k2j38K3M6mj20O6J38k28Q3J30%r2k0J93j28j84L74j82j58K36n9j67J78
4420F8o7O0m0j49K12n1j73K20o5j39J18J01j80O8J14n7j11R4K4r9R4j1O8n0j29
4445h0K18j09k60L93q4k72K91m5k18K27o0R7n4r1J81j11j51K62J7k85J92J07k07
4468d2p4K55j42k08K83k7j15M4O8k9n0o1K28m5k59L45m5l38L64j9k84J76J15j53
4492a3rrJ28j13o0J43o1r1J51O3k37lK83k08j42L87j59j84K69j61m2J01m2O2k0
4517C3j24K25q7k69K83Qk63K99r2j14P9J20p8q3M2O7Qm1L2nq2m0K67j20j68J48
$$ plain form
4543 45 15 -144 123 8 -140 45 -87 -16 115 -155 54 39 -138 139 116 -95 -61 193 -82 1 89 22 -50
4566 -50 16 28 7 -24 -94 -10 53 -93 94 26 -202 137 147 -176 100 55 -105 121 111 15 -17 -102 90 135 -93
4591 -93 35 111 -107 -77 194 -111 -162 116 -12 -118 54 52 -106 74 27 86 65 -65 44 77 -198 182 140 -212
4615 -212 84 131 -178 89 68 -125 52 23 25 28 -83 -38 28 -4 3 162 -58 -87 175 26 -90 194 42 -125
4639 -125 185 44 -73 83 -123 -47 57 -122 25 63 -200 104 103 -207 25 89 -63 78 122 19 48 60 38
4662 38 60 -21 -58 14 41 -84 73 33 -189 89 89 -70 95 -57 -120 77 -13 -6 76 -106 22 120 -114 47 69
4687 69 -96 -46 46 -3 -89 -40 -30 -76 8 1 -64 -26 -62 24 34 -127 48 109 -130 49 135 -146 42 104 -46 49 56
4714 56 -3 26 -13 62 -36 -86 27 40 -82 -3 98 -33 -95 93 138 -132 7 72 -104 -27 106 -100 -61 -53 17 39
$$ packed form
4543D5l0j59K67j15j48J85j32P1J31k70K09j5j77K77k3k11L4K54k75Q3Q8o7p2
4566e0O6J2k1l1p0Q4O3j46J87o8k28L39J0l23K76m5j60K26j0r6l2q5J92M5k28
4591i3J28P6k18L0K71l05n1K78j28j06J72kj58J80m7N9k1j30J09L3k75L80m2l52
4615b12K96M7l09K67k1j93J77k9KLj11M5O6l2PJ59k20k9K62j49j16K84j52j67
4639a25L10j41j17J56k06P6J04j79J47L8k63L04jl10K32O4j52J41M4j03K9J2k2
4662C8K2q1l7P2K7j25J57m0k22K78%j59J65j52o3J97r0PQ2j82J28R8k34J61K2
4687F9j65N0R2m9q6M9J0m6Q4po5L8l6Q6J0j61J75O1k39J79Q6k81J88O2j50R5P
4714E6n9K9l9P5r8n0J13J3j22P9J01j31o2J88M5k70J39O5j76P7J33k06L9QP0K2
$$ plain form
4740 39 -121 57 63 -136 25 132 -114 53 77 -72 -24 59 34 16 30 86 -5 -12 4 23 38 -54 81 25 -66 50
4766 50 27 -155 82 40 -95 32 -36 -39 75 -100 -62 85 -86 67 36 -62 21 57 12 -2 10 -20 -24 7 40 -19 -32
4793 -32 -22 36 5 -75 16 48 -139 -7 121 -59 -11 50 -8 64 -7 -26 25 -59 -13 21 -97 18 96 -56 -58 35 15
4820 15 -51 20 77 -49 41 19 -48 0 92 4 16 -40 31 74 -127 20 87 -80 0 105 -80 -46 79 -10 -23 -32 -52
4847 -52 38 -47 64 24 -61 48 30 -8 -47 52 45 -93 -32 6 -107 22 80 -102 37 31 17 -14 -70 -2 105 -70 4
4874 4 119 -33 -11 71 0 -11 73 49 -12 -28 -14 -32 -7 -4 23 63 -30 69 25 -111 5 93 -92 15 95 -56 28 15
4902 15 -9 63 -49 -4 84 -111 1 30 -7 -30 41 83 5 -5 1 -36 -36 20 -14 17 27 29 73 20 9 105 -38 -14 71 -94
4932 -94 -4 85 5 -102 -2 9 11 -28 10 76 -18 -14 86 -51 -13 49 4 -60 0 36 -29 -45 76 -66 -6 76 -15 6
$$ packed form
4740C9j60J78Oj99J61J07k46J67K4j49M8Q3k5j8J4N6r1pJ6J9J5r2J35n6r1J16
4766E0k3j82K37m2j35J27o8lJ14j75L8J47j71J53l1r8Q3L6m5j4J2l0mL1L3n9j3
4793c2J0N8l1q0R1L2j87J32J28j80M8O1n8P2p1j9N1q4M6L4j18J15P8j52kR3k0
4820A5o6P1N7j26R0k2o7M8R2q8J2n6P1M3k01J47O7j67Q0J05j85L4J25q9j3rk0
4847e2R0q5J11m0q5J09j8l8l9R9pj38O1L8j13J29N8j82J39oj4l1n6O8J07j75P4
4874DJ15j52K2Q2p1j1Q4k4o1j6J4j8K5LK7M0r3R9m4j36J16Q8j85J07Q0j51Q4j3
4902A5k4P2j12M5Q8j95J12K9l7k3P1M2p8j0Ol7%N6l4L1J0KM4n3j1R6j43K4Q5j65
4932i4R0Q9q0j07J00J1Kl9L8O6r4MJ00j37L8O2m5o4O0L6o5j6J21j42O0Q2r1K1
$$ plain form
4960 6 -23 2 67 -58 2 120 -99 -16 100 -48 -8 37 3 -1 -12 42 18 -12 10 80 -21 -11 -3 8 -30 27 34 -51 -41
4989 -41 4 -91 -19 30 -79 -6 57 17 68 -44 18 63 -110 -3 94 -98 -21 93 -7 35 4 44 17 -64 -17 29 30
5016 30 26 -37 22 -4 -29 45 -1 2 106 -17 1 49 -59 -3 45 -55 46 -30 -12 58 -38 -57 65 -92 -19 45 26 -75
5044 -75 -38 56 -3 7 9 11 10 16 -11 52 -16 -3 24 -11 -90 120 -23 -56 109 -100 -44 63 -70 0 -19 16 40 -46 -60
5073 -60 41 -18 -43 96 29 -55 -23 79 -39 -47 52 -65 -35 32 -19 13 -28 39 50 33 -17 48 -19 -28 111 -21 -37 13
5101 13 -3 -51 1 4 -52 -66 33 -2 36 -31 53 38 -55 -32 108 -105 -30 59 -46 -14 68 -61 21 18 -7 53 -14 -17 -1 8
5131 8 -10 6 -76 -46 8 12 52 20 44 29 28 95 22 24 31 -51 40 10 -74 45 -38 -45 91 -40 -11 41 -52 -9 26 -37 9 18
5163 18 -16 107 89 -55 36 55 -19 24 25 -7 -25 0 -46 -51 61 -1 -42 -7 -30 28 -7 -48 48 -27 -16 81 -45 -58 107
$$ packed form
4960Fk9K5O5j25O0J18k19Q3J16j48M0M5l4mj1N4k4l0K2P0j01J0QJ1l8N7Pq5J0
4989d1M5r5P2M9j09P3O3m0N1j12O2M5j73J07R7j92P7J14j00M2l1M0k7q1M7M6J
5016C0mo3N9k6k5P4m6LJ04j23J8M8j08N6M8j00J01p6J8P0r6j9J22j57P3O4j9j01
5044g5L7R4n9J0KKjOk7O3o8J3K7l5p9K10j43l3J65k09N6J07j33P0j9L5K4q6j4
5073f0J01n9k5J39o7q4L2J02j18qR9j17L0O7n1L2m1O7J1j7n0O5o7rJ39j32j6N0
5101A3j6m8N2Ln6j4R9l5L8o7Q4j5r3K3J40k13P5Q9j05L2Q2j29Q2lk5O0o7lJ6R
5131Hj8J6q2L0N4MM0l2K4j5jO7p3KPq2R1l0q4J19q3pJ36j31K9N2r3M3L5o3M6R
5163A8l4J23j8j44R1J9p4M3Jl2j8K5m6nJ12o2m1L5k3N8l5m1R6p5J1R7j26j3J65
$$ plain form
5192 107 7 -57 21 -13 64 37 17 50 -15 -9 -43 18 -39 -38 29 -19 13 6 -23 -71 15 -9 -11 62 10 24 47 -5 32 23 -35 51
5224 51 -24 -66 57 -19 -9 22 -6 -8 31 -23 -30 -5 22 25 2 -31 -43 55 -41 -63 61 -35 26 107 -26 -86 57 -34 -27 39
5254 39 -48 34 44 26 61 -17 -39 27 78 70 29 31 44 18 9 32 -10 7 15 -15 32 -6 14 -27 -53 39 -9 -4 64 -22 -81 80
5286 80 98 -61 5 -22 13 -40 -12 56 23 -63 55 47 2 -2 52 -30 -45 70 9 -81 44 47 -29 54 5 60 44 -67 99
5315 99 -24 -48 58 -20 -42 94 33 -11 -39 23 -25 -7 76 24 -6 35 13 3 -73 27 -26 -68 0 72 52 -52 65
5342 65 2 1 23 -25 3 3 6 76 6 -55 10 -17 -4 42 47 35 34 60 -1 -28 63 44 -2 -4 37 -7 -16 -38 15 28 -18 38 19 -58
5376 -58 7 9 -63 35 -38 -38 69 4 -9 39 -20 63 49 -69 73 13 10 -53 32 31 -86 34 16 -45 3 10 -42 14 21 59 51
5407 51 -14 25 -10 -27 14 29 -39 109 44 14 15 4 51 -37 -54 7 -36 10 18 -46 -59 -40 27 24 -49 13 64 -44 20 21 -6
$$ packed form
5192A07j00o4P8l4P7k7k0L3o5Ol4O1n7JO7m8L2pk9m8Q6k4kP3n2J4K3n2L7rn8Q6
5224E1p5m2J23p6J0L1k8kL9n4pK5K7Lk3l3j2R8r6k2J24r6O1Q1j33o0J43r1PO6
5254C9q7Q2J0j8L5p8k2O6N1qm1KJ3k6rK3m2J7Ql0M7l8K0m1k6R2m8NO8q6n9J61
5286H0J8j59O6k7L5n3K8O8l3q6J18qm5mN4q2j5J15o1r0J25Lp6Q3m9N5j6j11J66
5315I9j23k4J06p8k2J36o1m4k8O2m8J8Q3n2l0M1k2j0p6J00n3m2O8P2k0j04J17
5342F5o3jK2m8K8%LP0p0o1O5k7J3M6Nj2jK6o1k7R1j9m6kM1m4rk2N3J3m6N6j9p7
5376e8O5Kp2R8p3%J07o5j3M8n9Q3j4j18J42o0lo3Q5jj17J20j8o1M8Pn2N6PL8q
5407E1o5L9l5j7M1J5o8J48o5l0Jj1M7q8j7O1m3M6Qo4j3J9O7lp3O2N1j08O4Jk7
$$ plain form
5438 -6 -4 82 -20 28 13 -1 55 -11 64 -23 -83 -25 47 -26 -20 -17 16 -26 5 16 -43 51 12 -9 12 -5 -9 84 -49 68 25
5469 25 -84 92 -35 -21 91 46 -25 2 -27 12 30 -74 26 77 6 9 29 -49 43 10 6 -5 -13 67 -26 54 2 -17 64
5498 64 -52 29 51 -52 -11 11 -78 29 37 -41 38 79 -29 46 4 -11 -22 -45 -2 -17 15 -8 18 -25 -8 42 22 -90
5526 -90 23 74 -64 69 -28 14 35 7 19 39 -28 32 75 -35 21 5 -39 48 35 -4 58 13 -10 -16 -5 -27 -75 14 30
5555 30 1 -8 45 33 -28 -67 109 50 -45 12 16 -26 13 65 -4 8 -50 16 -8 -53 -17 44 -44 53 59 -78 17 55 -31 19 55
5586 55 75 1 -41 15 -9 12 7 -11 21 -48 -23 47 -1 11 29 -83 19 -29 3 56 33 -31 -11 -14 -5 31 16 9 41 -41 -29
5617 -29 73 -37 -46 28 -24 -44 -22 74 -24 -48 10 -1 17 -76 20 57 -35 42 78 -67 14 20 32 -18 8 4 63 -12 27 36 -40
5648 -40 20 44 -4 -18 40 22 -44 98 -20 10 38 81 19 93 68 -18 25 -67 48 65 -104 -19 31 -58 2 73 -22 13
$$ packed form
5438fKQ6j02M8j5j4N6o6P5q7o0N8P2p3OLL3m2L1J1n9R4l9k1K1j7mR3j33J17m3
5469B5j09J76j27J4J12m5p1K7k9L9J8j04J00N1p1LK0p8R2l3mj1qQ0r3Q0n2j9Q1
5498F4j16Q1K2j03M1K2q9J07Qp8P9M1j08P5m2j5j1k3M3j5L2k3K6m3J7N0k0j12
5526i0J13N1j38J33r7M2K1k8J2K0o7O0M3j10N6j6m4Q7j3l9O2m5k3oJ1k2m8Q9J6
5555C0k9rN3j2o1l9J76n9r5N7Mm2L9N2o9J2n8O6k4m5L6O1q8R7Oj37R5L8q6N0L6
5586E5K0p4m2N6k4K1nj8L2o9K5P0m8J2J8j12J02m8L2N3k3o4K0lRL6j5pL2q2J2
5617b9J02j10rP4n2k0K2R6r8k4N8j1J8r3R6L7r2P7L6j45Q1OJ2n0K6mN9p5L9Rp6
5648d0O0K4m8j4N8j8o6J42j18L0K8M3o2P4k5q6M3r2J15J7j69Q5N0q9O0P1r5L5
$$ plain form
5676 13 21 6 37 -5 9 -61 18 52 3 -9 -7 -32 2 -26 -5 9 -12 -7 25 0 32 35 -68 -23 19 1 9 -8 4 26 19 43 10
5709 10 -19 8 11 45 -7 7 9 -25 5 -25 -29 -66 -38 17 13 -14 -18 63 -37 3 35 -44 11 51 5 58 39 -60 23 -6 55 7
5741 7 -43 -22 104 -20 -25 50 31 -21 38 -12 -39 63 45 -22 44 39 5 51 -26 13 19 -67 30 -18 -36 2 -27 -14 6 1 7 -5
5773 -5 -16 -22 40 12 -85 -4 38 28 3 -60 -23 34 10 -16 44 13 -3 21 38 1 -4 15 10 23 -8 8 24 -56 33 -1 -68 -9
5805 -9 8 -3 -60 4 9 -18 -28 39 24 -27 -9 -11 -8 -31 32 -16 -5 -29 17 -45 -28 38 -41 24 16 -28 5 -42 23 -5 -5 -15 5
5838 5 -9 -27 88 -47 -10 46 26 4 -21 15 17 39 -5 28 -8 -24 20 37 23 94 29 5 -36 53 22 -53 -24 -49 -3 -1 -13
5869 -13 23 4 -27 49 -30 -22 3 32 -30 -45 -15 -34 25 10 -30 7 -16 -17 11 -4 -43 9 -26 -49 57 -76 -11 -11 16 6 32
5900 32 10 15 -72 44 33 -7 -6 14 50 -5 34 26 17 -6 6 -17 12 27 -95 5 -7 7 11 29 -38 -16 15 13 10 -2 -7 -11 12
$$ packed form
5676A3Qj5L1m2J4p0P9L4m9j2Kk5L4k8K1J4k1NL2k5L2Lj03M5M2j8Qj7J2K2pK4l3
5709A0k9K7LL4n2J4Kl4L0l0ml7K8N5mk7mQ1j00M0L2p9N5M0m6N3j9r9Q3k9O1m8
5741Gn0K1J26j24nP5j9n2N9n0k7J02j8o7O6nl4M6p7L9Oq6R7m8j8L8k9J3K0nOj2
5773ej1oO2k8r7Q1M2j0k5o3L7N7k4k6O0l1j6K4J7l7nJ9nJ3l1J6J6q0Q9l4o7N9
5805iJ7j1n7O4Nk7j0O7j5n1J8kLk3O3m8J1k4M6o2J7O6p9O5qm4L3m7O5k8%j0K0
5838Ej4j8J15j35L7N6k0k2k5L6KK2m4L3l6j6M4J7j4P1o5k4m1Q9l1p5K9k5M6Kj2
5869a3L6j9l1P6p9QK5K9o2j5L0j9N9j5m0L7k3jK8j5l9N2l5k3J06j33O5%K7j0K6
5900C2k2Nq7J16j1m0JK0L6n5L9qrk3J2k3K9J5j22J00j2J4MJ8o7K2L1klj2nmK3
$$ plain form
5933 12 67 -19 -43 -9 -48 -4 -60 -31 -18 -46 -19 50 -1 0 73 2 24 -21 27 52 -16 54 80 -6 0 3 22 9 -72 -41 -33 0
5965 0 -45 6 38 -23 50 5 21 -7 53 39 21 2 -80 25 2 13 38 1 -34 -21 35 40 -1 -65 -31 13 5 -10 -8 -65 12 -40
5997 -40 -65 27 0 50 50 -3 -27 50 8 -6 -5 -7 -21 -33 -28 -6 24 38 -28 9 -29 -24 -11 14 27 -17 -18 42 27 -13 67 -32 48
6030 48 4 -21 73 -7 -42 39 -14 3 6 -34 -12 -130 -17 35 -16 14 34 -42 40 31 -21 3 14 -3 21 -21 4 39 -17 11
6060 11 63 -20 22 -1 -1 14 35 32 -12 -90 -4 75 -13 7 14 60 11 7 9 -8 -1 12 -23 -10 24 -21 22 22 -62 16 7 1 -8 -9 -7 44
6096 44 -10 39 29 24 34 21 24 12 5 35 -23 43 -33 29 16 -22 -51 38 -49 -4 46 -41 35 7 39 -31 41 -46 3 10 -25 -2
6128 -2 -63 93 15 -34 18 22 -89 -37 6 -66 -6 -51 46 36 -10 25 -18 9 -22 66 18 21 25 42 -52 8 22 9 38 -11 -26
6159 -26 -37 2 -49 9 5 10 2 60 36 21 20 66 -63 70 18 62 -7 -8 58 38 27 21 -5 14 49 53 41 -2 23 14 0 -43 17
$$ packed form
5933A2N5q6k4L4l9M4n6K9J3k8K7O9n1JP3p1K2m5M8K5o8P0K6q6OLJ9j3q1L1QL3
5965@m5N1L2o1P3m5J6k8O0j4j8j9q2J05k3J1K5l7l5J3N6Nm1o4L4M4qj5Kn7P7n2
5997d0k5R2k7N0%n3k4P7m2j4Jkj4j2NK2L0J4o6L7l8NJ3K5J3m4jO0j5m0Q0r9Q0
6030D8m4k5R4q0l5Q1n3J7Lm0K2j18J13N2n1L0K0p6Q2rn2K4J1j7K4m2K5L5n6K8
6060A1N2q3M2k3%J5K1lm4p8Q6P9q8K0PM6m9mKj7PJ3l5J3L4m5M3%q4P8rorjKN1
6096D4n4M9j0nJ0j3Lj2pL0n8O6p6O2j3l8k9Q9q7M5N0q7P6k8L2p0P2q7M9Pl5K3
6128bo1J56p8m9N2Mj11N2M3p2O0m5R7j0m6L5m3K7l1Q8m8LMJ7r4O0J4j3K9m9j5
6159b6j1L9n1N8mNqN8k4j5jM6j29J33n2M4o9jO6k0j1ok6J9L5Mj2m3K5rj4m3O0
$$ plain form
6192 17 -37 -86 -27 46 30 -35 38 23 -91 40 -20 9 -26 -5 -3 -68 33 16 96 -21 49 -6 -45 10 19 -14 19 41 -52
6221 -52 8 -12 19 -3 -61 29 78 -46 -8 -1 -46 23 -14 47 -23 -15 -92 51 51 23 -1 24 -41 13 17 -7 22 -10 -42 -47 60
6252 60 -1 -20 12 27 9 34 7 -45 -59 3 -21 15 -16 17 26 8 10 25 -20 30 16 -24 -65 -35 -3 -27 -6 3 23 -22 62 50
6284 50 -27 3 -24 -36 -23 12 -25 15 -15 -21 8 4 14 -8 -37 -36 40 19 0 -21 3 -55 45 -13 -26 26 -14 3 8 16 -23 39
6316 39 -34 0 77 -14 6 -16 -24 -15 37 -20 -2 57 -45 -35 6 -25 -55 -7 40 1 77 -44 10 -8 -7 40 53 -60 -22 17
6346 17 -31 44 12 -11 18 -19 24 15 -73 5 55 -67 23 42 26 -20 26 -6 -40 -8 4 1 -49 -45 -41 -44 -1 6 -46 -28 -23 9 -41
6379 -41 -39 -23 -42 24 36 -22 -10 25 10 -31 -56 15 -14 -5 26 45 -46 32 8 54 42 46 9 50 22 84 -21 30 -33 -10 5
6410 5 -84 8 26 -43 73 9 16 14 13 -34 37 2 6 55 -4 -28 33 13 6 16 37 -13 1 24 17 30 39 -28 51 -7 -41 -21 31 -18
$$ packed form
6192A7n4m9N9P3j6o5P3j5j14J31o0K9l5K1Ko5J01j7Q0j17P0n5l9N5Rl3L3K2r3
6221e2O0k0L1k2n8R0M9j24L8Pm5O9l7O1p0Qp7J43%k8k4K5o5N4Mk4K9l2l2nJ07
6252F0o1j9L2J5j8K5k7n2j4O2k4L6l1L3Rj8KJ5m5N0j4m0m1L0L2k4K1RK0m5Q4j2
6284E0p7L0k7j2J3L5l7M0l0oK9mJ0k2k9JP6k1j9k1K4n8J00n8j3N2m0J7NQl9O2
6316C9p3L4P7r1K0k2qRN2n7J8N9j02J0M1l1l0M8M7l9P6j21N4j8JM7J3j13L8L9
6346A7m8P5l2k3K9l7M3rq8P8N0j22R0J9j6m6M6l2l4L2J2ln0MMlM3Pn2J8NL2n0
6379d1KJ6j9O6J2n8J2L5j5m1k5P1k9RL1J9r1P8k4M6j2Ml7M1k8O2j05N1o3K3J5
6410Eq9R2J8o9J16o4Pkjm7P1l5MM9n9k4O1k0pJ0K1n0J4K3pJ3Ro7P9n8l4K0N2m9
$$ plain form
6444 -18 34 -26 -87 28 12 43 95 -34 -29 4 33 36 -13 -6 -25 -4 35 41 -49 30 5 32 39 39 42 -31 -6 19 -14 -15 38 7 38
6477 38 -5 -22 46 -12 43 28 -53 -8 53 -43 20 39 10 -14 48 -60 -24 5 22 22 9 47 33 -44 32 52 32 10 42 11
6507 11 -22 -27 46 -28 -5 56 -6 -9 27 12 11 -53 -34 -4 -71 36 -39 33 -27 50 45 20 15 -4 21 19 -15 -31 -11 -15 13 -8 16
6540 16 -52 11 -54 12 -17 25 63 41 -15 48 62 -9 45 -23 25 -4 16 -47 -25 -20 3 49 -9 -21 -15 75 -4 -12 26 -47 66
6571 66 17 -59 32 2 15 30 6 5 50 -49 11 40 21 -40 -63 13 -4 -27 22 -13 -25 -43 60 -8 -8 15 -18 -68 21 79 -89
6602 -89 -32 95 -27 -1 65 -14 -21 -14 -23 -8 -39 7 53 1 -4 72 -28 -73 84 53 -56 86 6 28 -10 31 -42 -107 2
6631 2 35 -8 -9 47 2 -107 -9 26 -52 -7 82 -29 -10 44 29 64 25 5 -50 -61 39 15 0 -56 37 -46 -42 51 7 -41
6661 -41 12 4 -24 8 58 -23 39 -6 14 42 -42 -19 37 33 71 39 -9 14 31 30 -10 10 -34 42 23 -14 9 1 -16 22 42 -23
$$ packed form
6444a8N2o0o1J15j6L1N2j29NL3K9Lm9Pj9K1L9Or0P9k5K7P%Lp3K5K5l3jN3l1L1
6477C8m3j7O8n8N5j5q1M5O1r6O3J9k9k4O2j08L6K9J7%j3L8j4p7P6K0k0k2L2l1
6507A1l3nP3p4K3O1o2lL6j5jo4J9L0o7J07p5P2o0P7nk5nj9K5kl4j6K0mK8k1K4
6540A6o8O3o5O6k9M2L8k2n6O3J4p1N4o8M8k9K0o3K2NK3M6n8j2OR0p9qL8p3J13
6571F6m9p6R1l0J3J5k4jM5r9O0K9j9o1k3P6j7k3M9l5j2j8J03o8%K3l3n0Q9N8j68
6602h9N7J27j22K6O6p9pPrJ5l1M6M6n2nP6j00m5J57l1j09J42q0K2l8M1p3o5J09
6631BL3m3jN6m5j09R8L5p8M5Q9j11J9N4j5L5l9k0n5j1J00k4j5n6R3q3MR3m4m8
6661d1N3qk8L2N0q1O2m5K0K8q4K3N6mL8l2m8K3J7jm0K0m4P6j9l7K3qj7L8K0o5
$$ plain form
6693 -23 86 55 -23 -37 41 14 -33 61 10 -11 -31 -35 -19 -31 -17 41 -18 -32 88 2 4 8 -26 -51 -2 11 -48 6 8 25 -40
6724 -40 -1 58 64 -40 -16 54 -74 -94 105 -64 -31 55 -43 -1 -6 -9 9 12 -18 91 -5 -13 90 -16 -40 58 12 -38 75
6753 75 17 -28 17 0 -56 -26 -19 0 0 -10 -22 63 45 -6 86 -39 -32 5 -43 9 33 30 -55 44 -31 -34 -26 17 9 20 -42 7 20
6786 20 -20 -19 50 -17 -16 14 -9 6 5 -20 36 -20 -18 45 -71 -62 59 -14 -19 30 -28 -33 -2 -14 -32 -36 23 25 44 -98 13 27 17
6819 17 -39 43 -1 4 38 -43 54 2 -35 3 70 64 8 34 36 23 -55 -32 88 -42 -13 35 -15 -52 43 -7 -13 -37 31 -8 -60
6850 -60 16 -25 -1 47 -4 -7 -32 -20 51 28 13 49 15 -5 101 89 -28 32 42 3 62 32 31 -7 32 21 -41 -26 -2 -23
6880 -23 -23 43 16 -12 2 -17 -42 -22 -10 2 31 -23 29 23 -21 -40 51 -28 -53 54 8 -53 -30 -30 -13 -28 -74 -13 24 4 80
6911 80 -7 -35 3 19 26 80 66 -26 -30 7 -1 68 7 27 -35 0 1 19 -23 -26 17 -20 -55 -28 -1 -57 40 17 4 -7 67 24 64
$$ packed form
6693b3J09l1p8j4P8k7m7R4n1k1k0mJ6j2J4N8n9j4J20q6KMl4k5M9J3n9N4KJ7o5
6724d0L9N9Oj04K4P0j28k0J99j69L3Q6r8M2nlJ8Ll0J09r6qJ03j06k4R8m6n0J13
6753G5n8m5M5j7n6L0PJ9%j0j2Q5j8n1R2j25PL7m8N2K4lq5R9p5lQM3qJ1o2M9J3
6786B0m0JO9o7JL0k3J5jk5N6n6KO3j16RJ21p3nM9n8nL1j2j8mN9KJ9j42J11J4j0
6819A7n6Q2m4NL4q1R7n2l7L8O7on6K6Kj3p8K3J20j30K9M8n0l7R5n0ok4O8l9n2
6850f0P6m1K4M8n1lk5J2P1k3j5L6l4k0J06j2j17O0J0l9N9l0jl8L9j1o2J5K4k1
6880b3%O6k7k8J4j9k5K0J2J2K9n4N2om4j9R1p9k5J07m6o1K3%J7j5m6O1L7k0P6
6911H0q7k8L8J6PN4j4r2mL7qO9o1K0o2L5JJ8m2lM3l7l5K7K7n6R7k3j3j1P4m3M0
$$ plain form
6944 64 39 50 0 -64 20 -38 -33 -8 39 -9 -18 -18 -19 -89 2 -20 13 -10 2 35 6 -27 5 25 9 42 21 -51 25 -23 -50 24
6976 24 58 -11 -67 10 -56 -53 22 65 -5 -15 8 15 9 12 26 -11 -6 62 57 -45 31 15 -53 -45 36 29 -30 23 -3 -75 -31 52 -26 -40
7010 -40 -27 37 -2 -19 17 10 -9 -13 6 0 -38 -56 34 -46 -8 58 4 -36 31 -26 -9 84 60 15 -13 -76 3 75 58 35 28 11
7042 11 18 -19 3 -32 88 40 35 88 -20 20 24 51 15 34 -43 21 -6 -4 29 -30 -42 53 -42 -37 36 59 6 -46 36 2 -30 58
7074 58 -15 1 -30 -38 28 20 11 28 35 -53 85 -1 -29 18 41 -34 18 7 -3 -6 -19 4 8 -30 -38 3 -100 -23 64 -31 -6 18 -12
7107 -12 -45 20 23 -1 -28 -15 -2 0 -20 40 1 -25 -4 9 -25 49 17 -31 -22 -36 -15 -15 -25 1 -8 1 48 0 -61 26 -28 -24 48 35
7141 35 -61 8 12 -1 -18 13 -12 24 -33 2 38 1 58 22 23 -107 36 45 -98 36 65 33 -17 -14 -47 -1 -16 -3 5 33 -25
7172 -25 21 -58 9 -38 -46 -29 69 12 -47 12 14 -21 -16 -31 63 64 -13 29 32 3 19 7 -66 -4 27 -39 -5 13 -17 -60 0 38 14
$$ packed form
6944F4k5J1n0o4Q4n8NK5M7m8r%jp0R1k2L3k3J2L3k9l3L2K0j6L3k1p2P6m8k7P4
6976B4L4o9n6P7o6LP5M3p0j0K3PoLJ4l7NO8nj02P6j6o8QQ1pn9N3k6p2M4Q3p8j4
7010d0J3O4l9j7L6pj9mJ9ol8j8R0q0L8O6n4m0O7n7J7R3k4m5k8o3P9P2j7k3pj7
7042A1Pl7K2l5J20m8nN3j08M0MK7l6J9p7O4k7KL3n9j2R5r5NP3K3n3n2Q2l4l2Q8
7074E8p3J6l1qO6qrJ7Pq8J38q6k8M7K3p5N2j1j0lj3K3Ml8qM1j03P7Q7r5K5K4l0
7107a2l3O5Lk4k7J3J3Kk0O0l9k6K1J3l4P4l2m8Rj4K1%j0K6rRM7m8o1Q7n4MP2j3
7141C5r6O9Mj3j7L1k5L6n7L5L6l7N7l6Jj30J43Rj43J34K9l2n0Ll3M6j5J3QK8n8
7172b5M6p9O7m7qJ7R8n7n9N9Kl5Nj5R4Jp7M2Lk9J6j2p3O2L1o6L4J8l0m3O0L8k4
$$ plain form
7205 14 -4 26 -4 2 47 113 2 -32 62 14 5 12 14 -24 27 9 8 16 1 70 9 -22 -2 -4 -66 -35 16 -71 32 44 44 39 -9 -9
7239 -9 -36 16 13 -40 6 1 2 18 -38 46 4 -16 4 -26 -8 27 34 -1 19 31 -34 24 24 14 21 -3 -78 -21 9 -6 -1 5 -9 19 35
7274 35 2 73 3 -14 51 -14 10 -22 6 65 41 -35 -11 32 32 8 14 13 9 9 60 -12 6 13 14 -11 39 67 -7 -17 55 -24 -75 0
7308 0 28 0 13 14 -49 -1 12 -35 45 34 -42 82 -77 -11 -9 -66 -10 80 -48 -5 38 44 5 46 49 4 31 30 27 13 -55 2
7340 2 -17 -51 11 47 -72 -11 -51 0 12 -19 12 -25 25 -9 60 -21 30 40 -6 42 54 -9 -3 -28 31 -14 15 25 -38 36 -35
7371 -35 -61 -15 -10 -1 27 13 39 30 -27 63 51 15 19 25 55 14 16 11 -10 -39 -29 4 -22 -36 -25 -4 10 -9 24 26 -23 51 -7 22
7405 22 64 -12 36 -34 -5 22 -43 -37 -43 -27 -3 35 -31 -51 4 8 58 14 26 7 7 32 -47 0 49 38 42 -12 65 66 -13 0 -77
7438 -77 -46 -6 50 -6 28 -37 -15 -44 -55 50 -19 -57 -44 -39 -9 0 35 -6 16 84 29 -36 -27 49 -29 23 -9 -77 1 33 18
$$ packed form
7205A4j8L0l0OM5O6j11l4R4m8rPKl8N1j8jQj5O9o1l1K0ko2L1N1q7J03J2%nm8%
7239ik7N2ln3M6nJJ6n6Q4m2k0K0l0J8L5Pl5K0J2o5N8%j0Pk4p5N7L0j5NOj4K8J6
7274C5l3P1p0j7O5o5K4l2K8N9k4p6K4M3%k4Ojm%N1p2J8PJk5N0K8p4j0P2p9n1P5
7308@K8k8J3Jo3M8J3m7Q0j1p6J24j59O6Kn7N6R0j28M3M3Ol9M1Lm5K7jlj4o8N7
7340Bj9l4O2L6j19O1m0N1J2l1L1l7N0l4O9q1N1J0m6M8J2o3Ok5N9m5K9J0o3P4p1
7371c5k6M6NRK8j4K6rn7R0j2l6MOL0m1Knk1k9J0L3k6j4J1K1J4j9L3Km9P4n8K9
7405B2M2p6M8p0K9K7o5OoJ6K4L8o6k0N5MN0m4J2j9%K5p9M7M9j1Mn4P7Jp9J3p7
7438g7L1M0N6n6L4o5K2k9j1J05o9l8J3NL0RL5m1K2O8n5o5RP6p8N2l2o8P8L2j5
$$ plain form
7469 18 -32 -73 32 -9 -41 -17 15 -42 -15 -11 -30 22 -10 -4 -8 -3 41 -6 -30 -25 61 43 27 1 -1 -13 9 49 30 12 34 -11 -31
7502 -31 10 -39 -23 -38 7 18 -13 28 46 -2 4 2 -11 6 -17 20 32 -16 -24 29 -49 60 -34 -7 -35 3 8 -19 67 12 -14 -22
7534 -22 22 -34 18 -26 3 14 -77 3 7 -6 13 24 -28 -21 63 -12 -17 9 20 4 61 45 1 -51 39 -31 -20 -29 -1 -36 -34 62 23
7567 23 34 56 11 -52 -11 28 10 -22 10 33 35 11 27 60 -13 -2 10 -29 -23 -25 -20 2 -10 -13 38 24 32 -24 32 13 71 25 -36
7600 -36 32 -8 -28 7 17 27 20 -24 -21 6 -32 -39 41 -39 -14 -38 -66 -12 33 7 -12 32 -21 36 -37 58 6 38 60 -18 24 30
7632 30 -11 0 -23 20 40 -23 34 55 19 34 4 49 26 -26 -11 -9 40 5 21 20 48 86 4 -41 -4 -49 -63 45 30 -15 -16
7663 -16 11 -64 -25 -11 -80 31 -3 34 45 -28 16 55 -13 20 74 0 -37 15 58 -2 -63 13 3 -1 -21 -52 -7 -14 44 -9 -11
7694 -11 41 63 4 8 -8 -29 14 11 6 -14 28 18 -8 -23 -22 -28 22 36 -37 8 59 32 30 11 47 8 -18 -30 53 -27 -30 23 -1 71
$$ packed form
7469A8n0m1J05m1l2K4L2n7K7Mj9N2l2OmNM4m7k4NQ6j8j6k6kj2K2M0j9j8K2m5k0
7502c1M1m9J6j5M5J1l1M1J8m8Okj3J7k3L7J2m8qN3p8J09r4K7k8L8Nk7Q6n5k6q
7534b2M4n6N2m4K9J1r1Q0Mj3J9J1n2PQ4p5nK6J1j6N7j6m4n2R0p0J1rK8l5KR6l9
7567B3J1K2m5o3M1L9j8l2L2K3Kk4J6L3p3J1J2l9OkNK2j2lN1j4Qn6N6j9N8m6o1
7600c6O8m0k0L5J0J0pm4LK7l8pQ0q0K5k4k8N4M5k6j9M4n3N7p3R5n2L2K2p8M2O
7632C0m1J1k3M3K0o3N7K1l6J5l0M5k3n2J5KM9l5J6jK8L8q2m5L7m5j4J08j5m5j
7663a6K7p5L9J4o9J11l4L7J1p3M4L9o8L3N4p4l7N2M3o0o1P6j0mk0l1M5pN8n3k
7694a1N2K2n9Mj6k1M3lnk0M2j0k6j5JoN0J4p3M5N1k7kj9L6l9k6j2Q3q0lN3k4P2
$$ plain form
7728 71 -20 23 4 43 28 -11 -65 22 3 -36 -5 -36 -77 -23 -26 2 -45 14 46 0 -4 7 -24 28 -11 27 38 -16 -49 13 -11
7759 -11 -31 40 -48 -14 -17 -59 -17 -45 47 3 17 49 42 -26 3 -31 -18 30 32 0 21 12 12 7 -41 73 37 0 -12 -5 0 18 -15 27
7793 27 -29 42 -21 -46 -8 -3 -28 41 13 38 -10 -14 37 -1 -6 64 -17 -14 -3 6 -16 35 -12 -31 5 70 27 7 1 -4 45 -32 24 17
7827 17 28 0 33 16 -57 17 2 -5 -12 -63 8 32 -37 31 -2 -14 26 28 -29 22 44 -8 -12 7 34 -30 4 44 -28 -6 0 6 -2 38
7861 38 2 14 -16 13 -31 -38 19 -46 -21 -32 -45 -32 24 -7 -52 43 37 30 30 -15 17 23 -49 53 39 8 -21 -6 0 17 3 -21 9
7894 9 -41 -34 24 96 -72 -9 36 -22 45 -42 -1 14 -29 -6 -7 10 -8 11 -30 -9 2 -48 32 22 -41 -13 -1 11 29 -1 18
7925 18 38 -17 -39 13 8 26 63 -37 6 -39 -18 -23 17 12 -34 0 29 -10 4 17 33 -6 -22 -50 20 4 29 97 55 -3 57
7956 57 32 -7 26 -106 3 14 -14 -49 -8 -32 31 -18 -22 63 13 -65 -16 66 19 19 6 41 -16 -54 -10 -32 9 81 25 -2
$$ packed form
7728G1r1M3j9L9j5l9n4Q7j9l9L1l1m1N4lK8m7N9L2m6mJ1l1N2l9L8J1n4l3O2k4
7759a1k0P1q8L4lm2M2k8R2m4J4L2po8K9l4J3M8Kl2K1r%nm8J14l6l7j2PNJ8l3M2
7793B7n6P1o3k5L8Nk5O9k8K5m8mN1l8nP0q1LJ1Rk2N1m7j9L6O5m3k0onM9p7N6p
7827A7J1k8L3j7p3P4j5ppn1P1K4o9O8l3j2M0Kn7N1K2n2mJ9K7o4L4M0p2K2OOqM0
7861C8l6J2l0K9m4pN7o5K5j1j3J3N6l1m5R5op%m5L2Op2J02j4l1k9J5OJ7j4k4L0
7894In0PN8P2j68O3M5n8O7q7M1J5m3K3jJ7j8J9m1K1J1n0Q0j0o3K8J2J2J8l0J9
7925A8K0n5k2N2nJ8L7j00M3m5K1nM0nm6L4K9l9J4J3J6l9j6k8P0j6K5O8m2n8O0
7956E7k5l9L3j32J09J1k8l5M1k4O3m9mQ5n0p8M9Q2m7%j3L5n7l8M4k2M1P2n6k7
$$ plain form
7986 -2 0 53 22 -13 3 -12 -5 -22 -11 -18 5 23 -25 -1 4 -20 22 25 29 41 2 -6 -24 33 0 8 47 6 -18 11 30 13 64 33 -36
8021 -36 -31 31 -16 -19 19 0 -7 25 -6 -34 3 23 -16 1 -19 -27 -22 60 -27 41 -24 -2 3 -27 -31 13 11 -62 42 -1 -46 1 17 -33
8055 -33 19 53 14 21 -22 4 8 4 27 20 16 -1 -5 -23 -11 -7 -9 10 -7 -11 56 -11 23 -35 24 7 29 36 24 38 9 -17 -29 -37 -34 -47
8091 -47 -25 31 -10 -13 25 37 -24 36 -23 -17 3 15 -9 -28 14 -11 -20 7 -18 -31 -80 -1 -42 20 -18 18 1 -43 48 15 25 20
8123 20 57 -68 -21 57 -5 40 -5 3 23 -45 64 -3 -31 -27 32 14 -56 -18 59 -13 -12 108 -47 -31 34 49 17 49 36 61
8153 61 11 40 -22 -58 21 -67 -83 43 63 -24 15 53 40 41 -25 -21 9 31 -40 -8 40 27 28 21 21 19 7 -29 25 -21 -19 -9 -21
8186 -21 9 -9 -40 -31 -7
$$ packed form
7986bKN3l1l5J6j5Pj7J1pK3J8m8K4Nk4M2LMJ2l9qj8N7l3QL9m1k4K9J9j7N1l1o9
8021c6NO2m7lL8j9pL2l1k8L7K0l9J7k0qNQ2q7O8o5K2Nl0mM4kp3J04m3m5M7J6n0
8055c3N2L4l9Pm3K6MmK3pmj7mj8J2MkJ9j7mO7o7L4n8N9j7K2Pj2J4k9k6j2qLj3
8091d7K2N6m1lL8J2o1O0n9OK0J2k4j9M2k5rK7k5j3m9P9m1O2l8L6j7m4R1l3J0n
8123B0L7j25M7P8o2M5m5QK0o8J09o7k8MN9j8p0L8P7p2JJ20j55J6O5J5l2L2j3K5
8153F1n0K9o2l6P9q8j6J26K0q7L9L8j3Jo6ML0K2p1L2M8j3Jp%kj2l6N4m6KJ0j2
8186b1L0j8l1RK4
8191g
$$ Imaginary data points
##PAGE= N=2
##DATA TABLE= (X++(I..I)), XYDATA
$$ plain form
0 0 0 0 0 0 0 0 -8 8 -8 8 -16 16 -24 32 -40 48 -64 72 -88 112 -136 160 -192 224 -261 304 -355 410 -472
29 -472 541 -619 706 -802 906 -1024 1152 -1294 1447 -1619 1804 -2009 2231 -2471 2739 -3031
45 -3031 3346 -3692 4070 -4483 4938 -5440 5994 -6606 7289 -8056 8919 -9905 11037
58 11037 -12354 13906 -15774 18066 -20959 24737 -29891 37373 -49248 70961 -123287 500339
70 500339 255471 -741628 225335 -77948 -143230 507724 98860 -348997 -110779 -116663 309093
81 309093 146475 -366914 126821 140934 -411929 217403 299209 -403385 -12442 328375
91 328375 -195582 -83843 189180 -74535 -103583 88396 112459 83703 -158791 -172062 169716
102 169716 57471 -56786 248872 -135252 -485371 219342 362894 -166654 365 -265
$$ packed form
0@%%%%%%qJ6j6J6k4L2m0N6p2Q8j12J36j60K00k48K96l52M16m85N65o59P65q82
29d72J013j160J325j508J708j930K176k446K741l066L423l813M240m702N210n770
45c031O377p038P762q553R421j0378J1434j2600J3895j5345J6975j8824K0942
58A1037k3391K6260k9680L3840l9025M5696n4628O7264q6621J20209j94248O23626
70E00339k44868r97099R66963l03283o5282O50954m08864m47857K38218n884M25756
81C09093j62618n13389M93735J4113n52863O29332Q1806p02594L90943L40817
91C28375n23957J11739K73023k63715k9048J91979K4063k8756k42494j3271L41778
102A69716j12245j14257L05658l84124l50119P04713J43552n29548J67019o30
$$ plain form
112 -265 -279304 107056 282336 14452 -57796 -177925 5710 258222 -104091 -54668 210944
123 210944 -224710 -82242 349384 -160494 -227499 232481 -1874 -91384 92944 -83797
133 -83797 -66013 19457 -1250 163429 -31929 -229499 119053 65129 -149890 203516 142935
144 142935 -268778 -49708 154141 -19389 42257 86973 -99016 -114221 -2587 102947
154 102947 101819 -119211 -94621 121080 -50828 -77003 180704 -48183 -177663 181017 81898
165 81898 -183619 15227 86988 -15105 27387 23636 -10842 -70896 -55732 159644 72525
176 72525 -175658 22067 80583 -164575 27168 199326 -94555 -121592 83581 -10158 -62005
187 -62005 82868 73201 -58309 -79796 38433 78814 -52670 -18682 106993 -53861 -101417
$$ packed form
112b65k79039L86360J75280k67884p2248j20129J83635K52512l62313M9423K65612
123B10944m35654J42468M31626n09878o7005M59980k34355q9510J84328j76741
133h3797J7784Q5470k0707J64679j95358j97570L48552n3924k15019L53406o0581
144A42935m11713K19070K03849j73530O1646M4716j85989j5205J11634J05534
154A02947j128k21030K4590K15701j71908k6175K57707k28887j29480L58680r9119
165H1898k65517J98846P1761j02093M2492l751l4478o0054J5164K15376q7119
176G2525k48183J97725N8516k45158J91743J72158k93881k7037K05173r3739n1847
187f2005J44873r667j31510k1487J18229M0381j31484L3988J25675j60854m7556
$$ plain form
198 -101417 114105 18554 -133712 68947 100404 -98284 -47452 54295 -19581 -25608 57747
209 57747 43648 -63839 -79549 56849 75046 -49229 14152 72888 -95785 -56227 128684
220 128684 11526 -72660 49323 5918 -73907 2143 48545 14517 -40736 -14772 45910
231 45910 -46886 -55300 96395 21552 -84330 43138 35840 -82348 4380 87942 1869 -49181
243 -49181 8411 21925 -39469 -9603 76754 10178 -80222 -622 41162 -45576 -11259 79316
255 79316 -12090 -83674 17672 39827 -32839 8245 59822 -17675 -63107 20983 51117 -26159
267 -26159 -11619 58023 -11258 -72134 21911 52146 -38068 -12036 63739 -29733 -88101 40007
279 40007 63160 -43407 -13732 45546 -30767 -58828 47026 63073 -49342 -26826 68927
$$ packed form
198a01417K15522r5551j52266K02659L1457j98688N0832J01747p3876o027Q3355
209E7747j4099j07487j5710J36398J8197j24275O3381N8736j68673L9558J84911
220A28684j17158q4186J21983m3405p9825P6050M6402l4028n5253K5964O0682
231D5910r2796q414J51695p4843j05882J27468p298j18188Q6728Q3562q6073n1050
243d9181N7592J3514o1394K9866Q6357o6576r0400P9600M1784q6738L4317R0575
255G9316r1406p1584J01346K2155p2666M1084N1577p7497m5432Q4090L0134p7276
267b6159J4540O9642o9281o0876R4045L0235r0214K6032P5775r3472n8368J28108
279D0007K3153j06567K9675N9278p6313k8061J05854J6047j12415K2516R5753
$$ plain form
290 68927 -24644 -77017 64667 59278 -62310 -8699 45132 -47182 -48330 71721 46514 -77496
302 -77496 -24541 59934 -31809 -43685 73871 26098 -74588 4535 56360 -40973 -35219 79994
314 79994 30204 -78293 -7095 49657 -27925 -14453 63779 -2067 -80376 4446 59392 -30205
326 -30205 -32624 54522 2664 -66085 9297 41519 -26220 -8291 54934 -7162 -72411 14782
338 14782 65543 -16866 -22960 34589 -12944 -50307 26953 49405 -33414 -30232 43593 -3674
350 -3674 -61000 19185 49969 -23726 -19245 24168 -16495 -38731 34205 53285 -31916 -38026 33343
363 33343 6832 -32957 25374 35197 -32686 -20107 31315 -10135 -36848 33368 39389 -37222
375 -37222 -34592 17684 9400 -12857 17283 25844 -40300 -35359 51124 15862 -45269 22220 31945
$$ packed form
290F8927r3571n2373J41684n389j21588N3611N3831r2314j148J20051k5207j24010
302g7496N2955Q4475r1743j1876J17556m7773j00686P9123N1825r7333N754J15213
314G9994m9790j08497P1198N6752p7582J3472P8232o5846p8309Q4822N4946q9597
326c0205k419Q7146n1858o8749P5382L2222o7739J7929O3225o2096o5249Q7193
338A4782N0761q2409o094N7549m7533l7363P7260K2452q2819L182P3825m7267
350c674n7326Q0185L0784p3695M481M3413m0663k2236P2936J9080q5201o110P1369
363C3343k6511l9789N8331R823o7883J2579N1422m1450k6713P0216O021p6611
375c7222K630N2276q284k2257L0140Q561o6144M941Q6483l5262o1131O7489R725
$$ plain form
388 31945 -39043 -16305 29014 1848 -19256 15579 26655 -39112 -41204 47905 25901 -45189
400 -45189 9672 29066 -48235 -15815 59745 -1140 -42529 29760 22356 -47810 -6410 51584
412 51584 8254 -31574 3304 17335 -31573 -8333 63831 -7302 -70830 28853 34621 -51047
424 -51047 5146 41845 -32689 -20812 32413 -2067 -34695 3199 41207 4272 -41053 3029
436 3029 24432 -27874 10081 56415 -36211 -50460 44857 12439 -32713 26663 16760 -34599
448 -34599 -13084 15535 15486 -6902 -9095 21709 -14723 -38501 42223 30531 -50928 2837 38428
461 38428 -30784 -10798 35664 -16000 -22150 28594 11700 -23255 -22532 3927 32248 -3499 -21047
474 -21047 19305 -27638 -35932 68783 19835 -61890 15543 11137 -31885 32256 22624 -20136
$$ packed form
388C1945p0988K2738M5319k7166k1104L4835J1076o5767k092Q9109k2004p1090
400d5189N4861J9394p7301L2420P5560o0885m1389P2289p404p0166M1400N7994
412E1584m3330l9828L4878J4031m8908K3240P2164p1133o3528R9683N768q5668
424e1047N6193L6699p4534J1877N3225l4480l2628L7894L8008l6935m5325M4082
436C029K1403n2306L7955M6334r2626j4249R5317l2418m5152N9376r903n1359
448c4599K1515K8619m9k2388k193L0804l6432k3778Q0724j1692q1459N3765L5591
461C8428o9212J9986M6462n1664o150N0744j6894l4955P23K6459K8321l5747j7548
474b1047M0352m6943q294J04715m8948q1725P7433m406m3022O4141r632m2760
$$ plain form
486 -20136 -6271 -13594 16761 22910 -32086 12494 25206 -49644 8910 48044 -43244 -18519
498 -18519 42095 -12214 -16552 16948 -10923 -13420 7230 14972 19348 -25899 -34039 34833 11478
511 11478 -22397 41264 -3384 -72152 27369 53512 -29005 -3239 11988 -33396 -2173 29021
523 29021 9107 -11291 -30185 7810 34021 -28012 -8105 41406 -35937 -20941 67023 -18192
535 -18192 -52818 42964 9371 -26545 28745 0 -27794 -1344 3299 30507 3572 -45563
547 -45563 15013 7282 -38625 49449 31110 -71780 -2458 37926 -19909 12398 22742 -28827
559 -28827 -13841 11935 16340 11803 -25306 -9153 29446 -14699 -12473 35628 -23508 -36232 47495
572 47495 10935 -40795 12612 2793 -21959 23983 15970 -13085 -12779 -18501 21726 31823 -23378
$$ packed form
486b0136J3865p323L0355O149n4996M4580J2712p4850N8554L9134r1288K4725
498a8519O0614n4309m338L3500k7871k497K0650P742M376m5247q140O8872k3355
511A1478l3875O3661m4648o8768R9521K6143q2517K5766J5227m5384L1223L1194
523B9021j9914k0398j8894L7995K6211o2033J9907M9511p7343J4996Q7964q5215
535a8192l4626R5782l3593l5916N5290k8745k7794K6450M643K7208k6935m9135
547d5563O0576p731m5907Q8074j8339j02890O9322M0384n7835L2307J0344n1569
559b8827J4986K5776M405m537l7109J6153L8599m4145K226M8101n9136j2724Q3727
572D7495l6560n1730N3407r819k4752M5942q013k9055L06n722M0227J0097n5201
$$ plain form
585 -23378 -1113 10338 -39296 16841 52666 -31918 -25622 23020 -13832 -2297 27164 -12908
597 -12908 -15345 2020 -2769 18928 -2625 -27887 21513 6145 -25046 32333 4565 -46681
609 -46681 22431 27361 -19513 9178 -2512 -23481 12729 10947 7067 3660 -36420 -3932 34276
622 34276 -12927 -3351 21365 -33305 -16340 41833 700 -21945 11129 -1796 -7910 12018
634 12018 3865 -276 -7559 -9362 24631 3309 -31453 16248 10743 -29696 22771 20148 -41520
647 -41520 -3744 25244 -7038 1447 6077 -11301 -6398 -220 16145 14672 -23048 -6999 21024
660 21024 -13992 -3778 31411 -14882 -27103 22888 5416 -17305 9648 1796 -11873 2192
672 2192 3987 4071 -7673 -13169 19467 8782 -21587 9729 7907 -22284 14164 23837 -18833 -10984
$$ packed form
585b3378K2265J1451m9634N6137L5825q4584O296M8642l6852J1535K9461m0072
597a2908k437J7365m789K1697k1553k5262M9400j5368l1191N7379k7768n1246
609d6681O9112M930m6874K8691j1690k0969L6210j782l880l407m0080L2488L8208
622C4276m7203R576K4716n4670J6965N8173m1133k2645L3074j2925o114J9928
634A2018q153m141p283j803L3993k1322l4762M7701n505m0439N2467k623o1668
647d1520L7776K8988l2282Q485M630j7378M903O178J6365j473l7720J6049K8023
660B1024l5016J0214L5189m6293j2221M9991j7472k2721K6953p852j3669J4065
672B192J795Q4j1744n496L2636j0685l0369L1316j822l0191L6448R673m2670P849
$$ plain form
686 -10984 10859 -480 -1076 6692 1400 -8140 -10294 5537 12277 -9282 -6821 12822 -9161 -14049
700 -14049 20741 4395 -19628 9306 8677 -11565 3793 6178 -3521 -703 1052 7541 -2635
713 -2635 -15565 9037 10961 -12874 2569 6937 -16409 -2737 16194 -160 -9570 421 2447
726 2447 -3156 107 8208 3259 -9209 -2442 10954 -1658 -8346 11462 3773 -15504 3694 10118
740 10118 -10251 -3291 9854 -1230 -8944 -30 6410 -3740 -5802 10848 3765 -14682 1516
753 1516 12849 -6318 -4111 13414 -2275 -14961 7538 10559 -9221 -1900 8125 -5203 -8993
766 -8993 4808 8100 -6887 -7016 10255 -1294 -13627 9586 9146 -11713 1283 9763 -6434
779 -6434 -5675 8685 6254 -7278 -2524 8596 -4054 -8180 9348 4473 -10306 -921 6565 -5167
$$ packed form
686a0984K1843j1339n96P768n292r540k154J5831O740k1559K461J9643k1983m888
700a4049L4790j6346k4023K8934o29k0242J5358K385r699K818J755O489j0176
713b635j2930K4602J924k3835J5443M368k3346J3672J8931j6354r410R991K026
726B447n603L263Q101m949j2468O767J3396j2612o688J9808p689j9277J9198O424
740A0118k0369O960J3145j1084p714Q914O440j0150k062J6650p083j8447J6198
753A516J1333j9167K207J7525j5689j2686K2499L021j9780P321J0025j3328l790
766h993J3801L292j4987j29J7271j1549j2333K3213m40k0859J2996Q480j6197
779f434P59J4360k431j3532M754J1120j2650m126J7528m875j4779R385P486j1732
$$ plain form
793 -5167 -6446 8757 4401 -11206 -628 8218 -5113 -3044 8941 1369 -8059 220 7666 -2749
807 -2749 -5186 8427 2266 -10261 1356 6276 -4956 -2423 6504 -461 -8864 1155 7397 -4122
821 -4122 -3118 6635 -905 -6315 2972 5394 -2483 -2351 5674 231 -7767 3084 6501 -4296 -1808
836 -1808 3429 -2041 -4363 1418 4737 -2730 -4749 4432 100 -6414 3331 5211 -3361 -2371 3347
851 3347 606 -4133 2588 6362 -4361 -4099 5354 108 -4597 2633 4297 -3943 -4664 4969 865
866 865 -7198 4305 5888 -7642 -2397 5922 -1169 -3323 3843 3789 -5319 -3278 7166 183 -5817
881 -5817 5225 3190 -7774 -672 6836 -1976 -5118 4829 2126 -7864 784 6500 -3659 -2895 4639
896 4639 594 -4969 -363 6269 -1111 -5544 6071 2074 -8862 3063 6828 -4879 -1582 4255
$$ packed form
793e167j279J5203m356j5607J0578Q846j3331K069J1985p572r428Q279P446j0415
807b749k437J3613o161j2527J1617M920j1232K533Q927o965q403J0019O242j1519
821d122J004R753p540n410R287K422p877J32Q025n443p998J0851L417j0797K488
836a808N237n470k322N781L319p467k019R181m332o514R745J880q572R90N718
851C347k741m739O721L774j0723K62R453n246m705P230J664q240p21R633m104
866H65q063J1503J583j3530N245Q319p091k154P166n4r108K041J0444o983o000
881e817J1042k035j0964P102P508q812l142R947k703r990Q648N716j0159P64P534
896D639m045n563M606O632p380m433J1615l997j0936J1925L765j1707L297N837
$$ plain form
910 4255 -1923 -4521 2257 5125 -2670 -4493 3214 1033 -4800 2339 5575 -4891 -4321 6811 217
925 217 -6577 4948 3467 -6055 1174 3455 -2512 -1607 1210 3606 -1448 -5174 4439 958 -6834
940 -6834 5470 4639 -8131 -535 4621 -2701 -359 3969 -799 -3957 -547 3426 1905 -2553 -749
955 -749 2951 -2679 -2524 6849 -706 -7397 5530 2796 -6704 2581 2229 -3840 1407 1127 696 -905
971 -905 -5409 4297 4769 -6547 2388 3990 -9111 1141 9862 -3521 -4750 3171 -854 -1898 3646
986 3646 2052 -2668 -3764 856 5447 -2281 -4655 6030 -1265 -7284 8447 2351 -10877 4195
1000 4195 5696 -5774 1566 2785 -3853 -888 1760 4269 622 -7470 953 5275 -4465 2369 6528
1015 6528 -9809 -4969 10861 -166 -5400 4202 -2501 -4404 5174 1806 -1102 -2143 -3520 6347
$$ packed form
910D255o178k598O778K868p795j823P707k181n833P139L236j0466N70J1132o594
925B17o794J1525j481r522P229K281n967R05K817K396n054l726R613l481p792
940f834J2304q31j2770P596N156p322K342M328m768l158L410L973j521m458J804
955g49L700n630J55R373p555o691J2927k734r500R285l52o069N247k80m31j601
971i05m504R706M72j1316Q935J602j3101J0252Q721j3383j229P921m025j044N544
986C646j594m720j096M620M591p728k374J0685p295o019J5731o096j3228J5072
1000D195J501j1470P340J219o638K965K648K509l647q092Q423M322r740O834M159
1015F528j6337M840J5830j1027n234R602o703j903R578l368k908j041j377R867
$$ plain form
1029 6347 1428 -7245 6182 560 -9480 9192 4949 -11129 1906 3905 -4056 3457 1899 -3857
1043 -3857 -1953 -1635 4389 4664 -6341 -2149 4135 -4174 1122 9232 -5698 -7676 7453 1279 -3554
1058 -3554 5141 -1848 -4895 3487 900 1271 -146 -6856 3742 4551 -6576 3635 1788 -10509
1072 -10509 5025 8511 -6643 -1269 1478 -3502 3968 3284 -2154 64 -4195 -270 9052 -2825
1086 -2825 -5567 6222 -3983 -5142 10515 -651 -8765 4030 246 -2413 4023 -1593 -1415 4
1100 4 -2689 6859 1883 -9984 3690 5258 -6107 4885 4675 -10536 -1287 8834 -388 -2904
1114 -2904 315 -2568 -1235 2404 2562 704 -5745 -3161 7578 -568 -5211 7226 -1843 -9054 9002
1129 9002 4325 -8203 2451 2120 -3255 2739 1055 -806 -1739 -4145 5819 4370 -8663 127 4622
$$ packed form
1029F347m919q673J3427n622j0040J8672m243j6078J3035J999p961P513j558n756
1043c857J904L18O024K75j1005M192O284q309N296Q110j4930j978J5129o174m833
1058c554Q695o989l047Q382k587L71j417o710J0598Q09j1127J0211j847j2297
1072a0509J5534L486j5154N374K747m980P470o84n438K218m259L925R322j1877
1086b825k742J1789j0205j159J5657j1166q114J2795l784k659O436n616J78J419
1100Dk693R548m976j1867J3674J568j1365J0992k10j5211R249J0121r222k516
1114b904L219k883J333L639J58j858o449K584J0739q146m643J2437r069p211J8056
1129I002m677j2528J0654l31n375N994j684j861r33k406R964j449j3033Q790M495
$$ plain form
1144 4622 -6590 2463 8873 -7349 -6523 6487 1615 -1478 2934 -1359 -3232 277 2675 4534
1158 4534 -3315 -5913 5901 773 -6045 6414 567 -9802 4770 5627 -6232 -512 2304 -2100
1172 -2100 813 1667 554 -924 -3881 2502 5920 -3913 -1898 4922 -4517 -2734 9001 -883 -6831
1187 -6831 2698 -4 -1851 3249 -493 -1223 -1582 -2845 5670 1369 -7346 3818 3199 -6219 3679
1202 3679 4282 -6331 -191 5380 -355 -2484 -381 1196 -120 -1622 2394 1745 -5904 -1501 6543
1217 6543 -1987 -4741 5926 -528 -7633 5005 4953 -5105 105 2934 -1627 -1206 1576 3460 -1899
1232 -1899 -4872 4910 2527 -7247 2451 4941 -6672 -690 6495 -3701 -4942 4317 2370 -3228
1246 -3228 -681 2327 -573 -2905 2465 4827 -4398 -3531 6486 -599 -5367 5743 2105 -7074 906
$$ packed form
1144D622j1212R053O410j6222Q26J3010m872l093M412m293j873L509K398J859
1158D534p849k598J1814n128o818J2459n847j0369J4572Q57j1859N720K816m404
1172b100K913Q54j113j478k957O383L418r833K015O820r439J783J1735r884n948
1187f831R529k702j847N100l742p30l59j263Q515m301q715J1164o19r418R898
1202C679O03j0613O140N571n735k129K103J577j316j502M016o49p649M403Q044
1217F543q530k754J0667o454p105J2638n2j0058N210K829m561M21K782J884n359
1232a899k973R782k383r774R698K490j1613N982P185j0196j241R259j947n598
1246c228K547L008k900k332N370K362r225Q67J0017p085m768J1110l638r179P980
$$ plain form
1261 906 4295 -2452 -2227 2439 1375 -4077 -1363 5153 -1304 -4563 4360 2363 -5456 522 5163
1276 5163 -2392 -3022 5021 1110 -5874 1549 4415 -3068 -1525 3135 -444 -3680 134 4044 -1415
1291 -1415 -3859 3691 754 -5520 2573 4408 -3596 -1466 3208 -111 -2400 1298 3055 -1652 -2563
1306 -2563 2968 1177 -3994 535 4171 -2148 -3587 2836 910 -4047 1503 3545 -3058 -2777 2976
1321 2976 1562 -2842 37 4085 -1599 -3841 4190 1991 -4739 1590 4504 -3731 -3269 4061 1390
1336 1390 -4195 944 3376 -3978 -2740 4919 761 -4844 1156 4128 -3158 -3144 5352 1157 -5322
1351 -5322 2868 3818 -5209 -1012 5490 -210 -4209 1029 2969 -3118 -2282 4988 -401 -5936 2884
1366 2884 3645 -5161 -1417 5523 -522 -4419 2526 2589 -4240 501 5835 -1894 -4951 2733 3660 -3228
$$ packed form
1261I06L389o747K25M666j064n452K714O516o457l259Q923j997p819N978M641
1276E163p555o30Q043l911o984P423K866p483J543M660l579l236L814L910n459
1291a415k444P550k937o274Q093J835q004K130M674l319k289L698J757m707r11
1306b563N531j791n171M529L636o319j439O423j926m957N550K042o603K81N753
1321B976j414m404K879M048n684k242Q031k199o730O329K914q235M62P330k671
1336A390n585N139K432p354J238P659m158n605O000K972p286J4Q496m195o479
1351e322Q190R50r027M197O502n700l999N238J940o087Q36P270n389n535Q820
1366B884P61q806L744O940o045l897O945O3o829M741N334p729l057P684R27o888
$$ plain form
1382 -3228 -1697 4497 -1204 -5380 4187 2781 -6575 589 5553 -3387 -3582 3235 1503 -2658 145
1397 145 3440 -1657 -3691 4085 3067 -4967 93 5341 -2845 -3697 4219 730 -3929 2163 2034 -4199
1413 -4199 -1678 3313 1917 -2678 -2512 2803 375 -3083 3746 1859 -5811 1423 5397 -3066 -2280
1428 -2280 3249 498 -1722 412 1104 -1205 -2264 1981 3096 -4054 -2782 4761 -1281 -4557 5459
1443 5459 1564 -6786 2118 3905 -3504 491 3371 -770 -2492 -892 4333 1556 -5379 2072 2952
1458 2952 -6520 1952 6772 -6666 -3909 6433 -432 -3811 2029 335 -2376 871 2915 586
1472 586 -4205 -1338 6528 295 -5317 4637 828 -7816 5607 6199 -8023 -890 4364 -3561 -456
1487 -456 2501 -261 -1103 -3824 1867 5150 -5331 -637 6735 -6478 -2444 10717 -3029 -7091
$$ packed form
1382c228J531O194n701m176R567j406r356P164M964q940j95O817j732m161K803
1397A45L295n097k034P776j018q034N060N248q186q52P916l489m659O092j29o233
1413d199K521M991j396m595J66N315k428l458O829j887p670P234L974q463P86
1428b280N529k751k220K134O92k309j059M245J115p150J272P543o042l276J0016
1443E459l895q350Q904J787p409L995K880m141j722J600N225k777o935P451Q80
1458B952r472Q472M820j3438K757J0342o865l379N840j694k711L247K044k329
1472E86m791K867P866o233n612R954l809q644J3423N92j4222P133N254p925L105
1487d56K957k762q42k721N691L283j0481M694P372j3213M034J3161j3746m062
$$ plain form
1501 -7091 6158 720 -3230 3957 -654 -3618 231 993 3955 -1674 -7567 4226 3010 -6149 5575
1516 5575 2767 -11118 2592 8303 -4354 -126 2561 -3858 735 2746 760 1323 -4484 -1709
1530 -1709 6538 -2094 -3809 5321 -3634 -5795 8213 1081 -7489 2420 649 -2534 4506 -145 -2734
1545 -2734 591 -2860 4583 6112 -8125 -678 6012 -6475 2651 8914 -8775 -4892 6322 -982
1559 -982 137 1653 -4318 -480 335 162 5701 -3736 -7240 7659 2077 -6146 6431 557 -9354
1574 -9354 6208 6362 -5889 80 686 -2847 2963 846 -574 83 -7034 1430 8957 -5856 -3392
1589 -3392 6214 -6461 -2172 11400 -2189 -7316 3725 639 -194 3719 -1632 -891 -355 -2479 6394
1604 6394 1261 -9750 3817 4202 -8243 4949 4969 -11304 650 7441 -3558 469 1178 -3843
$$ packed form
1501g091J3249n438l950P187m611k964L849P62K962n629n893J1793j216r159J1724
1516E575k808j3885J3710N711j2657M228K687o419M593K011j986N63n807K775
1530a709Q247q632j715R130q955k161J4008p132q570R909j771l183P040m651k589
1545b734L325l451P443J529j4237P447O690j2487R126O263j7689L883J1214p304
1559i82J119J516n971L838Q15j73N539r437l504J4899n582q223J2577n874r911
1574i354J5562J54j2251N969O06l533N810k117j420O57p117Q464P527j4813K464
1589c392R606j2675M289J3572j3589n127J1041l086q33L913n351P41N36k124Q873
1604F394n133j1011J3567L85j2445J3192K0j6273J1954O791j0999M027P09n021
$$ plain form
1618 -3843 1577 1038 1966 3999 -7257 -2645 9455 -2598 -3460 7282 -5237 -6724 8867 1461
1632 1461 -6325 1746 -584 -2267 2894 -303 -162 -152 -4396 4241 4817 -6530 1505 4607 -6649
1647 -6649 2769 7660 -6468 -2663 4044 -1565 1503 1377 -3680 26 -1546 -559 6483 -3219 -7123
1662 -7123 5563 882 -4461 6187 498 -7255 3341 3983 -1718 909 -991 -597 1988 -1634 1964
1677 1964 1714 -6923 1271 6299 -5555 -1550 4849 -4982 -2138 6353 -523 -3997 494 1120 838
1692 838 401 682 1559 -2957 -1938 6198 1147 -5943 2344 2175 -5489 2469 4708 -5674 -2598 3538
1708 3538 -370 -945 -163 -276 337 -1562 2009 3531 -5079 -1363 7046 -1740 -3526 5187 -917 -4865
1724 -4865 3851 2817 -3565 -1306 1434 -136 -1858 -109 2892 -1791 -4471 3497 2622 -4715 1762
$$ packed form
1618c843N420n39R28K033j1256M612J2100j2053q62J0742j2519j487J5591p406
1632A461p786Q071k330j683N161l197J41J0m244Q637N76j1347Q035L102j1256
1647f649R418M891j4128L805O707n609L068j26n057L706j572R87P042r702l904
1662g123J2686m681n343J0648n689p753J0596O42n701K627j900L94K585l622L598
1677A964k50q637Q194N028j1854M005O399r831K844Q491o876l474M491O26k82
1692H38m37K81Q77m516J019Q136n051p090Q287j69p664P958K239j0382L076O136
1708C538l908n75P82j13O13j899L571J522q610L716Q409q786j786Q713o104l948
1724d865Q716j034o382K259K740j570j722J749L001m683k680P968q75p337O477
$$ plain form
1739 1762 3999 -4798 -507 5720 -1268 -2922 2428 1173 -1435 -17 1426 -484 -2748 987 3134
1754 3134 -3064 -3282 3445 102 -3621 2619 1654 -4502 577 3885 -1171 -1160 1331 788 -332 -878
1770 -878 1919 1644 -3362 242 3395 -3326 -1430 3978 -1678 -3227 2049 622 -2059 -215 1359
1785 1359 68 -1869 937 2735 -2100 -1696 4109 720 -3621 1873 2449 -3204 73 3761 -1927
1800 -1927 -3350 1868 1538 -2263 -1112 1896 -329 -3018 1334 2723 -2995 -1010 4137 -803 -3164
1815 -3164 2957 2090 -2783 344 2978 -1410 -2221 2173 1572 -2768 -1058 2687 -865 -3627 2078 2262
1831 2262 -3946 -387 3853 -2205 -2548 3660 1358 -2862 354 2839 -832 -1992 2622 1852 -3548
1846 -3548 -221 3571 -2151 -2733 3266 443 -4125 738 2592 -2748 -1491 3278 -71 -3046 1091
$$ packed form
1739A762K237q797M291O227o988j654N350j255k608J418J443j910k264L735K147
1754C134o198k18O727l343l723O240r65o156N079L308n056J1K491n43j120n46
1770h78K797k75n006L604L153o721J896N408n656j549N276j427k681J844J574
1785A359j291j937K806J798m835M04N805l389m341N494N76n653L277L688n688
1800a927j423N218l30l801J151L008k225k689M352J389n718J985N147m940k361
1815c164O121q67m873L127K634m388q11M394o01m340J710L745l552k762N705J84
1831B262o208L559M240o058l43O208k302m220L216K485l671j160M614p70n400
1846c548L327L792n722n82N999k823m568M863J854n340J257M769l349k975M137
$$ plain form
1861 1091 2560 -1346 -1231 2794 866 -3166 1119 3355 -2593 -1567 3472 -665 -3018 1465 1154
1876 1154 -2043 -733 1566 -106 -2352 202 2520 -1187 -1803 2633 543 -2857 1827 2889 -2332
1891 -2332 -740 2686 -528 -1736 1209 1196 -1311 -1701 1352 982 -3024 2 3084 -2631 -2136 3656
1907 3656 -338 -3171 2246 1809 -2059 -3 1974 -63 -1437 848 2391 -1359 -2436 2416 950
1922 950 -3402 1515 2462 -4292 -1044 3787 -1360 -2139 1729 100 -1348 111 1608 776 -2491 285
1938 285 3898 -2001 -2180 4261 -653 -3667 3434 1434 -3977 377 2076 -1481 -957 885 370 -1713
1954 -1713 -1450 3000 1149 -3962 1258 3061 -3850 589 5321 -3210 -2906 4177 114 -1963 1645
1969 1645 173 -1462 -762 1001 1942 -2694 -2468 3681 -455 -3511 3460 460 -4811 2619 3396 -3136
$$ packed form
1861A091J469l906J15M025j928m032M285K236n948J026N039m137k353M483l11
1876A154l197J310K299j672k246K554K318l707o16M436k090l400M684J062n221
1891b332J592L426l214j208K945j3k507l90L053l70m006L026L082n715M95N792
1907C656l994k833N417m37l868K056J977k037j374K285J543l750j077M852j466
1922I50m352M917R47o754L248M831n147p79L868j629j448J459J497q32l267K776
1938B85L613n899j79O441m914l014P101k000n411M354J699l557N24J842n15k083
1954a713K63M450j851n111N220J803o911M439M732q531L04P083m063k077L608
1969A645j472j635P00J763R41m636K26O149m136l056O971l000n271P430P77o532
$$ plain form
1985 -3136 -140 1746 -1129 475 1281 359 -119 -2495 833 3566 -2666 -1465 3158 -3149 -1929 4971
2001 4971 -1045 -3671 1820 132 -780 1465 -277 -219 -337 -1009 3255 1009 -4196 1735 2528 -3475
2017 -3475 1774 3097 -4871 -973 4000 -1228 -1014 667 -1799 105 401 141 2217 -2735 -2652 4822
2033 4822 -224 -2932 4410 -1007 -4696 4408 2318 -3169 748 -71 -1157 1672 -192 40 -166 -3685
2049 -3685 1945 3913 -4443 -953 3546 -3702 37 5476 -3067 -3138 3050 294 247 1343 -1474 233
2065 233 -444 -805 4347 -944 -5168 3431 1024 -4198 4060 1388 -6402 1228 3570 -1899 356 111
2081 111 -1826 1127 580 1213 1463 -4352 -118 5597 -2328 -1706 3915 -3771 -2220 6109 -820 -3827
2097 -3827 1133 -934 26 2120 -1214 -248 -898 -2201 4135 1679 -4598 1538 1822 -3392 2841 3200
$$ packed form
1985c136K996J886k875J604Q06r22m78k376L328K733o232J201M623o307J220O900
2001D971o016k626N491j688r12K245j742N8j18o72M264k246n205N931P93o003
2017c475N249J323p968L898M973n228K14J681k466J904K96k60K076m952Q3P474
2033D822n046k708P342n417l689R104k090n487L917q19j086K829j864K32k06l519
2049c685N630J968q356L490M499p248L739N439q543p1O188k756m7J096k817J707
2065B33o77l61N152n291m224Q599k407n222Q258k672p790P630K342n469K255k45
2081A11j937K953n47O33K50n815M234N715p925O22N621p686J551Q329o929l007
2097c827M960k067R60K094l334R66o50j303O336k456o277O136K84n214O233L59
$$ plain form
2113 3200 -4338 -636 2516 -783 796 146 -2012 504 -484 2 2920 -2854 -3259 3980 -129 -2358
2129 -2358 3689 -1280 -4164 3498 2299 -1521 361 -1075 -351 1973 -228 749 63 -3949 1740 3879
2145 3879 -3561 -979 2594 -3267 -339 3978 -1942 -2220 1487 -232 572 682 -977 1027 -690 -1269
2161 -1269 3898 8 -3982 2392 1091 -3039 2688 1469 -4220 -127 2002 -400 118 -775 -924 641
2177 641 -715 1104 2153 -3439 -988 4338 -1310 -1662 3571 -1573 -2561 3481 643 -2172 381 -259
2193 -259 8 324 -957 1151 -841 -2915 2937 1528 -3866 1340 1813 -3238 1377 3107 -2200 -921
2209 -921 1461 116 386 42 -52 374 -1651 353 2616 -2031 -2071 2436 -743 -1976 2446 -227 -2616
2226 -2616 1230 1286 -603 -112 -219 532 423 -613 1441 370 -2422 1120 2185 -2074 -335 1780
$$ packed form
2113C200p538L702L152l299J579o50k158K516r88M86K918n774m05P239m109k229
2129b358O047m969k884P662j199l820J882j436P24K324k201R77o86m012N689K139
2145C879p440K582L573n861K928M317n920k78L707j719Q04J10j659K004j717n79
2161a269N167l890l990O374j301m130N727j219n689M093K129k402N18q93j49J565
2177F41j356J819J049n592K451N326n648l52N233n144r88O042k838k815K553o40
2193b59K67L16j281K108j992k074N852j409n394N206M73n051M615J730n307J279
2209i21K382j345K70l44r4M26k025K004K263m647m0M507l179j233M422k673k389
2226b616L846N6j889M91j07P51j09j036K054j071k792L542J065m259J739K115
$$ plain form
2242 1780 -1689 -1016 1918 -256 -1395 65 183 75 -436 97 1149 -1085 -950 2474 97 -2028
2258 -2028 1758 843 -1770 1104 1257 -1459 -490 885 256 -644 -810 570 -28 -1311 764 912 -1808
2275 -1808 -352 1907 -573 -982 1567 323 -1383 693 1298 -520 -564 731 513 -885 -305 1241
2291 1241 -442 -1746 1120 753 -2068 143 1497 -1301 -701 1593 -57 -1201 566 1175 -371 -682
2307 -682 994 578 -1295 152 1776 -1007 -1354 1626 2 -1846 829 856 -1634 -414 1090 -284
2323 -284 -830 407 903 -589 -675 1433 395 -1267 868 1313 -1235 -297 1425 -390 -1061 724 478
2340 478 -1113 -285 757 -250 -931 208 638 -786 -724 1271 181 -1269 899 1040 -1194 121 1287
2357 1287 -357 -561 586 341 -647 -384 832 43 -1364 305 809 -1294 -417 1167 -568 -1002 966
$$ packed form
2242A780l469O73K934k174j139J460J18j08n11N33J052k234J35L424k377k125
2258b028L786r15k613K874J53k716R69J375o29r00j66J380n98j283K075J48k720
2275a808J456K259k480m09K549j244j706K076O05j818m4J295k18j398N80J546
2291A241j683j304K866l67k821K211J354k798O00K294j650j144J767O09j546l11
2307f82J676m16j873J447J624k783l47K980j624j848K675K7k490J220J504j374
2323b84n46J237M96j492q6K108j038j662K135M45k548R38J722j815o71J785k46
2340D78j591Q28J042j007o81J139M30j424O2J995j090j450K168J41k234J315J166
2357A287j644k04J147k45r88K63J216p89j407J669N04k103Q77J584j735m34J968
$$ plain form
2374 966 479 -906 208 1052 -174 -517 622 733 -473 -344 1029 -85 -1099 746 646 -1442 -118
2391 -118 1014 -729 -775 592 56 -568 78 632 -127 -830 623 1095 -725 -281 1286 -288 -981 1218
2409 1218 365 -1392 258 918 -771 -482 433 95 -605 -380 812 -143 -1215 988 849 -1441 374
2426 374 1563 -1011 -397 1374 -35 -638 486 286 -491 -363 579 316 -1147 -463 951 -457 -968
2443 -968 1039 -126 -1493 930 978 -1158 66 821 -237 73 339 134 -43 -558 676 761 -1306 -24
2461 -24 1097 -1186 -432 1267 -769 -1011 727 45 -450 243 90 -72 -234 -14 1136 -62 -1103 960
2479 960 433 -1225 1104 746 -1738 211 1051 -716 -151 37 -554 174 -113 129 369 -1255 7 1608
2497 1608 -658 -593 1262 -612 -653 1702 37 -1001 468 124 -97 396 -383 24 -141 -934 865 535
$$ packed form
2374I66m87j385J114Q44j226l43J139J11j206J29J373j114j014J845j00k088J324
2391a18J132j743m6J367n36o24O46N54p59p03J453M72j820M44J567j574o93K199
2409A218q53j757J650O60j689K89R15l38p00K25J192r55j072K203j39k290J815
2426C74J189k574O14J771j409o03J124k00p77J28R42k63j463O84J414j408n11
2443i68K007j165j367K423M8k136J224P55j058L10K66k05j77n15J234Q5k067J282
2461b4J121k283P54J699k036k42J738o82m95O93j53j62j62K20J150j198j041K063
2479I60n27j658K329l58k484J949Q40j767N65J88n91P28k87K42K40j624J262J601
2497A608k266O5J855j874m1K355j665j038J469l44k21M93p79M07j65p93J799l30
$$ plain form
2515 535 -1672 411 855 -1485 594 1185 -1239 -142 881 -181 385 109 -349 362 -328 235 1087
2532 1087 -1121 -1009 1363 -232 -879 1046 -514 -1466 1037 644 -788 -60 -122 -64 543 -150 296 105
2550 105 -1145 820 1315 -1281 52 1048 -1240 56 1334 -804 -630 435 -263 118 68 -498 186
2567 186 -480 -285 1304 -231 -1221 864 289 -814 1210 451 -1464 413 734 -328 292 -305 -458
2584 -458 325 -346 281 566 -1454 -247 1359 -727 -297 1000 -903 -485 1343 22 -544 207 -218
2601 -218 235 467 -251 225 -187 -811 947 549 -1390 342 475 -1276 620 900 -1213 -132 304 -329
2619 -329 581 -55 -509 370 -486 199 1350 -899 -728 1153 -227 -406 996 -520 -963 698 356 -291
2637 -291 -79 -475 1 400 -310 423 140 -1188 630 1094 -927 195 744 -1096 142 1081 -467 -287
$$ packed form
2515E35k207K083M44k340K079N91k424J097J023j062N66k76m58P11o90N63Q52
2532A087k208J12K372j595o47J925j560r52K503l93j432P28o2N8O07o93M46j91
2550A05j250J965M95k596J333R96k288J296J278k138J74J065o98L81n0n66O84
2567A86o66J95J589j535r90K085n75j103K024p59j915J877L21j062O20n97j53
2584d58P83o71O27K85k020J207J606k086M30J297j903M18J828j321n66P51m25
2601b18M53K32p18M76m12o24J758l98j939J732J33j751J896K80k113J081M36o33
2619c29R10o36m54Q79q56O85J151k249J71J881j380j79J402j516m43J661l42o47
2637b91K12l96M76L99p10P33k83j328J818M64k021J122N49j840J238R39j548J80
$$ plain form
2655 -287 5 -167 453 -61 -309 323 -667 -230 1072 -398 -980 722 -3 -663 825 133 -909 272
2673 272 489 -106 281 -271 -85 251 -379 483 595 -1150 -31 849 -684 -28 625 -784 -250 657 2
2692 2 -200 -191 -33 268 37 -55 375 -301 -462 756 208 -820 383 313 -772 262 560 -680 -226 214
2712 214 -111 79 -88 -99 156 -410 260 762 -685 -345 778 -231 -215 643 -148 -504 361 254 -191 -113
2732 -113 -25 47 -69 -235 321 10 -777 290 516 -657 180 513 -682 30 661 -181 -139 23 41 273
2752 273 -177 10 346 -505 -96 602 -283 -517 441 -20 -504 350 250 -491 -20 290 -77 -51 -10 175 64
2773 64 -292 342 360 -696 165 618 -555 -62 523 -469 -272 349 -38 -172 -215 37 177 -380 -24 369
2793 369 -372 -207 576 -31 -397 355 281 -396 90 389 -185 -152 228 45 -65 -178 182 88 -541 156 418
$$ packed form
2655b87K92j72O20n14k48O32r90M37J302j470n82J702p25o60J488o92j042J181
2673B72K17n95L87n52J86L36o30Q62J12j745J119Q80j533O56O53j409N34R07o55
2692Bk02RJ58L01k31r2M30o76j61J218n48j028J203p0j085J034K98j240M54M40
2712B14l25J90j67j1K55n66O70N02j447L40J123j009J6Q58p91l56Q65j07m45P8
2732a13Q8P2j16j66N56l11p87J067K26j173Q37L33j195P12O31q42M2J62J8K32
2752B73m50J87L36q51M09O98q85k34R58m61m84Q54j00p41M71L10l67K6M1J85j11
2773F4l56O34J8j056Q61M53j173M93N85r92J97O21l87j34m3K52J40n57L56L93
2793C69p41J65P83o07l66P52p4o77M86K99n74L3L80j83j10j13L60r4o29O97K62
$$ plain form
2814 418 -564 -84 502 -289 -155 401 -5 -222 41 312 30 -252 235 245 -305 -93 335 -96 -485 284
2834 284 244 -601 13 330 -431 -160 371 -146 -171 52 223 98 -289 209 382 -484 110 477 -360 -148 383
2855 383 -62 -351 119 196 -169 -221 203 -25 -347 105 259 -160 -282 353 263 -430 118 525 -295 -94 540
2876 540 -217 -249 167 79 -166 -247 142 170 -477 27 315 -368 -180 491 -122 -390 333 338 -338 -46 413 -65
2898 -65 -120 220 79 -156 -137 292 116 -536 154 343 -500 -78 436 -385 -234 237 -69 -187 -15 139 69
2919 69 -281 144 356 -263 -124 381 -68 -346 344 201 -515 40 419 -327 -149 148 -133 -97 1 224 125
2940 125 -522 249 497 -446 13 551 -362 -91 539 -108 -269 112 93 -43 -124 54 95 -349 -117 356 -182
2961 -182 -484 291 151 -539 269 401 -500 -19 368 -123 25 84 36 19 -317 168 381 -543 -93 477 -403
$$ packed form
2814D18r82M80N86p91J34N56m06k17K63K71k82k82M87J0n50K12M28m31l89P69
2834B84m0q45O14L17p61K71N31n17k5K23J71j25l87M98J73q66N94L67q37K12N31
2855C83m45k89M70P7l65n2M24k28l22M52J54m19j22O35r0o93N48M07q20K01O34
2876E40p57l2M16q8k45q1L89K8o47N04K88o83J88O71o13k68P23No76K92M59m78
2898f5n5L40j41k35J9M29j76o52O90J89q43M22N14q21J51M71l06j18J72J54p0
2919F9l50M25K12o19J39N05m49k78O90j43p16N55L79p46J78K97k81L6R8K23r9
2940A25o47P71K48r43M59N38r13K71O30o47j61L81j9j36q1J78M1m44K32M73n38
2961a82l02P75j40o90Q08J32r01M81L87m91J48N9m8j7l36M85K13r24M50N70q80
$$ plain form
2982 -403 -105 517 -357 -445 302 109 -238 1 95 -43 8 134 247 -105 -358 341 382 -566 148 405 -704
3003 -704 161 563 -495 -150 134 -166 102 -62 -127 165 -393 20 650 -387 -280 565 -183 -267 624 12
3023 12 -566 245 280 -175 53 -69 -135 -2 -143 267 236 -766 79 662 -607 82 570 -737 -36 676
3043 676 -187 -47 39 -235 283 12 -134 291 -473 -319 871 -47 -706 370 -9 -628 537 326 -747
3062 -747 59 293 -100 289 -154 -147 328 -397 256 698 -772 -82 759 -560 -23 765 -617 -308 365 -48
3082 -48 99 19 -388 108 11 -109 479 -250 -673 616 347 -660 384 204 -807 465 589 -479 -17
3101 -17 -35 -146 426 -222 -110 383 -738 16 893 -639 -373 636 -420 -195 690 -220 -371 178 52
3120 52 192 138 -155 73 -36 -305 502 224 -847 140 484 -667 215 470 -836 -46 512 -162 81 -191
$$ packed form
2982d03K98O22q74q8P47j93l47K39R4j38N1J26J13l52k53O99M1r48P14K57j109
3003g04Q65M02j058L45K84l00K68j64o5K92n58M13O30j037J07Q45p48q4Q91o12
3023A2n78Q11L5m55K28j22o6J33j41M10l1j002Q45N83j269O89M88j307P01P12
3043F76q63J40Q6k74N18k71j46M25p64J54J190r18o59J076l79o19J165k11j073
3062g47Q06K34l93L89m43PM75p25O53M42j470O90Q41j319N37P88j382L09O73m13
3082d8J47q0m07M96r7j20N88p29m23J289k69j007J044j80j011J272J24j068M62
3101a7j8j11N72o48J12M93j121P54Q77j532K66J009j056K25Q85r10j51N49j26
3120E2J40n4k93K28j09k69Q07k78j071R87L44j151Q82K55j306P90N58o74K43k72
$$ plain form
3140 -191 -261 407 -140 -49 493 -583 -323 841 -101 -354 373 -189 -352 516 147 -447 4 13 -42 204 -228
3161 -228 4 147 -590 342 712 -793 -91 664 -505 70 760 -522 -314 227 109 268 -111 -397 178
3180 178 -231 -130 530 -353 -673 541 204 -536 324 169 -618 293 563 -323 44 62 -5 317 -211 94
3200 94 376 -723 69 824 -604 -313 601 -503 -144 518 -190 -241 -43 6 286 -87 -199 248 -101 -241
3220 -241 589 119 -683 253 392 -564 229 449 -647 -92 299 -86 -3 -228 -62 261 -364 89 569 -590
3240 -590 -193 766 -146 -255 437 -97 -220 268 223 -140 -156 45 82 -49 -118 144 45 -482 205 394 -610
3261 -610 -27 505 -464 18 568 -230 -143 160 165 187 -208 1 344 -400 -62 532 -268 -502 335 87 -408
3282 -408 64 307 -323 -139 365 -88 -99 90 131 99 -151 201 430 -475 74 659 -410 -280 514 -244 -354
$$ packed form
3140a91p0O68n47R1N42j076K60J164r42k53P27n62j63Q68l69n94M51Rn5K46m32
3161b28K32J43p37R32L70j505P02P55j169N75O90j282K08N41j18J59l79k86N75
3180A78m09J01O60q83l20J214l37p40Q60j55p87R11K70q86L67J8o7L22n28L05
3200I4K82j099P92P55j428K91R14j104L59O62p08n1J98M9K80l73j12M47l49j40
3220b41Q30m70q02R36J39r56P93K20j096N55L91l85Q3k25J66L23o25M53M80j159
3240e90L97R59r12j09O92n34j23M88m5l63j6K01L7j31o9K62r9n27O87J89j004
3261f10N83N32r69M82N50p98Q7L03NK2l95K09L43p44L38N94q00k34Q37k48m95
3282d08M72K43o30J84N04m53j1J89M1l2k50L52K29r05N49N85j069J30P94p58j10
$$ plain form
3303 -354 262 98 -326 -219 211 124 -326 -52 356 -182 -262 426 203 -473 194 450 -407 18 468 -234 -190
3324 -190 260 -85 -93 -106 9 144 -404 3 522 -510 -243 583 -139 -313 390 141 -321 34 409 -22 -213
3345 -213 151 230 -174 -223 218 74 -429 52 299 -492 -120 504 -372 -273 396 -108 -66 144 37 108 -133 177
3367 177 477 -391 -151 609 -104 -368 365 116 -379 42 226 -250 -243 216 92 -276 -147 253 217 -290 122
3388 122 464 -385 39 656 -333 -218 524 -3 -202 115 80 -75 -194 24 180 -523 -191 510 -218 -471
3408 -471 364 204 -446 165 521 -341 -194 504 63 -233 120 153 107 -199 16 310 -481 -101 474 -493 -342
3429 -342 562 -223 -384 218 40 -144 43 200 51 -277 90 557 -198 -419 413 281 -377 141 333 -563
3449 -563 -151 583 -278 -419 145 -42 -66 -78 -55 211 -229 8 632 -327 -289 676 -134 -331 513 56 -360
$$ packed form
3303c54O16j64m24J07M30q7m50K74M08n38q0O88k23o76O67K56q57M25M50p02M4
3324a90M50l45qj3J15J35n48M07N19j032K67Q26p22j74P03k49m62L55L75m31j91
3345b13L64P9m04m9M41j44n03M81K47p91L72O24q76R9O69n04M2K10j07P1k41L10
3367A77L00q68K40P60p13k64P33k49m95M21J84m76PM59j24l68J29M00l6n07M12
3388A22L42q49M24O17r89J15P42n27j99L17l5j55j19K18J56p03L32P01p28k53
3408d71Q35j60o50O11L56q62J47O98m41k96L53L3m6l06K15K94p91L80N75r67J51
3429c42R04p85j61O02j78j84J87J57j49l28L67M67p55k21Q32j32o58N18J92q96
3449e63M12P34q61j41N64j87k4j2K3K66m40K37O24r59L8R65q10j97Q44m57m16
$$ plain form
3470 -360 122 132 -121 -151 32 20 -211 -287 281 228 -594 8 550 -447 5 698 -419 -226 602 1 21 15
3492 15 -143 305 -51 -202 409 -317 -414 698 -100 -585 362 68 -533 198 327 -253 -161 174 18 92 -110
3513 -110 177 269 -484 76 758 -539 -312 716 -473 -308 696 -262 -413 186 -62 46 -64 -242 221
3532 221 -176 -151 692 -108 -661 553 363 -501 314 368 -565 -24 565 -184 -243 -66 -127 195 -199 -103 429
3553 429 -570 -299 887 -302 -495 698 -236 -355 674 122 -279 64 28 128 126 -179 103 -138 -448 480
3573 480 353 -826 -70 519 -554 8 666 -599 -357 575 -53 76 79 -286 348 -14 -202 714 -318
3592 -318 -707 650 114 -544 434 -104 -645 220 283 -279 -75 -131 -54 321 -56 16 244 -505 80 971 -522
3613 -522 -460 719 -380 -225 734 -308 -420 210 -234 227 30 -608 345 -48 -554 681 159 -874 375
$$ packed form
3470c60M82J0k53l0J83j2k31p6N68n3q22O02N42r97M52O93j117J93Q28o01K0o
3492A5j58M48l56j51O11p26r7J112p98m85R47k94o01P31J29n80R2L35j56P4k02
3513a10K87R2p53N60O82j297K27J028j189J65J004r58j51N99k48J08j10j78M63
3532B21l97K5Q43q00n53J214j90q64Q15N4r33N41N89p49n9J77o1L22l94R6N32
3553D29r99K71J186j189j93J193r34j19J029n52m01L43l6J00kl05K82k41l10R28
3573D80j27j179P56N89j073N62O58j265K42R32o28J29Ll65O34l62j88R16j032
3592c18l89J357n36o58R78n38n41Q65O3n62K04n6P7L75l77P2K28p49N85Q91j493
3613e22O2J179j099J55R59j042j12O30m44M61j97o38R53l93n06J235n22j033J249
$$ plain form
3632 375 380 -532 335 421 -580 1 423 -8 79 -219 -236 435 -246 -104 565 -729 -538 965 -303 -628
3652 -628 655 -265 -422 539 76 -144 0 -179 379 144 -354 329 14 -613 483 512 -797 -30 454
3671 454 -514 -46 540 -402 -252 212 -67 182 -53 -231 392 -282 -211 912 -319 -648 723 19 -409
3690 -409 491 -82 -558 164 210 -48 -122 -299 68 125 -231 157 139 -502 101 679 -342 -247 553 -272 -191 590
3712 590 -86 -207 113 -114 220 11 -374 261 -164 -476 540 141 -625 98 207 -345 171 322 -298 -143
3732 -143 255 130 183 -103 -112 313 -129 -163 539 -364 -504 702 -143 -576 365 -81 -392 245 9 -43 -40 -179
3754 -179 331 47 -315 403 158 -527 267 476 -389 -75 365 -221 -217 358 -56 -278 -26 -21 130 -149 -244 343
3776 343 -192 -291 727 -109 -607 556 196 -374 286 166 -183 -21 123 180 -184 -175 243 -2 -414 120 239
$$ packed form
3632C75Nr12Q67Q6j001N81M22m31Q7k98j7O71o81J42O69j294J91J503j268l25
3652f28J283r20j57R61m63k20J44j79N58k35m98O83l15o27J096K9j309P67M84
3671D54r68M68N86r42J50M64k79K49k35j78O23o74P1J123j231l29J371p04m28
3690d09R00n73m76P22M6k58p4j77L67N7l56L88j8o41O03N78j021R5Q00q25Q1P81
3712E90o76j21L20k27L34k09l85O35m25l12J016l99p66P23J09n52N16J51o20J55
3732a43L98j25N3k86rM25m42l4P02r03j40J206q45m33R41m46l11O37k36n2Lj39
3754a79N10k84l62P18k45o85P94K09q65L14M40n86MN75m14k22K52NJ51k79r5N87
3776C43n35r9J018q36m98J163l60n70O60j20l49J62J44N7l64RM18k45m12N34J19
$$ plain form
3797 239 -443 -66 509 -261 -237 461 -26 -261 304 119 13 -44 -17 273 -77 -117 399 -256 -437 444 75
3818 75 -349 153 130 -255 -30 143 -68 -253 39 206 -34 -93 76 230 -59 6 320 -100 -308 427 -10
3839 -10 -346 202 85 -160 -45 -95 31 -105 -171 262 -47 -289 218 143 -397 100 259 -89 -73 275 -4 -221
3861 -221 134 162 -235 -113 52 60 -149 -204 228 -163 -354 361 10 -469 293 153 -239 51 193 25 -92
3882 -92 77 239 -68 -158 320 77 -365 94 272 -284 -284 291 -106 -368 237 116 -344 56 146 -15 -116 -27
3904 -27 318 -67 -275 477 64 -435 306 135 -459 105 194 -228 -146 47 -73 -138 -34 167 -60 -185 112
3925 112 191 -192 -69 344 -33 -180 407 37 -330 218 102 -130 48 -46 21 -48 -247 201 -97 -382 245
3946 245 82 -344 106 230 -223 -46 245 -7 -52 60 53 34 -65 27 128 -108 -210 310 -27 -424 231 -43
$$ packed form
3797B39o82L77N75p70K4O98m87k35N65j85j06n7K7K90l50m0N16o55j81Q81l69
3818G5m24N02k3l85K25J73k11j85K92J67k40n9J69J54k89O5L14m20k08P35m37
3839a0l36N48j17k45J15n0J26j36o6M33l09k42N07p5n40M97J59l48J6L48k79k17
3861b21L55K8l97J22J65Qk09n5M32l91j91P15l51m79P62j40l92K90J42j68j17
3882i2J69J62l07r0M78k43m42M59J78n56%N75l97k62O05j21m60M00R0j61j01Q9
3904b7L45l85k08P52m13m99P41j71n94N64Q9m22Q2J93j20o5J04K01k27j25K97
3925A12P9l83J23M13l77j47N87l70l67N48j16k32J78r4O7o9j99M48k98k85O27
3946B45j63m26M50J24m53J77K91k52m5J12pj9r9R2J01k36j02N20l37l97O55k74
$$ plain form
3968 -43 -367 338 36 -228 43 17 130 41 -135 225 66 -217 290 255 -345 58 289 -207 -166 186 -118 -236
3990 -236 112 29 -123 -55 -95 69 -99 -168 311 -84 -422 434 127 -352 336 101 -369 227 195 -99 -67 -117
4012 -117 104 47 -185 103 14 -406 28 403 -276 -198 330 -108 -216 399 6 -313 200 150 65 24 -123 204
4034 204 -24 -310 366 93 -581 266 152 -402 198 157 -379 9 170 6 7 -64 2 104 -70 62 238 -262
4056 -262 -168 456 -46 -335 342 -104 -359 350 -54 -233 74 -133 50 203 -264 150 88 -345 271 309 -352
4077 -352 119 220 -235 158 205 -163 -118 14 -49 140 -95 -209 78 -129 -214 396 -122 -448 351 155 -223
4098 -223 311 66 -272 211 80 74 86 -281 120 213 -300 181 149 -473 8 341 -236 -130 162 -171 -166 235
4120 235 44 -174 3 -2 174 33 -187 153 -13 -263 377 99 -459 212 188 -317 146 126 -251 -40 52 107
$$ packed form
3968d3l24P05l02k64K71k6J13q9j76L60j59k83N07l5o00M03K31m96M1L52l04j18
3990b36L48q3j52O8m0J64j68o9M79l95l38Q56l07m79O88k35m70N96l2k94L2n0
4012a17K21n7k32K88q9m20M34L75o79P8N28m38j08O15l93l19N13n0q5m1j47L27
4034B04k28k86O76k73o74Q47j14n54O00m1n36L88J61j64Jp1O6J02j74J32J76n00
4056b62R4O24n02k89O77m46k55P09m04j79L07k07J83J53m67M14o2m33O16L8o61
4077c52M71J01m55L93M7l68M5J32o3J89k35j14K87k07q5O10n18l26P99j96l78
4098b23N34k45l38M83j31oJ2l67M01R3n13M81l2o22M81L33n77J06K92l33NM01
4120B35j91k18J77nJ76j41k20L40j66k50O40k78n58O71k4n05M63k0l77K11R2N5
$$ plain form
4142 107 -35 -187 43 135 -158 78 303 -233 -202 407 -27 -215 278 -16 -292 258 84 -199 22 -157 26
4163 26 41 -260 145 -7 -450 273 240 -373 29 169 -185 88 247 -42 -22 -7 103 59 -63 -141 96 -50
4185 -50 -110 298 -95 -411 217 113 -238 232 13 -212 220 52 -38 162 -220 66 181 -256 76 210 -370
4206 -370 33 237 -161 -81 55 -94 -127 139 -16 -100 -55 -107 189 45 -232 195 48 -234 353 216 -364 178
4228 178 136 -230 178 28 -146 27 -70 123 109 -257 42 103 -257 -27 245 -164 -235 222 56 -156 207 85
4250 85 -221 33 133 -30 -18 -173 97 8 -235 230 104 -418 201 261 -265 -6 99 -152 -30 69 10 -89
4272 -89 5 128 149 -86 17 90 -47 -47 193 -39 -271 164 47 -300 67 42 -198 57 -25 -86 58 -90 69
4295 69 47 -157 184 173 -219 37 218 -59 -30 91 -43 -121 34 52 -123 -106 -85 59 48 -149 112 88 -227
$$ packed form
4142A07j42j52K30R2k93K36K25n36L1O09m34j88M93k94k76N50j74k83K21j79J83
4163B6J5l01M05j52m43P23l3o13M02J40l54K73J59k89K0J5J10m4j22p8K37j46
4185e0o0M08l93l16O28j04l51M70k19k25M32j68r0K00l82K86J15m37L32J34n80
4206c70M03K04l98Q0J36j49l3K66j55q4M5n2K96j44k77M27j47k82N87j37n80N42
4228A78m2l66M08j50j74J73r7J93j4l66K99O1l60K30K72m09p1M57j66k12L63j22
4250H5l06K54J00j63J2j55K70q9k43M65j26n22O19O0n26K59J05k51J22R9n9r9
4272h9R4J23K1k35J03P3j37%K40k32k32M35j17l47L67k5k40K55q2o1J44j48J59
4295F9k2k04L41j1l92K56J81k77K9J21j34p8J55J8j75J7K1J44j1j97K61k4l15
$$ plain form
4318 -227 187 222 -286 55 155 -108 70 33 -51 54 -124 92 68 -228 67 156 -236 -97 143 -52 -93 139
4340 139 81 -118 0 126 -64 -62 92 76 -37 -89 120 78 -239 100 115 -277 109 135 -221 -12 51 -73 35
4363 35 -27 30 -7 -141 87 135 -157 53 197 -41 -123 125 36 -174 119 99 -223 59 115 -134 -56 -12 38 23
4387 23 -178 116 77 -176 153 149 -198 17 131 -87 -48 21 48 -18 -11 104 -15 -103 25 28 -84 -74 41 -67 -188
4412 -188 108 103 -136 51 76 -88 36 -13 -41 89 -40 38 92 -142 68 74 -140 36 66 -121 -84 15 0 -98 -68
4437 -68 77 -30 -19 75 50 17 -57 98 157 -215 96 178 -157 88 93 -184 -27 61 -4 28 -121 14 59 -106 -10
4462 -10 98 -173 -2 119 -20 -127 115 41 -131 121 108 -116 -9 57 -23 16 -75 36 75 -221 71 148 -257
4485 -257 19 164 -109 50 204 -66 -42 50 35 55 -60 -13 84 -52 27 156 -94 -154 96 43 -167 90 74
$$ packed form
4318b27M14L5n08L41J00k63J78l7q4J05j78K16k4k96K95Q9l92J39K40j95m1K32
4340A39n8j99J18J26j90KJ54j6j13n2K09m2l17L39J5l92L86K6l56K09O3j24J08
4363C5o2N7l7j34K28M8k92K10J44k38q2K48q9k10K93k0l22K82N6k49P8M4N0j5
4387B3k01K94l9k53L29ml47K15J14k18L9O9K7o6PJ15j19q8J28Lj12J0J15j08j21
4412a88K96nk39J87K5j64J24m9k8J30j29P8N4k34K10Ok14J76L0j87L7R9j5r8L0
4437f8J45j07J1R4k5l3p4J55N9l72L11Q2l35K45Nk77J57Q8o5L2j49J35M5j65R6
4462a0J08k71J71J21j39j07K42p4j72K52j3k24J07O6q0L9r1J11L9k96K92P7m05
4485b57K76J45k73J59J54k70K4R2j5K0j15M7R7j36P9J29k50o0K50n3k10K57j6
$$ plain form
4508 74 -190 77 76 -106 31 13 -3 78 -102 69 80 -180 67 171 -161 57 144 -131 -6 43 -30 -109 -7 24
4532 24 45 -65 -14 40 -42 -70 128 38 -134 88 71 -149 110 119 -194 39 77 -45 29 -147 -32 110 -125 33
4556 33 129 -168 -33 164 -48 -87 84 -51 -68 78 94 -23 26 8 -12 94 -63 60 119 -210 55 217 -201
4579 -201 -60 162 -133 56 116 -38 25 -39 33 162 -116 -67 108 -44 -35 117 12 -144 111 20 -163 43 52
4602 52 -161 -59 40 13 -17 -113 -71 134 -118 31 191 -236 -15 238 -162 -9 122 -151 2 104 27 -3 -58
4625 -58 -2 100 -76 -56 80 -5 -89 137 61 -165 54 116 -131 87 110 -134 61 -3 -42 97 -78 -4 86 -168
4649 -168 17 121 -166 -15 114 -94 8 91 -54 -101 46 -10 83 15 -91 11 85 -4 64 84 -167 28 164
4672 164 -165 4 77 -91 26 2 -105 15 -72 -58 211 -30 -13 109 -76 -46 131 -34 -85 74 42 -50 0
$$ packed form
4508G4k64K67jj82J37j8j6Q1j80J71J1k60K47J04l32K18Q7k75J25M9p3p9J02L1
4532B4K1j10N1N4q2k8J98r0j72K22j7k20K59Rl13K33L8j22P4j76J15J42k35J58
4556C3R6k97J35J97k12l9J71j35j7J46J6j17M9j8k0J06j57J23N9l29K65J62m18
4579b01J41K22k95J89O0j54O3o4P2J29k78M9J75j52RJ52j05j56K55r1j83K06R
4602E2k13J02R9k7l0r6M2K05k52J49J60m27K21K53m00J53J31k73J53J02p7l0n5
4625e8N6J02j76K0J36q5q4K26p6k26K19O2k47K18K3k44J95o4l9J39j75P4R0k54
4649a68J85J04k87J51J29k08J02Q3j45m7J47n6R3o8j06J02P4q9O8K0k51J95J36
4672A64l29J69P3j68J17k4j07J20q7J4K69k41J7J22j85L0J77j65n1J59l2r2N0
$$ plain form
4695 0 71 -28 -53 49 -12 24 -102 -13 96 -80 -10 149 -169 -49 140 -61 2 93 12 81 36 53 -11 -64 -7 110
4721 110 -60 -93 132 -16 -67 50 89 -138 -35 122 -106 -40 97 -44 20 21 26 169 -71 -19 102 -85 -31 119
4745 119 -128 -31 109 -99 -29 59 -56 -45 -33 72 -12 -22 -24 49 31 6 -25 97 -114 8 129 -62 7 116 -70
4770 -70 -3 59 -64 49 -52 -44 102 -32 -34 116 -92 9 13 14 -88 65 29 -2 -4 35 10 -36 73 32 46 -53 -56 56
4798 56 -64 -55 146 -116 -41 97 -19 6 14 -38 95 -29 -12 101 -21 -58 37 -49 -22 56 1 -22 -41 60 -44 -76
4824 -76 0 -9 -47 61 -74 -28 8 52 133 -103 -37 147 11 -41 115 -45 -108 96 95 56 -5 -25 38 -94 40 27
4850 27 -112 -15 27 -8 -50 -27 68 -76 -25 114 -26 -96 74 -12 -41 55 -20 0 -3 -31 68 -61 -40 117 54 -18 109
4877 109 -47 19 25 31 16 -6 13 5 -3 71 -6 -39 -20 -46 50 -9 -3 62 -48 -30 163 -46 -59 41 16 58 -37 -40 72 3
$$ packed form
4695@P1r9k5J02o1L6j26Q9J09j76P0J59l18J20J89k01O3R1q1O9m5J7o4n3N7J17
4721A10j70l3K25j48n1J17L9k27J03J57k28O6J37j41O4JNJ43k40N2J21j87N4J50
4745A19k47R7J40k08P0Q8j15J1J2J05q4j0kP3j8k5l1J22k11J22J21j91O9J09j86
4770g0O7O2j23J13j01QJ46j34kJ50k08J01MJj02J53l6l1kL9k5m6J09m1J4r9lJ12
4798E6j20RK01k62P5J38j16K5Qn2J33j24J7J13j22l7R5q6K7P8n5k3j9J01j04l2
4824g6P6rl8J08j35M6L6M4Q1k36O6J84j36n2J56j60o3K04jl9o1k0O3j32J34j3
4850B7j39R7M2l5m2K3R5j44N1J39j40p0J70q6k9R6p5K0lk8R9j29K1J57o3p2J27
4877A09j56O6OOj5k2J9qqP4p7l3J9k6R6n9OO5j10J8J93k09j3J00k5M2r5lJ12o9
$$ plain form
4907 3 -74 51 79 -41 12 60 -37 12 14 15 -53 41 27 -68 65 18 22 25 -11 83 -59 -34 102 24 -47 79 8 -40 82
4936 82 41 -22 -24 -18 96 -50 -20 29 -31 -59 38 36 -47 17 39 24 -105 30 3 -17 84 -55 -9 58 21 11 -36 -30 144
4965 144 -40 -60 117 -37 0 77 -32 -43 -24 9 62 -101 25 64 -19 -58 15 -45 -10 23 50 7 -22 20 -66 -69 53
4992 53 -47 -63 24 -22 6 0 -44 24 -38 -26 91 3 -34 23 58 6 43 52 -22 -23 -22 34 2 -28 -17 27 -61 -84 21 -46 -51
5023 -51 108 -8 24 55 -33 -11 31 -56 28 -22 -23 12 -12 -21 65 -35 -76 -3 69 -71 -35 29 27 -1 36 42 -37 44 9 77
$$ packed form
4907Cp7J25K8j20N3M8r7M9KJo8R4j4r5J33m7MLl6R4j42K5J36p8p1J26p1m8J22
4936H2m1o3kOJ14j46L0M9o0k8R7kq3O4K2j5j29J35k7k0J01j39M6O7l7j0m7OJ74
4965A44j84k0J77j54L7P7j09j1J9L3N3j63J26L9q3l9P3o0L5L3K7m3k9M2q6lJ22
4992E3j00j6Q7m6K8om4O8o2J2J17q8l7N7L5n2L7Rp4jJN6l2l0J1M4q8k3J05o7n
5023e1J59j16L2L1q8K2M2q7Q4n0jL5k4rQ6j00m1P3P2j40L6O4kk8L7Op9Q1l5O8
$$ [...]
8191A1
##END NTUPLES=NMR FID
##END=
