##TITLE=1H_E3d2512-2.2
 CDCl3+DMSO
 8 sc, 
 26.12.2023
##JCAMPDX= 6.0         $$ Bruker NMR JCAMP-DX V2.0
##DATA TYPE= NMR FID
##DATA CLASS= NTUPLES
##ORIGIN= UXNMR, Bruker Analytische Messtechnik GmbH
##OWNER= root
$$ XWIN-NMR		Version 3.5
$$ Tue Dec 26 14:45:47 2023 Russian Standard Time (UT+4h)  she@DPX200
##.OBSERVE FREQUENCY= 200.1313
##.OBSERVE NUCLEUS= ^1H
##.DELAY= (6, 6)
##.ACQUISITION MODE= SIMULTANEOUS
##.ACQUISITION SCHEME= undefined
##.AVERAGES= 8
##.DIGITISER RES= 18
##SPECTROMETER/DATA SYSTEM= spect
##.PULSE SEQUENCE= zg30
##.SOLVENT NAME= CDCl3
##.SHIFT REFERENCE= (INTERNAL, CDCl3, 0, 15.7039)
##AUDIT TRAIL= $$ (NUMBER, WHEN, WHO, WHERE, WHAT)
$$ ##TITLE= Audit trail, XWIN-NMR		Version 3.5
$$ ##JCAMPDX= 5.01
$$ ##ORIGIN= Bruker BioSpin GmbH
$$ ##OWNER= she
$$ F:/spectra/data/she/nmr/H-F/1/audita.txt
$$ ##AUDIT TRAIL=  $$ (NUMBER, WHEN, WHO, WHERE, WHAT)
(   1,<2023-12-26 14:44:28.81 +0400>,<she>,<DPX200>,
      <created by zg, POWCHK disabled, PULCHK disabled
       configuration hash MD5:
       00 E9 B6 7A A2 85 ED C7 34 08 36 98 17 FE 4E 26
       data hash MD5: 16K
       F0 AE F4 4D 0E 7F 73 D3 FC 9D 5F A0 40 F3 64 2C>)
$$ ##END=
$$ 
$$ hash MD5
$$ 3F 24 25 70 E0 C9 C8 21 B4 CE D6 44 D0 19 07 87
##$RELAX= 
##$RELAX= 
##$RELAX= 
##$RELAX= 
##$RELAX= 
##$RELAX= 
$$ Bruker specific parameters
$$ --------------------------
##$DU= <F:/spectra>
##$EXPNO= 1
##$NAME= <H-F>
##$PROCNO= 1
##$TYPE= <nmr>
##$USER= <she>
##$AMP= (0..31)
100 100 100 100 100 100 100 100 100 100 100 100 100 100 100 100 100 100 
100 100 100 100 100 100 100 100 100 100 100 100 100 100 
##$AQSEQ= 0
##$AQ_mod= 1
##$AUNM= <au_zg>
##$AUTOPOS= <>
##$BF1= 200.13
##$BF2= 200.13
##$BF3= 200.13
##$BF4= 200.13
##$BF5= 200.13
##$BF6= 200.13
##$BF7= 200.13
##$BF8= 200.13
##$BYTORDA= 1
##$CFDGTYP= 0
##$CFRGTYP= 5
##$CHEMSTR= <none>
##$CNST= (0..31)
1 1 145 1 1 1 1 1 1 1 1 1 1 1 1 1 1 1 1 1 1 1 1 1 1 1 1 1 1 1 1 1 
##$CPDPRG= <>
##$CPDPRG1= <>
##$CPDPRG2= <>
##$CPDPRG3= <>
##$CPDPRG4= <mlev>
##$CPDPRG5= <mlev>
##$CPDPRG6= <mlev>
##$CPDPRG7= <mlev>
##$CPDPRG8= <mlev>
##$CPDPRGB= <>
##$CPDPRGT= <>
##$D= (0..31)
0 1.2 0 0 0 0 0 0 0 0.06 0 0.03 0 0 0 0 0.0002 0 0 0 0 0 0 0 0 0 0 0 0 
0 0 0 
##$DATE= 1703587468
##$DBL= (0..7)
120 120 120 120 120 120 120 120 
##$DBP= (0..7)
150 150 150 150 150 150 150 150 
##$DBP07= 0
##$DBPNAM0= <>
##$DBPNAM1= <>
##$DBPNAM2= <>
##$DBPNAM3= <>
##$DBPNAM4= <>
##$DBPNAM5= <>
##$DBPNAM6= <>
##$DBPNAM7= <>
##$DBPOAL= (0..7)
0.5 0.5 0.5 0.5 0.5 0.5 0.5 0.5 
##$DBPOFFS= (0..7)
0 0 0 0 0 0 0 0 
##$DE= 6
##$DECBNUC= <off>
##$DECIM= 32
##$DECNUC= <off>
##$DECSTAT= 4
##$DIGMOD= 1
##$DIGTYP= 9
##$DL= (0..7)
0 120 120 120 120 120 120 120 
##$DP= (0..7)
150 150 150 150 150 150 150 150 
##$DP07= 0
##$DPNAME0= <>
##$DPNAME1= <>
##$DPNAME2= <>
##$DPNAME3= <>
##$DPNAME4= <>
##$DPNAME5= <>
##$DPNAME6= <>
##$DPNAME7= <>
##$DPOAL= (0..7)
0.5 0.5 0.5 0.5 0.5 0.5 0.5 0.5 
##$DPOFFS= (0..7)
0 0 0 0 0 0 0 0 
##$DQDMODE= 0
##$DR= 18
##$DS= 0
##$DSLIST= <SSSSSSSSSSSSSSS>
$$ [...]
##$SUBNAM2= <"">
##$SUBNAM3= <"">
##$SUBNAM4= <"">
##$SUBNAM5= <"">
##$SUBNAM6= <"">
##$SUBNAM7= <"">
##$SUBNAM8= <"">
##$SUBNAM9= <"">
##$SW= 18.0517328524113
##$SWIBOX= (0..15)
0 0 2 0 0 0 0 0 0 0 0 0 0 0 0 0 
##$SW_h= 3612.71676300578
##$TD= 16384
##$TD0= 1
##$TE= 0
##$TE2= 300
##$TE3= 300
##$TEG= 300
##$TL= (0..7)
0 120 120 120 120 120 120 120 
##$TP= (0..7)
150 150 150 150 150 150 150 150 
##$TP07= 0
##$TPNAME0= <>
##$TPNAME1= <>
##$TPNAME2= <>
##$TPNAME3= <>
##$TPNAME4= <>
##$TPNAME5= <>
##$TPNAME6= <>
##$TPNAME7= <>
##$TPOAL= (0..7)
0.5 0.5 0.5 0.5 0.5 0.5 0.5 0.5 
##$TPOFFS= (0..7)
0 0 0 0 0 0 0 0 
##$TUNHIN= 0
##$TUNHOUT= 0
##$TUNXOUT= 0
##$USERA1= <user>
##$USERA2= <user>
##$USERA3= <user>
##$USERA4= <user>
##$USERA5= <user>
##$V9= 5
##$VALIST= <valist>
##$VCLIST= <CCCCCCCCCCCCCCC>
##$VD= 0
##$VDLIST= <DDDDDDDDDDDDDDD>
##$VPLIST= <PPPPPPPPPPPPPPP>
##$VTLIST= <TTTTTTTTTTTTTTT>
##$WBST= 1024
##$WBSW= 4
##$XGAIN= (0..3)
0 0 0 0 
##$XL= 0
##$YL= 0
##$YMAX_a= 265008
##$YMIN_a= -352125
##$ZGOPTNS= <>
##$ZL1= 120
##$ZL2= 120
##$ZL3= 120
##$ZL4= 120
##$ABSF1= 10
##$ABSF2= 0
##$ABSG= 5
##$ABSL= 3
##$ALPHA= 0
##$AQORDER= 0
##$ASSFAC= 0
##$ASSFACI= 0
##$ASSFACX= 0
##$ASSWID= 0
##$AUNMP= <proc_1d>
##$AZFE= 0.1
##$AZFW= 0.1
##$BCFW= 1
##$BC_mod= 2
##$BYTORDP= 1
##$COROFFS= 0
##$CY= 11.3945322036743
##$DATMOD= 1
##$DC= 2
##$DFILT= <>
##$DTYPP= 0
##$F1P= 15.7292609196834
##$F2P= 12.9074282941183
##$FCOR= 0.5
##$FTSIZE= 0
##$FT_mod= 4
##$GAMMA= 1
##$GB= 0.15
##$INTBC= 1
##$INTSCL= 1
##$ISEN= 128
##$LB= 0.24
##$LEV0= 0
##$LPBIN= 0
##$MAXI= 10000
##$MC2= 0
##$MEAN= 0
##$ME_mod= 0
##$MI= 1.114404
##$NCOEF= 0
##$NC_proc= 0
##$NLEV= 6
##$NOISF1= 3.799351
##$NOISF2= 2.8
##$NSP= 1
##$NTH_PI= 0
##$NZP= 0
##$OFFSET= 15.70392
##$PC= 1
##$PHC0= -24591.3
##$PHC1= 8.652728
##$PH_mod= 1
##$PKNL= yes
##$PPARMOD= 0
##$PSCAL= 0
##$PSIGN= 0
##$REVERSE= no
##$SF= 200.130013532006
##$SI= 16384
##$SIGF1= 3
##$SIGF2= 2
##$SINO= 400
##$SIOLD= 16384
##$SREGLST= <1H.CDCl3>
##$SSB= 0
##$STSI= 0
##$STSR= 0
##$SW_p= 3612.71676300578
##$SYMM= 0
##$S_DEV= 0
##$TDeff= 0
##$TDoff= 0
##$TI= <>
##$TILT= no
##$TM1= 0
##$TM2= 0
##$TOPLEV= 0
##$USERP1= <user>
##$USERP2= <user>
##$USERP3= <user>
##$USERP4= <user>
##$USERP5= <user>
##$WDW= 1
##$XDIM= 8192
##$YMAX_p= 0
##$YMIN_p= 0
$$ End of Bruker specific parameters
$$ ---------------------------------
##NTUPLES= NMR FID
##VAR_NAME=  TIME,          FID/REAL,        FID/IMAG
##SYMBOL=    X,             R,               I
##VAR_TYPE=  INDEPENDENT,   DEPENDENT,       DEPENDENT
##VAR_FORM=  AFFN,          ASDF,            ASDF
##VAR_DIM=   8192,          8192,            8192
##UNITS=     SECONDS,       ARBITRARY UNITS, ARBITRARY UNITS
##FACTOR=    0.0002768,     1,               1
##FIRST=     0,             0,               0
##LAST=      2.2672688,     0,               0
##MIN=       0,             -352125,         0
##MAX=       2.2672688,     265008,          0
$$ Real data points
##PAGE= N=1
##DATA TABLE= (X++(R..R)), XYDATA
0@%%%%%%%%%%%%%%Mj2J6j6J6j6K2l0L2l6M4n0N8o8P6q6R8j12J28j44J60j80K04
37A08k29K54k81L12l47L85m24M67n15N69o27O90p62Q39r23J018j125J247j383
56g27J538j721J938k197K511k904L416m103N072o541Q998j3794K6281j12856k57036
71c52125L35907Q2953j75011K35506J37778l63367r8749K26063l5279l1735J95365
82A57306o3415k10824M9535M7927n0795J35058P0409j69316k4396Q9101q1853
93e1263J0538J50419q2142j40082R7323M8416n7573R2689M1445j56523m5566O2434
105b9885j4576P0913J06855j03805j01783M1327m7851j65K05694J9800j92867
116d6343J1876L5621j48272Q3745K47709r0581j54136R7158n2234j57590J73741
$$ y = [0, 0, 0, 0, 0, 0, 0, 0, 0, 0, 0, 0, 0, 0, 0, 4, -8, 8, -8, 8, -8, 14, -16, 16, -20, 24, -26, 32, -36, 40, -46, 52, -60, 68, -76, 84, -96, 108, -121, 133, -148, 164, -183, 202, -222, 245, -270, 299, -328, 362, -400, 439, -484, 534, -591, 656, -727, 811, -910, 1028, -1169, 1342, -1562, 1854, -2249, 2823, -3718, 5280, -8514, 17767, -95089, -352125, -16218, 66735, -108276, 127230, 265008, -98359, -197108, 28955, -6324, -38059, 157306, 93891, -116933, -67398, -19471, -70266, 64792, 135201, -34115, -58511, 30590, -51263, -40725, 109694, 27552, -112530, -15207, 33209, -24364, 68325, 109770, -46753, -92319, -29885, -44461, 26452, 133307, 29502, -72281, -30954, -78805, -78970, 126724, 146524, -46343, -34467, 1154, -147118, -63373, 184336, 93755, -60381, 36777, -15457, -173047, 694]
127F94J60912j64420m0881J06599j25167o8712K02929L3474j45473M0982L4002
138C4939j20548L7402J30695n3176n3422M7895m5441l6224R6082J6214o7860J8088
150D644j2504o7755O4030Q3004n3164k1616K6092p1035k3153J02290K1003m4445
162G391J9771l1253p1747N3689O4299k8743K0715J3237j03094j7166R7119j3664
174A0554k6234Q3736l2912j21998N6624P6685p2050J6817Q9527q5164p7029R6066
186A4622J7738o9427N9858L7615r8526n406P5661l4246k1340O2130k6102n9437
198d6860M6150K1547l9965K9689K2454n9283k591M8405k1021q430M3495k3357
210A0233m3834L1782J3454k4743K6518J4552m4622j622K6046k0934M738L6975
$$ y = [694, 161606, -2814, -43695, 62904, -62263, -130975, 71954, 105428, -40045, 937, 34939, -85609, -48207, 82488, 29312, -24110, 23785, -21656, -57880, 38202, 54416, -13444, 4644, -7860, -75615, -11585, 71419, 18255, -3361, 22731, -48304, -71457, 30833, 51836, 7391, 27162, -4091, -75838, -22149, 42150, 13407, 34122, 47359, -55735, -72901, 24218, 10554, -15680, 68056, 35144, -86854, -30230, 46455, -25595, -8778, 80749, -4415, -81444, 14622, 32360, -37067, 22791, 60406, -38120, -43526, 32135, -2111, -23451, 38679, 12577, -46860, -710, 20837, -19128, 10561, 33015, -26268, -28859, 19546, -1475, -9905, 33590, 10233, -33601, -1819, 11635, -13108, 13410, 27962, -16660, -18282, 7764, -13170, -8432, 28543]
222B8543k4006k6323K9101p272k5741L8411J3145m3091J3516K7320m0268k068
234a8733M7392k3709k9688M1509n78m4668K6459K5428m1258M397L9674k8310k0707
247b2792L6755q272l0040L3010J4459l5974P935K0961k8255j384L4661j2826k0690
260a2452J9532o128k2584K3551J6713k3487J121J0599k1713K76K9654m108j4283
273c309J0190r654j8144K1674J7426j4661P86L224k4597j236K9040J387j0464
286A662P457j3066k2179J7392K1889o112J680J426k5584p969K6180R723l559O688
300A5628j3024k5993P544K2684L493L706l11k5330j5364J7255J5978N162P143
313A8571j1573k6968k475J8478J2829R743O30k2013j9985O000J5922J4510J0419
$$ y = [28543, 4537, -21786, 7315, 43, -25698, 12713, 25858, -17233, -3717, 23603, -16665, -18733, 28659, 4950, -24738, 16771, 16193, -28475, -2016, 23412, -17846, -13449, 26225, -2085, -22792, 13963, 5691, -24349, 8661, 23120, -12854, -4919, 16042, -12213, -13597, 21064, 8238, -12452, 7080, 952, -21632, 1919, 18632, -4855, -3734, 6865, -14848, -14572, 15082, 10974, -3309, 6881, -2773, -20917, 757, 18183, 3522, 4308, 7532, -17065, -18301, 10739, 12126, 1662, 9119, -3947, -26126, -8734, 13155, 7043, 8723, 10149, -15435, -23404, 2776, 12499, 8940, 15628, 2604, -23389, -15845, 6839, 10332, 14038, 13727, -11603, -26967, -9712, 6266, 11428, 18571, 6998, -19970, -22445, -3967, 8862, 18605, 19235, -2778, -22763, -16763, -841, 13669, 24088]
326B4088j0295k6778j1606J0070J5665J6206N220j7912k3951m638J2656J9433
338H158J5933l527k3037j9355K01J6382K1637J0876j2073k4430j5642M831K0717
351F71K0937K830j8703k3485r252J0643K4165J8110l788k3449k2002j656J7759
364g220K3307J3084r814k7397j8722N623K1125K0344P462j7613k9243j0318J3572
377a5810K0877J8902K888k5407k7217L11J6848J9280J8117n047l1874j9397Q994
390a8535J6005J9035J5358j6905l4798q411J3875J4910K0319Q926k6735k9428
402b6384K284J5253J6669K0331m178l2999j8507Q718J5756K0586J4699j7809l1646
415a7227r453R823J8635K3210K389k5319k3807n440J1603K6239J8975j0110k3617
$$ y = [24088, 13793, -12985, -24591, -14521, 1144, 17350, 22570, 4658, -19293, -23931, -11275, 8158, 24091, 20564, -2473, -21828, -21627, -5245, 16392, 27268, 15195, -9235, -24877, -20046, 671, 21608, 24438, 5735, -17750, -27002, -16359, 7806, 25916, 22128, -1321, -23323, -24979, -7220, 16087, 29171, 19357, -8040, -26762, -21139, -14, 20330, 27792, 10179, -19064, -29382, -15810, 5067, 23969, 26857, 1450, -25767, -25456, -8608, 10672, 28789, 23742, -8132, -27529, -18535, -2530, 16505, 31863, 14958, -19840, -28251, -14376, 534, 20853, 29779, 3044, -26384, -24100, -8847, 7822, 28153, 23975, -9024, -27531, -18813, -3057, 17529, 32228, 14419, -17227, -26680, -16857, 1778, 24988, 27377, 2058, -21749, -27189, -15586, 10653, 29628, 19518, -4099]
428d099j7291n703J7610L1408P065j7672j5342j6261p830K7683K8978r715j6955
441A876p007j8074k174L6423J7461k0948r993n063j8552J2272L7592n5k2731l524
455b497j0630j2266K7542K8505j5246j7790m128j6729J726L6534J3053k0456r373
468a755j0280j7463J7070L5373R08j6941p959j5449q974K2762K4980j142j2536
481H594j5051j3392M003J6231J3264N696j2869k2754o93J3686K593R196J2339
494B0843k0820k3302J7127J3726r948J2127J1306l1101j4414K8530N462j2460
506b924J5270q13l2862K920K7470l937l024J4240j7896k4454J8766J6612q466
519I02J1167O391l0783j0596K5420L105o296J8489l440l2813O0K1895k459j142
$$ y = [-4099, -21390, -27093, -9483, 21925, 28990, 11318, -4024, -20285, -28115, -432, 28546, 18831, 1876, -5131, -23205, -25379, 11044, 28505, 7557, -2436, -7499, -26051, -13779, 23813, 23758, 1027, -2497, -13127, -25393, 2149, 30654, 15408, -2382, -6510, -23239, -21513, 15021, 28074, 7618, -1755, -12035, -29498, -12428, 22945, 23853, 6912, -1047, -16496, -25470, -2708, 22272, 21130, 8594, -6457, -19849, -15846, 385, 13649, 19345, 6476, -16278, -16971, -3285, -692, 8504, 20843, 23, -23279, -6152, 7574, -2374, 9753, 21059, -10042, -24456, 4074, 9536, -2924, 12346, 11533, -21329, -18409, 9061, 5124, 2100, 16340, -1556, -26010, -7244, 9368, 902, 12069, 18460, -12323, -22919, 2501, 5606, -690, 17799, 14359, -18454, -18394, 3501, 1042, -100]
533a00J5557p361k3133J263J4256K337j42N343j686j1532o122R932R763o477l681
548a783Q631m881j3405J0611J1350j5128l818J6017o489j1555J6014M124k0738
561a1050L696J6067j0740k867J8426p659j7946J0898N472j2403J0510J3419j7536
574a713p936J3491p379q888J9060N291j7916L736Q889j4688k380J8268j601j0632
588d398R997K698j5225p45J0577j828k851P524J509q946o911K593N744O34O10
603I82P699k675j6314j84J4338k490l970J4642j215k2339J878J5571p160k211
617c448J5837o172j8046P693P929r291N362J0285j3086o232J3037k049o829J1553
631F543p87j6465P376J3391j0266j630J2256j1335j5247J4774J1703r838J155
$$ y = [-100, 15457, 8096, -15037, -13774, 482, 2819, 2677, 8020, 6334, -5198, -11320, -1388, 8375, 1898, -1783, 6848, 1967, -11438, -827, 10523, -4605, -8423, 7594, 1105, -10450, 5564, 9688, -11050, -7354, 8713, -2027, -4894, 13532, 5873, -12073, -1175, 4297, -8106, 2404, 15823, -1713, -9649, 3842, -3537, -12425, 6635, 11926, -5990, -2254, 6635, -8053, -10433, 7835, 6234, -4398, 5599, 8297, -6928, -7673, 2904, 1076, -1775, 5749, 7258, -1688, -8599, -6006, -262, 372, 982, 8681, 6006, -10308, -10492, 3846, 1356, -2614, 12028, 10813, -11526, -9648, 5923, -1237, -3448, 12389, 6217, -11829, -4136, 3793, -5498, -136, 10149, -2937, -9169, 3868, 1819, -5010, 6543, 5756, -10709, -3333, 10058, -208, -1838, 10418, -917, -16164, -1390, 10313, 475, 1630]
644A630O083j4683r661J4582J0001k514R13k542j2080m507R759J0606L656l628
658G615q123o987l109N651J2458M740q709p238k940l835N711J4448J57j0759k474
673c394j300m383R792J2598p238r505J576l393k179J4480O613j3608o350K914
687c377m747L529J6458o87j5434k784J580l716J0578J4599p302j3946q97j058
701g204J73J4251R397j0709j1989j965j450N097J3602M145j0620r798l185J314
715h941R071J0641K5r874q373k346M808R707O755k619r454q859j55Q242Q502K426
731I556m355r575p863L561J0694O434k0n342j0106n335P540J1019L478j736o535
746A415j0263k622J0428R899M98m117p788r072J579J1401P611q30n455q858o041
$$ y = [1630, 7713, -6970, -16631, -2049, 7952, 5438, 6351, 3809, -8271, -12778, -3019, 7587, 11243, 7615, -508, -7495, -10604, -4953, 7505, 12245, 3536, -3702, -6642, -10477, -4766, 9682, 9839, -920, -3394, -4694, -9077, 715, 13313, 6075, -3430, -1854, -5247, -7426, 7054, 13667, 59, -6291, -3377, -8124, -4595, 11863, 11176, -4258, -7042, -5462, -9178, 1400, 15999, 8697, -5249, -6146, -7204, -7031, 7220, 16617, 5908, -6081, -8046, -9496, -4399, 9203, 13348, 2728, -7070, -10255, -8941, 130, 10771, 10796, 922, -7451, -9797, -4989, 4718, 11473, 8854, -600, -9459, -9614, -1372, 7130, 9556, 5201, -4374, -12237, -8676, 2018, 8452, 8432, 3090, -7016, -12351, -4811, 6208, 9686, 7950, 1415, -8848, -11470, -1042, 8857, 9355, 5238, -2550, -11622, -10043, 1358, 8969, 8139, 2684, -6174, -12215]
761a2215N507J1728N013k294o481q822l205Q243J0328K433l952p966q278J41R777
776d3P845N76m763q491o235L461J0336N995j298n985p924k765N834Q968M175l046
792F640p963o744N50O714O951K286m511q936m536L430P158N851N43o407p986j387
808h347N554O753M253j083p674o823R68N736N659K913l697p752m535K464N455
823a56N515J550n514p099j336L576N180M971n48o443n294O92L593N355L315l312
839D045o775k894R99M050N082J102m648n649r26K003M474M498p83m879l651j88
855d140K609M556K932k610m606k560L83L081L917P73l300l853j639J077L985L023
871C628j033k890k176j285J831M519J454k132j963j796q78K266L667m7k513j932
$$ y = [-12215, -6708, 5020, 10033, 7739, 1258, -7564, -10769, -2526, 7802, 10235, 6283, -1683, -9961, -9820, -43, 7802, 8378, 3615, -4876, -11111, -7650, 2686, 8681, 7383, 1398, -6526, -9291, -3457, 5511, 9686, 6640, -1323, -8067, -7517, -803, 6148, 8434, 3923, -5013, -9549, -6119, 1039, 6890, 7433, 1026, -6960, -8347, -2793, 3960, 8213, 7130, -544, -7367, -6399, -663, 4996, 7909, 4212, -3540, -8075, -5611, -156, 5359, 6909, 1395, -5704, -7040, -3464, 1716, 6687, 6139, -304, -5598, -4906, -1313, 4042, 7357, 4045, -2730, -5624, -4625, -575, 4507, 5609, 961, -4688, -5614, -3611, 863, 5361, 4578, -301, -3952, -4140, -1531, 3025, 5957, 3347, -1259, -3819, -3436, -355, 3562, 4335, 1035, -2818, -4457, -3380, 605, 3628, 2595, -295, -2471, -3756, -1925, 2594, 4048, 1916, -47, -1843, -2721, -455, 3212, 3165, 652, -1280]
887a280j138l43K680K456p32k240r17r11N43L055J124j148j089o40o33J241K225
904B253l34j764q3n26j179J293J760j220j704R92K38j212J527J348j518r72J608
921E07K98j072Q36R63j474p14J512J86j223Q8N25j014j81N88J68l55o33L36N88
940g1L20J24K60q89q80J262J312k24J52m58k176p24K241J094n06M44j480l454
958c653J085L163J04j99J936k929l884K895L814j479P24K327m954l608M614K595
974B551k381J367J109n612j639M871J420j981J546o62m249R81M412M03j067P01
990A770k740k411K953L296j38q06j882l428m23L700K669K59j660l185k264N36
1006c754L758M024J3l546k848o63j38L742N598j527n694j206j8j482M227O164
$$ y = [-1280, -2418, -2761, -81, 2375, 1643, -597, -1514, -2425, -1882, 1173, 2297, 1149, 60, -580, -1213, 28, 2253, 1919, 155, 72, -454, -1633, -340, 1420, 200, -1504, -512, -274, -1486, 41, 1389, -129, -1101, 507, 805, -267, 569, 1532, 58, -656, 856, 1042, -181, -93, 432, -582, -763, -175, -7, -362, -995, -659, -71, 249, 373, 633, -256, -1136, 126, 1438, 1214, 1366, 908, -1268, -1992, 249, 1343, 837, 1281, -199, -3653, -2568, 595, 699, 500, 2436, -493, -4377, -1482, 2332, 853, 1577, 3904, -1050, -4658, -44, 2551, 170, 1537, 2646, -2966, -4605, 266, 1686, -295, 1251, 589, -3660, -2679, 1733, 2136, 1069, 1770, -970, -3381, -428, 2868, 2730, 1924, 42, -3386, -3809, -109, 2560, 2819, 1159, -2026, -4290, -3754, 4, 4028, 4041, 495, -2353, -3016, -3154, 588, 6186, 4659, -1035, -2241, -2259, -3741, 486, 6650]
1022F650m161n843J211n6k175N787M982o313l540L106j086q05O416J487p214j505
1038c059L083j860J985N081k713n978M04J170j27M594K403n040l999J117O57K327
1054D5N030j19n578l071K17J548M090L420j401m598l994o43M134L892K66l73k866
1071an849O29O730J336j217J891l204o702L551P069k118j390K942m598n456O382
1087eM457m278j05J694o041j200Q061R68l883J397j416n525L863O917k034j593
1103A277Q31m794l245O403M128k334j44j490n754k34O117K355p56j22l920l315
1119d997K143L469K338J190k326m478J86J351J041L793M83n388j808K230j126
1134a899R85N450k513o242J920K698k598L016M435n520m123M414P35k174M917
$$ y = [6650, 2489, -3354, -2143, -2199, -4374, 1413, 6395, 82, -3458, -352, -1438, -2243, 4173, 5660, -1554, -3059, 24, -1836, 149, 5230, 2517, -3461, -3057, -1887, -2014, 2580, 4983, -57, -4056, -2939, -2282, 45, 5075, 4956, -622, -3693, -3476, -1928, 2162, 5582, 4181, -417, -4411, -5054, -920, 2972, 3238, 2865, -1, -5850, -5221, 1509, 2845, 1628, 3519, 315, -6387, -2836, 4233, 2115, 725, 3667, -931, -6387, -5, 4452, 174, 69, 1763, -4278, -5478, 2583, 3551, -332, 1065, -351, -5876, -2013, 4904, 2870, 1277, 2108, -2686, -5931, 472, 4600, 2266, 2122, 632, -5122, -5356, 761, 3116, 2360, 2238, -1682, -4997, -2854, 615, 2953, 4143, 1817, -2661, -2475, -1124, -83, 3710, 4193, -1195, -3003, -773, -1899, -914, 4536, 2023, -4219, -2299, 399, -2199, 817, 5252, -268, -4391, 23, 758, -1416, 3501]
1149C501J185p312q29M294j660L35N489l165o608K318K039k066M170L597n699
1164d11l516L079l42Q1N302k3n464o38J225j097K386L136j900l030k62r22P04
1181a692L541M9k343L2q24j528L081K606k467o08J090k491K36M264r05k883J284
1198D42n68l046L001L383l557p87J486k534q33M768Q54l601J147Q03l835J606
1214a271M674j737k134K268k221k718L063K430k502l16J204k692l96L161j68j163
1230e18J742j412j450J834J159j619R89O53k336K93K265j231p34J678j571j616
1246a874J877Q13j851J045M26k058M59K282j252n29K286j298j857K554L29k350
1262i98J539J399k966j38K879j890j570K760p09k255J871J371k548L99K074j716
$$ y = [3501, 4686, -2626, -3455, 839, -821, -486, 5003, 1838, -4770, -2452, -413, -2479, 1691, 5288, -411, -3927, -848, -1190, -1109, 4193, 4170, -1294, -1932, -707, -1804, 582, 3718, 1818, -1212, -1474, -2396, -1692, 1849, 1898, -445, -413, -1237, -2765, 316, 2922, 455, -153, 937, -1554, -1318, 2946, 2041, -842, 442, -126, -3172, -171, 3212, -345, -1132, 354, -2180, -3013, 1755, 2609, -992, 155, 958, -2877, -1271, 3403, 1666, -468, 1800, -421, -3139, -76, 2354, -148, -464, 740, -1952, -2348, 813, 645, -518, 1224, -188, -1638, 196, 1355, -264, 725, 1378, -958, -665, 1600, 369, -365, 1313, -258, -1874, 3, 816, -1035, 10, 436, -1622, -1163, 1119, -133, -662, 1624, 326, -1531, 1023, 1352, -998, 541, 1940, -1026, -1164, 1715, -175, -1745, 1015, 306, -1949, -78, 1293, -1255, -856, 1218, -498]
1278d98m84K584n86k060J823J18j680J303J130k398K35J175j604m29K681r46k117
1295a753J594J17j546J800J814k320k48J400j404l19K728m51k231J138l77j636
1311a694J608J780j819o08R94j495m22K821J39k061R35l43j527J906K285j678
1327H21r82Q95j571r25K901P77k171L25l46k032R73K832p33r75P93j709q12K307
1345C68J326j001L84q93j946Q78K330j40p62M75k123j422K372J231p64L05l34
1362B84k412K30K406O07l17O25j666j802J401J896j02L62l48k597m73J881O03
1379E78J30P56j951j963J042J515j9J401L1k866q26J954Q35L85J238j238k426
1396a424K6J590L92R20L0k129j530M24J234R47J044p60k015m87P29R21J462P93
$$ y = [-498, -982, 1602, 1016, -1044, 779, 897, -783, 520, 1650, -748, -513, 662, -942, -1371, 1310, 364, -1753, -159, -42, -1588, 212, 2026, -294, -542, 858, -546, -865, 1863, 1412, -819, 319, -58, -1694, -86, 1694, -125, -733, 261, -1234, -1656, 1165, 1304, -757, 178, -165, -1692, 214, 2499, 821, -161, 734, -837, -1762, 1139, 1916, -255, 70, -276, -2308, -1335, 1497, 764, -211, 582, -1127, -1939, 368, 1694, 693, 1077, 184, -1762, -884, 1446, 1306, 544, 1019, -1104, -2526, -154, 1077, 313, 618, 284, -2128, -1898, 508, 1115, 798, 1423, -243, -2045, -644, 1252, 1150, 1512, 1164, -1433, -1906, -25, 578, 708, 1464, -487, -2450, -1408, 107, 88, 1489, 1520, -1346, -2172, -218, 617, 1002, 2240, 1002, -1424, -1398, 192, 584, 1504, 1534, -595, -2125, -1701, -467, 480, 1524, 764, -1251, -1738, -1009, -88, 1374, 2167]
1414B167j665j600P1L57J289J609m45k143j224L25M37J640P65j040j241r83K03
1431a478J213J857k06j286q38n00K04K071J281j354j168r5j012M37J921P52j857
1448e8r26k60l40Q75K184j23j543n49k97J66J447J393p64j350o82J45J78J298
1466G94Q76r25j649l55K43K68J591M82j190j180j83M56P93J443J09j478q88L27
1484d66K32O50J101p7k106n56O11L64K95P50k59j681j74J040M67K55L31l94j159
1503g76K6R97P56j91j17n26j010m7J192Q22r60k82k51j008J13J635N04p27j24
1522B6l84r02O30K089n45m94K47o17j364J272J289j041l75P58j306q00J799L04
1540E86j354N29Q11j411j38J853L6j280N67L47r25K35J159o17o31J21r1l43O22
$$ y = [2167, 502, -1098, -1027, -670, 619, 2228, 1783, -360, -1584, -1259, -822, 818, 1583, 543, -698, -1681, -1478, -265, 1592, 1386, 100, -738, -1238, -1034, 1037, 2318, 964, -204, -299, -1311, -874, 1047, 1799, -58, -984, -1244, -1584, -709, 1475, 1352, -191, -740, -1037, -871, 576, 1969, 1205, -145, -827, -682, -504, 794, 1670, 745, -904, -1259, -1016, -748, 843, 1325, 135, -1045, -1228, -772, 21, 1464, 1573, 95, -793, -466, -234, 416, 1517, 1440, -666, -1222, -611, -247, 48, 798, 539, -1142, -1316, -276, 191, 446, 777, 383, -776, -750, 247, 1003, 812, 695, 169, -841, -888, 304, 1126, 166, -116, -367, -1375, -1262, 373, 877, 150, 26, -358, -1260, -630, 1459, 914, 420, 667, 50, -1314, -42, 1247, 206, -169, 589, -717, -1517, 282, 586, -768, -239, 572, -839, -977, 876, 912, -368, 199, 546, -379, -144, 1015, 398, -233, -112, -203, -546, 76]
1559G6L50l73l99m96J41O99R4K85L33q23p85R00M22j5N25P4j343l86R64k12n58
1580e27J143k29j309L82Q29j067J93J500j003j002J742J70j715R27J367j838j36
1597e73J817p51j280J264P1j686Q65J322j441l54J051p56o22J099O22q83M59J33
1615C57o87J32R02l83j13L04o55l75P38m00j91M92j45n79N13O2m83N99n7m36L38
1636f7P67q87Q7Q40m69j020J528K44j408N31N72j727J8J776o26q34P52O8j720
1655a575J189J381p46l57J141j073q81J404N50j121M59M86j468JJ052m24m11O34
1673B41n23o63Q45K64l15L45J63o92K06O20j70J16J95r25j45P66k07k6O83p05
1693G3j510J153L11o28Q34N54j486o39J563l5m84J687l39j682K05J326j021j05
$$ y = [76, 426, 53, -346, -842, -701, -2, 92, 377, 710, -113, -898, 2, 424, 409, 934, 1008, -335, -721, 243, 31, -527, 616, 387, -922, -540, 289, -778, -585, 915, -88, -1090, 652, 822, -893, 34, 1401, -437, -573, 1244, 493, -787, 477, 548, -1138, -273, 1049, -392, -746, 305, -451, -1073, 26, 648, -235, 224, 357, -330, -198, 704, 321, 208, 512, -143, -518, 220, -180, -371, 121, -24, -603, -90, -28, -511, 88, 31, -405, -67, 700, -187, -100, 740, 271, -749, 779, 1023, -385, 146, 718, -1009, -991, 785, 159, -675, 77, 145, -1575, -386, 995, 249, -108, 1033, -40, -921, 483, 1033, -88, 371, 857, -611, -610, 442, 18, -393, 241, -282, -945, -100, 164, -151, 194, 357, -335, -129, 491, 321, 437, 632, -293, -438, 328, 121, 95, 778, 73, -1437, -284, 27, -601, 233, 787, -699, -1338, 225, 190, -294, 1393, 1054, -628, -423, 903, -118, -223]
1711b23J479j122j418J174J63q16J047N87j503j68J164n01j77J340n01j267O03
1728a39P30n00L42Q05j377o58R00k05q8J022p68p99j52M41k23J109K81q38k70
1747c87M52l56L16J123n17p23J74K3p05J146O89j220n60K71m95j02J255J05j013
1766e24L08o6l02O09J089o14o01M61n05j50J072J58q11j27j80q30O11P81k34n53
1786d08L16k76l63P60Q22o89l3J12p04L19P93J77p31n9l04m14P43K60n03M21l13
1807g4p22J45R32p7j74L22p42l63Q38N09k61L7J52p95j54O72J57l52K90m07p50
1828h17M64L53j88K98m9p66J34O87J17j22L32j00p11K50N47n7M5J30p70k49K93
1849a79K94k29PJ9n65M16Q5l3M00L07p11k69Q80j39k26M27o6n13N7K8K1j0K84
$$ y = [-223, 1256, 134, -1284, -110, 53, -763, 284, 871, -632, -800, 364, -137, -314, 1026, 525, -742, -139, 591, 91, 433, 1238, -139, -797, 103, -102, -190, 832, 64, -735, -887, -446, -669, 440, 721, -117, -387, 65, -291, 25, 1148, 631, -92, 82, 105, -600, 546, 1235, 15, -545, -274, -769, -871, 384, 489, -524, -216, -282, -584, 25, 1114, 500, -101, 360, -145, -295, 777, 935, 124, -3, -183, -1013, -402, 379, 145, -408, -92, -368, -731, 29, 851, 162, 129, 241, -463, -144, 649, 826, 95, 36, -268, -682, 61, 321, -182, 239, -74, -796, -651, 281, 204, 30, 352, -390, -753, 85, 594, 333, 370, 522, -273, -427, 245, 402, 50, 340, -67, -817, -353, 0, -188, 110, 61, -705, -571, 116, 233, 111, 443, 343, -368, -118, 429, 372, 417, 547, -223, -472, -179, 115, -114, -107, -88, -653, -237, -152, -185, 215, 522, -189, -458, 422, 283, 57, 484, 418, -95, -38, -10, 11, 1, 285]
1872B85m04l96L31K54k03L42L6m77K40J57k63M11L32l79m03L65Q8m95M88R1o62
1893b62J8K41l85L3N06m03l62L65J74j81M60K02m93J88L45m05J67K00J7n36p5
1914a86P7j89M74j74k31k9J07j83L74k2J8J21J8k97Q4N12j9l67L20m37k97K01
1936a25M42n08OJ09k79k67M55L65l07k8M8po3M71R4m71K62j7j85O2K00o3l82J08
1960h0k6m08M48J71l77l4PJ6M7L42J29q5j82J64J49lq9J34l34j24J18J5k64J37
1984a29K76n26r1M46Q9m70L58K93l23j20M67j11j40J40L8l69K39J97k82OK4j11
2006i9l51K52J54Kr6K31n4m83M09M07l59j7L39l4n00K65L38k06p0J07j49l87R1
2029b10L26l00j07L81l15l04M36L52l86O5M72l28k88O63o8m37J37J97o25P0L48
$$ y = [285, -119, -515, -184, 70, -133, 209, 245, -232, 8, 165, -98, 313, 645, 266, -137, 228, 316, -179, 309, 400, -262, -244, -3, -388, -355, 151, -252, -614, -249, -75, -256, 204, 406, -87, 101, 446, 41, 208, 408, 425, -111, -186, -109, -298, 176, 2, -229, -258, -151, -334, 40, 18, 36, 157, 175, -122, -38, 474, 455, 88, 408, -29, -326, -125, 317, -191, -185, -76, -355, -622, -167, 198, -109, -137, -89, -96, -159, 312, 406, -65, 197, 180, -5, 57, 257, 194, -188, -80, -106, -514, -66, 105, -272, -306, -299, -283, -236, 106, 235, 150, -32, 132, 281, 278, 189, 323, -11, -135, -17, -2, -266, -129, 147, -379, -470, -24, 65, -405, -47, 246, -77, -197, 270, 159, 19, 159, 197, -172, 67, 264, -18, -12, 12, -99, -450, -198, -44, -42, -138, 93, 39, -444, -35, 372, 13, -4, 335, 301, -199, 66, 404, 198, 128, 235, 86, -301, -210, 116, -184, -291, 90, -225, -529, -93, 259, -127, -62, 410, 82, -206, 457, 389, -48, 89, 286, -339, -269, 79]
2050G9j37k60K53j82j30J59L97j59k05M00m6l39L98N76m74l20Q6q0j19K9M45l77
2072fk87N8j19Q3J03L81j22l63L76q4k82K09N83j77l46K61O0m95J49K89l52j63
2094b44M91m76l44P41j31m41j07P45m06j77O56m7m43K07L07l40R9K20j06l72K85
2115A17J17m84K12K87k47l46J11J86k99K18L00j16j22j49M12p8j39K56j9l01Q5
2136AJ06j93r1K15J9p24M29K99l50J50M00k87l01M01L04l77J44N74p94r3O82j64
2158C50o58M80K74r13P3O03k39m59M42K02p46M47K77m7k36L73j74j17J62J67L3
2179B94j57J00m14J0k9K82o0k61J06p7j50M4K75O6Q9J08j33j4O7J61Lk43J70k74
2203c7j41K92J5j72N2j48m0j94J48L03k82K00J48k85j13N77j38k45L20l2k16j17
$$ y = [79, -58, -318, -65, -247, -377, -218, 179, 20, -185, 215, 169, -170, 228, 804, 330, 10, 96, 16, -103, -74, 371, -6, -293, -235, -354, -271, -168, 213, 91, -272, 104, 20, -262, -53, 530, 353, 7, 268, 328, -167, -18, 271, -81, -244, 247, -229, -573, 168, 37, -404, -511, 234, -172, -349, 307, 260, -183, 24, 331, -9, 90, 310, 204, -168, 117, 234, -250, -38, 249, 2, -344, -233, -47, -346, -128, 172, 56, -66, -215, 197, 119, -20, 236, 217, -84, 1, 107, -86, -177, 38, 57, -667, -238, 61, -289, -139, 261, -26, -327, 74, 378, 1, 145, 719, -75, -168, 514, 350, -308, 172, 446, -467, -394, 209, -30, -489, -47, 155, -591, -144, 133, 86, -150, 223, 49, -68, 94, 261, 294, 137, 237, -177, -167, -196, 86, 26, -235, -129, -206, -356, -312, -37, 29, 118, 226, 93, 79, 146, 307, 310, 67, 237, -37, -178, 114, 129, -43, 9, -139, -179, -373, -225, 78, -204, -4, 144, -141, -254, 323, 185, -60, 260, 228, 12, -105]
2225a05J97J16l31L4P3l14M8M54j41k24J5p8M6K05J67L0j75O3jO7j87J92n1j62
2249f2j98L59l18J92j21L32l83m1o5L24o9K73j4k20J11K8j12K44P7m16M6N0k71
2272b54J30K2j3j12j09J61j17J13P0K56j84q7O9K60k11K52O1l29l7l1J05K17j17
2295A15Qn50L5K68l5p9n4K81j51J08k2L06O8k63p5J70L7r6J30j24k6p1j34J12
2319d2n8J5J50j94M9L3j00M7L07l74J55J2l7M0L55k58l8M9l22P6R9l6O5K28j45
2344G6o0l52K84K38j61K07j45k8k09K91J82j99M6j55l10K50P3J8p0Q4j89k04J83
2367a50J65K12j52K4j90r9J06L20p0J58l04q9R5R8m7O3K22n87j31Q2K19P7J76
2390A98j95m4k55N5J65N40P6m69J60l74K10p0L90p9l31k6j36j67M20K00k89k38
$$ y = [-105, 92, 208, -123, -89, -16, -330, -282, 172, 31, -193, -178, -256, -210, -5, 162, 192, 17, 80, 79, 146, -41, 151, 100, -62, -260, 99, -219, -27, -148, 184, -199, -240, -305, 19, -50, 223, 209, -11, 100, 128, 16, 260, 337, -79, -33, 17, -254, -124, -102, -115, -227, -336, -175, -292, -179, -109, 147, -37, -124, -55, 205, -6, 246, 307, -22, -59, -90, 15, 232, 115, 123, -427, -392, -124, -159, -238, -292, -11, -162, -54, -76, 230, 298, 35, -40, 130, 167, 71, 201, 77, 51, -20, -154, -42, -100, -85, 65, -129, -80, -47, -147, -100, 207, -167, -12, 0, -37, 3, 358, 100, 62, 111, -211, -135, -36, -72, -7, 221, 76, 16, -336, -52, 186, 25, 232, 87, 59, -150, 141, 323, 124, 170, 15, -295, -45, 28, 46, -24, 60, -129, -333, -150, 15, 227, 75, 99, -91, -190, -84, 236, 166, 324, 20, -69, 26, 124, 77, 140, 362, -225, -356, -274, -55, 22, 198, 3, -41, -296, -241, -76, 464, 540, 71, 231, -143, 67, -3, 387, 308, -23, -49, -185, -352, 68, 268, -21, -259]
2412b59n2k9J77J34L27j70n3j79j10L18N64k64l43j5k30j29J39L67q0l10L3k68
2434d32K51M29L0j88k36j30J41J93J91L7n9k22k49L07j36K34K41n33j90j6J95
2455a42J37K51jl89k48Q3K53n0K53J90l47j21K94rlL64j31o63j40M69p1K7K07
2478B13k51k10j67M40RK14%j26m39J77J81L22J9j01l89j3NJ55K09k0k54l98j17
2501e41J71L95j08L82k11k51j29M72K91k38j64j33j76JM03O8o1k93J97l75j33
2522d33N30J35j31k1j04k22j43Q10j00k40J49k36M7k9L93k10k57Q1l22q0L29L87
2544C33l47r6J03j10l61P22N8l28R1q1k3J63J49J80l67k46J05l8j00M44Jm11o1
2567b20J49j92J91J50J11j65j85O9K31l53M22J76l59k12J07J27q6J09R2j82k03
$$ y = [-259, -311, -340, -163, -29, 298, 128, 75, -104, -214, 104, 668, 404, 61, 46, -184, -313, -174, 193, 113, -197, -164, -432, -181, 248, 278, 90, -146, -276, -135, 58, 249, 286, 227, 5, -244, 63, -73, 161, 402, -131, -321, -337, -142, -5, 246, 245, -144, -392, -309, -56, -106, 147, 337, -10, -131, 163, 154, 151, 515, 384, -279, -419, 50, -21, 6, 213, -38, -248, -415, 25, 34, 248, 248, 122, -317, -140, 41, 363, 382, 281, -108, -121, -116, 39, 248, 228, -26, -424, -541, -370, 25, -83, 299, 88, -163, -292, 180, 471, 233, 69, -64, -240, -239, 164, 232, 171, -122, 75, -300, -433, 97, 232, 101, 80, -24, -246, -389, 421, 321, 81, 230, -6, 41, 12, 405, 195, -62, 19, -303, -383, -54, 333, -14, -110, -7, -117, -478, 244, 302, -26, 65, -16, -39, 124, 273, 453, 86, -160, -55, -93, -193, 251, 252, -159, -220, -71, -263, -72, 78, 189, 24, -161, -92, 139, -214, 208, 384, 25, -187, -80, 47, -39, 70, 162, -20, -223]
2588b23O4L4N2K99Jl85j18M18k48J42M91m07k60Q2J83m1O8K13l39l17L94o7j83
2611a47J44k9MO1N1l3j26K55L01n40r8L92q8k11M16j85m78K87J05j60m9Q6J06
2634F4k57k33L71K9l4R7K27k60k9J04j2k0K33q2k37j85K55Q4k06Q7L4k25K3L18
2658A46r1j87J91K1k59J3J97p8N4K07k55j22j23K94Q5k10K75k87j76K73K07m98
2680c23L24M8k07j6J93j5K6J28J98l69j83K29P2q8J02N2k49r5J83M2lj25J52k58
2704a82n2K7J72J83qj27j34J75J04R8j05k4K9l73N8L65l0K8k16j44j05J21Q1L06
2728B47k66l4Q2l83K63K46L24l62N6k15O0L3K28j21k69j9j70nK55L21j68k10j56
2751b63J93m3K35J19j93J60k18k34N5L77J02l21J1k07k38K80L58K5j58j04k26
$$ y = [-223, -159, -125, -73, 226, 227, -158, -276, 142, -106, 36, 527, 120, -140, -58, 125, 84, 152, 365, 26, -291, 103, 36, -147, -3, -32, -28, 33, 84, 51, -75, 180, 481, -59, -157, 235, 147, -64, 352, 167, -311, -24, 81, -79, -128, -42, 64, -193, -426, -55, -26, -60, 37, 264, 4, -25, 79, 67, 47, 280, 198, -39, -224, 31, 115, -91, -4, 30, -195, -172, 146, 55, -132, 59, 80, -179, -166, 31, -47, 7, 214, -41, -163, -286, 8, 93, -117, 158, -129, -305, -32, 175, -323, 1, 49, -158, -174, 19, 4, 30, 158, 356, -13, -196, 33, 105, 17, 119, 171, -78, -173, 10, 52, 49, -76, 76, -182, -234, -207, -35, 148, 140, 13, -121, 54, 158, 256, 151, 127, 156, -217, -159, 206, 176, 204, -12, -156, -261, -140, -59, 247, -19, -53, 29, -354, -91, 155, 479, 117, 173, -42, 18, 51, 279, 158, -111, -130, -300, -305, -50, 271, 103, -107, -263, -70, -113, 122, 241, 48, 208, -10, -244, -189, 188, 290, -31, -20, -227, -465, -185, 173, 198, 40, -64, -290]
2772b90J35Q8K81J85n19p9r7J82K38K22j77j61k11o5K8K97K08k08o05R8J73J39
2794a38N49j72j95k44P2J73Q2J03K56l18k96M8J05J08P0j59j64k14P9P9J88K75
2816B87j69l34j47J03L42L26j80l19j6k11K23K08K36j34k31j02j80J14L33K13
2836C62l97m36Q1K48L2L81O4l41l1k00r9O29M2k77o4j95KJ12O2K37j80k69j59
2859c96R0N33j18K17l73O1m63K78N64P3j66j06n40N5J52L18J63l05o1m14J48J63
2881a27K69m8j69j91k60K72N37o7k6R2n38M9J91J38J23m3l72rJ2K06P8L7p0j55
2905g1q0k08M70%J10j58j31Ll0J60K39M8l72K7j43j27J84J70j14j43j89K25j9
2928a49J58L39j91j26L7p6pK15m1j21Jo1l1j02K82q8r6j87J2N0QM21j28k25K48
$$ y = [-290, -155, -67, 214, 399, -120, -199, -296, -114, 124, 346, 169, 8, -203, -268, -240, 57, 265, 57, -548, -450, -277, -138, 411, 239, 44, -200, -128, 45, 127, 230, 486, 168, -128, -80, 25, 133, 203, 44, -120, -334, -255, -176, 12, 287, 118, -216, -363, -260, 82, 408, 228, -91, -107, -318, -95, 113, 349, 215, -16, -118, -298, -184, 149, 362, -35, -471, -390, -142, -110, 271, 335, -6, -37, -237, -336, 293, 335, 58, -6, -201, -199, -87, -25, 212, 32, -237, -396, -306, 227, 109, 326, -47, 14, -449, -171, 393, 466, 300, 194, -346, -291, -139, 179, 342, 37, -24, -438, -290, -127, 142, 94, -75, -266, -526, -254, 283, 216, 190, 282, -256, -207, -16, 122, 245, 202, -170, -179, -167, 39, 117, 154, 84, -71, -151, -359, 111, 111, 221, 63, -68, -65, -95, 65, 304, 352, -20, 7, -136, -263, -79, 91, -23, -166, -355, -130, -149, 9, 348, 157, 31, 68, -8, -15, 200, 159, 38, 39, -22, -53, -155, 127, 39, -57, -244, -232, -182, -174, 247, 119, -106, 142]
2953A42m88M62m9j17J90j86j79J25J58j33J18N4p5o5J34o8k08P8J26r5q0J51K12
2976B07j08l3K03l24j51K82nl1J45J61l34k97K21j59L7L14m0l32QL80j78K12N4
2999B32j29j87l3J73k8r5K42N0m08lN0n4K79o6J26k44j5j4j13K83J48j47q9Q3
3023D1p8n2L44p7k75r0J16KJ51lJ62l40j80J38RQ5R3K39m88j90L50K56k35K71
3047B49j01k69o0L44o2J46j88l03j80J10K46K71j76q0j55qj03L08N6P6J80m17
3069a16n3r8N06J48k32Q2k75l25L53j5J87j67k3l66O4K30J48Q1l88J64j59J20
3091a34K68M34n13j52m3q2Q6K11L69k49k54p6k23K67K68J10l55k4j60J29K13K14
3113C04n8j14l30n1J84K49J72j37j03m03K5J24J71K42j6k84k18kK88K18L3l30
$$ y = [142, -346, 116, 67, -50, 140, -46, -225, -100, 58, -75, 43, 97, 22, -43, 91, 23, -185, -107, 19, -76, -156, -5, 207, 99, 66, 269, -55, -206, 76, 71, 40, 185, 346, 12, -285, -64, -223, -186, 128, 88, -244, -236, 144, -34, 178, 232, 103, -84, -117, 56, 28, -67, 175, 225, -183, -186, -136, -190, 89, 23, 149, -95, -110, -124, -237, 46, 194, 47, -42, 41, -37, -89, 255, 178, -97, -187, -71, -69, 82, 79, 241, -99, -279, -141, -132, -47, 46, 285, -203, -393, -43, 213, -22, 249, 148, -121, -181, 163, 101, 247, 59, -244, -424, -314, -68, 203, 27, -53, -208, -216, -319, -11, 45, 121, 301, -116, -169, -267, 239, 387, 155, 237, -38, -363, -10, -25, 162, -5, -28, -394, -330, -100, 48, 129, -259, -95, -254, -134, 134, 568, 55, -97, -140, -222, -136, 75, 444, 195, -59, -135, -358, -91, 177, 287, -68, -92, -252, -123, 90, 304, 246, 132, -198, -249, -65, 184, 356, 219, 116, -287, -262, -138, 33, 275, 259, -25, -243, -245, 43, 261, 294, -36]
3135c6m2j65J32K16K45j80j94k11P0R0J74k6K47m36m22K68J76M11q9J7l63j34
3157b52J62K33K9K38j01p50J03K85K42o1j96O5l06K5J79L25P3r8k72k9O3J48K03
3180C08r9L2k82k08r7N58N2J03k80l81j1K4N83j54k8q7j72k44K14N10jk91k25
3203a76l2j84O04P9J54n23k89j6J69J74L36l74j83m6J01K99J32J18k59k01nq7
3225b09L17L18k73j52k64K07m3J45K52k13k60q7J82j23K43J89k54j11l37K77M28
3246B32J18l6km74Q4J58l9J90j27K7m10j61K49K28J62l1k61q7k8M16J1j6j56j94
3270a47j32K02K25K00q7j06l78Q2OJ24K43k51j50jJ56o2K65l81K85j52p5K74j54
3293a4K26q9M8j73q6K01l42L72k47K29k96O9K4L6l4J64j28L6j19M5K74l22J65
$$ y = [-36, -78, -243, -111, 105, 350, 170, -24, -235, -165, -75, 99, 73, 320, -116, -538, -270, -94, 317, 228, 245, -118, -252, -90, 143, 172, 410, 309, -441, -338, -53, 189, 128, -68, -3, -309, -284, -105, 220, 293, 195, -77, -106, -43, 105, 308, 209, 241, -41, -249, -346, 212, 264, 367, 87, -294, -305, -281, 302, 148, 120, 33, -139, -383, -169, 341, 340, 49, -176, -208, -392, 212, 291, 445, -78, -367, -383, -214, -40, 296, -78, -261, -307, -206, 93, 225, 343, 84, -117, -122, -209, 108, 426, 153, 1, -263, -56, -99, 46, 298, 85, -175, -262, -80, -203, 40, 229, -25, -136, -473, -196, 232, 350, 314, 312, -162, -78, 80, 41, 231, 104, 131, -279, -440, -191, 37, 199, 168, -93, -180, -208, 208, 219, 203, 47, -147, -279, -77, 148, 348, 261, 155, -223, -141, -135, -11, 232, -19, -169, -170, -14, -76, 189, -192, 93, -59, -134, 140, -14, 212, 123, 171, -2, -88, 113, -229, 143, -104, 125, -171, -102, -78, -42, -76, 88, -40, -4, -123, -78, 196, -126, 39]
3316C9l8J98Rk00l1m9K22P6k44p9J57O7j31qj2J52k72J21J33R5j77J00n7k96K10
3341a5o6R3J74k45L7J43l14j01N33r4k14O4j43q6L05J2q9K23j78mRJ7P6jj38P4
3367G2j98j4J76n7R0k27q2J10L05j56l5J39l26Q9K02J73P1Jl11r2j36O5K92J49
3391C00k12p2o3k63L85j14J55p7j95j20J17K90J03n4j1l81KJ73J71K44k37j45
3413dj14l00K17K64R2P6m84O6j16M82j82J86M9m22j7J48K92J6j10j71m52K27K14
3436d3J76j6o2rl26J67J23J33J32l34j53j73K30L77J81r5l37k17L7J25J63J87
3458B66j1n28M6q0L70j05J03R9l88MJ25J84J42lk27j62m3J21R2L57l59k1q5k13
3482c16J60J69K61j02l15m1r8L74J19Q4l28l54K25M0K71J76k16r2k01r6K48J16
$$ y = [39, 1, 199, 208, 8, -23, -72, 150, 226, -18, -97, 60, 127, -4, -12, -24, 128, -144, -23, 110, 205, 28, 128, 71, -225, -15, -81, 12, 186, -59, -22, 121, -193, -294, 239, 145, -69, -5, -148, -234, 71, 83, -6, 217, 39, 35, 44, 61, 137, 136, -2, 72, -126, -140, 36, -21, 69, -158, -240, -130, 175, 19, -16, 123, -203, -114, 88, 261, 332, 333, 22, -70, -206, -141, 151, 300, 88, 16, -47, -310, 75, -39, 116, 39, -156, -276, -159, 131, 234, 180, 169, -212, -210, -37, 134, 378, 141, -4, -118, -418, -201, 63, 155, 231, -253, -187, -303, 179, -3, 183, 232, -190, -207, -59, 233, 249, 139, -32, -484, -257, -43, 133, 117, 55, 46, -280, -113, 10, 143, 275, -59, -212, -385, -155, 222, 403, 308, -29, -246, -209, -84, 79, 266, 255, -273, -227, -307, 63, -42, 61, 160, -228, -224, -99, 85, 227, 224, -3, -165, -208, -87, 5, 362, 3, -18, -103, -316, -156, 13, 274, 172, -143, -184, -282, 92, 211, 295, -33, -387, -162, -122, 149, 325, 109, 17, -184, -280, -32, 84]
3504H4k9l%k77j13M18L70k51q8j55k51J82K74K14k44j52p6j99J69L49j02k1l28
3527b29j19KJ96J71J55j9l32j9j00K36L87Q6m47r2q5R4L85m3j35k16M0j09Q8L01
3551A96ml02j0m9J01J50Q5j56R1l30L4qK09J03M2k97N6j4M8%L28r8l67P5k1J16
3577b2J26O9k42j70j08L68L51k81o4j83K1o3J79J08p2L6k68K06l5J2k5J03r8K8
3601b4k16j2L36m7K18N0l09j2Q5Lj27J45K2k8j78P0O0J08n6k12j45J09J96n6J70
3626A50ql02K55l6Q4j18j31J91q3j20J29J14j23n4O7J07j08j03J75j29L4k46L34
3649G9j44K17j13J87j87J3n5j12J46J5q8J23J5p2j24K0J27j15j35K21j22j56N17
3672B57p8j8q5j64L32j54LM4j72J10n2k9j19K95j12j48J36K17m14M7Q6l3J32n7
$$ y = [84, 55, 52, 52, -225, -338, 80, 450, 199, 111, -44, -295, -113, 161, 375, 131, -21, -97, -296, -127, 222, 120, 99, -229, -348, -346, -150, 21, 176, 157, -175, -194, -294, -58, 329, 415, -32, -124, -209, -115, 270, 227, 92, -124, -84, -193, -105, 196, 192, -110, -120, -169, -68, 82, 167, 11, 102, -228, -194, -202, 7, 110, 152, -145, -89, -103, -55, -55, 273, 175, -192, -117, -138, -22, 104, 173, -69, -239, -347, 21, 372, 91, 27, -156, -135, -198, -19, 89, 17, 53, -215, -9, -44, -32, -57, 46, -52, -24, -240, -252, 84, 37, 255, 305, -4, -16, 69, 72, -55, 90, 112, 84, -94, -24, 36, 144, 88, -124, -269, -160, 36, -20, 150, 142, -160, 95, 59, 143, 25, -106, 85, 2, -118, 11, 125, 2, -52, 15, 122, 14, -89, 86, -43, -9, -255, 79, -65, 152, 39, 226, 39, 52, -3, -115, 31, 46, -42, 81, 96, 24, -100, -80, 47, -68, -203, 18, -104, -260, 257, 179, 161, 76, -88, 244, 90, 93, 137, -35, 75, 23, -6, -125, 170, 58, -90, 46, 263, -151, -104, -18, -51, 81, 24]
3696B4N0l1j22J55JJ5j16o1m8L30J5l24O4K9L0q9j48M79l46J09k2r8j8J61M3M3
3722A25j33j12j3oK74N8k26j34K8j9J37K39j8Mo3k88J2K4L54J42l59J07l71P2
3746a66L93q4r2p4j67k79O75mmj36N5k21pO9J87J25j92L9n11J84M20M5kj66r8
3771a1J76l42P8L35k28n9l0l5n1L33J04j95N6l20J28J05J48lj72J11n47K26Q8
3794a05K27N1j62j88q8L38N0J8J39j97k65r8M29K89k23l7l01m8j11L56P5J64j02
3817B11l73O7k02N07j7N8p9m84O5J66J80Q7p6j62k19J97L58m1j1k04k86J14J75
3840C1J7J19k07j53J7l3L95l7M7p9j93j19O1J53J03J66k84j82N8j08M00N2k40
3863a6j42j12O6J4K40J8R5k08j55j07L54K7j9J39k73Oj62N25k37R7j79n4j09R7
$$ y = [24, 74, 43, -79, 76, 77, 92, -24, -85, -133, 197, 212, -112, -48, -19, 11, -78, -226, 253, -93, 16, -6, -104, -122, 39, 82, 125, -8, -120, -133, -139, 135, 193, -33, -167, -139, -158, -21, 218, 200, 204, 141, -147, -135, -111, 243, 385, 26, 133, -238, -166, 227, 143, 51, -23, -190, -469, 206, 202, 198, 62, 117, -104, -111, -42, 145, 270, 78, 117, -394, -210, 210, 255, 253, 87, -11, 165, -177, -99, 236, 8, -51, -81, -116, -167, 166, 270, 75, 131, -189, -61, 44, 192, 189, 17, 128, -419, -193, -105, 122, 173, 11, -177, -265, 73, 123, 141, 280, 83, -182, -280, 149, 438, 215, 178, -123, -171, -282, 74, 149, 313, 211, -162, -95, -297, 210, 193, 251, 172, -312, -247, -81, 99, 186, 110, -52, -271, -74, 284, 243, 232, 28, -258, -144, 31, 48, 167, -40, -193, -176, -209, 186, 149, 196, 117, -76, -195, -134, 19, 122, 288, 4, -178, -120, -228, 172, 224, -16, -158, -270, -204, -190, 50, 68, 163, -45, -200, -307, 47, 74, 55, 194, -79, -73, -235, 290, 53, 150, -29, -83, -192, -95]
3887i5J87J15j33k47J07p2L03m8K41k10k86n5P0K27j46N4j66K54l22J66J41J59
3909B44j83K3m2o4J21j11K20p7k85o7M5K64k07K91r7k05J21lpq3J45j69N4l0J29
3934B7o6J48M3j42r7Q1J29Q5j96k9J60j82J6J33j21J5k13Q4r6K52O0L0P5k04o4
3959g2K0M8J40p7J15l52N7M20l04M0J54j46j46J07j60J95j4l8o0kJ14j92L14k04
3983d3J11Pp5p6O1K18l09J79o9o6j5oK34k36J17j94J31J75k51L4P6j28Q4K88k
4008B45j22M4j02K0p5n7J01j70oJ98r6P6j18o5j32L44J7n1r1J30L6o6j17J58j72
4033g1J15k2j21J30M3j97J63j3j99l9J46q0J17N3j57J56j68J97J48Pm7l8o8j34
4057g9J50l9q2j11%J98k22J82j31K79l25j2M1K40j6J80k11Q3l30R5J07J88M2k53
$$ y = [-95, 92, 207, 74, -173, -66, -138, 165, 117, 358, 148, -138, -193, -123, 104, -42, 12, -154, 100, -222, -56, 85, 244, 61, 84, 42, -22, 99, -12, 208, 131, -154, -221, -176, 88, -119, 172, 75, -130, -9, -12, -19, -102, 43, -126, -72, -102, 27, -39, 109, 152, 10, -87, -6, 123, 208, 12, -17, 143, -39, -23, 110, -11, 4, -209, -125, -221, 31, 91, 121, 196, -8, -72, -52, -4, 136, 59, 174, -178, -121, 299, -5, 35, 189, 43, -103, 4, -156, 39, 25, -13, -73, -75, 39, -153, 161, -43, 68, 75, 0, -76, -15, 203, -106, 73, 4, -62, -77, -83, 151, -85, 32, -162, -31, 144, -107, -73, 3, -125, -41, 247, 245, 123, 167, 65, 85, 10, -47, 54, -116, -122, 76, -20, 56, -62, -127, -259, 85, 102, 51, -40, 90, 126, 60, -57, 101, -71, 44, 22, -99, 31, 74, -123, 40, 27, -172, -211, -65, -145, -28, 25, -132, 24, -144, 53, 201, 208, 161, 123, 55, -79, 71, 32, -50, -161, -161, 37, -185, -3, -134, 145, -180, -192, -151, 89, 73, 253, 42, 125, -205, -110, -3, 185, 227, -26]
4081b6o1oJ5L7K33j80j9k68P1J72J74q4j99M9N9l0j56J98L48l91k4p8k4L92Oj08
4107A00j54j91P5K52o6K05j71j14m0k71O05J04Nk08m65M1K21J32J16n3j96k85
4129c58o5N28j41K1K86l63j66M1L05J1L18l28j87O7j01L45N2j30m3l14p2K84K54
4152B44j70J53m67j5q2L09J96J9j06j54l49L08M38n6lj47m39J18K44J58N8j99
4174E8M6o28K66K35K85j29n9j77o7KK82K54n5k12j67k38L55K8K86j12l44j16J8
4197a89j7N25N0k81l03o0R4J86K14J50k37k27l9J59J22O8k5m61J10o9K60q5L97
4220C42l9l54k09o6N00m0l0r7k32O0J25lK15Q2j41l76NM52l3K52l35r0k27j28
4244c67M09K62j72n1k12j60L31N8N2j19r4j18J90k42L82m9l9k8j49M3P4L45k53
$$ y = [-26, -87, -93, -78, -41, 192, 12, -7, -275, -204, -32, 142, 58, -141, -92, -33, -63, -219, -21, 327, -64, -88, -166, -190, 202, 208, 100, -54, -245, -170, 82, 16, 221, 50, -64, -104, -375, 230, 334, 339, 131, -334, -293, -72, 60, 176, 123, -73, -358, -423, 105, -36, -15, 271, -92, -258, -217, 88, 99, 417, 89, -98, -31, -132, 213, 265, 135, 92, -222, -294, -10, 244, 74, 227, -240, -255, -337, -28, 168, 187, 81, -73, -422, -114, 324, 268, 265, 118, -321, -203, 41, 199, 257, 58, 104, -524, -258, -23, 262, 133, 74, -103, -170, -168, 114, 368, 313, 101, -66, -304, 51, 79, 365, 253, -91, -207, -189, -206, 319, 369, 88, -215, -275, -181, 5, 219, 369, 132, -95, -134, 25, 147, 215, 190, -271, -161, -230, 30, -55, 342, 303, -51, -260, -326, 174, 134, 104, 7, -225, -165, -40, -43, 172, 254, 113, -263, -258, 194, 161, 413, 78, -12, -239, -367, 42, 304, 132, 81, -131, -291, 40, 98, 150, 31, -63, -181, 9, -233, 149, 100, 61, 33, -116, -73, 1, 346, 93]
4267I3m8k19J74k4k2J61J72k01l05J88n4J32P6J26n04J53N1n3L59q4q4j95P1k3
4291f0Q7L65m54N2q1j09L46L3j58P8k30L1M2L7P4J05j91J18l31K51j21J34MR6
4315A18j87j51M29njm36K69m7j3K55k68n1L55m90K81o9l3L7j73K71M8q0k36K23
4339D6r7l5P2K6j61K95j55K77l65K15l5j69J04M2Q4k46O9QR0j93QJ72m3l5J61
4364A35lk90L7k6L37k95K59j16j07k0J04j8J09j17K8k1k53J14J13L5L4j2lq8j07
4389a71K18q6L0Qk11q1L57op5M5k10J97o3Q6K04j18k50J37k10J17J81knk19P5
4414e2qJ97j07M8p7k7r1m0Q1K11j39j59qq1L42J40n2l5k28j15K9J63J88m6k75
4439a41J11l01N6K57J99N6k08j74K7K3L91J31n72M6L5l3K01J09nk65O7j94PK03
$$ y = [93, 45, -174, 0, -24, -46, 115, 287, 86, -219, -31, -85, 47, 123, 249, -255, -102, -51, -104, 255, 171, 87, -108, -37, -60, 27, 392, -62, -10, -91, -200, 146, 179, 21, 99, -131, -100, -58, -21, 53, 158, -33, 85, -246, 5, -116, 18, 22, 118, -69, -220, 209, 204, 203, -233, 36, -11, -24, 231, -37, -88, 267, -223, 58, -11, -44, -7, -180, 91, 139, 59, -177, 46, -51, -86, -14, 12, -149, 146, -9, 268, -97, 118, 83, -86, 18, 60, 144, -102, -33, -25, 65, -128, -120, 52, 9, -26, 135, 132, -158, -121, -147, 190, -105, 154, 38, -69, -89, 15, -3, 106, -11, 17, -4, -257, -143, -30, 5, 39, 27, 24, -64, -171, 47, -39, -9, -1, -212, -293, 64, 58, -17, 28, -182, 15, -48, 38, 242, 124, -126, 11, -199, -82, 99, 97, 92, -127, -52, -60, 137, 30, 78, 1, -26, -117, -157, -76, 135, -4, -163, -171, -252, 90, 230, 178, 143, -85, -200, -171, -8, 180, 134, -141, -30, -331, -275, -18, 181, 237, 29, -145, -118, -95, 296, 427, -145, -99, -64, -97, 104, 213, 208, -57, 10, -184, -177, 26]
4463B6J85j0j73l07O2J14K31J25k67j36j57J84J98J48j1j16j15oj73K00K62l1
4485B33l39K5j63J41L34Rj97j96j02J84K7L38p8k43j55o2J02J95J31K20m11k22
4507b29k3M0L1L62Q0m04j71k5K65K05J10k28k04j30o5L93J12J50j78k99N6J63
4529A1J11O7J30n11k98J62K04L06Q5j80j39k11J71K16M7R2j00m29l4J84K17L47
4551D48m16l60P0L6J11J76K47o5l90k00K09J71K72n5j07j28m70N31k1J80o9j59
4573A1j43j64K38K58j54r8l6k25Q3K36L30p2Lj76k97K1L96J14k72N7l12K5L26
4596A49M0ro2l1l10J9l4L98J95j67m27P5o8K08J15K34m30j08nJ75K7K31k04Ok56
4621b39J72M5J75J23k4k82q7Q6p9L27j38j30K8m8KK33Q5k82r4j03Q9J50J11Q0
$$ y = [26, 211, 201, 28, -279, -217, -103, 128, 253, -14, -150, -307, -123, 75, 223, 212, 96, -19, -25, -198, 2, 264, 233, -106, -81, -244, -103, 231, 240, 43, -153, -255, -71, -44, 294, 216, -27, -182, -244, -142, 53, 184, 404, -7, -229, -252, -212, -181, 181, 261, -143, -314, -339, -74, 131, 241, 13, -191, -321, -386, 7, 119, 269, 91, -208, -152, 11, 122, 189, 319, -192, -490, -328, -124, 182, 267, 87, -52, -263, -92, 124, 171, 263, 163, -266, -300, -116, 101, 448, 32, -328, -258, -222, -111, 65, 312, 247, -143, -343, -134, 37, 309, 254, 147, 19, -451, 80, 59, 239, 170, 11, -132, -296, -58, 200, 46, -52, -88, -313, -230, 6, 336, 264, 267, 91, -206, -185, 211, 325, 53, 110, -202, -177, 149, 189, 180, 118, 87, -223, -204, -238, 160, 355, 188, -239, -164, -232, -24, 91, 325, -105, -213, -218, -43, -16, 215, 11, 17, -239, -67, -22, 153, 276, 252, -30, -117, -31, -110, 217, 79, -51, -23, -71, -69, 164, 249, -33, -127, -230, -141, 9, 120, 200]
4645B00j4j41j91J34k4J83M5k87K47Jk42K16J0j66l3l1P1J44j29k34M51k64j01
4668a55K7K00j52J04J52q7j67Q2R0j50kO5j26K43j12o2J45k60P6P5J67J17k63
4691Gj5j43J26Q5k1k53K28K6K8O9j26P0l24L78l02O5K3q8J12j13o7K14R3j37Q9
4716B4PK5r2j5O3M6R1o1r2j32M3J73Q4j94J63j9j69KK26k7k2l96K00o1O2J5J54
4743I8j34r5K00K4PM2L3m32P6L34k67K42o7j01j7r4L9L29n3Ok84n8Q0J77P5q5
4769G5O1q5l06L9K55J80j28j90p4O2J0J88n4j10J15l7p2M7Q2p0J74j43r2r6J69
4794@P7J74m9j74k86O8K03J75o1k32m1P3K1J79J62l87J83k25J11r3K35K1l4j76
4818g6l0j38L25Q6r5p8o1k23K10J57m2J37k2l24J6K84J63M3k95k78k2o3M34M4
$$ y = [200, 186, 45, -146, -12, -36, 147, 192, -95, 152, 153, -89, 127, 137, -29, -62, -93, -22, 122, -7, -241, 210, -54, -155, -128, 72, -80, 24, 176, 89, -78, 4, 94, -56, -58, 7, -119, 124, 12, -50, 95, -165, -89, -14, 153, 270, 7, -8, -151, -25, 60, 39, -214, 14, 40, 68, 137, 11, 81, -243, 135, -167, -102, -79, -167, -55, -168, -235, -21, 72, -65, 24, 31, 56, -36, -51, 12, 58, 149, 88, -4, -136, -93, 80, 164, -30, 133, 114, -55, -53, 173, 146, 124, -272, -72, -133, -71, -56, 98, -36, -131, 69, 93, 100, 142, 175, -257, -181, 153, -114, 128, 61, -40, -57, -151, -112, 217, 164, 170, -114, -172, -92, 85, 160, 75, 136, 51, -255, -216, 39, 219, 91, -99, -173, -111, -101, 87, 33, -77, 38, 1, -71, -24, 58, -12, 162, 19, -73, -169, 0, 77, 251, 202, 28, -258, -190, 13, 188, 127, -105, -146, -73, -52, 127, 289, -98, 85, -140, -29, -122, 113, 134, 100, -76, -106, -244, 81, 167, 72, -6, -67, -290, -80, 77, 35, 172, 150, -174, -158, 126, 289, 332, 37, -241, -263, -326, 108, 152]
4842A52K04k49j84j64J59L22J28k41o8j61j49K24J83Q3P5l94k52K46L18N0L8k58
4864F2k68n0K39l8J38J25j31j79Oj24J52K33K4k11l09j8L42K81O3l12j51l0j11
4887b67J51J65J14j50J6m97L02J95J87rj45j09j45pL13K54j77l81M5J15M2K05
4909B17o3k08m7p6l3J22J37j3L3j34l7j4K43j1j25pp6P2Q8K15j01q1k42j26J82
4934h5J40R1o1k55r6Q9K07J51l9j78p0k2j44L03J80J25l28oj42R1J26J25k3p3
4958A06k41L3N2J55N6p4k29o3K39j26N3O4k3Rj28q2K76K3p5L6j67L2m0J16j56
4983a54K71j22R0j54O2P4oj74j5N9J22N5M5j13j80J04j06j25L1L51p2n3qN3m8
5008a3lj0L2j12L0J32j34M5n5l1j8J11J5J05O7K9m6k86l5J01LQ1q4J47k7J2%Q3
$$ y = [152, 356, 107, -77, -241, -82, 240, 368, 127, 59, -102, -251, -27, 156, 239, 314, -80, -332, -86, 232, 282, 320, 62, -206, -256, -17, -55, 83, 208, 77, -102, -96, -220, -68, 165, 189, -22, -331, -349, -7, 274, 337, 25, -126, -156, -267, -116, 49, 163, 13, 29, -468, -166, 29, 216, 207, 62, -47, -192, -199, 114, 368, 191, -190, -145, -30, 12, 217, 154, -54, -101, -177, -210, -88, 49, 36, 69, -65, -102, -116, 127, 116, -9, -16, -92, -20, 68, 283, 182, 101, -141, -267, -85, 55, 146, 85, -170, -266, -177, 30, 181, 142, -36, -106, -128, -272, 31, 211, 336, 8, 2, -140, -49, 77, 202, 179, 106, -135, -102, -50, 105, 161, 87, -142, -205, 34, -92, -39, 25, 2, 11, -117, -199, 77, 100, 25, 61, -106, -74, -114, 2, -154, 117, -5, 85, -69, -7, 67, 61, -113, -128, -69, 53, 108, 153, 40, -140, -36, -142, -267, -236, 115, 43, -10, -18, 35, -13, -16, -26, 6, -106, -76, 56, -78, -33, -88, -119, -137, -26, -11, 94, 161, 190, 144, -142, -177, -76, -73, 8, -76, 71, 44, 56, 56, 139]
5036A39l33O9L42l44k04K81J71j43j3p3K10k75K61k24L8l0K07q0O4m7k1PN6L9
5060I7j81j08K56L7j24L3J5J60L7q2l00P9K84m3j08L1k40jO9J62M8l2j33p0J86
5085G2Kk6k6K2K1j6L2O8Kq4r2k08L01j56K03J8p6j40QL8Q2Q9q9j8j83J13m9K00
5113A08nn9N9k14L1K40k76K45J4q1k15K61j31K95j27j42l7L4j95K50O2j0Nm40
5137c28n5K63J52M3L2q8K7J0J22j11r2N2j34M8J24K9L06l83j12Pk4J74J35j78
5161A9K04k95r5m7J44J09K67L9m28p2K26l7L7oj62k2m0L71o2Q7j09j50k41K49
5185a4P1K82l57J9P6j56q5L84j11l1j21r5RJ14J72n9m3k05j03L27j07K4J22jl17
5210b05j01J53P9K12n4K9n1j64rN9O9J43m8l05J69rO7R2q1j72J41m3K11l2L6j01
$$ y = [139, -194, -125, 217, -127, -331, -50, 121, -22, -35, -108, 102, -173, 88, -136, -98, -128, 79, -1, 63, 16, -5, 2, 58, 97, -84, -192, 64, 101, -23, 10, 25, 185, 222, 140, -160, -81, 203, 160, 52, 83, -157, -158, -89, 73, 121, 89, -44, -114, 72, 74, 48, 22, 44, 65, 49, 81, 149, 151, 67, -25, -233, 68, -88, 115, 133, 57, -83, -75, -37, 45, 134, 45, 27, -156, -43, -92, 108, 103, 44, 103, -111, -80, 160, -116, 129, 143, 62, -153, 108, -23, 272, 145, 3, -34, 0, -195, 55, 117, 107, 112, -328, -383, -120, 32, 75, 107, 19, 46, 56, 178, 67, -25, 27, -107, -59, 65, 94, 400, 17, -95, -88, -112, 62, 197, 19, 223, -72, -167, -214, -70, 39, 306, 345, -83, -155, 71, 34, 71, 65, -97, -119, -159, 212, 150, 237, 128, -22, -263, -14, 57, 339, -18, 1, 77, -79, -164, 220, 109, 78, -43, -138, -129, -15, 157, 98, 55, -150, -253, 74, -33, -9, 113, 112, -205, -306, -153, -74, 138, 84, 113, 62, -102, -111, -52, 17, 160, 112, -193, -24, -33, 34, 126, 45, -127, 14, -29, 182, 150, 186, 85]
5236H5m51J95N4k9L78j72j96pK4R7K46q3j52N4p3l2QL37j27k64j56L13K4Jj58
5261h4K73k06k41J07J40m3K32k67KQ9n0P2LJ45j47j76J39Om2K70q4j87J62q8m7
5286b2n4K18q7j29%N5K8m1J5m5P6Nj70J01K01j14r7j28J31J49J2J45l21K01j88
5311e9M9J31R2j46L2k00N0j69K12K29nl93J3J58O4O9j23N9p3J99n40N07k1j25
5335A0K2j75J40R6J32j76j78m1L6Q0Q4P5j89J30pk18J93j08J59R7j53j88L16j89
5359e2J14J15j23K2q8p5L8J09J32k08J4J4O8j88J1J34k28L76k95M0M1j58K92l2
5383G3k50K17m1Q3Q1j39m9O4j37J4k4O4J01J14q2k07Q4k9Rj06mK25Q4m6M4q3j19
5410e9j26L02j01P4j18n8j20K90k06L27k70L9k70K56J07k72K3J19Q8j36l1J15
$$ y = [85, -366, -171, -117, -146, 232, 60, -136, -143, -119, -22, 224, 141, -11, 43, -30, -62, -54, 283, 156, -108, -264, 49, 73, 74, -84, 189, -17, -258, -151, -11, -54, 178, -89, -87, 2, -48, 24, 27, 172, 25, -151, -12, -6, -48, 222, 138, -49, 113, 25, -22, -76, 142, 55, -74, -74, -19, 9, -32, -17, -62, 14, 19, -151, -50, 151, 37, -60, -188, -57, 92, 104, 249, -72, 129, -59, -10, 121, 213, 67, 99, -101, -51, -220, -8, 221, 216, -177, -164, -6, 58, 127, 4, 63, -10, 189, -351, 156, 135, 10, 32, -143, -3, 93, 225, 49, -129, -170, -134, -54, 30, 105, -84, 46, 39, -179, 14, -94, 65, 162, 9, -179, 137, -52, 62, 177, 54, 76, -12, -87, -49, 60, 192, -16, -2, 12, 80, -108, -97, 37, -191, 185, -110, -70, -29, -187, 105, 73, -177, 40, -1, 82, 163, 24, -25, 39, -98, -84, -108, -44, 57, 171, 89, -118, -34, -63, -54, -160, -164, 61, 145, 99, 143, 60, -59, -185, 117, 16, 90, -28, -86, -206, 84, -122, 205, -65, -26, -296, -40, 67, -205, -182, -63, 25, -111, -142, -27]
5432b7K65j40r9j56Q0J45J8j52J82j69qL8l6j9K49k34j22J30l6J42p6Q4n8k08
5456b07K35N7J0k22K58k58R7j8l8L83j93j14j17L6K67j77K22k18P5l83K40Q8J13
5479A36r4lj44j35L16K0k3m8pj09J4J36m0J02R4l31j14Q0R2n6R0K06l85p5K41
5504c7J98p6M4Rn2j50j4K95j99l2J47k57M0mJ09J77k06J74l12J0J13mPj19qJ84
5530C7j52R1N3L3j45R5k01K68r4N4J75l20N0j87M41j79k7j33j09K11P8k81K92
5553E0M2p3j11j5J39K63k52j15r4J21O2O3k7P9j9l39J20L8OJ56K8j33j29J89M8
5578I7m0K47m18j76K71j70J82O2l0j60J00J5M4J33O3k63Q9q2p0O2P2J58n7j90
5602f1k80M1M43j23jL0J01k29O5m6P9J1j01r5J83J61q7J3j02o0J40l68L42j76
$$ y = [-27, 238, 98, -1, -157, -77, 68, 86, -66, 116, -53, -61, -23, -59, -78, 171, -63, -185, -55, -91, 51, -25, 59, 1, -207, 28, 85, 95, -127, 131, -127, -30, -48, -86, 297, 104, -10, -127, -91, 176, -1, 221, 3, 78, -305, -65, 23, 136, 42, 39, -105, -240, 76, 96, 73, 25, 18, -91, -77, 59, 19, 121, 215, -116, -230, -150, -58, -114, -24, 182, -203, -278, -37, 161, 85, 129, 138, 86, -64, -78, 217, 18, -14, 133, -124, -84, -88, 21, 198, -8, 166, -146, -136, -23, -27, -20, -139, -147, 37, -115, -24, 29, 62, -83, 12, -189, 79, -15, 39, 214, -106, -56, -243, 198, 19, -8, -141, -250, -39, 39, -242, 50, 92, 19, -92, -107, 32, 295, 43, -72, -166, -45, 17, 80, 53, 132, 113, -226, -106, -68, -62, 94, 122, -11, -140, 49, 97, 57, 304, -114, -290, -19, -189, -7, 55, 25, -135, -35, -20, 24, 157, 220, -43, 46, -36, -106, -44, 28, 186, 129, -61, -341, -300, 143, 20, 19, 49, 150, -79, -14, -60, 19, 30, -71, -166, 17, 178, 91, 104, 2, -58, 82, -286, 56, -120]
5626a20J65j02R1k8j07MJ15J08k86r5L80j16L1K56k79j81J59j48L36k34J29m4
5648C4K9n1L2m5J40J49k96l7k3K45l96J90N3j01kJ88n7l0k8Pj41l8L37j32J7J11
5674A55k36O6j59J51L54k67j40Lr7P5J01J21j28r9j06P1J38J23j55J8k82K10P
5697g6J2Q2J33j84n8p9Kq8K22M9p2m2J57R1r0L8k6o5j14J85k74P5J46j82J54N3
5723D9q1M00l01P9k11k5K59j44k7k1P6q1q6OJ73J11j32j45p1J44O8Q4j73K9p4
5748i4Q4nJ07Kj40K0J6k16J92qK8L7l5j52J99j60L9J80p0j04n1K0K13o2J04j95
5774e1O3M5k48K03M2j2j4j99J95r6lQ1j01P5j14J61M7n5j69J38l1r9K23k5o7R
5800bj12j09Q9K01J7j77J40j02l5J31O9J7K5j58j0j78L29Q6j64j37J14o5r8K96
$$ y = [-120, 45, -57, 34, 6, -101, -97, 18, 126, -160, -255, 125, 9, 40, 296, 17, -164, -5, -153, 183, -51, 78, 34, 63, 12, 44, -1, 139, 288, -8, -45, -68, 177, -219, -29, 24, -77, -79, 109, 52, 22, -6, 1, -140, -178, 159, 27, 44, 155, -81, -15, -174, -23, 331, 64, -76, -73, -170, -95, 6, 127, -1, -100, -206, -135, 3, 126, -29, -11, -293, -83, -76, -64, 18, 151, -33, -91, -170, -168, -256, -34, 15, -57, -99, 58, 149, 59, 97, 71, 6, -108, 77, -197, -122, 24, -158, -4, 49, -32, 368, 67, 146, -65, -90, 169, 25, -2, -23, 53, -28, -114, -108, 65, 176, 44, -101, -172, -28, 40, 124, -49, -20, -94, -10, -15, 92, 94, -46, -26, -10, -226, -34, -42, -14, 23, -12, -164, 35, -125, -86, 94, 24, -80, -131, -111, 102, 40, 144, -51, 12, 57, -191, 12, 54, 42, 28, -171, 24, -72, -75, 6, -95, -20, -134, 27, 74, 19, -150, -12, -43, -142, 81, 56, -11, -2, -114, -223, -134, 67, 84, -93, 47, -55, -90, 41, 110, 127, 152, -6, -16, -194, 135, 221, 57, -80, 34, -31, -129, 167]
5824A67l13J83l9j00j10K15L0j17N3p3j53K64k6q8J13K6j4o2l3K06J3j71R8o7
5848Bm2j3J17l6kk37K17J42j27R7J34l70O2K7LJ18n5K32p3k4k71J27J45l3j51
5873a1r1r7QQ1K33o2O5p3l9l8K86l3l64J51mm3J36p7J51J40k98J4L2J60Pj39k84
5900a89N4O5J51n0J63j61j29l8LK7J97k04K5M10l88N9l8J35k05R6j82K04l7Lj60
5925a89J38L6l1o6K8K40l51K52k0NN2q4j0j3m7J5%K52j28j7j74J9j04L63k89K05
5951H2j30J06j55K46k70J62J53j26j3j07P6J9m7M2j89J00P6OL4j03L9K26j21q9
5975A7N8O8l9J2l1J3k8j43KL6L7J16j14j47J27j20P6PP1k01K37J01m3rl35K77
6001D5k41L40l7j06P1p0l8L8j4l5j98P5j10L72n5j50K52k7k95J31M8q0K91l28
$$ y = [167, -146, 37, -2, -102, -212, 3, 33, -84, -31, -104, -257, 7, -19, -107, 6, 32, 18, -44, -77, 129, 142, -29, 69, 2, -40, -53, 64, 28, 26, -211, 6, 148, 21, 118, 252, -118, -56, -29, -26, 92, 37, 269, 196, 172, -99, 28, 173, 140, -11, -102, -199, -191, -110, 123, 61, 126, 53, 14, -24, 262, 229, -135, 16, 12, -31, 105, 28, 179, 319, 21, 35, 67, 227, 234, 95, -189, -135, -70, 81, 31, 194, 33, -96, -134, -131, -104, 93, -111, -86, 324, -64, -5, -43, 92, -113, -17, -199, 5, -32, -29, -189, -51, -15, -46, -112, -84, 156, -195, 57, 37, 42, 94, 10, 0, -13, -60, -45, -45, 207, 79, 62, -112, -93, -197, 166, -123, 82, -48, 58, -97, 149, -121, 41, 194, 68, 55, -52, 24, 43, -4, 38, -151, -51, 25, 31, 65, -38, 1, 227, 106, 17, 75, 143, 104, 116, 85, 98, 70, -73, -71, -35, 2, 118, 4, -143, -16, -136, -60, -53, 18, -183, 54, 155, 112, 103, -232, 45, -196, 144, 107, 1, 72, 2, -36, 2, -12, -47, -245, -170, -280, 92, 37, -113, 139, 112, -183, -52, -4, -84, 207, -121]
6025a21J06P8k4P9j15J49j54M2m1m1J00n4O6m6o4j05K62k06L3J11K8k37R0L6q
6050c6L13j70k36O5mJ2K08k4j93J10r2J26L9Qnq9j07jK04J46r8j44k72o3K79K20
6076A96j18j25j21J12j85J62o7J97mk88P5K52k24J32N0N4k54J29J82j24K8J64
6098B23k50J30j17K27m25K85M0o6j4m9r8J39q5J19n6J97l82K34j15L6j31K3l7
6121a72J45j02L05n7J5k34k2K08k47K87k51J24K35l40J30m8n3O0j22J98o5k45
6143b51L14K8Kl07L02q9l8M2R2P8k95J57j1J03k46L1J32N0k01M4K48m72K33J34
6167H0q5O3L7j67J76j22m3L1P9j93N3jK33k43O9j37L49q3L8r4N5m1j4j3j6M7j96
6194a38P5kJ40p6j1O7j28j5R8O6j6L7l4k51K04K1r4M7J4J10j22k5q8K68j13mj
$$ y = [-121, -15, 63, 39, 118, 3, 152, -2, 40, -1, -42, 58, 4, 70, 24, -40, -145, 117, -89, -56, 55, 83, -154, -64, -28, -36, 277, 107, -129, -64, -68, -56, 152, 128, -65, 45, -47, 79, 118, 126, 121, 32, -75, -76, 128, 274, 176, 32, -240, -303, -24, 196, 78, -47, -168, -56, -241, -79, -146, 51, 47, -241, -166, 86, -138, -6, 44, 98, -156, -27, 155, 31, 59, 223, -27, 103, -14, 213, -212, 73, 113, 47, 33, -16, -114, 25, -60, 59, 3, 200, -182, 52, -63, -27, -158, -135, -172, -27, -129, 176, 119, 134, -100, -122, 86, -161, 126, -125, -1, 234, -106, 24, -24, -77, -17, -139, 59, -6, -251, 63, 91, 93, -214, 88, -1, -39, 3, 95, 173, -122, 35, 24, 127, -119, -88, 44, 94, -107, -63, 185, -287, -54, 80, -5, 58, 95, -72, 104, -18, -61, -30, 49, -144, -91, -92, 141, -102, -33, -170, 179, 96, 134, 40, 95, 54, 40, 27, 11, 58, -138, -63, -65, 75, -1, -12, 55, -73, -88, 10, 76, 60, 97, 63, -188, 16, 37, -57, -10, 4, 114, -8, -33, -121, 147, 34, 30, 29]
6221B9k31J85q2L26k86K64k21n9Nn9K27j33N4m3N9J34r2Om4k50J50J98J1j34n1
6246c7j28J53j5K5J26j22K6J13j98K1J18q8j03K12p0n8R7L2o6j58O5J08k61M7
6270a61R0J26k3o7P6N4j41m1q8J73kK6N6J6j37Q0MJj27J41j46M8K72j66J3J36
6296B13k71O8m8J87j74L9l0J1N9j30o5L11k13J0K0J52r7m8J67j94n5n0M83l80
6320c5J55o2r5N1j59L12j59K11j68L5q6j64J74J16k45O5rK31j19K9q7K19k51M1
6344@r8J12J0K35l02j54L1O7J68p8K08k47J82p4j16P1J10Qmp1Jj70l0l2J14O0
6370Aq4J71q4K3l8n2n9J19j3O8Q9j84J19k42J63n6P0L7M7pL0q9J15k48k9K38l6
6397F9j00J29L1L6k55J20kk42N35k52k9K11n77K85J06j67J96j01j34J14K6p4j73
$$ y = [29, -202, -17, -99, 227, -59, 205, -16, -75, -70, -129, 98, -35, 19, -24, 35, 169, 77, 83, 39, -211, -61, 137, 148, 14, -37, -165, -12, -27, -2, 124, 2, 28, 141, -57, -36, 82, -6, -109, 103, 33, -25, 72, 104, 38, -120, -55, 53, -208, -161, -71, 55, 32, -35, 41, 95, -46, -87, -175, -2, -4, 22, 78, 94, -43, 37, 41, 42, -85, 56, -90, -42, 230, 64, 77, 213, -58, 10, -38, 149, -25, 14, -16, -5, 54, -76, -141, 170, -43, -33, -13, 139, 42, -6, 161, -33, -88, -138, 345, -35, 120, 58, -37, 14, -145, 167, 8, 219, 51, 86, 0, -164, 10, 126, -119, -54, -63, 168, 49, 78, -9, 210, -41, 0, -98, 14, 24, 259, -43, -197, -166, -99, 69, -9, 199, -48, 134, 60, -56, 15, 125, 133, 129, 58, 59, -111, -141, -173, -59, 1, -83, 88, 4, 27, -11, -63, -122, -3, -16, 52, 141, -43, 76, -166, -3, -59, 11, 48, 95, 88, 118, 29, 144, -104, -133, 105, 69, -31, 98, 129, 165, -90, 30, 28, -214, 321, 69, 40, 251, -326, -41, 65, -102, 94, -7, -141, -27, -1, -75, -248]
6420b48J84J61m7J35j18k5K62k69J12j60K17q4m1j77N4P9j86K14j45o1J22m5k6
6443i2K86j57J4Q3m2j61l0%J24p9K0l7rJ02m7j8Ll7K48j48J19j54j62K49p8J61
6469A58r4j23m2K71k22k21K64Nr1J34K0M2r7q6K87j39j58J67m5N8Pj32Q9n2O0
6494F0L0K54l19J8j78J34n2R7k9M7j46J89k53j3L70j57j10j34J28l0K00k9J36
6517B13k97Q1R4k28Q8L8L79m04R6k13J64m5j27K69r7j31J19j7l7O1j90K65P3r0
6541F4j19r1K87PMk25j74L07mP4j20j59R0P0LK12L4j42r2j08K00j86K33k01J7
6566a9M2k11J98pkM3k8Mm0K2Q2j4k26J39Rj00J82n0j01J53k76M14k79R9J42R5
6592B71k05q3m6P6q4R2P8j98J51j18L8J05qn9l6o5J1R0K81m02J53l1n2Q1n3Q2
$$ y = [-248, -64, 97, 50, 185, 67, 42, 304, 35, 147, -13, 204, 120, 79, -98, -44, 35, -151, 63, -82, -143, -21, -66, -92, 194, 37, 51, 134, 92, -69, -99, -99, 25, -54, -34, -71, -80, 22, -25, -43, -40, -77, 171, 23, 142, -12, -174, 75, -3, 158, 64, -59, -101, 170, -52, -273, -9, -4, -95, 39, 59, 101, 4, -82, 205, 66, -92, 75, 30, 88, 95, -37, 52, 0, 60, 90, 344, 25, 43, -135, -1, -53, 44, 15, 62, -84, 105, -148, -161, 209, 52, -58, -192, -64, -94, 106, 77, 213, -84, -3, 91, -137, -49, -11, 368, -36, 60, -153, 11, -34, -161, 108, 11, -120, -1, -18, -55, 6, -184, 81, 154, 64, -55, -146, 141, 148, 152, -73, -247, 60, 56, 130, 10, -149, -59, 11, 14, 226, 260, 118, 26, -82, 118, -68, 165, -36, -19, 23, -188, 10, 3, 1, 44, 16, 20, -20, 2, 84, 70, -156, -17, -8, -108, 74, 24, -77, 76, -200, 214, -65, 34, 176, 271, 66, -17, -63, 13, -71, 21, 99, -99, 52, -66, -28, 77, 69, 10, -26, -91, -80, 10, 291, -111, 42, 11, -41, 40, -13, 69]
6618F9k18O3j61O4K72R2n2r7m6R8r4k76N99k31k08K97k52lRJ14j35O6o6J47R1
6643A42k8J6j82J2j33J07O1O4j69L36j46j08r5J19n0k0K22j01p5J75l54L21J16
6666B30j71j04J07r7J38q0p1J30j19J33r3o5k0J16J00j33m3P2J00k2j30J84j75
6689a3O7M2r6J5j03Q4k6l7J88nk67J47M7J64j07Qn8mm0j38J85j84J25j85J70J66
6715A45j74j3J5L8r3j2r9L21K2k75O8j11k8J74L8K7m5L3R8j31J8r3Q2j36J30j5
6741a6p2K1k7J53J27o5l12J34P4J1m4p5J58Q0k09J04J26k91K81q7m8R0o7lq3P9
6767C9Op0P2k13P7O5n3J53j32J80l18K74J08M9k89l9J40j64J0K08j49k1p5J22
6791b0o1Q8RJ14r7pj76J21J12R7k35q8J1K04m9J3m1J96r8k10n2J21K39l13N2O4
$$ y = [69, -149, -86, -247, -183, 89, 181, 129, 32, -14, 84, -10, -286, 313, 82, -126, 171, -81, -84, -75, 39, -96, -30, -96, 51, 142, 114, 130, -52, -40, -173, -66, -5, 59, -110, 226, 80, -28, -123, -4, -54, -74, 148, 47, -28, 147, -207, 114, 230, 59, -45, 62, -35, 103, 23, -48, 82, -37, 96, 3, -62, -82, 34, 134, 1, -42, 30, 130, 108, -22, 162, -13, 54, 96, 0, 15, -88, -4, -30, -67, 121, 116, -151, -4, 43, 207, 100, 108, 50, 46, 6, -132, 53, -131, -6, -191, -21, 145, -29, -42, -27, 11, -82, -94, -193, 128, 150, -125, -57, -168, -196, -22, 16, 43, -2, 31, 129, -2, 16, -77, 5, -131, -1, -16, -88, -67, -94, 59, 186, 121, -191, -57, 17, 28, -16, -91, 67, 147, -62, 42, 168, -123, 158, 71, 23, 113, 46, 43, -40, 39, 45, -25, 47, -166, -89, -24, -77, 76, -56, 124, -194, 80, 188, 237, -52, -91, 49, -115, -105, 103, -46, -67, -142, -20, -81, 7, 16, 130, 33, 26, -150, -29, 83, 180, -55, -143, -132, 72, 23, 36, -5, 191, 93, -117, -169, -48, 191, -122, -70, -6]
6817fJ86l08L81l01J57j51P5R5j03Q7J7n8m9p0P5L6n3o8P6K4J2j95J33J17M8k8
6843A29l20N8J39K3O8J23k60J0j3Q7K0O4r0j32J89k01Q9P0r9J89j27j67P6J31
6867E6q6J1K6J44k77J71n0k1l8J24k38P2K12q7J84k22j11J51j18M5Q5qQ4j58n3
6892a02o7M06j52j30L8m5Qn8M9J72n1L9p4o8j07K96j69j38j10L10j62rk8J58L4
6917D0k26K5r7L59j25J1R1j74J41l5j73M42l11j18m9K83j07J41k8j0Ml50K78K61
6941B73k14O4k3p9j06J70o2j5N5j8l42L30k7jM1k88K1K60j51K03K6j80K6k3j63
6966b23K05lM0P7j42n7k2Q9J61j2j96K2J42o6n3J28m1J71k17K6j0n8K51j40q5
6991a3j48j49L96K1l8l6k52J12M4J13j8j17Q7J2O4J03l39O9J19J12j25m08L34
$$ y = [-6, 180, -128, 253, -48, 109, -42, 33, 128, 25, 112, 129, 71, 22, -48, 27, 63, 10, -58, 18, 42, 54, -141, -8, 109, 157, 129, -191, -133, 6, 29, 97, 220, -40, -30, -43, 44, 64, 128, 38, -94, 95, -106, -17, 53, -46, 143, 16, -151, -75, 56, -30, -19, 7, 151, -126, 45, -5, -26, -64, 60, -178, -106, 106, 19, 203, -19, -130, 21, -97, -52, 33, 25, 109, -49, -102, -169, 237, 85, -45, -7, -52, -44, -102, -53, 119, 68, 107, 33, -35, -142, 154, -15, -153, -263, 47, -115, -124, -152, 6, 40, -186, -161, -258, 101, -24, -13, 78, -96, 45, 10, -163, 279, -32, -150, -199, 84, -23, 118, 90, 80, 84, -266, 12, 273, 59, 123, 100, 21, -85, 85, 23, 8, 63, 45, -297, 33, 6, 5, 46, -242, -221, 39, -112, 91, 117, -63, -37, -60, -223, -18, -21, 19, 96, -46, -103, -125, -36, 125, 113, -83, -61, 81, 15, -38, 90, 49, 220, 3, 29, 19, -39, 212, 72, -13, -161, -310, 86, 107, 69, 33, -219, -107, -63, 50, 32, -85, 2, 14, 78, 181, -158, -89, 30, 142, 17, -391, -57]
7014e7J16P2o8k40J74N3j09j1K86k75J69ql2j66J62o0j83K69o4k49R8J41k4Qj76
7039a74K03j89K31L8k47N6R0j13R3R3j03N7j53O3J54j70J5J79j88M7J89k30M5
7062a4kJ73j83P4J42j98R0Q0Qmj70M0N8J73k62j50K10k63J26K53k62R2j86J98
7086B3Jj32K04k15K1L52r6l71K70K1o5P9M7j57K4j1n8J45Mk24J67j33J64j36J64
7111H8k19K04j10JJ37lr8j1J00k51J44L7KJ22j35M8l5m1m0J59n9j16P0M2M5jk25
7138a45L54j75LJ2j26K09j75J56j78J25p1J22r5l6L9j17K39k3p3j47K39N8l48
7161a53J36L7M9l4J71j44p6J0l35L52k5p1P6j59k4J50k00L88r6k06J91k91N4J08
7185i2K85j25l9K6m5M0o8j3J24m8j13NK14k4Lj02k55J19o8K91j43J34P0k77lK31
$$ y = [-57, 59, 131, 63, -177, -3, 50, -59, -70, 216, -59, 110, 102, 70, -96, 66, 6, -177, 92, 28, -221, -123, 18, -6, 2, -174, 29, -160, 71, 109, -138, -82, 8, -105, -12, 81, -22, 35, -118, -55, 99, -71, -56, 123, -65, -18, 171, -59, -14, -16, 157, -26, 48, 190, -8, 82, 162, 170, 166, -4, 36, 94, 267, 5, -145, 65, -198, -72, 181, -81, 11, -175, 23, 24, -108, 96, -119, -98, 254, 158, -213, 57, 78, 13, 92, 139, -18, 6, -5, -63, 82, 86, -138, 29, -104, 60, -76, 88, -131, 73, -37, -36, 101, 98, 0, -11, 89, -162, -18, 19, 21, 143, 8, 56, 21, -20, -60, 99, 40, -76, -6, 36, 81, 80, -145, 209, 34, 37, 49, -77, 132, -43, 113, -65, 60, -11, 111, 16, -20, 19, -98, 141, 118, 45, -102, 137, 195, -153, -17, 20, 69, 35, 206, 62, -14, -4, -339, 13, -12, -83, -7, -166, -190, -40, -240, 148, 52, -154, 37, -254, -200, -92, 193, 68, 29, 55, 10, 50, -18, -31, 93, 45, -68, -63, 151, 127, 130, 28, -227, -108, -176, 115, -28, 106, 176, -101, -104, 127]
7211A27m0O8O3l41m8J96r9J48n4J20k26O5o0J50k17K75k91J62j45K64j01p7J64
7234A03J7q3p2lJ38J08k88J1J37r8p8L14p7l91J66N3J13M4M3J01j81o0o3n7J31
7259B8K80k89k84K77j79K13L5l6j27Np3P9J40r2J45qq1k9L8Q4n2L0k58K4M5J71
7285H6j44O1J34j38j07K8J77n3J52j85q0j4k3n6L94r0qp3r5q9K53k31J31K08m34
7310a96oJ89L09l05L5P0k55J38J96j63n2K7k40J56N2J57j86K45o3m32J24J17K05
7333A22j09J83k20q9K33l23Q1K18k19R8j10K42RJ14o2l3k29J18j58R8Q1J34k91
7356a12J64j54J76J5j04Rl6P7L2N4qm2k9j68J31j13lO7R4k32J01Q5pj18N4Ql4
7383i3K34k10K97j94qk10Q7J40rn8M5oj02P0p3J04j34J30n7j55J81j4p1J01nj7
$$ y = [127, 87, 155, 218, -123, -171, 25, -74, 74, 20, 140, -86, -21, -81, 69, -148, 127, -164, -2, -147, 117, 16, -61, 103, 120, 37, -35, -38, 100, 208, -80, -69, 68, -30, -108, 206, 129, -262, -96, -43, 70, 114, 157, 258, 77, 17, -46, -103, 28, 308, 19, -265, 12, -167, 46, 81, 45, -82, -77, -150, -71, 69, -23, 122, 114, 33, 4, 42, 126, 74, 104, -154, -130, -85, 86, -58, 3, 137, -1, -108, -80, 97, 44, 196, 11, -69, -83, -106, -162, 232, 142, 134, 61, -34, -123, 130, -101, 30, 238, -196, -202, -13, 296, -9, 26, 96, -159, -21, 175, 12, -40, -13, -253, -97, -45, 112, -74, 171, 108, -324, -200, -83, 122, 13, 196, -24, -113, 120, -203, -122, 96, -123, -25, -135, 107, 116, 230, 168, 135, -94, 24, -134, -36, 45, 179, -112, 52, -102, 74, 89, -15, -6, -42, 35, 67, 121, 113, 71, 42, -126, 5, -108, -111, -44, 50, -182, -81, 4, -3, -121, -67, -59, -93, 141, -69, 228, 34, 26, -184, -97, 43, 34, -24, 21, 15, -87, -17, -90, 14, -120, 10, -47, -202, -21, -35, -106, -5, -10, -27]
7409b7p3M0j5l7J68j13j6K1N3J6l9J70m0j68J80J06k46J17j07r1K38m6j1n6j19
7434i5K02O9j28r3j05M9J38N2n6p2Q4J89j98l0j1K9l6K7l5j18O8Q1qJ93k33J26
7460H9j50J20r0Q7j30j86J80n6K68k0j7r3k2J2O0j33J48K07j02m15K85R3q8p8
7484c1J5M2j76J83j19J83j80J49r2k1K05j25K2nj73L01m4q4O7p9j03M7j94J32
7508h0j2K43pj62M0m9m6R4K61l60R0j31j95K62J83k0k3Nk93R1J23j31K89k18J17
7533G1j48J31k10K89j89J88j78k23J88J94k8p3j88k7K42J3P5Op3j19k61J46J49
7556b5L7m5J76k41J8R7P7L3q6j41qJ68j74N5J58m5N9k37PK61k26J94K6k24k43
7581c29L49K50k81p8N4J24k29J07J66n7J6j30m5J56j18K3J66n5k15r9p1K06P0
$$ y = [-27, -100, -60, -75, -112, 56, -57, -73, -52, 1, 17, -22, 148, 108, -60, 120, 226, -20, 97, -10, -101, 137, 91, 80, 24, -95, 107, 176, 48, -45, -150, -101, 37, 89, 33, -39, 45, 234, 36, 6, -5, 24, -12, 15, -20, -138, -70, 11, 3, 196, -37, 89, -61, 59, -31, 56, -74, -260, -80, -136, 132, 112, 95, 2, -20, -8, 52, -81, 67, 274, 172, -243, 42, 135, 47, -31, -16, 26, -150, 33, -86, 97, -83, 66, -26, -47, 158, 33, 55, 50, -123, 178, 134, 50, 117, 38, -65, -18, -212, -80, -92, 151, 144, -18, 22, -27, -73, 21, 282, -78, 12, -119, -314, -52, 131, 111, 88, 93, -200, -109, 14, -117, 172, -46, 71, -77, 54, -156, 133, -56, 132, -46, -269, -81, 113, 85, 12, -176, -203, 39, 52, 127, 133, 60, -59, -320, -174, -25, 12, -33, 143, -98, -80, 17, 94, 127, 41, -100, -108, 60, -114, -59, 99, 54, 113, -124, -117, 144, -82, 112, 138, -86, -329, 20, 270, -11, -89, -35, 89, -140, -33, 133, 76, 92, -38, -83, 73, -45, -22, 144, 89, -126, -225, -296, -90, -20]
7604b0L9j79J75m1J16o0K62j83q3n7j45P5K33J3k10J81l3l12K08J44o8l5O2k55
7628a73J04J65l3J59l82K49j77j58L94J32l22j22o2K33M3j04Q8n3r6n2j6J81J75
7651A73j25j51O5Lj80M90j93K3q5j96L44l16J02K36j61M4j52R8q5K3J87k06p1
7674a33K13O2K3j07q7N4q2Q3j20j47K28J11k60J98j6n7M6L4kKR3k77K28J80l74
7699a07J80O9j03oN2L7k25N8j4k12K52J2K4r9k0K69k73M43k83j02k41J13J48q4
7723a12L8JK2L8J55oO9j05n7J30j65k36Q8J22Q8j22m3K34k33M5klQ8m1L8j01J89
7750A19k67L81j87j51L9J41m8j8k49L60N6k39J00j10R7n1J38K1kn3p3J27k60K29
7774A00o5r6L42l10P4J14l1o8m4k14K34j35j2R4j49K05j26J21k43J72J27J29j03
$$ y = [-20, 19, -160, 15, -26, 90, 30, 292, 109, 26, -31, -176, -101, 132, 145, -65, 116, 83, -229, -21, 123, 55, 20, 82, -173, -69, 96, 63, 222, -160, 89, -88, -246, 148, 280, -42, -164, -226, 7, 50, -54, 34, -19, -115, -167, -183, -2, 173, 48, -103, -38, -35, -215, 275, 82, 105, 20, -176, 168, -148, -46, 190, 29, 73, -79, 19, -66, -43, 144, -62, -133, 80, 142, 165, 58, -29, 25, -57, 26, -94, -241, -13, 98, -162, 36, 20, -37, 9, 43, 41, 43, 136, -141, 87, 267, -107, 73, 142, 39, 33, 85, 122, -103, -45, -59, -271, -19, -7, 17, -82, -102, 167, -106, 337, 54, -48, -289, -176, -28, -112, -74, -73, -51, -13, 142, 136, 205, 100, 43, 173, 8, -228, -140, -18, 70, -52, -95, 139, -94, -49, -51, -54, 34, -7, 31, -70, 119, -148, 233, 46, -105, -66, 75, 27, 9, -240, 120, 176, -63, 37, -73, 24, -27, 111, 132, 130, 77, 4, 131, -129, 100, 35, -61, 281, -29, 45, 159, 128, 60, 16, -198, 36, -99, -111, -17, -166, 39, -87, 34, -209, -37, 90, 219, 116]
7797A16j09k67K40k82K08J57M6jj37m2m0Q7K8j20j9Q3J83N9k16L7r7J27j59M2
7821g6J72J15k73J56j9n9j3l3J60j53N6O3p8J38k67n4jlJ23J01Q7l0j88mP6J90
7847A86l7j5k57K0R3M4R4K9N4p2L8l21K21j0j20k0J09p0k5M2J11R1k08m4jm4Q6
7874b6j2J8L1l30L75n4k7l5K10j93m9M6%J40j5j6r7k4l19K63L61j44p5J39o1m83
7900c77M76j49K17l8j96q2J62l9M0l8j25O2Q7j77M55k07j32K6j94K66Q3Q9k16
7923gJ00l06J1J68j7K28r6j07M0M1L9k21J45OJ3k59Q6J71q8M0P9j48j79L94j07
7948B6P1O2l07K58k97K63j01l7K03r0l00R9nK73qj31j31jN0J43J21k14j06J32
7972b7M4Q6j3j0r3O2j66LJ93k3J45j29o1k1m0J13M9q8l2O9j67L1O9N2n5p9J6k9
$$ y = [116, 7, -260, -20, -302, -94, 63, 109, 108, -29, -71, -111, -24, 4, -116, -135, -52, 131, 190, -26, 11, -86, 41, -118, -76, 96, 211, -62, 94, 75, 16, 3, -30, 130, -23, 33, 96, 18, 156, -111, -165, -166, -169, -46, 55, 142, 112, -76, -80, -4, 186, 149, 134, -123, -103, -10, 34, 128, 157, 211, 139, 177, -144, 77, 67, -53, -73, 36, -34, -59, -17, 94, 185, -23, -67, -68, -112, -26, -38, -20, 11, -319, 56, 2, -25, -60, 150, -43, -92, -46, -46, 94, 79, 63, -34, -58, -377, -114, 247, 103, 28, 167, 106, -377, 99, -50, 167, 129, -67, -149, 13, -26, 14, -24, -149, -87, 0, -177, 278, 71, -61, -35, -229, 37, 120, 209, -7, 93, -213, -202, -34, -51, 177, 81, -26, 14, 55, 94, -127, 18, 24, 37, -222, -136, 35, -53, -13, 66, -82, -261, 133, 26, 97, 159, -148, 110, -187, 76, -25, -62, 141, 51, -249, -150, -155, 118, 110, -21, -152, -153, -103, 40, 161, -53, -159, -27, 17, 103, 90, 80, -13, 49, -117, -114, 79, 56, 201, 72, 11, -10, -50, 63, 112, 24, -8, 61, -106, -75, -6, 46, -9, -88, -72, -101]
8000a01J85m4n1oq0o0J42k11M02j32l2n5J4NJ06n4J9K7K6j98O9J14m2p3J18l96
8026c08M43j12J7Q4j09Q9l0q5J64mjq9k69Q1QJ80j34K11q4k07K17j94J08Q3q0
8051b1K2J12j42j9J56J3N8l14J2J70p8J85j69j13N5K1j1J51j2j5n7m9R0p2J42
8076A15k40J99mP4p5j17O4OK2r9K00o4k9lk89K42Jk1K5R3j37J0%mN9K6J0k30M7
8105a19L26k33r2K84l4j98L8R3NM5q0j40N8N4J53j48J5k05J30K3j01J00j68J97
8129CM1l2j19j6J01K49k8r4lj96J35q0J26j2j7j12M2K42l2j71r2j9J68r2Q1l2
8155D1k5n1J83j64j23J65n8J06k58J80P8p7r7J49j43J5j37K70M5m5J18k81K1J43
8179E5K9K15k67N3j20J8P7n3N3j50o3L06
$$ y = [-101, 84, 40, -11, -17, -97, -157, -15, -226, 176, 44, 12, -43, -29, -24, 82, 28, 47, 74, 100, -98, -29, 85, 43, -30, 88, -308, 135, 23, 40, 124, 15, 104, 74, -11, 153, 149, 148, 59, -210, -129, -121, 59, -75, 136, 52, -155, 62, -132, -24, 59, -21, 1, 113, -29, -48, 108, 121, 179, -135, -123, 47, -31, 154, -15, -128, -73, -52, -63, 88, 76, 61, 4, -45, 45, -27, 115, -125, 74, 70, 144, 69, -48, 16, 22, 44, -55, 145, 81, 52, 49, -240, 2, 3, -18, 7, 100, -37, -27, -27, -31, 28, 54, 64, -166, -119, 207, -26, -118, 166, 132, -66, -28, 65, 70, 115, 35, -105, -47, 7, 160, 12, 27, -178, -48, -25, -126, -26, -194, 3, 44, 12, -107, -123, -22, 227, 199, 105, 102, -94, 41, -39, 87, 75, 58, -54, -12, 230, 198, 27, -65, -84, 84, -8, 73, 41, 16, -35, 148, -16, -139, 26, -32, 74, -184, -4, 74, -3, -100, 49, -94, -79, -216, 54, 99, 54, 172, -109, -88, 55, 84, 299, 32, 85, -35, -17, 60, 7, 60, -90, -153, 153]
8191A53
$$ Imaginary data points
##PAGE= N=2
##DATA TABLE= (X++(I..I)), XYDATA
0@%%%%%%%%%%JrJ6j6K4l2L9m7N6p2Q7j03J20j37J61j92K24k56K96l43L91m46N09
33B71n76O49p31Q22r23J033j154J287j431J587j761J952k155K379k627K893l187
50a672L514l870M264m701N190n742O365p074P896q857R998j1384J3102j5303J8239
65I965k2370K8654l9486O3226k08544J31774K84751k88391J13404J21647l17588
76a22958j43485L31654L2905j12815J14193k5148k35611O8495J39418l9790M9971
87E6829O6750j77602n6350J32859k4878m0477J28112n3103j52626R7799J06729
98H4042q0524K3963M2763j42225m7033J26731K4396J0943O3573j03695j24840
109a21906P7609L9238j2225J38866P284k25587j7916J21723p1120L9327K16705
$$ y = [0, 0, 0, 0, 0, 0, 0, 0, 0, 0, 0, 1, -8, 8, -8, 16, -16, 23, -24, 32, -40, 47, -56, 64, -73, 88, -104, 120, -136, 160, -183, 208, -238, 271, -305, 344, -387, 435, -488, 545, -609, 678, -753, 834, -927, 1025, -1130, 1249, -1378, 1515, -1672, 1842, -2028, 2236, -2465, 2725, -3017, 3348, -3726, 4170, -4687, 5311, -6073, 7029, -8274, 9965, -12405, 16249, -23237, 39989, -168555, -36781, 247970, -40421, 72983, 194630, -122958, -266443, 65211, 98116, -14699, 99494, 74346, -161265, -92770, 46648, 6858, 56829, 123579, -54023, -110373, 22486, -2392, -42869, 85243, 32140, -120486, -22687, 84042, 3518, 27481, 70244, -71981, -119014, 7717, 32113, 43056, 106629, 2934, -121906, -44297, -5059, -17284, 121582, 128866, -96721, -114637, 7086, -64034, -24707, 191998]
120A91998r5509k25863Q6482N2081j25391J31807J73946j81555j15075J35175
130B8096m5897q5293J80828N3759j88872j639Q8963q4867R815J38199m9524r9493
142e5925N2451K020m2159Q0563K7672r1904j815K9589m3488M5974Q3349o5619
154B0708o1798L7066k7795k1832R8402K5039q1163n320L542m8585N1965P9228
166F9457m2758k7650J7495o8999j6093J12423Q619o5477M7146r033j12621M7521
178c9970J08908o3837l1444Q1631n7500q8791R7682N3083q4323K3240N3711q6741
190c4351k1705R4070j4200m9533N0917n425o5583L9176M3568m6063L654L1453
202B5978m9287j2871N9076q509k9626L4267r760m7179L1081L2323k8906P766J9611
$$ y = [191998, 96489, -129374, -42892, 9189, -116202, 15605, 189551, 7996, -107079, 28096, -17801, -103094, 77734, 131493, -57379, -59018, 29945, -54922, -45107, 93092, 43568, -55925, -3474, -1454, -43613, 36950, 64622, -27282, -29097, 492, -42996, 2978, 86327, 20708, -41090, -4024, -31819, -53651, 44751, 69790, -11373, -16693, -13151, -61736, -9771, 69457, 26699, -951, 16544, -52455, -68548, 43875, 52494, -12983, 34163, 25130, -87491, -39970, 68938, 5101, -26343, 55288, -2212, -91003, 6679, 59762, -24561, -1321, 52390, -34351, -56056, 38014, 23814, -25719, 25198, 19773, -45810, -6634, 36934, -9129, -5475, 25978, -23309, -36180, 22896, 14387, -15239, 19028, 9268, -37911, -6830, 25493, -3413, 4353, 23964]
215B3964m0240r338L8807r175j0723L0818j6662l6229K7532J0802k8343K5085
227F298K1000m3764p42L7320k7633j4945M7408j0725m0743L3992J5456m5994J4188
240h884L7263l6037j0784M2218j8521l2566L4223O490l4727K2587K2810l6854
252a2782l227K9950j8144j0654L4314o205k9969J7075P387k1947J6634K0937k6452
265c083r317J7143j2334m411K7842k347k4592O735K010j4087J8518K0057j9457
278B677r607Q639j3522r12L0038J907k2144J416k775j5742J7309K4964j2542j2323
292b617J872j5988l562K9595J0965j5583l359o875j7178J3179K8269r81j1069
305F668m499j7305q041K4708J8718o225o730j1900j9902N791K6486J0400m800
$$ y = [23964, -16276, -25614, 13193, 4018, -6705, 24113, 7451, -28778, -1246, 9556, -18787, 6298, 27298, -16466, -17208, 20112, -7521, -22466, 24942, 14217, -26526, 7466, 22922, -23072, -8884, 28379, -7658, -18442, 23776, 5255, -27311, 6912, 13402, -21325, 1262, 24072, -12782, -16009, 13941, -4203, -14857, 19457, 13252, -16717, 358, 7745, -14202, 2432, 23369, -3083, -12400, 4743, -7591, -12002, 15840, 13493, -11099, -4364, -2354, -16441, 2077, 22134, 2677, -6930, 1709, -11813, -12725, 17313, 19220, -2924, -1508, -4283, -20025, -2716, 22248, 9706, -2617, -745, -16733, -20295, 9300, 20265, 4682, 1323, -5552, -22730, -9551, 18718, 17737, 6668, 2169, -15136, -23177, 1531, 20249, 14024, 7294, -4606, -24508, -18717, 7769, 18169, 13369]
318A3369q641j9194j1276J7064K2504O136l634j5680k2145o09K1538J7499M224
331B1155p675k1787j7826Q122K2020J4890J665j4648k3840r038J4481K2221J3625
344B3365l236k0498k1577j846J8051K2938R968j1553k4583j6468M955K1397K0385
357B1298L952j7620k5831j1018J3002K5324J6130l110k0804k4348n093K0529K4841
370A7252R875q650k3979k2043L988K5822J9625L372j2416k7704j8159J4855K6991
383H829J3120K43j5666k9711q527K4831K2336P647j504k2255k9379M434K8988
396C386J5641M308n639k9035k2296J6335K6299J0271K457j4000l1398q378K4674
409g375K1766Q777j435k3813k7365M826K5288J8523Q089j0884k9751j6421J1774
$$ y = [13369, 4728, -14466, -25742, -8678, 13826, 19962, 16328, 648, -21497, -22106, -568, 16931, 21155, 13480, -8307, -26133, -18011, 4009, 18899, 20564, 5916, -17924, -26962, -12481, 9740, 23365, 20129, -369, -21946, -23792, -5741, 17197, 27165, 15612, -8971, -25439, -20484, 913, 21298, 25250, 7630, -18201, -29219, -16217, 9107, 25237, 22127, 1323, -23025, -28118, -7589, 17252, 27127, 18477, -5502, -27545, -23557, 2265, 21890, 25262, 12846, -14858, -33017, -18162, 8829, 21949, 22192, 6526, -23185, -31712, -6881, 15455, 23102, 21598, -657, -30036, -25602, 3386, 19027, 23335, 17696, -11339, -33635, -17300, 8999, 19270, 21727, 7727, -23671, -32049, -7375, 14391, 23168, 21733, -2080, -29445, -24619, 669, 19192, 27281, 16397, -13354, -29775, -18001]
422a8001K1770J9624L955k2576k6763n209J1729K2194K2482n859k9197j4798K24
435b0425O969K6924K1096k0520k7896j228n01M973L1483J0515l2438j7580O690
448a1938l553J1957L1612o929l4613l669O723k138K3152K2288k4069k6615M296
461a3496J074N856L1032N687l3098j5343L982k984J7727L0073r414l0395p584
474a6883J04J547K3821K0101j3669k2031r679q41J2461J9001N514o849j5945j7258
488b0606N798K1236L738k673L793j7545j9915K0773K1242j2707j171R695k3265
501a1607j3188L2591J2060k1185M116M676k5535K359L2936k762j6753P786r794
514d300k0796K0801K3297j3429l919O004k3441q039L1373R298j5507O816n04k7708
$$ y = [-18001, 3769, 23393, 27348, 4772, -21991, -27200, -15471, 6723, 29205, 23346, -5851, -20649, -20425, -13456, 13468, 34564, 14044, -13852, -15080, -15581, -10608, 20875, 31390, -1048, -18628, -11938, -15491, -3534, 28078, 21149, -13464, -17133, -10410, -12548, 10604, 32892, 8823, -17792, -13496, -12422, -6566, 24466, 30153, -2945, -18288, -14306, -17290, 437, 30510, 21096, -9299, -16883, -16779, -15232, 8589, 28690, 15021, -7010, -16689, -17530, -5069, 13932, 19446, 12597, -3348, -20606, -14808, 6428, 10166, 7493, 11286, -6259, -26174, -5401, 15841, 3134, 1963, 11658, -11607, -24795, 7796, 19856, -1329, 2787, 7463, -18072, -15713, 17223, 14461, -2292, 5494, -4300, -25096, -4295, 19002, 5573, 1654, 7658, -15783, -23822, 7551, 16849, 1342, 8158, 7654, -20054]
528b0054K262K9524P08j1219P924n887k1309M625K0525J746o453L70k639r136
542i013j758J1841R543p320p420P068m28j1501Q122J3241j3225q370J5836j093
556E523j4831J1193P714j9552j68J9762p297r533J5096l317j9324J0249J3548
569I063j1397K936J3517j5470j2121J6100O59j1074J4622O786k0301j769J3324
582D875r667n214J7981M56j4755N844N876j3058j232J4363L28o113M683R31r329
597d031m422O185P239l58k760K365k859j3250Q67J7189O08r330Q281N84j9929
612a3621J823K0959l518q624J1615k924j8361P191J4204q713j250J0011j0761
625a969r140J3870K166j0414P144L316j5090M956J6507r031q102J1461n263j4159
$$ y = [-20054, -17792, 11732, 12440, 1221, 9145, 3258, -18051, -13426, 7099, 8845, 2392, 2762, 123, -9013, -10771, 1070, 10613, 3293, -4127, 2941, 2513, -8988, -866, 12375, -850, -9220, 6616, 5523, -9308, 1885, 9599, -9953, -10121, 9641, 2344, -7189, 7907, 4590, -14734, -4485, 9063, -2334, 602, 14119, -1351, -13472, 2628, 3287, -7787, 6835, 13621, -6680, -8449, 4875, -4792, -10006, 7975, 8431, -6324, -480, 5396, -7662, -8894, 5469, 5797, -316, 4367, 5298, -4031, -8453, -2268, 4971, 4613, 1853, 4218, 1359, -11891, -11024, 6165, 6773, -2557, 5724, 6308, -13621, -11798, 9161, 5643, -2981, 8634, 5710, -12651, -5460, 8744, 31, -1219, 8792, -1969, -11109, 2761, 4927, -5487, 1657, 4973, -10117, -5161, 11346, 2315, -5787, 5674, 411, -13748]
639a3748J4646J4906j3054o429P100r265p866J6547J0979r179o016j629p585K49
653a0344J3188Q775k848q272p574k136L684Q136R091l15j2542p807K491K725N374
668A626J0211l336j4618k773M931k60P226R270r326j2783M393L833m28J0106M179
683A2251j5416p615Q839J642J368J1257l364j8506k044R131J060N882R346j0312
697C519j6721K878Q060K273R493M818j4523j2628M199O732N803Q422j273j4468
711c416q708L854O532P916N406o111j2158n328M341Q437Q077J172p675r698l471
726a0830O092J0312N540l232q316p747j918Q015J0633K009o923p502o694O14J0684
741G37R828j890p949o616m401K839J2596P503n465q413n749k825N831J2065L935
$$ y = [-13748, 898, 15804, 2750, -3679, 3421, -5844, -13710, 2837, 13816, 4637, -1379, -3008, -10593, -10344, 2844, 11619, 8771, 499, -7075, -9211, -5527, 2609, 11700, 11385, -1157, -8964, -6473, -3748, 1626, 11837, 8501, -6117, -8890, -3959, -4219, 3007, 12277, 2951, -9832, -5439, -1606, -2034, 8072, 12251, -3165, -10780, -1941, -299, 1069, 12326, 8962, -9544, -11588, -2457, -1397, 4485, 13831, 3519, -13202, -10324, -2264, 9, 9502, 14320, -203, -12831, -8632, -1900, 3903, 12325, 11052, -3416, -12124, -8270, -1738, 6178, 11584, 5473, -6685, -12013, -7672, 765, 8842, 10014, 2339, -7359, -10830, -4738, 5574, 11114, 7882, -434, -8181, -10099, -2084, 8549, 10558, 3635, -3867, -10561, -9947, 737, 10565, 8675, 726, -5890, -10291, -7452, 5144, 12647, 7182, -1231, -6980, -9805, -3974, 8091, 12026]
756A2026p613q362n324l83Q538J0753K6q713p047l949K478J0616Q311l119q634
771c96o529k501N303J0919M658n303q491n749j059P196R813J473o899p467m323
786i355K020Q423P788q75p293p150k154N176Q443M304k755p424o852J25P009P082
802F512J543m462p901n039K855Q218N212n69m816p490l184N536P966L216j583
817F014n769o848j87O060O114K018l159p009n234K304O325M339P05l786o942k724
833g779M320O028L199l05n234n742K6N050M642K224j931o319m314J731M438L841
849C875J049l212n807j991L057M077L188K93m203m627L11L054L918J873j231m461
865h37k625K52L157L297R72l137l784r81O81K771L206P1l839k402M74J282K677
$$ y = [12026, 4413, -3949, -9273, -9656, -1118, 9635, 9661, 948, -6099, -10048, -7570, 3046, 11357, 8238, -396, -6925, -9426, -4123, 6796, 11454, 6151, -2340, -8089, -9148, -1952, 7861, 9334, 2435, -5032, -9355, -7335, 1088, 8876, 8001, 708, -6442, -8596, -3420, 5023, 9327, 6572, -852, -7704, -7579, -570, 6512, 8055, 3593, -4308, -9347, -6492, 1726, 6938, 6369, 1553, -5937, -9121, -3585, 4381, 7597, 6014, 245, -6603, -6790, -730, 5384, 7402, 4243, -2766, -8000, -5696, 629, 4968, 5673, 1887, -5055, -7779, -3459, 2569, 5768, 5463, 229, -5513, -5487, -437, 4205, 6429, 4498, -1821, -6135, -4404, 34, 3875, 4924, 1712, -4095, -6086, -3029, 1048, 4236, 4529, 326, -4301, -3990, -936, 2982, 4855, 3624, -837, -3462, -3210, -53, 3244, 4216, 1079, -2705, -3686, -3005, -234, 2972, 3043, -796, -3198, -2724, -1442, 1235]
882A235K685j217l533j230O88Q75K448J567k275k949o97P73J321J694M29k090
898b76j675K35L78J476J905l85k022r1O07l74J027J621j428k156P75R21j260N67
916a55J111j448j442J488Q79j228K67J214j119q21J972P07j201l61J005m68n08
933a08O41K50j032m95L86P34n17k21q0n66m96J313J243m25o87j62q22K34K470
952A660Q83j591l04q78k392J269L738k86k149K03j601l043L197M539k046j511
968c12J627l013k915N306L895l455p12J297l846j521N911J353l695n8L4l494J306
985b292N025q07k875j6q54j298L430L454j621k321r92j420J112M228J656k101
1001B308l062k145o39K554L726J538k390m530k034J564K290K949L133k944o277
$$ y = [1235, 3920, 2703, -830, -2060, -1372, -497, 1951, 3518, 1243, -1706, -2403, -1630, -309, 1385, 1814, -276, -1951, -1716, -1338, 138, 2043, 1658, -364, -455, 152, -222, 805, 2426, 998, -1158, -383, 538, -722, -155, 956, -492, -1934, -446, 433, -795, -528, 686, -433, -1254, 718, 1425, 224, -137, 868, 400, -108, 533, 783, -249, -744, -358, 376, -141, -362, -442, -1008, -1504, -191, 1052, 627, -60, -222, -1044, -810, 1660, 2543, 952, 648, -230, -2622, -1353, 2385, 2099, -50, 153, -1448, -4491, -1294, 3245, 1199, -312, 1315, -1698, -4613, 693, 4588, 1133, 421, 1718, -2128, -3649, 2262, 3615, -80, -138, -104, -3598, -2292, 2733, 1926, -949, -965, -1819, -3117, 313, 3767, 2146, -175, -1167, -2587, -1475, 2753, 4409, 2308, -754, -2899, -3538, -984, 2742, 4280, 1890, -2640, -4674, -3110, -820, 2129, 5262, 2318, -3959]
1016c959j18L536L61K762M001m726p139K409L559j575L251L334o760n083M595
1031a552J929j479M240Q95p453j560N462N80k41L715k540o463J784M140k60J792
1047B989Q69n815l691L537K736R57K322j805o153j522L474L024L142Q22l454m798
1063c366j305K415M677K928j948l012k582l310K180P300L34m257m57j201m672
1078f276M006P939k660m757K566j763m233O268N805n919k713K817l500j224P604
1093C960J257p050r6R85l724L307P222l323m735J155j682j575O562M613n124k740
1109i88P4l202J148O879J283l768j918k476j788L513M215L39j478l171k988J540
1125b786L398J092J752q00n061j438M138R86p25L396k123o549K040M935k300N0
$$ y = [-3959, -4077, -541, -180, 2582, 6583, 1857, -5282, -2873, 686, -889, 2362, 5696, -1064, -6147, -1552, 377, -1102, 3138, 4033, -3420, -4980, 482, 1062, 821, 4536, 1996, -4467, -2683, 1457, 1197, 2989, 3858, -1957, -5648, -2111, 625, 1582, 3904, 2099, -4054, -5576, -2102, 922, 4064, 4886, 1432, -3366, -4671, -2256, 2421, 5349, 3401, 389, -2193, -5503, -3323, 3977, 4311, 54, -403, -1604, -6276, -2270, 5669, 3009, -1748, 818, -945, -5178, 1090, 6895, 976, -1737, 1080, -2420, -3644, 3960, 5217, -1833, -1929, -944, -4668, -1361, 5861, 2538, -2197, -1042, -2724, -4299, 2263, 6876, 1752, -988, -914, -4116, -2968, 3911, 5194, 1426, -492, -2968, -4756, -1243, 2972, 3311, 1833, -1338, -4326, -2786, 612, 1704, 3456, 2656, -2405, -3843, 295, 1281, 556, 3952, 1829, -4720, -2680, 2255, -45, 5]
1141EL512m641m913N406L178l309K403J499o613r02O755m03j603L497k418o658
1157e205K825M811j973R29K495n500m157M779J930j304L338k44o032m25L889J67
1173C23J047K614k892l612J073J192M09K513n80l419n00Q98q07K043K377l226
1189e47j629J853o74j10L669k68l957J011J544k119J883L182l172k985K507r90
1205h02j298M092P97m679J1K231k866J111M739j936l430K051K52k552K993K785
1221C499k876j468J653j727m93L015k39k205O52M9k063J933J712j784p1R63j715
1238a165K56K459m76j620J378l64j622J767J120k116q2J214j805k37K425r26j479
1255a273J602m00j915K218J111k536R56J795k395l57L422j349k184K061N68k920
$$ y = [5, 3517, -1124, -6037, -631, 2547, -762, 1641, 3140, -3473, -4375, 2380, 1977, 374, 3871, 1453, -5205, -2380, 2431, 458, 1387, 3882, -1618, -5775, -996, 934, -370, 2968, 2724, -3308, -3733, 156, 323, 1370, 3984, 1092, -2520, -1447, -255, 154, 2667, 2087, -1332, -1832, -934, -1741, 302, 2679, -547, -2176, -323, -997, -1107, 2562, 2294, -1663, -652, 892, -1227, 656, 3838, 666, -2319, 188, -802, -2100, 1992, 2789, -1890, -1879, 352, -2514, -1403, 3336, 1400, -2030, 21, 273, -2279, 714, 3499, 623, -845, 808, -919, -1412, 1603, 1364, -841, -189, -140, -2203, -270, 1442, -342, -413, 550, -1165, -909, 1550, 1074, -546, 832, 468, -1154, 613, 1733, -383, -465, 749, -1056, -1293, 1132, 206, -1273, 329, -71, -1986, 232, 1343, -1193, -237, 1558, -837, -1194, 2228, 879, -1305, 756, 1324, -1596]
1271a596J329K026k752n42K778j499j443K415q1k166J453J010j577P98J529j961
1287b79o17K172j128q70K217n26k788J250J087j566Q29J893k229j355K181m98
1303b27q15K365O8k583P79J011j144J018J898k181j262J210m49m96K155r3k588
1320a334L28P77j339J288K284j675j856J470l18o18K481R09k550o40Q33j145Q51
1337b54K670j372k115M15l63r13K358J193j944m26K80j270J021K863p96j528K26
1354D5o78r74K327J826j711q09k78j663M48K702L78j605l05p10j337J945K160
1371A761n31q51l14j739K73K469R03o58l80j327j713J490K058p13r1l04k368o09
1389b644K699Q55k43J57j049k004R07K652J98l38n2j894j122J694J425P5r6j250
$$ y = [-1596, -267, 1759, -993, -1535, 1243, -256, -1699, 716, 635, -1531, -78, 932, -645, 153, 1682, -279, -896, 1276, 148, -722, 1495, 969, -1819, -569, 518, -1048, -219, 1674, -555, -1910, 271, -227, -1042, 1323, 1391, -1192, -413, 598, -546, 472, 2370, 189, -1073, 137, -312, -808, 1347, 1254, -1334, -1006, -229, -1568, -280, 2004, 329, -1527, -57, -375, -993, 1488, 2397, -153, -793, 40, -1105, -254, 2416, 1044, -1071, -656, -1019, -1932, 426, 1619, -325, -751, -471, -1741, -720, 2143, 1347, -181, 45, -633, -1607, 720, 2546, 835, 26, -252, -1915, -1467, 1235, 1613, 8, -297, -1007, -2344, -399, 1761, 1230, 379, 65, -1674, -1401, 1068, 1971, 1313, 933, -394, -2107, -617, 1441, 728, 637, 333, -2035, -2644, 55, 910, 667, 824, -225, -2229, -1322, 1330, 1528, 1190, 1138, -756, -1878, -184, 1241, 1316, 1220, -30]
1407c0j891P3J674P33N38l56j624j310J133J549O14N40q58j665m82J075J068Q95
1425A676P9j596j726K25P32J221Q93j050j697k28K99N36J776O79j524j404J91
1442i18K76R20J789j49k190j062P16K90P77J339r26k208n40Q73O77R73P37j020
1460C54j585N0P76Q03J075J05j017j804K28R58P05P90m77j393r73K73Q60O27O40
1479I95n23j450p23J254P56L05M90l08j544m21J632L59j84K63o33j263R7J120
1497B22K54l26K3n46j005L33J294O55m19m81k06o06M89J255N40j092n08k20l74
1516g18K70J529J2j337o02K21o29O61J766o21j238O26k36q34J487J358j150j045
1534d80R27m73q30J326R91k000j37J101j120m42J762n1j580M87N79r75N95J398
$$ y = [-30, -1921, -1848, -174, 559, 1097, 741, -883, -2193, -1060, 489, 1103, 1643, 785, -880, -1362, -287, 781, 1676, 1755, 159, -1567, -1342, -610, 611, 1504, 454, -1243, -1471, -1172, -636, 1140, 1819, 295, -1109, -918, -642, 278, 2067, 1918, -272, -1334, -618, -328, 449, 1788, 862, -1346, -1886, -1013, -336, 637, 1374, 354, -1231, -1181, -405, 398, 1473, 1578, 561, -1243, -1015, -57, 648, 1438, 961, -432, -1405, -1132, -272, 355, 995, 472, -978, -1701, -447, 309, 614, 1104, 796, -748, -1169, 463, 822, 638, 901, 268, -995, -898, 222, 476, 150, 173, -373, -1378, -1045, 249, 904, 485, 4, -202, -808, -319, 936, 1476, 384, -124, -344, -718, -448, 1081, 1093, -244, -846, -625, -1254, -593, 1173, 552, -686, -60, -296, -1130, 357, 1715, 565, -480, 447, -26, -856, 470, 1461, -539, -676, 425, -695, -1137, 625, 574, -1006, -519, 60, -915, -320, 1078]
1552A078n80j072M31L07j81O81J95m18r43j7J35O77J34m89Q7m86o38P79R92n45
1572A27K92K12j111l45J400J84r09Q59Nj573L03J501j212o55J735p93j479J413
1590d6N92j662M50J701j337o14J945j86k041J396Q40j664O39J277j020j101J177
1607C46k11j019P99N74r99j00P28p57J66R41j13l39L33k86l68P04J91k89N3j9
1627C35p38N44N0p52K15N29p79L39P35n17p44J155k42r99J291Q16j806K12J085
1646G29j035k06J800k59j897Q65J51j412O77J499r75o35P84m42q01J298P66j122
1664b15J45Q00j180J35J238k25o63M37l66o12N91M05r07K57r2k43j16Q38j95p4
1684d2J94n32N1Q94Q7n20O67o55q33Q34Q86q58k58P00j313r14J571N72p97O92
$$ y = [1078, 498, -574, -143, 164, -17, 664, 859, 441, -502, -519, -384, 293, 427, -62, 25, -461, -1099, -320, 672, 127, 419, 631, -480, -825, 575, 759, -150, 709, 714, -859, -556, 945, -267, -922, 813, 20, -1459, -46, 546, -1116, -666, 1035, -302, -916, 1029, 843, -1198, 198, 1038, -626, 13, 1290, 270, -831, 346, 135, -884, -85, 489, -510, -610, 118, -639, -473, 468, 355, 16, 349, 63, -305, 399, 590, 301, 354, 335, -403, 141, 191, -561, -346, 183, -596, -257, 478, -39, -783, 372, 130, -869, 422, 1238, -568, -356, 729, -306, -512, 1288, 1029, -868, -3, 148, -1264, -587, 912, -63, -698, 86, -356, -1157, 141, 907, -215, -70, 730, -450, -315, 923, 698, 35, 472, 106, -506, 85, 490, -417, -160, -252, -495, -611, 227, 32, -42, 152, -380, -329, 565, 652, 132, 799, 144, -689, 145, 1031, 173, -85, 615, -698, -1612, -41, 531, -266, 426]
1704D26K91j973J13J910k87o15J158p47j216R02O51q46N46N18j366m68J343p4
1722B66p76R16k44j412O50J124n32K89L41o94n01P43N74k94L66l58p97j48N15
1741B8J96P0L25j287k31O40k2Q6O91j63j127L97L88p5N24Q27j114p93O64k7l40
1762c43Q65J80j535m4P51m86N24P14n99p44M00J67j48P45O06j144l30N93k64K50
1782A58R74o66r95L54Om16N39O99p88o62N22j85J42R05j58m62R0j76l24R22M61
1803I40o90k60O9m55J87R35j60r62K63j85n46Q14P68p33j66M98p53M7R62N2m14
1824B11O6j81m82N04N91l20n39Jm55l48J157K15p32K48k12l40L55P95l35l07M11
1845C03l20m46O95L77n04L50k68q20L14M90l6l26K0k82j55O59J99k28K52j65n10
$$ y = [426, 717, -1256, -1143, 767, 480, -135, 1023, 276, -940, -38, 613, -233, 313, 831, -535, -1003, 340, 266, -510, 406, 162, -1250, -600, 524, -8, 281, 622, -72, -573, 170, 744, 450, 816, 458, -339, -487, 28, 224, 294, 619, -668, -899, -259, -281, -195, 496, 333, -794, -397, -9, -84, 440, 1267, 153, -640, 24, -3, -343, 522, 702, -833, -877, -126, -612, -88, 626, 27, -717, -317, -150, -298, 447, 1053, -91, -421, 172, -92, 158, 1132, 466, -529, -175, -169, -585, -46, 653, -135, -797, -275, -460, -318, 587, 429, -33, 57, -119, -443, 479, 940, 250, -10, 59, -396, -209, 726, 566, -396, -133, -318, -864, -50, 718, -15, -181, 317, -436, -389, 573, 625, 211, 277, 96, -386, 118, 709, 389, -150, -149, -604, -952, 205, 420, -312, -64, -276, -616, -261, 534, 199, -108, 303, -17, -463, 232, 609, 105, 455, 187, -633, -319, 171, 135, -191, -171, -453, -608, 51, 250, 22, 274, 109, -401]
1866d01M43M21k9l24K75l60l06L77K8k18K64rp06J60L26k8p6J18j7k16K60L96
1888C78j71K19J53o57j00M02p1m4K50l62l71o4L35k07K44l0k77o1L26p0L11K87
1910D20k09l60Q6M48L9j65K14n99J8K94k95r0L49k52l19R0J52j09M14j8n46M47
1932IJ01j01O6O40l92l72K49M2l59L54o0j88l47M55j50j72L11Mm33Q4K85m3Q2
1955F5L07j96l40K12K31j81K06L2l23k43J74k62PL03k5j90K4j47L91m6J0K81j22
1978A68k48M57j06j17j15J19j62k54K59L06m52J00rl52m7M44L0j25Q7Qj09j75
2000b93O22J16m27L17n6l69j37N36k50j57N7j72l0K06J60r9k3k05L74o66N35L73
2022D12k2k91k80L38j61k8N26k65k98J75J24o32M54j9k44j07K41N9n17P14K10
$$ y = [-401, 42, 463, 434, 110, 385, 25, -281, 96, 124, -94, 170, 161, -545, -385, -59, -87, -163, -45, -62, -278, -18, 378, 207, 426, 579, -78, -178, 224, 153, 109, 359, -3, -374, -438, -103, -310, -66, -96, -373, -434, -108, -178, 133, 420, 211, -149, -63, 385, 424, 259, 473, -126, -108, 186, -109, -199, 150, -102, -421, -331, -179, -288, 126, 108, -438, 9, 110, 9, 75, 715, 323, -49, 200, 242, -117, 237, 177, -11, -358, 97, -53, -225, 86, 90, -343, -259, 26, -17, 65, 372, 176, -164, 48, 279, 98, 304, 336, 13, -230, -56, -318, -311, -8, -33, -223, -199, -346, 45, -1, 9, 290, 168, -80, 377, 271, 154, 39, 158, -4, -258, 1, 307, -145, -45, -54, -406, -453, -9, 21, -104, -17, -9, -118, -293, 329, 445, 18, 335, 279, -90, -227, 309, 59, -98, -41, -213, -243, -37, 123, 24, 1, -204, 170, -496, 39, 412, 390, 99, -181, 157, -4, -32, 494, 229, -69, 106, 230, -402, 52, 33, -211, -318, -77, -18, -535, 179, 389]
2043C89m96L4N30m45K02L38k07k62O9K2k85j63L82q0m35L56L4l67M72J66l08k93
2065c47K58M46l20J67L00j38o56L55J39k79M4L60l42n22L53K58m69J2P34l45k77
2086b69L87lk59J80O61n08k05J17J37l78L18kn19J34L71l77j52M14J33p13K79
2107b54M61m25QN10j01k42L26J49l78J22K83m34k67R7J81q0K4q0M5l82K73L20
2129A56j0j18L2J50k07j16M98q0l32M13j77n80K76K93k44j77N18k97n35L07M27
2150A97k68KL64l88k10P57J2l64p2M19o32J39O34l70m03K60M1n55P6O01k18m54
2172d32K32K23k63J71P7R2o4K02qk48J36K01L3n69O3j06K56j6J12m8l94J06J63
2195h1k99J70L20J6l87L54j09L5J37N2J54l44L00k20j37L3R9l92L5L67l16j62
$$ y = [389, -107, -73, 457, 12, 214, 552, 345, 83, 152, 174, -111, -274, 108, 28, -407, -51, -17, -384, 88, 254, -54, -347, -89, 357, 37, 204, 504, 366, -290, 65, 204, -75, -31, 329, -13, -535, -182, 76, -393, -381, 353, 8, -269, 118, 115, -144, 36, 697, 189, -16, 101, 238, -140, 178, 176, -343, -209, 162, -215, -367, 47, 180, -533, -254, 207, -218, -210, 300, 199, -43, 283, 432, 54, 176, 459, 25, -242, -145, 36, -44, -20, -100, -55, -437, -164, 156, 146, 28, 60, 210, 3, -113, 385, 305, -27, 386, 209, -371, -95, 198, -46, -223, 295, -2, -537, -230, 197, -71, -69, 295, -93, -303, 454, 466, 102, 30, 449, -183, -44, 590, 220, -183, 77, 118, -437, -361, 240, 22, -432, -200, 23, -240, -69, 8, 100, 36, 238, 230, -18, 118, 319, 352, -217, -154, -260, -4, -20, 92, 44, -350, -244, -81, -380, -210, 110, 126, -261, 93, -16, 19, 156, 208, 362, 18, 318, 98, -39, -6, 93, -299, -264, 103, -213, -375]
2217c75M53J18m58J69K86j83r5L13Pk13R7p3j13O6K81k09k95K05N6j85J64m7k4
2240e5j43q7K70j25N24j43j11o6k33M48k09P8J61k33k14j30J22k10K68p2J51k33
2262b42J12L9m8k8K39J71l57K20J03N3k7j4k11j41J05P5j30L5P5p4l51L08L9O
2286d3J8M8k35J77M3L09m04M06nk84j32J70j38r8L16k85l7J59j78NK3L67l25k65
2310c88K95K52k15L23J21j95p3k0K9J17r4k71P3j20k95L80j19m9K10Q2l76L07
2332b6pm9K30q9k9q0J62oL5P0j06j52j4L4J94l92K5M4m0o7Q8K42j9kj37O1nK94
2360B59k0nJ36n43o4M26nm5m3k02j34j73K18J60J44M5j65j22J86J51J3l9Q0l65
2384a07J81R8j78K14J47j72l63o0q6L96m3J00k99j70Q9L70J15J24j78k47L2p6
$$ y = [-375, 78, 196, -262, -93, 193, 10, -85, 228, 235, 22, 119, 46, -67, -1, 280, 71, -224, -19, 37, -148, 16, -31, -55, -198, -285, -15, -140, 384, 241, 130, 64, -169, 279, 70, 148, 309, 76, -138, -268, -146, -356, -88, -160, -9, -242, -130, -91, -139, -167, 72, 243, -114, 106, 209, 262, 235, 221, 10, -131, -26, 49, -81, -46, 29, -45, -396, -88, -49, -43, -25, 23, -212, -35, 8, 317, -87, 319, 314, 30, -102, 68, -70, -168, 148, -137, -174, -15, -193, -188, -165, 202, -123, -388, -93, 159, -56, 267, 388, 193, 120, 100, 129, 246, 152, -119, -46, -166, -461, -81, -200, -249, -39, 43, -333, -26, -33, -82, 148, 59, 30, -50, 112, 106, 141, 211, 105, -47, -61, -27, 167, -225, -200, -156, -196, -263, -175, 67, 48, 46, -91, -30, -35, 259, 239, 234, 370, -173, -237, 189, 184, 139, 96, -106, -240, -413, -195, -35, 109, 154, -11, -133, 53, 204, 217, 178, 258, -107, 74, 172, -6, 208, 355, 183, -180, -240, -326, 70, 27, 127, -172, -342, -253, 117, 232, 356, 178, -69, -37, -113]
2406a13J72L28j79k96Mj84P5K56j52K27m83J70J20j74J31K15j05o5P5j39K54P2
2428B09J52j17l54j50J98J03P0Q4k72k18M5l04N40L91q9k95l32R7K95O3K70m8
2450C38l10j95J38p8M0L60K4m47k89K96K10L1J33k59k11k9K14K49K07r6j84k53
2472a11j8M76M2l06r2j46l21J46N27l5j47J35m15j35K43L30k83K86j54k54L3K41
2494D2J39m2J97l66k26J04K88J74k15k62j45j59K70K36L69k13k11k06M1O9N67
2515D51j03l22J63n0k65N2L89j1l39p9P4k36J12M70J68n02m45L30j79K93N24k94
2537B01k57J2K41k73L43K24k86o09J30L65m01N39j32k83L8q4r2J18N16O0l16k0
2559C4j83L57k00M48k33j81k44J88m0J56O0r4k88o3J50J61k5J13Qn55K42J37K05
$$ y = [-113, 59, 387, 208, -88, -84, -268, -193, 63, -89, 138, -345, -175, -55, -229, -98, 117, 12, -53, 22, -117, 137, 209, 361, 244, -110, -260, -62, 41, 111, 195, -77, -295, -250, -554, -14, 377, 288, -7, -339, -242, 53, 116, 386, 338, 28, -167, -29, -107, -67, 293, 317, -130, -419, -123, 87, 118, 251, -8, -219, -248, -34, 215, 422, 326, 142, -111, -129, 347, 389, 83, -9, -155, -476, -330, 197, 162, 15, 150, -265, -400, -157, 173, -110, 176, 22, -232, -199, 42, 181, 139, 336, -30, -256, -152, 136, 310, 95, -167, -312, -471, -201, 35, 404, 191, -20, -226, -185, -116, 451, 348, 26, 189, 139, -126, -74, 315, 304, -35, -114, -40, -276, -164, 306, 474, -28, -473, -143, -322, -29, 495, 201, -56, -44, 197, -76, 267, 491, 205, -404, -274, 91, -310, 229, 97, -186, -148, -232, -324, -206, 310, 370, 54, 34, -149, 208, 8, 456, 223, 42, -202, -14, -54, 102, 162, 68, -220, -283, -133, 28, 3, 116, 124, -431, -189, -52, 153]
2582A53r4K50p4l60j35M67k31J94J29k88l85L23M7k41J60J96J65o10J87L80j67
2603F6L4J10k58l6J06L03k93P2J10l06l00L14P2j22m4K63k27N0M5J97j51L1j56
2626a20m4L11J6J24n59L57N2k03j75J95J3j43J45L4k81l1L33r7J36J29j0l03K6
2649i5M70k27n5K6M6l61kJ78J6M1Pk9k42j2L70j75j05L28k49L5M3K27n5j57J16
2674A39J57m71K85n7r0j3J26j99j69K90J18k08J91J76m39J59N5J74j80J14J24
2695B82m36J99M0J62k74J59j86j01o0L58M6k53K01k62J07j77L16J69Rk27k03N2
2717g9j6M98k29r5k07O8j21R3J53J28k95J09j0l43J83K61k4k55K70r5j7K44J31
2740C52k65j78J42m2j36K71J59m07q2k00K64j48N05j49j52j24k10J02M13K73o6
$$ y = [153, 59, 309, 235, -125, -260, 207, -24, 170, 299, 11, -374, -51, -4, -245, -85, 111, 276, -334, -147, 233, 66, 100, 210, -48, -84, 22, 325, 32, 104, 214, -92, -392, -78, -6, -128, -172, 91, -136, -86, -41, 156, 5, 36, -120, -164, 147, 163, 287, -272, 85, 137, -66, -241, -46, -33, -176, -31, 3, -278, -309, 24, -73, 63, 192, 182, -121, -95, 375, 148, 93, 119, 165, -196, -198, -20, -4, 37, 44, 15, -227, -239, 131, -44, -149, 179, -70, -35, 8, 235, 180, 23, 139, 296, -175, 110, 53, -37, -50, 76, -123, -292, -2, 116, -92, 99, 275, -164, -5, 50, 224, 44, 158, 282, -154, 45, 85, 247, -27, 132, -54, -155, -215, 143, 189, -64, 137, -125, -18, -195, 121, 290, 299, 72, -131, -79, -95, 403, 174, 79, -128, -60, -181, -88, 65, 193, -102, 7, -3, -346, -163, 98, 74, -181, 89, -6, -23, 221, 352, 87, -91, 51, 9, -127, 144, 303, -104, -186, -386, -122, -270, 235, 86, -66, -190, -400, -298, 115, 388, 322]
2761C22k22q5k76L5L61P2o9l03k4r5L97QJ16l24r6k08k5L94K09K40k89l19k07
2784c88K84M21P9N2k59m61J97K93m7M5lm88j98N7L46K13o1J0k39k80L70J49L98
2807D90q5k74l18j28K43N9L25l48j29q7n7L95l9K04P7n42p5K29K32J45K48n51
2829A4k15L1J25J85K28M0n26n1r8K17K75O4k64k52j37J79J78K04K10k67k56j59
2851b75J73L37J4L4k15l75LJ55M06K2j86k37k46L2M36M43n8l97l4j42J7L31K66
2874E04k47k42j96n3L49J42K00j40k84m27J75K38J62m5O1l56j68J08K71L25j82
2895A95Q4k89k20J69K01L0J60k77m37M0Q2L84j03J01m36j5Q2L90L2O7p1k73l20
2918d24K42L65k73L63l9m64j8J69K84k90K57j68k31K6J03R5M6J29j84k72K30K48
$$ y = [322, 100, 15, -261, -226, 135, 207, 138, -165, -189, -284, 113, 121, 237, -87, -183, -391, -416, -22, 187, 427, 138, -181, -388, -104, 317, 396, 448, 189, -272, -75, 218, 171, 216, 213, -275, -473, -416, -70, 143, 82, 92, -147, -427, -57, 92, 490, 405, 131, -187, -315, -72, -13, 312, -36, -165, -252, -309, 86, 47, 251, 328, -214, -289, -60, 172, 317, 565, 14, -201, -170, -45, 140, 368, 408, -118, -169, -267, -50, 225, 289, 25, -227, -364, -185, -7, 197, 407, 140, -116, -275, -102, 235, 249, 283, 68, -307, -304, -149, 257, 279, 93, -144, -390, -358, 78, 521, 463, 66, 32, -110, -93, 238, 504, 257, 15, -181, -234, 115, 257, 457, 317, 33, -394, -219, 19, 181, 136, 197, -159, -327, -219, 52, 377, 195, 279, -10, -230, -61, 140, 170, 330, 53, -384, -344, -262, 122, 19, 120, -316, -331, -249, 141, 173, 240, 169, -104, -424, -182, 183, -90, 273, 234, -230, -248, -79, 205, -85, 172, 4, -227, -201, -98, -3, 43, 172, -12, -284, -54, 194]
2940A94j92K24M9l33k4L9K20R3j60k76j06O4j12M55M7j60k51R2J48J61N7o9K0
2963A80j71Q0o9n5J93k4j23p9o0j02K3J73k9M2O0j52L4L3R4j6RJ32k90k5K35n9
2989C4K66k00n5l69K77J34j31m4J89k25O1m0M2J06r4J75P1k17o6L24k6m6Km5l97
3014b74M1Q1J52J20q0j47k08J68J07L17m10J51q7j33K08J17J23l3j16j22J28o7
3036C6J74Q6l59K43k67k58N14j01Ok47r8J11P1M45j31J09l54k25Q2P9K32Q2k34
3059dm4k55J59%K23N3k93m6j58J03L61N7K14l57j20O2M7p9M52R7m47l77J47oM58
3084B47O4p3m21j71L21L2J97l6kk63q0R4J73N4K62l72l92K83m2L62O4j16l52m3
3108b10l08M17L47p6l6m08P1K40N8L36O9l37m53K9J00L24J50l4j30m50p6K75K96
$$ y = [194, 2, 226, 275, -58, -82, -43, 177, 270, 110, -166, -272, -208, -320, 135, 182, 22, -229, -137, 11, 172, 229, 160, 180, 9, 89, 20, -35, 158, 134, 11, -68, -128, -230, -207, -34, -63, -21, 39, -113, -79, -46, 48, 32, 41, 173, -117, -142, 93, 34, 300, 100, 45, -324, -47, 87, -44, -88, 101, -124, -63, -103, -61, 45, -49, 126, 197, -20, -86, 238, 212, 166, 168, 123, -274, -233, -152, 0, 120, 40, -107, -315, -147, -40, 277, -133, 18, -69, -202, 6, 123, 246, 213, 97, -25, 103, 36, 210, 296, -63, 180, -87, -345, 169, 68, 74, -173, -271, -160, -89, 356, 225, 334, -20, -245, -163, -84, 148, 230, -4, -48, -303, -144, -144, 79, 132, -161, -207, -365, -262, 99, 156, 370, 13, -107, -45, 2, -77, 375, 472, 25, -352, -205, -211, 247, 311, 238, -183, -354, -33, -1, 196, 160, 158, -105, -185, -91, 82, 136, 398, 26, -366, -83, -125, 237, 301, 185, -167, -210, -518, -101, 246, 170, 134, -274, -203, 37, 95, 431, 500, 163, -290, -261, -161, 163, 313, 279, 149, -301, -377, -102, 194]
3131A94rK00l34m73Q8K91L35J02j91l58K1o0N62j21O9l39j79k72K45L52J37q1
3153A79l31k00M1K67K75J52l93L1l63M3L80M49l31l11lj30j44O35o6p8j18l40
3175c56j94K99N31n7k22m5k57J99K1N12j3l92q0q4Q7R2K58l3j91l98m9K49L01
3198A78K05j55l64j61J07j62M73L75j61l58r6J26J57K84j53j67m43J00K65J05
3218A55J66j32l88j53M7M18j66N41k85m33j76M82M0J16j31M9k25r1J60K1J47n7
$$ y = [194, 185, 385, 51, -422, -334, -43, 292, 394, 203, -155, -134, -194, 368, 247, 316, -23, -202, -474, -229, 123, 260, 179, -152, -352, -311, -44, 231, 383, -10, 21, -342, -299, 81, 530, 199, -112, -115, -245, -389, 246, 180, 102, -16, -356, -550, -251, 280, 223, 1, -44, -301, -102, -81, 431, 418, 26, -54, -138, -51, 41, 299, 266, 75, -323, -372, -123, 178, 383, 228, -136, -297, -190, -352, 121, 496, 335, -23, -119, 7, 164, 448, 295, 128, -315, -215, 50, 155, 321, 189, -199, -352, -305, 113, -53, 488, 203, -230, -406, 76, 116, 232, 101, 150, -75, -166, -6, 15, 162, 105]
$$ [...]
8191A18
##END NTUPLES=NMR FID
##END=
