##TITLE=1H_E3d2512-2.1
 CDCl3
 8 sc, 
 26.12.2023
##JCAMPDX= 6.0         $$ Bruker NMR JCAMP-DX V2.0
##DATA TYPE= NMR FID
##DATA CLASS= NTUPLES
##ORIGIN= UXNMR, Bruker Analytische Messtechnik GmbH
##OWNER= root
$$ XWIN-NMR		Version 3.5
$$ Tue Dec 26 14:55:26 2023 Russian Standard Time (UT+4h)  she@DPX200
##.OBSERVE FREQUENCY= 200.1313
##.OBSERVE NUCLEUS= ^1H
##.DELAY= (6, 6)
##.ACQUISITION MODE= SIMULTANEOUS
##.ACQUISITION SCHEME= undefined
##.AVERAGES= 8
##.DIGITISER RES= 18
##SPECTROMETER/DATA SYSTEM= spect
##.PULSE SEQUENCE= zg30
##.SOLVENT NAME= CDCl3
##.SHIFT REFERENCE= (INTERNAL, CDCl3, 0, 15.7039)
##AUDIT TRAIL= $$ (NUMBER, WHEN, WHO, WHERE, WHAT)
$$ ##TITLE= Audit trail, XWIN-NMR		Version 3.5
$$ ##JCAMPDX= 5.01
$$ ##ORIGIN= Bruker BioSpin GmbH
$$ ##OWNER= she
$$ F:/spectra/data/she/nmr/H-F/1/audita.txt
$$ ##AUDIT TRAIL=  $$ (NUMBER, WHEN, WHO, WHERE, WHAT)
(   1,<2023-12-26 14:54:03.54 +0400>,<she>,<DPX200>,
      <created by zg, POWCHK disabled, PULCHK disabled
       configuration hash MD5:
       00 E9 B6 7A A2 85 ED C7 34 08 36 98 17 FE 4E 26
       data hash MD5: 16K
       52 CA B5 2A 0F 00 BA 15 94 25 6E 73 1B 65 7F 5B>)
$$ ##END=
$$ 
$$ hash MD5
$$ 14 F3 CF 5E E3 40 B1 20 CC 7A 4D FE 39 66 7F E9
##$RELAX= 
##$RELAX= 
##$RELAX= 
##$RELAX= 
##$RELAX= 
##$RELAX= 
$$ Bruker specific parameters
$$ --------------------------
##$DU= <F:/spectra>
##$EXPNO= 1
##$NAME= <H-F>
##$PROCNO= 1
##$TYPE= <nmr>
##$USER= <she>
##$AMP= (0..31)
100 100 100 100 100 100 100 100 100 100 100 100 100 100 100 100 100 100 
100 100 100 100 100 100 100 100 100 100 100 100 100 100 
##$AQSEQ= 0
##$AQ_mod= 1
##$AUNM= <au_zg>
##$AUTOPOS= <>
##$BF1= 200.13
##$BF2= 200.13
##$BF3= 200.13
##$BF4= 200.13
##$BF5= 200.13
##$BF6= 200.13
##$BF7= 200.13
##$BF8= 200.13
##$BYTORDA= 1
##$CFDGTYP= 0
##$CFRGTYP= 5
##$CHEMSTR= <none>
##$CNST= (0..31)
1 1 145 1 1 1 1 1 1 1 1 1 1 1 1 1 1 1 1 1 1 1 1 1 1 1 1 1 1 1 1 1 
##$CPDPRG= <>
##$CPDPRG1= <>
##$CPDPRG2= <>
##$CPDPRG3= <>
##$CPDPRG4= <mlev>
##$CPDPRG5= <mlev>
##$CPDPRG6= <mlev>
##$CPDPRG7= <mlev>
##$CPDPRG8= <mlev>
##$CPDPRGB= <>
##$CPDPRGT= <>
##$D= (0..31)
0 1.2 0 0 0 0 0 0 0 0.06 0 0.03 0 0 0 0 0.0002 0 0 0 0 0 0 0 0 0 0 0 0 
0 0 0 
##$DATE= 1703588042
##$DBL= (0..7)
120 120 120 120 120 120 120 120 
##$DBP= (0..7)
150 150 150 150 150 150 150 150 
##$DBP07= 0
##$DBPNAM0= <>
##$DBPNAM1= <>
##$DBPNAM2= <>
##$DBPNAM3= <>
##$DBPNAM4= <>
##$DBPNAM5= <>
##$DBPNAM6= <>
##$DBPNAM7= <>
##$DBPOAL= (0..7)
0.5 0.5 0.5 0.5 0.5 0.5 0.5 0.5 
##$DBPOFFS= (0..7)
0 0 0 0 0 0 0 0 
##$DE= 6
##$DECBNUC= <off>
##$DECIM= 32
##$DECNUC= <off>
##$DECSTAT= 4
##$DIGMOD= 1
##$DIGTYP= 9
##$DL= (0..7)
0 120 120 120 120 120 120 120 
##$DP= (0..7)
150 150 150 150 150 150 150 150 
##$DP07= 0
##$DPNAME0= <>
##$DPNAME1= <>
##$DPNAME2= <>
##$DPNAME3= <>
##$DPNAME4= <>
##$DPNAME5= <>
##$DPNAME6= <>
##$DPNAME7= <>
##$DPOAL= (0..7)
0.5 0.5 0.5 0.5 0.5 0.5 0.5 0.5 
##$DPOFFS= (0..7)
0 0 0 0 0 0 0 0 
##$DQDMODE= 0
##$DR= 18
##$DS= 0
##$DSLIST= <SSSSSSSSSSSSSSS>
$$ [...]
##$SUBNAM2= <"">
##$SUBNAM3= <"">
##$SUBNAM4= <"">
##$SUBNAM5= <"">
##$SUBNAM6= <"">
##$SUBNAM7= <"">
##$SUBNAM8= <"">
##$SUBNAM9= <"">
##$SW= 18.0517328524113
##$SWIBOX= (0..15)
0 0 2 0 0 0 0 0 0 0 0 0 0 0 0 0 
##$SW_h= 3612.71676300578
##$TD= 16384
##$TD0= 1
##$TE= 0
##$TE2= 300
##$TE3= 300
##$TEG= 300
##$TL= (0..7)
0 120 120 120 120 120 120 120 
##$TP= (0..7)
150 150 150 150 150 150 150 150 
##$TP07= 0
##$TPNAME0= <>
##$TPNAME1= <>
##$TPNAME2= <>
##$TPNAME3= <>
##$TPNAME4= <>
##$TPNAME5= <>
##$TPNAME6= <>
##$TPNAME7= <>
##$TPOAL= (0..7)
0.5 0.5 0.5 0.5 0.5 0.5 0.5 0.5 
##$TPOFFS= (0..7)
0 0 0 0 0 0 0 0 
##$TUNHIN= 0
##$TUNHOUT= 0
##$TUNXOUT= 0
##$USERA1= <user>
##$USERA2= <user>
##$USERA3= <user>
##$USERA4= <user>
##$USERA5= <user>
##$V9= 5
##$VALIST= <valist>
##$VCLIST= <CCCCCCCCCCCCCCC>
##$VD= 0
##$VDLIST= <DDDDDDDDDDDDDDD>
##$VPLIST= <PPPPPPPPPPPPPPP>
##$VTLIST= <TTTTTTTTTTTTTTT>
##$WBST= 1024
##$WBSW= 4
##$XGAIN= (0..3)
0 0 0 0 
##$XL= 0
##$YL= 0
##$YMAX_a= 207012
##$YMIN_a= -269989
##$ZGOPTNS= <>
##$ZL1= 120
##$ZL2= 120
##$ZL3= 120
##$ZL4= 120
##$ABSF1= 10
##$ABSF2= 0
##$ABSG= 5
##$ABSL= 3
##$ALPHA= 0
##$AQORDER= 0
##$ASSFAC= 0
##$ASSFACI= 0
##$ASSFACX= 0
##$ASSWID= 0
##$AUNMP= <proc_1d>
##$AZFE= 0.1
##$AZFW= 0.1
##$BCFW= 1
##$BC_mod= 2
##$BYTORDP= 1
##$COROFFS= 0
##$CY= 11.3945322036743
##$DATMOD= 1
##$DC= 2
##$DFILT= <>
##$DTYPP= 0
##$F1P= 15.7292609196834
##$F2P= 12.9074282941183
##$FCOR= 0.5
##$FTSIZE= 0
##$FT_mod= 4
##$GAMMA= 1
##$GB= 0.15
##$INTBC= 1
##$INTSCL= 1
##$ISEN= 128
##$LB= 0.24
##$LEV0= 0
##$LPBIN= 0
##$MAXI= 10000
##$MC2= 0
##$MEAN= 0
##$ME_mod= 0
##$MI= 1.114404
##$NCOEF= 0
##$NC_proc= 0
##$NLEV= 6
##$NOISF1= 3.799351
##$NOISF2= 2.8
##$NSP= 1
##$NTH_PI= 0
##$NZP= 0
##$OFFSET= 15.70392
##$PC= 1
##$PHC0= -24594.25
##$PHC1= 13.25273
##$PH_mod= 1
##$PKNL= yes
##$PPARMOD= 0
##$PSCAL= 0
##$PSIGN= 0
##$REVERSE= no
##$SF= 200.130013532006
##$SI= 16384
##$SIGF1= 3
##$SIGF2= 2
##$SINO= 400
##$SIOLD= 16384
##$SREGLST= <1H.CDCl3>
##$SSB= 0
##$STSI= 0
##$STSR= 0
##$SW_p= 3612.71676300578
##$SYMM= 0
##$S_DEV= 0
##$TDeff= 0
##$TDoff= 0
##$TI= <>
##$TILT= no
##$TM1= 0
##$TM2= 0
##$TOPLEV= 0
##$USERP1= <user>
##$USERP2= <user>
##$USERP3= <user>
##$USERP4= <user>
##$USERP5= <user>
##$WDW= 1
##$XDIM= 8192
##$YMAX_p= 0
##$YMIN_p= 0
$$ End of Bruker specific parameters
$$ ---------------------------------
##NTUPLES= NMR FID
##VAR_NAME=  TIME,          FID/REAL,        FID/IMAG
##SYMBOL=    X,             R,               I
##VAR_TYPE=  INDEPENDENT,   DEPENDENT,       DEPENDENT
##VAR_FORM=  AFFN,          ASDF,            ASDF
##VAR_DIM=   8192,          8192,            8192
##UNITS=     SECONDS,       ARBITRARY UNITS, ARBITRARY UNITS
##FACTOR=    0.0002768,     1,               1
##FIRST=     0,             0,               0
##LAST=      2.2672688,     0,               0
##MIN=       0,             -269989,         0
##MAX=       2.2672688,     207012,          0
$$ Real data points
##PAGE= N=1
##DATA TABLE= (X++(R..R)), XYDATA
0 0 0 0 0 0 0 0 0 0 0 0 0 0 0 0 0 0 8 -8 8 -8 8 -8 16 -16 16 -22 24 -28 32 -36 40 -48 53 -60 67 -75 84 -93
38 -93 102 -116 126 -142 157 -173 192 -210 232 -255 280 -309 339 -374 413 -456 507 -564 628 -704
58 -704 797 -906 1039 -1208 1433 -1739 2181 -2872 4075 -6565 13695 -74181 -269989 -14725
72 -14725 48448 -85255 96329 207012 -69321 -152311 16669 -5458 -26795 121083 73060
83 73060 -88236 -53016 -17236 -53940 50496 104472 -25017 -45323 20133 -43463 -33162 86823
95 86823 25951 -83496 -10851 23987 -23057 51430 90299 -31210 -71573 -25299 -39150 13301
107 13301 103551 30794 -50363 -20347 -60653 -72569 86960 118029 -27366 -24855 6258 -111402
119 -111402 -61289 134366 80047 -41158 30424 -5824 -137731 -13530 123659 5679 -32836
130 -32836 53963 -39645 -110093 42494 84990 -25554 -827 31288 -63790 -46331 59354
141 59354 28665 -14146 22503 -13788 -52262 20714 43703 -6631 7384 1906 -58646 -20308
153 -20308 50281 16113 -784 24495 -31719 -64223 13786 40250 5849 25558 11143 -55566
165 -55566 -28839 27005 9133 23085 45787 -29819 -61561 10219 8523 -18623 48489 41854
177 41854 -59708 -35794 32056 -17092 -15820 63112 13164 -61352 1970 27109 -29918 9216
189 9216 53780 -18876 -39887 20608 2425 -23426 26774 19824 -33428 -8301 15800 -15488
201 -15488 2189 29902 -12528 -26022 12730 780 -12649 23944 16982 -23100 -6434 9392
213 9392 -11639 4487 25652 -6193 -16039 6032 -8669 -13997 18956 11029 -16280 2039 5050
226 5050 -20223 1343 22411 -7383 -7154 19408 -6080 -19785 17399 11322 -19810 6310 18649
239 18649 -18156 -9907 18439 -7642 -16527 16599 5519 -18306 6342 9476 -18225 -1126 20222
252 20222 -4340 -7482 13344 -3204 -14841 10404 11007 -7389 3436 4623 -16284 -5630 13248
265 13248 -158 -3835 7662 -6774 -16482 4772 10153 -661 6244 3529 -14733 -6064 11181
278 11181 4400 3880 10828 -7129 -18679 468 8586 1535 8215 4717 -16663 -13937 3540 4013
292 4013 6894 13329 -3484 -19211 -5564 5919 5064 13649 11857 -10907 -16897 -2848 3385 9077
306 9077 15789 1598 -17642 -13606 -2657 2577 13726 14789 -5472 -18371 -10715 -717 9839
319 9839 18906 9940 -9441 -15435 -9370 816 15244 18777 1898 -14825 -16131 -8628 4097 17526
333 17526 14670 -3776 -16862 -16739 -5934 11140 20580 11114 -6861 -16311 -13646 -115 16452
346 16452 20137 6508 -12032 -19943 -12431 5572 18780 16040 188 -16187 -20752 -9285 10482
359 10482 21268 13232 -5846 -18521 -16113 -1807 15999 23255 10365 -10938 -20229 -13688 2251
372 2251 18675 20050 1894 -16503 -19719 -11749 5019 22061 17305 -5430 -18766 -16442 -6604
385 -6604 12205 25382 12781 -9621 -17219 -14317 -3140 17911 24281 3435 -15346 -16652 -13003
398 -13003 829 21442 19298 -4349 -17443 -16543 -9359 9969 24606 12848 -8367 -16193 -15402
411 -15402 -3835 17799 23945 5570 -12433 -18342 -14490 3214 20699 17613 221 -14887 -22381
424 -22381 -12217 10853 20979 13146 -567 -16403 -21209 -3434 16204 17783 11771 -850 -21089
437 -21089 -19342 5768 15747 10140 8689 -4624 -25134 -13887 12034 12505 6300 6328 -10681 -23535
451 -23535 -2027 16996 10102 6949 3276 -17265 -18626 7502 16792 8511 6437 -5503 -23119
464 -23119 -11471 10916 12654 9418 5467 -13709 -23251 -3731 12636 12304 11607 3304 -15811 -17796
478 -17796 -443 11992 14623 9706 -4011 -13927 -11944 -3069 9982 15550 2486 -10118 -8208
491 -8208 -7919 -4923 13124 15672 -6224 -10181 683 -5759 -3695 18491 12436 -13504 -7921 4826
505 4826 -5740 -287 17782 2853 -16790 -5067 1289 -5149 7865 15125 -6352 -13154 -575
518 -575 -2417 -992 16194 10761 -10756 -7542 -12 -5931 3446 18152 4044 -11829 -5109 -3094
532 -3094 -7631 4488 14170 1873 -9377 -5268 -2887 -2795 3188 9055 5540 -4226 -6732 344 2962
547 2962 -1601 2948 8101 -3430 -8588 3832 3144 -7832 362 7117 -6409 -5844 9585 1282
561 1282 -10261 2524 5298 -7877 313 12596 -153 -6724 3769 -1205 -8266 5290 8487
574 8487 -3598 -1330 3239 -8147 -7307 6608 3077 -3883 4583 2797 -8495 -3110 5134 -1348
588 -1348 -1016 8241 3142 -5395 -878 1067 -4080 -1392 6079 4736 -1624 -3839 -2596 -2891 -4407 1384
604 1384 9417 3387 -6961 -2425 1023 -5712 -733 13277 5542 -7607 -831 2144 -7886 -579
618 -579 11874 1290 -7126 965 -1151 -8163 2333 7805 -3425 -3469 2943 -2805 -2556 7328 2723
633 2723 -6282 806 3060 -4171 2636 10029 -2631 -9309 408 926 -3384 5404 8255 -4813 -9837
648 -9837 -2719 -395 1472 8318 6588 -3449 -8044 -4883 235 5820 8274 5235 -2275 -8747 -7201
663 -7201 1497 5755 4604 3454 -2561 -10516 -6581 3995 5302 2753 3375 -2777 -9503 -1828 6787
678 6787 4318 2807 2901 -5740 -8389 2829 7458 1605 1303 -509 -9315 -7082 5516 6806 1527
693 1527 1125 -4091 -10423 -2614 8617 6996 3292 1251 -6729 -9860 978 9512 6563 2732 -1761
708 -1761 -9076 -8558 1683 7845 5962 1428 -5048 -9670 -5338 3644 7801 6327 615 -5654 -7549
723 -7549 -2261 5052 8797 5514 -2392 -7214 -6139 -749 5098 7639 2721 -5821 -8291 -4595 861
738 861 6344 7617 496 -6852 -6280 -1757 2933 8417 7328 -1841 -8027 -5203 -77 4383 7889 4179
754 4179 -5076 -9326 -4823 495 5669 7580 1432 -6964 -7666 -2785 2695 7513 7505 30 -6945 -6207
770 -6207 -1039 4410 7893 5175 -2743 -7388 -5957 -1206 4383 7103 2302 -5035 -7262 -4273 998
785 998 5753 6662 1181 -4895 -5907 -2092 3795 7315 4739 -1379 -5642 -5685 -1512 4440 6378 2091
801 2091 -3422 -6619 -5296 240 5665 5755 772 -3594 -5349 -3463 2504 7437 4955 -413 -3976 -5139
817 -5139 -2155 3533 5801 2651 -1876 -5246 -5508 -977 4150 4287 1165 -2273 -4781 -4102 1382 5461
833 5461 4424 959 -2576 -4446 -1830 3041 4826 2816 -334 -4034 -4988 -1360 2970 3501 1225 -1842
849 -1842 -4545 -3435 461 3569 3448 1657 -1620 -3749 -1583 2294 3714 2794 313 -2338 -3508 -1317
865 -1317 1741 2416 1335 -1309 -3548 -2806 -259 1509 2605 1524 -1368 -2736 -770 1405 2686 2830
881 2830 1429 -1632 -2161 -259 873 1516 1729 -265 -2803 -2415 -326 622 654 776 -271 -1941 -1101
898 -1101 801 1260 1769 1102 -235 -835 -94 531 612 1102 295 -1354 -1344 -14 43 -315 -74 -436 -1118 -553
918 -553 477 301 -55 808 339 -381 606 1386 405 -235 331 530 -553 -314 458 -531 -1428 -519 -33 -153
938 -153 -691 -405 -35 -476 138 1066 1034 -208 199 -38 -255 930 2225 667 -1179 -830 -1018 -1137 914
957 914 2032 -502 -1954 -1388 -1658 -876 2360 2420 -472 -688 -212 -1749 55 4013 2511 -1301 -884
974 -884 -427 -2426 -213 3335 822 -1946 -1116 -1228 -2172 994 2904 22 -1734 -441 -731 -266 2673
991 2673 2938 -7 -1608 -1089 -336 1144 2276 1261 -1112 -2871 -2673 -359 1762 1924 884 -1938
1007 -1938 -3432 -1741 1262 2774 2892 1831 -1797 -4024 -855 2447 2255 2745 1894 -3642 -4998 -79
1023 -79 1777 846 2539 980 -5045 -4092 1699 1589 611 3341 897 -4582 -2054 2932 1590 1040 2426
1040 2426 -986 -3951 -517 2529 1156 893 37 -3408 -3328 622 2181 1687 1108 -1235 -3704 -1716
1056 -1716 1922 3548 3522 860 -2483 -3269 -1378 1439 3796 3109 -765 -3232 -3615 -2465 1241 4234
1072 4234 2032 -1941 -1938 -2477 -2783 2460 5555 733 -1961 48 -1571 -2190 3593 4365 -1765 -2221 47
1089 47 -2334 -1493 4088 2139 -3324 -1780 -255 -1844 942 4409 653 -2999 -836 -237 -333 3485
1105 3485 3823 -664 -2371 -1490 -1961 489 4005 1921 -1762 -2821 -3050 -2157 1857 3317 1388 -501
1121 -501 -2086 -2803 72 2618 2622 1629 255 -2859 -2391 1260 1698 834 1890 -956 -4302 -1014 1994
1138 1994 -18 123 2075 -2087 -3686 1357 2492 -283 1464 1505 -3037 -1869 2987 1844 -376 1617
1154 1617 -632 -4410 -761 2669 535 296 1049 -2842 -3817 488 1802 722 2148 656 -3194 -1742
1170 -1742 1556 1556 1345 2266 -835 -2839 -873 308 401 1616 494 -2078 -1950 -738 -656 1167 2108 -778
1188 -778 -1514 56 55 -22 2558 1584 -1588 -311 929 -1156 426 2419 -591 -2518 -298 -414 -1416
1205 -1416 1504 1686 -1802 -1661 369 -954 27 3104 1171 -1706 312 639 -1370 1134 2558 -544
1221 -544 -1660 164 -790 -1417 1316 976 -1244 -552 33 -1475 161 1792 -63 -313 312 -270 -354 1611
1239 1611 813 -448 439 197 -1256 231 1225 -827 -978 245 -858 -1411 883 545 -944 230 450
1256 450 -937 562 1598 -292 -380 1309 -281 -977 1314 785 -1378 178 471 -1638 -509 1097
1272 1097 -790 -1530 858 46 -1176 811 1170 -754 -53 1270 -132 217 1334 -93 -1003 476
1288 476 91 -742 771 582 -1708 -799 374 -761 -126 1338 -403 -1402 378 293 -400 1357 1378 -773
1306 -773 -402 709 -347 139 1693 64 -1394 -314 -400 -994 368 914 -1068 -923 8 -901 -16 1810
1324 1810 955 -754 284 163 -571 1371 1783 -534 -897 -92 -991 -511 1478 642 -1357 -768 -525 -1125
1342 -1125 508 1824 357 -519 34 -649 -278 1698 1589 -54 -376 -445 -1191 128 1613 326 -586
1359 -586 -658 -1786 -1386 926 1113 -23 174 -341 -1683 -233 1922 1285 496 387 -818 -1401 744 1236
1377 1236 595 310 -524 -1792 -1223 736 622 354 277 -1244 -1669 208 1209 1041 968 242 -1385 -1140
1395 -1140 933 1235 825 836 -438 -1814 -901 655 556 353 -46 -985 -1829 -319 698 975 1104 -56
1413 -56 -1272 -610 556 1163 1391 892 -586 -1247 -434 -17 810 985 -7 -1511 -1284 -494 115 990 929
1432 929 -219 -963 -860 -24 769 1813 822 -627 -538 -575 -67 804 1302 53 -1177 -961 -726 -401 790
1451 790 764 -536 -1122 -580 -148 418 1313 1037 -561 -631 -6 214 773 1131 714 -801 -1273 -273 230
1470 230 372 533 -250 -1283 -1293 -399 334 572 707 47 -904 -630 552 853 886 818 -118 -934 -463 246
1490 246 430 208 212 -967 -1146 -304 52 109 255 13 -604 -345 139 751 582 333 190 -420 -556 401 859
1511 859 333 -455 -674 -553 -670 100 912 -91 -665 -259 -491 -822 684 1302 36 -168 167 -319 -182
1530 -182 1101 1190 -301 -199 -232 -890 -339 622 86 -481 -301 -367 -831 147 884 -123 -260 396 99 -184
1550 -184 663 824 -236 -124 220 -95 49 402 42 -568 -704 -418 -179 4 28 159 37 -550 -314 783
1570 783 616 133 858 122 -585 -143 738 32 82 443 -261 -997 69 109 -774 114 574 -343 -791 695
1590 695 145 -566 735 718 -401 163 1103 -112 -152 841 -155 -636 414 533 -961 -390 92 -595 -504
1609 -504 520 305 -466 93 245 -276 404 546 306 154 224 -139 180 119 81 132 -103 -397 -521 126 -470
1630 -470 -495 276 -94 -445 -82 250 -309 47 477 92 172 744 321 -366 116 187 -748 -99 408 -288 -580
1651 -580 38 -410 -889 315 815 -327 -3 299 -374 -149 822 523 -170 422 -24 -717 -203 583 -30
1670 -30 -174 7 -549 -592 -242 -60 -78 71 -107 -384 32 531 124 325 206 -87 131 527 239 433 281
1691 281 -533 -843 -102 179 -365 144 -53 -1035 -495 409 304 181 651 79 -526 57 710 49 403 683
1711 683 -172 -739 -51 -10 -196 182 69 -825 -465 80 -198 -80 615 90 -617 198 469 253 563 548 -349
1732 -349 -321 249 -221 243 438 -298 -578 -397 -72 -187 403 221 -286 -200 120 -71 383 763 170 -282 -117
1753 -117 210 -170 552 695 -118 -307 -270 -491 -77 435 -84 -691 -264 -263 -410 359 848 280 -163 87 -45
1774 -45 82 733 736 -180 -142 -248 -364 20 405 -69 -558 -117 -478 -611 310 439 3 -2 -49 -338 123 866
1796 866 331 43 -69 -55 -269 394 304 -257 21 -301 -484 -279 203 -55 -232 132 -340 -555 153 506 210
1817 210 151 286 -233 -135 320 349 83 16 -214 -459 -280 5 -66 -70 -203 -445 -513 74 206 254 341 90 -255
1840 -255 -9 399 71 377 322 -335 -297 -90 33 -250 45 -210 -477 -379 43 -6 -46 103 164 -170 65 136
1862 136 81 442 170 -85 13 -168 80 126 120 -377 -272 -265 -343 -242 -93 71 -397 -178 185 -48 57 372 220
1885 220 151 363 127 -47 166 137 -257 -154 76 -286 -185 -3 -8 -350 -180 27 -176 123 227 -53 80
1906 80 -152 191 102 380 139 -149 -295 16 -291 182 -67 -239 -344 -122 -449 -24 261 -175 151 -94 -69
1927 -69 9 430 413 302 320 113 67 57 81 -2 -188 -114 -21 -325 -21 -114 -279 -104 153 -41 -3 296 91 -8
1951 -8 190 327 106 197 185 142 -129 -324 2 -89 -91 -97 -176 -148 -133 -101 -228 -36 51 24 70 -47 220 291 336 259 173
1978 173 -85 -1 84 -143 -122 11 -349 -436 -173 -159 -116 -88 15 -139 -105 76 136 174 194 294 -36 -72 257 160
2002 160 42 65 -117 -69 -327 -48 -10 -140 -90 -61 -171 2 246 -35 161 50 308 -83 81 337 171 175
2024 175 121 -275 -75 -65 -47 -257 -281 -200 -282 -232 -160 163 9 -27 315 -137 -66 245 284 4 240 78 -127 -97
2048 -97 -159 -260 -384 46 -224 -291 -368 -57 -82 -208 101 69 -96 176 477 109 103 29 80 89 74 112 40 -327 -127
2073 -127 -188 -357 -271 -179 136 -256 -174 -1 -70 -140 198 389 -24 185 180 -33 214 255 231 -91 7 93 -316 -265
2097 -265 -108 -32 -154 -152 -124 -281 6 124 63 -22 337 64 -21 138 324 86 -75 113 -129 -375 -8 -16 -119
2120 -119 28 34 -96 -302 113 50 -76 163 105 168 93 304 329 14 -95 186 114 22 18 1 -305 -346 -51 -213
2144 -213 -158 -82 126 -15 -154 288 -96 -17 349 -77 71 124 253 -11 41 244 17 -324 -68 -83 -318 -172
2166 -172 5 -117 -168 -4 -160 45 213 310 186 49 280 139 88 123 -97 -219 -230 -65 -19 76 -188 -106 -125
2189 -125 -210 -57 49 110 -20 50 119 121 114 180 93 116 31 -85 -136 167 -42 -77 24 -27 -285 -330 -84 -98 -131 56
2215 56 86 -135 313 416 306 1 286 160 -205 65 39 64 -120 -32 -93 -242 22 -23 -14 -74 -51 -57 2 65 193
2240 193 -76 -57 205 -79 -43 -58 99 140 4 184 -73 127 -164 -168 43 -137 -18 -267 -217 63 273 -91
2262 -91 41 207 143 22 117 115 107 -56 -56 -8 -115 147 -138 37 -101 -326 -135 -16 -51 74 17 46 162 60
2286 60 283 235 125 84 260 82 -86 -76 26 4 -230 -200 -214 -41 -32 -187 32 -164 -48 39 80 143 262 -46
2310 -46 -20 105 31 91 143 179 23 -150 -302 -265 -221 9 -204 -13 -118 -105 189 64 288 226 -57 31 63 44
2334 44 304 72 68 -223 -94 -22 -243 -172 -9 -99 -209 -41 -174 100 -171 234 -185 48 -60 200 234 -27
2356 -27 206 -6 71 -166 87 -50 199 58 -231 -79 -245 -209 -67 83 41 -39 -13 50 18 250 138 148 -55
2379 -55 94 -86 -125 80 141 -37 -13 -68 -76 -165 224 -8 -3 -92 -255 163 219 174 104 319 -44 -59 92 308 70
2404 70 55 -343 -247 -421 -66 118 -43 32 -65 -148 21 220 255 105 280 132 -64 154 196 163 323 150 -109
2427 -109 -198 19 85 43 126 -20 -164 -232 -252 57 184 13 -45 -109 -145 -35 142 357 88 -101 -243 -111 10
2450 10 113 151 -52 -176 -278 -185 -129 148 -82 -78 -36 -51 -119 104 296 412 78 76 107 -47 240 252 -344 -186
2474 -186 -141 -291 23 245 44 -100 -140 -189 -194 -67 312 139 32 -117 -2 30 314 364 212 78 -237 -249 -95
2497 -95 -57 189 -195 -99 -411 -118 -143 -139 66 102 -264 -74 50 142 395 232 151 -211 -30 -15 70 126 45 -328
2521 -328 -439 -5 -99 -9 162 6 -355 -162 357 211 132 311 177 -151 29 75 -20 43 187 -102 -226 -266
2543 -266 146 -47 -261 179 -73 -234 79 259 68 190 -38 -136 -154 238 183 349 83 63 -55 -276 20
2564 20 -167 -48 -42 -222 -78 -357 64 97 117 217 -138 169 10 255 49 -59 -15 182 -101 -7 11 47 -33
2587 -33 -197 -48 -332 -105 150 242 166 44 87 -198 62 326 222 49 66 397 -137 45 146 31 -167 -67
2609 -67 -40 -303 -239 -45 146 -225 -115 -358 -122 49 321 -38 -45 179 147 -70 -109 271 108 84 10 -139 -191
2632 -191 -96 74 -35 -213 -45 -179 -61 4 226 142 74 230 76 175 193 84 126 -78 24 149 -183 118
2654 118 93 -139 22 -50 -9 -162 110 49 -47 57 -25 105 -98 188 365 42 55 42 -224 -122 109 -27 -210
2677 -210 -127 -233 -50 -22 77 -120 -162 74 -110 -141 89 221 272 92 -134 107 -90 141 296 -262 -268 -224 -250
2700 -250 17 -104 236 -106 -84 -71 -100 -98 255 476 73 35 -93 140 100 195 334 36 -10 -162 -61 194 -193
2723 -193 217 -118 -176 -349 59 -60 298 98 54 -182 190 134 156 352 266 -187 -290 18 114 151 119 -92 -499
2746 -499 -281 42 -96 198 44 27 -186 -102 72 132 493 -11 19 -183 -224 33 275 87 -2 -229 -467 -423
2768 -423 148 324 -8 -113 -134 -265 51 203 436 191 -87 -228 -137 0 345 271 246 -7 -270 -263 158 150 -51
2791 -51 -13 -306 -494 -106 148 419 115 136 -212 -297 151 259 251 103 -21 -336 -253 79 158 -21 -24 -317 -551
2814 -551 -227 -98 308 318 -95 -99 -421 -79 291 546 68 63 -308 -81 -51 103 220 123 -47 -401 -341 -253 -27
2837 -27 439 88 -329 -47 -79 158 229 214 246 -98 48 -81 33 351 26 -69 -351 -105 31 292 105 -54
2859 -54 -268 -303 -166 72 158 107 1 -107 -192 -56 171 286 333 -154 -182 -192 -44 85 153 -94 -284 -166 -294
2882 -294 -45 478 102 -7 -253 38 -32 88 306 -50 324 -199 -250 -109 376 253 78 -212 -270 -537 -137
2903 -137 193 210 92 -182 -297 -179 176 183 334 -8 31 -127 -114 140 262 172 -40 -142 -485 -192 1 127
2925 127 214 94 -231 -322 -55 20 183 291 10 -289 -26 149 109 52 49 -17 -139 -19 -80 40 39 -50 -83 -12 -124
2950 -124 -43 149 35 80 52 -111 -125 223 270 244 -111 102 -117 -89 47 46 -39 -262 -116 -155 -257 -35 178 -31
2974 -31 29 -46 -3 227 310 436 105 114 175 -6 23 138 -44 67 263 -248 -145 -48 75 -48 -299 20 -116
2997 -116 -22 9 -7 -39 221 251 62 41 14 149 209 -43 -138 4 -263 41 435 55 -66 -241 -237 -296 40 307
3021 307 123 -127 -86 -151 -323 43 515 -62 -151 -168 -172 -118 176 126 -139 -42 -172 -137 125 250 174 57 -207 -255
3045 -255 -164 150 476 213 132 -285 -177 -225 42 207 226 -262 -358 -94 -380 -74 76 -43 31 -154 -99 -255
3067 -255 118 366 223 -157 -141 -30 -31 202 247 -17 -438 -286 23 23 114 -56 -52 -514 -211 -1 269 279 213 -37
3091 -37 -303 -50 45 108 123 311 -290 -341 -168 -225 80 238 157 -213 -401 84 178 281 295 34 -142 -318 102
3114 102 290 195 435 -61 -314 -271 115 166 238 56 -375 -555 -315 273 341 344 -11 -289 -261 -165 379 473 225
3137 225 121 -295 -447 -57 206 347 142 -277 -348 -340 97 152 135 9 -228 -375 -384 131 510 219 54 -315
3159 -315 -478 -267 81 599 142 -333 -368 -390 31 178 124 -174 -255 -483 -522 20 271 411 37 -35 -377 -256
3181 -256 360 508 323 -27 -275 -327 6 157 283 135 -287 -333 -215 -48 327 201 -23 -189 -355 91 189
3202 189 423 213 -35 -117 -266 27 177 140 280 -23 -409 -451 21 203 130 373 -12 -353 -97 126 174 299
3224 299 298 -317 -444 -28 209 309 253 -6 -287 -81 39 47 129 221 -33 -253 -311 -17 35 139 150 -54 -328
3247 -328 -174 138 288 181 102 -49 -306 -32 295 236 -3 -116 -85 -364 -258 149 222 198 35 13 -184 142
3269 142 56 184 162 -105 -128 11 14 136 -4 -217 -105 -67 -45 -127 12 93 69 13 -105 198 68 224 77 -146
3293 -146 -36 -39 87 129 -72 -13 40 -27 -99 -114 -67 131 17 -46 -234 -212 -31 -77 24 -65 -116 -2 147 89 149
3318 149 153 -67 61 -273 54 -227 -258 -49 -137 -93 -65 127 30 126 59 -237 128 -70 19 169 166 121 251 -67
3342 -67 37 -180 48 -8 25 91 78 -37 -352 -182 32 231 288 -147 -273 -175 52 152 284 71 -154 -96 -256
3365 -256 -18 -32 68 -31 -60 -312 -23 -77 6 160 92 -179 -22 9 111 182 263 -72 18 -182 93 142 189 135
3389 135 -70 -179 -96 47 116 216 -1 -250 -313 -236 140 416 69 -21 -105 -86 -51 139 77 116 -75 -138 -226 156
3413 156 333 151 136 -154 -137 -212 160 173 136 0 -110 -109 -185 312 167 206 -68 -123 -162 -136 230 210 114 -139 -295
3438 -295 -133 -35 101 401 67 -341 -272 -58 3 430 209 280 -223 -113 128 128 156 115 -183 -314 -230 -99 152
3461 152 119 -10 -208 -207 -412 177 347 445 117 -205 -195 -74 126 152 24 -29 -422 -24 -41 -58 72 67 -257 -298
3485 -298 -272 -91 188 215 -15 -209 -238 92 301 402 95 -4 -159 -111 -160 250 162 -29 -213 -5 -134 -323
3507 -323 295 105 66 -140 -229 146 41 266 155 -72 5 -209 11 357 295 152 -22 -225 -190 60 122 291
3529 291 9 -151 -171 -256 -22 111 189 143 -277 -138 -221 202 156 48 63 -241 -233 -74 338 -6 51 -257 -435
3552 -435 -215 -233 14 212 -132 22 -283 -70 -13 222 124 25 -77 -142 137 66 167 162 -84 -253 -221 -134 78
3575 78 93 142 -146 -120 -77 -68 114 217 -163 -67 -28 -58 199 182 -113 -92 -92 -243 -23 -171 122 -5 -119 -196 -216
3600 -216 -109 147 -180 103 133 -65 -170 -105 292 81 -32 -134 -277 104 114 184 136 81 -61 -22 -49 -82 178
3623 178 31 54 -120 -11 -36 252 152 18 -11 -26 -55 60 -50 60 16 54 -168 -58 -97 61 26 -107 -47
3646 -47 39 13 -18 119 -61 134 -209 38 -64 62 112 -14 -155 153 -76 -137 78 -41 14 9 60 31 26 69 112
3671 112 -38 129 36 33 63 -29 145 -50 55 -211 -76 -127 82 -84 66 -69 -46 -344 -54 -77 45 -29 131
3694 131 195 -3 77 -81 23 -103 224 -39 -171 -127 44 109 -157 -34 -273 -96 -60 30 227 187 -145 152
3716 152 -9 13 222 103 -44 -120 41 -44 -14 174 225 173 2 -56 -18 -7 176 89 35 -67 52 -64 198 98
3740 98 58 218 17 -115 -113 -50 -96 -32 8 -303 -326 64 -46 26 46 -83 -158 -161 74 90 197 -296 -135 -317 107
3765 107 142 106 64 -135 -92 -173 -112 143 192 148 -183 -168 -93 -69 160 113 -83 -183 -123 -162 64 164 325 -124 -95
3790 -95 -254 110 9 -29 -39 -345 -188 119 72 74 378 18 -266 -14 12 245 169 -177 200 -89 123 41 155
3813 155 138 66 -44 -195 -182 -175 213 134 -158 -209 -66 -122 13 71 188 -64 -120 -250 -63 -22 239 -1 -200 -124
3837 -124 -143 -100 102 213 104 -211 -232 -128 49 150 1 -72 -121 -174 -16 -136 81 97 244 -197 -140 95 13
3860 13 124 -230 -61 -166 -219 -104 47 285 218 47 -120 109 114 206 166 26 -224 -223 10 139 46 1 85 -106
3884 -106 -143 -104 34 64 102 5 -156 -28 9 145 132 248 -76 -167 -189 65 180 39 -45 28 -72 66 98 13
3908 13 147 143 -64 1 35 151 125 -10 -68 -212 12 -45 -99 43 120 72 -227 -153 -116 76 241 -18 8 -196 126
3933 126 57 195 64 77 -124 58 39 -135 201 -38 46 -127 -256 -99 -62 7 -3 101 -136 -137 61 50 -10 71
3957 71 -119 68 -110 31 180 -26 -39 -71 18 217 62 42 -90 -154 -235 -105 94 -83 -97 -83 155 -197 179
3980 179 -103 -48 14 -22 -142 118 -93 -98 -43 5 5 -153 -164 23 -35 31 -39 -1 46 -44 -66 115 137 232 -140 204
4006 204 1 126 13 113 -46 -131 -108 25 -44 55 -104 -176 56 25 20 111 4 -29 97 34 77 78 175 -16 185
4031 185 111 -13 93 -108 -14 -97 -121 76 106 -172 -82 -104 47 -94 -47 -11 -296 -68 147 -75 18 107 -5 107
4055 107 -20 -51 14 195 -247 16 -108 -18 -50 85 212 166 -247 -67 -208 -54 63 2 -59 68 -8 31 156
4078 156 335 165 -60 39 -36 212 -108 72 -155 158 37 25 -328 -3 110 -87 -33 18 -53 -21 124 -112
4100 -112 -97 -35 -205 -40 120 -42 113 -214 -134 -5 -86 -84 -20 49 -21 -103 -7 -46 -164 171 147 130 68 4 -37 161
4126 161 233 -75 -157 -325 192 198 57 39 -95 -75 104 6 219 -27 -98 -182 -108 3 149 261 183 -158 -59 -295
4150 -295 -165 141 82 4 95 -221 -144 263 148 20 76 176 -257 60 1 87 270 47 -196 -78 -99 41 -30
4173 -30 86 -89 -86 -192 -23 66 188 147 122 -52 68 -11 194 -11 116 -222 -88 8 -61 65 173 7 -358
4196 -358 -37 -222 40 -98 260 3 -198 -34 -104 169 328 -31 -156 -83 91 -34 130 215 -172 -304 22
4217 22 -9 134 -4 -109 4 -199 -271 -53 100 129 61 93 -58 -114 -3 126 138 42 -149 46 -19 223 -12
4240 -12 -81 -6 -275 -295 160 -151 123 -50 112 -47 -265 -44 172 268 -143 123 -92 106 -3 -239 159 4
4262 4 -152 -84 -103 104 72 21 -135 -153 -22 74 210 74 58 -114 -126 -146 107 -7 44 -133 122 -57 -64 49 29
4287 29 -181 -88 -97 -111 21 -175 176 46 -53 141 -33 -122 191 -35 130 6 -3 -33 23 -36 -80 31 -123 -54 -98
4312 -98 -105 74 79 -3 2 205 219 22 63 -33 -122 37 152 -42 112 123 -164 -223 91 -89 108 -45 -73 -40 -56 198
4338 198 -9 120 8 -79 -71 82 -41 77 -57 -159 -37 -103 146 -179 35 -58 -73 -52 -53 13 -83 -139 -106 113
4362 113 11 -103 -46 -162 88 -69 33 188 118 85 118 -249 60 121 -129 -40 -115 233 38 -106 224 9
4384 9 164 39 199 -46 109 -78 -18 40 -89 158 113 -67 35 122 -83 -127 -153 -84 67 108 -79 48 -143
4407 -143 -193 -143 96 303 73 -35 125 -43 -183 137 -76 124 -111 -203 82 41 204 22 -30 81 149 -105
4429 -105 76 40 170 -88 -246 -124 -141 -158 55 246 -131 -124 -184 -96 -30 184 75 172 -239 -172 35 324 150
4452 150 -39 -82 -57 -51 253 101 -83 -140 -107 30 93 151 15 19 -37 -377 -143 -50 -90 200 15 44 -327 -177 116
4477 116 132 -95 -279 -60 -39 -110 -46 113 155 -195 -82 16 -174 248 -69 -312 -191 -190 -125 145 131 180 -226 -110
4501 -110 52 120 67 137 -95 -64 -206 -32 45 -67 210 -43 129 -114 -52 -66 208 202 -168 -243 29 -102 260
4524 260 135 35 -198 -34 -314 147 275 22 -147 -202 -124 -96 146 164 -19 -114 -242 -328 -108 95 184 -19
4546 -19 -89 -66 -233 -42 -63 256 25 -103 65 118 -11 110 64 -31 -386 -220 -145 142 -115 209 67 -8 -44
4569 -44 -51 189 133 149 -132 -312 -160 6 -67 -92 -161 -79 28 81 190 166 384 93 -1 54 105 -18 189 -4 -128
4594 -128 -66 -107 31 68 97 349 -6 -202 -207 -22 -32 202 132 65 -19 162 97 -103 143 65 -306 -172 180 178 -73
4619 -73 -139 143 99 256 -70 120 -160 102 114 -29 0 -83 -30 11 99 115 -5 -89 87 -30 -66 69 -200 -204 -245
4644 -245 44 -27 -247 -179 -184 -108 156 125 -62 -160 -77 -68 -86 114 217 -70 -73 52 -58 67 -29 119 91 192 0
4669 0 -30 -87 -126 98 -151 177 176 -78 102 -50 249 34 -91 -90 -75 -193 144 34 -101 -143 -86 197 124 111 45
4694 45 107 7 98 37 -1 -102 67 45 18 -65 -52 12 -181 -48 -138 104 -87 -38 65 8 12 37 68 169 -34 -129
4720 -129 36 37 -29 21 58 44 -35 -149 -47 -5 35 -189 -94 -257 147 264 114 279 -106 -184 38 0 160 -39
4744 -39 -41 51 -119 27 8 137 -273 47 -300 -35 73 43 50 -23 38 -199 -5 -65 178 89 -145 68 -66 -93
4768 -93 -51 171 102 -25 53 -4 -11 18 171 -39 36 -110 -325 -142 49 83 174 196 -11 57 -168 54 153 51 79
4793 79 36 25 51 423 -8 -126 -94 -88 -223 -3 74 -115 113 -55 -13 132 194 197 -30 -85 -143 -220 -7 122 -5
4818 -5 86 -224 -48 36 84 243 155 -66 -145 -267 228 265 293 -93 -69 159 51 -86 120 -38 15 -267 -370 -146
4842 -146 -41 117 10 -45 -453 -164 2 49 196 195 -81 -67 -54 163 217 4 -183 -50 -286 -236 71 172 -30
4865 -30 -78 -205 -49 21 131 303 53 75 -329 -91 48 153 101 -54 -40 -128 -215 161 182 0 173 -215 10
4888 10 -323 178 92 -47 -96 -171 -157 8 24 33 52 -139 -172 -104 8 305 220 142 -252 -145 45 76 186 163 34
4913 34 -131 42 110 135 154 35 104 -49 -105 112 108 265 -228 -67 138 121 -255 -47 -23 -75 -101 -64 -130 95 -26
4938 -26 -140 -10 -59 -70 73 146 131 5 38 -168 -127 -62 81 25 -6 -99 -42 8 -102 204 -123 -228 -119 -78 97
4963 97 84 291 38 26 58 -5 95 226 15 -104 32 -24 59 147 80 -19 -128 -24 -25 48 127 127 -121 89 50 -27
4989 -27 -4 43 35 -99 -69 5 -68 70 38 -76 17 -110 -290 -27 -63 -181 165 150 51 -51 179 26 88 -82 -237
5014 -237 -32 103 -79 -109 -201 31 -64 50 99 -19 0 48 -95 -87 -74 -52 43 -2 -10 87 182 14 -129 -15 160
5039 160 118 70 -33 181 -53 -164 -44 -172 -137 20 -162 -9 -83 -162 105 -98 -84 163 51 6 -90 -65 196
5062 196 13 121 -152 -147 -132 143 79 -94 -39 -59 176 144 50 -87 -87 -119 85 146 245 4 -28 -137 -16 -163 -44
5087 -44 -49 144 18 -21 267 -112 141 -38 162 -78 -45 22 -63 -128 39 167 117 189 -70 49 0 -27 -4 -87 -4
5112 -4 -31 -173 14 -33 95 61 -19 -232 -100 211 83 112 -282 -196 -133 46 24 201 -233 -282 133 -11 -38 99
5136 99 94 -118 -32 -31 12 96 31 -12 -111 -54 -60 -16 86 -62 199 55 -119 -124 -5 142 133 -70 89 -170 -196 7 -7
5163 -7 58 -47 -61 27 -12 170 202 79 -103 -31 -153 -120 87 -8 54 95 -29 30 33 140 155 10 2 56 -90 136
5189 136 25 -101 -114 162 38 68 198 -85 133 -50 -231 7 -83 85 -7 86 26 -240 95 -86 110 188
5211 188 -30 -225 -170 205 266 66 0 -53 -124 -58 115 88 -41 -4 -144 16 -53 -18 71 -97 31 -47 51 -109
5235 -109 95 135 -61 69 -140 1 23 104 13 -64 -183 13 83 69 15 156 -60 10 -239 49 113 158 46 -69
5259 -69 -64 -167 -147 -162 80 127 -45 44 -172 1 89 55 -13 60 -170 -42 19 121 202 -162 -134 -130 188 75 89 62
5285 62 -133 -264 -272 -166 67 -1 2 -47 13 139 -153 59 -39 -71 -227 124 -146 184 155 76 104 23 151 57 44
5310 44 61 -8 -223 11 -63 97 147 21 105 -210 -174 98 276 221 -18 72 -23 -175 220 39 9 -93 -86 -133 -3
5335 -3 168 55 -12 27 -84 46 176 -136 91 193 32 -153 -41 -111 -19 109 -52 72 -2 -50 88 -69 83
5358 83 172 -240 68 -1 31 -49 10 -9 -76 -34 -41 187 97 -47 -3 71 -185 37 -87 57 61 -63 -7 -116 -145 86
5384 86 64 157 127 171 160 -74 -184 122 -93 2 91 69 -52 -50 159 -31 68 91 -43 132 -45 -56 -152 135 1
5409 1 -68 185 113 105 -178 -108 233 316 -313 -116 -52 -51 297 71 146 74 -212 -136 -41 249 106 -25 -149 106 -8
5434 -8 -90 174 282 40 -366 106 -104 59 0 105 15 38 42 209 129 172 -146 -17 -204 -263 144 102 -52 -10
5458 -10 84 -62 31 -84 -131 -71 18 22 -41 53 38 0 -89 -79 160 -159 199 -92 -82 29 -5 8 103 303 31 54
5484 54 -100 -5 173 34 120 -28 -158 -103 -15 -18 187 -8 -39 135 -138 50 101 7 128 63 -96 68 96 151
5508 151 310 -102 28 62 8 -46 187 243 98 -120 -59 79 79 53 119 -121 -24 -107 -54 -9 57 130 -62 -246 -132
5533 -132 104 -62 -66 -22 -5 2 -101 -88 24 213 65 -72 32 -82 -123 169 -60 -1 -181 8 8 150 113 60
5557 60 55 -64 -60 21 72 -91 -45 -25 -57 -52 271 -153 -135 -127 -78 -82 -54 -53 101 -177 -29 198 -75 -122 10 -197 -172 -220
5585 -220 20 118 114 181 6 77 71 20 -20 156 46 -24 -47 -23 106 -37 -37 68 274 -150 32 126 -86 81 103
5610 103 -64 -165 -135 -69 -59 -218 46 12 106 19 -88 49 59 -108 -123 60 -171 -76 -43 59 -13 -128 -39 -73
5634 -73 112 52 -37 -13 -23 -57 31 97 -96 16 204 -146 -45 -30 137 -172 -42 -259 -218 -151 82 9 142 18
5658 18 -84 -98 -99 85 182 107 16 -342 64 23 -35 -216 -90 -49 -50 31 -28 -179 138 -100 -93 18 68 331 120 54
5684 54 -131 -135 -35 -61 65 187 19 175 -140 -168 231 264 0 -169 -84 -89 83 118 81 -10 -26 -243 114 -257
5708 -257 85 103 -245 -29 -47 2 -25 125 -60 -2 -214 54 -7 -50 105 96 -15 -11 -48 -53 -48 -9 -60 131 -32 -264
5734 -264 -35 73 -151 -116 -166 -188 121 98 -190 -56 -93 -195 30 143 7 232 154 -111 86 234 -4 139
5756 139 2 45 -107 -235 -82 82 -43 -175 -71 -39 -59 54 205 166 19 -40 11 57 72 -77 -68 -65 -144 -17
5780 -17 52 87 29 -110 -116 -74 -123 120 55 99 56 95 -196 74 4 -217 -137 -95 -142 -61 -146 73 -47 -80 -176 -29 6
5807 6 133 198 -127 -139 -54 -22 -8 -49 50 -86 -206 92 44 119 -10 58 -56 180 74 -13 -18 -164 64 -57 -322
5832 -322 -107 52 112 100 -32 68 47 13 43 115 -96 98 -202 -138 -2 73 7 -7 179 -5 -103 56 -135 -23
5856 -23 99 13 -86 99 2 18 -1 10 58 -65 -72 2 -32 176 -88 193 -114 -51 6 85 -207 -174 -36 16 119 136
5882 136 56 -24 69 109 -157 -276 82 46 -125 -199 32 -23 -118 51 -114 -88 135 20 115 83 -6 -90 -158 53 -89
5907 -89 206 141 -45 -123 24 -68 6 -127 -34 -38 -82 -174 -190 50 63 -48 -18 69 41 -57 -62 18 57 -118 -113 -45 -84 -70
5935 -70 -25 52 -67 -15 191 -36 75 -47 -131 3 -125 -25 -60 -25 -6 -28 11 59 143 12 131 -67 15 -20 -42
5960 -42 -184 42 -26 -119 41 52 84 135 119 159 -183 -135 102 -28 -44 33 -195 -85 -17 6 -41 -116 -134 -240 -82
5985 -82 90 311 68 63 -3 -163 27 123 243 89 -30 -95 -63 15 75 41 138 102 -13 31 -12 128 -39 -36 -235
6010 -235 91 -49 -190 204 -39 -88 -30 69 -89 -19 99 209 130 58 14 2 18 125 -62 -80 -123 129 -101 83
6034 83 -31 89 122 206 -8 91 109 15 -21 -101 -241 12 -22 -77 -83 0 -270 -156 -109 126 13 111 -10 -128 -38
6059 -38 20 -55 164 -42 -84 84 1 328 -127 -136 82 45 -105 -4 109 95 4 -19 -17 -47 44 91 276 23 61 -20
6085 -20 9 64 -134 69 13 -173 -124 38 -11 25 -64 -187 -104 -260 -172 40 19 33 7 126 -63 -22 191 51 24
6110 24 -82 37 -170 20 147 56 -3 17 -322 -59 148 237 95 192 -70 -105 38 129 -77 -24 63 34 137 97
6134 97 -73 1 64 -116 -37 -251 99 79 40 71 -160 -16 -43 118 152 -41 -17 112 -52 -164 157 6 249
6157 249 -86 -86 184 283 27 -60 -70 182 -150 91 88 148 180 -275 -90 19 73 -49 85 -24 93 -101 89
6180 89 183 -224 119 141 25 56 -253 139 113 -36 40 -39 18 6 -140 -31 102 101 24 -193 -116 -85 21 -144 -77
6205 -77 -103 171 -120 0 134 176 83 -112 13 130 117 162 123 137 3 181 -157 -54 233 150 -99 -148 32
6228 32 86 46 127 -117 16 6 58 99 180 36 33 -72 83 -124 164 203 -32 -12 -181 118 92 -27 56 148 -37
6253 -37 82 -1 86 -13 -5 157 -223 75 65 -44 231 -8 -82 -169 -102 67 -30 3 -150 41 70 -147 -21 160
6277 160 -141 32 88 -239 -234 -85 -107 2 -46 -11 -109 -113 23 -11 36 -38 17 -19 71 -164 -57 -106 322 84 85 105
6303 105 -6 -30 -123 62 4 -25 -17 113 117 -7 -112 -54 -41 34 -15 -35 -49 -109 -213 -48 79 61 338 -177 0
6328 0 -175 -166 186 35 35 -29 -159 -69 165 -46 56 6 2 33 -4 -75 94 83 60 125 26 -135 26 13 127 -56
6354 -56 -64 178 105 -125 -80 -104 -109 63 -72 -120 -220 15 -104 161 37 -31 90 -8 24 158 -76 -111 9 -196
6378 -196 120 47 -55 -120 -20 70 134 -21 48 -34 -22 121 -3 -30 37 108 50 -183 50 -65 36 -11 4 360
6402 360 62 38 22 80 -43 -98 30 114 60 -9 46 26 -76 -251 -39 44 -108 -66 26 -195 -149 -266 83 -37
6426 -37 -50 65 -121 -30 103 -157 125 72 56 76 -139 -36 -56 70 55 38 -29 26 -113 -25 2 163 93 -6 -106
6451 -106 -69 -6 145 -27 28 -52 166 41 76 -206 120 280 28 114 17 57 127 200 92 81 -90 89 -13 -118
6475 -118 140 30 -41 25 -147 -15 -17 9 254 53 -139 -87 -60 120 -53 46 -158 -21 7 171 346 81 -41
6498 -41 -128 -156 196 38 124 4 -25 -95 -59 -197 -18 132 -167 -19 -85 34 54 17 116 -69 -176 -245 -174 -127 2
6523 2 99 -41 -230 70 -76 -34 41 240 44 -87 -22 33 173 -115 15 37 -15 -63 -239 78 233 -149 76
6546 76 -47 -60 44 37 230 -8 0 -172 31 -48 131 -81 -45 -188 -33 -94 -7 303 -55 -193 -96 -96 73 21 -266
6571 -266 106 -39 -25 -51 -121 190 20 -59 -63 -39 -89 67 -25 -57 -57 -10 34 -20 52 92 6 51 -27 -84 81 -13 32 -16
6599 -16 94 -186 -20 -72 232 -16 15 82 -294 257 42 -4 5 5 -57 24 -53 27 133 125 44 -69 -101 206 39 23
6625 23 180 -86 -88 99 64 150 109 20 83 64 50 5 104 168 42 79 -240 244 -38 -153 94 -95 174 -8 -137
6650 -137 29 -90 -69 -6 -56 78 -39 47 -105 94 -153 -121 -72 44 -168 113 154 -180 150 -91 -60 170 -84
6673 -84 -96 95 -22 47 74 73 177 -86 107 -83 -90 177 -155 165 -141 -144 71 -90 76 151 30 -132 44 -139
6697 -139 116 -39 -117 -118 133 -9 -6 145 154 40 -226 45 58 26 -22 72 -54 -110 13 -98 3 64 96 56 -209
6722 -209 169 118 71 254 190 -113 -11 29 -168 -69 98 98 -82 -131 -173 3 -2 86 53 -22 -54 31 27 -70 -82 176 63
6749 63 -33 92 -103 -34 44 -136 53 16 27 163 -76 209 -22 -161 -88 -67 129 27 -167 -145 1 -189 -4
6772 -4 110 -63 -143 49 103 -41 -154 72 -27 -84 8 -57 -13 -5 87 71 80 -10 143 -139 -72 -47 -48 -103 -42 -91 150 50
6800 50 76 -127 66 -189 -109 70 175 50 -165 -7 -13 -51 118 -278 164 -66 10 -52 14 -30 -219 -57 233
6823 233 -41 -107 125 -2 -21 204 -74 -97 -18 -201 -47 128 105 -27 -195 -176 312 -8 38 80 -205 -196 -99 46
6847 46 -1 219 143 -214 -70 -19 3 363 2 11 -95 -88 -183 -110 90 90 256 -116 -179 152 65 60 -116 174 -89 -5
6873 -5 10 91 158 35 -150 -99 -103 61 45 173 -67 -102 58 -59 54 100 -106 34 -185 -71 -17 135 119 30 -106
6898 -106 -93 -61 -75 46 -151 68 -208 -178 65 69 -2 321 23 -217 103 -52 283 34 139 23 24 -48 -126 82
6922 82 203 30 -190 87 -94 186 -10 56 -73 -225 -243 99 50 236 273 -15 -55 -78 -66 25 270 -17 -95
6945 -95 -125 106 -96 85 -63 8 171 -147 -158 -138 -38 34 118 -115 -182 7 12 -4 102 -60 73 28 65 122 86
6970 86 100 -190 -146 -25 10 3 1 -45 47 -116 -119 278 33 95 85 -79 -113 -336 -20 -108 -87 -208 43 8 -74 6 149
6997 149 -162 56 39 -100 -140 -70 200 -29 95 -73 16 -25 71 38 -12 52 -152 -227 -6 -143 109 72 155 190
7021 190 133 117 283 -138 82 -35 47 198 66 3 -32 -87 -84 104 -222 34 -38 49 -386 8 -62 -11 96 -35
7045 -35 -80 -40 59 54 -91 134 186 -172 -63 6 -19 -4 372 99 -56 23 217 -27 31 80 96 -1 -114 86 -112
7070 -112 -83 -25 -39 -115 91 97 -194 30 -27 309 42 -45 51 25 261 13 -6 -86 -28 45 59 -97 85 136 -117
7095 -117 -47 -7 -70 186 6 103 26 -109 -63 -26 88 187 195 64 53 -24 -6 -29 82 63 -225 -342 -13 114 -223
7120 -223 31 89 -53 -13 114 -68 -23 -4 168 84 -210 -130 55 -12 109 -150 -27 24 152 130 0 -159 81
7143 81 -122 -15 132 -47 19 -142 -47 -76 119 -16 215 -45 104 -165 105 -158 28 177 -53 12 -125 163
7165 163 -64 53 106 154 -78 -102 -145 -74 47 -206 -141 -40 135 -94 79 -15 -55 -152 -88 -181 50 -89 80 -34
7189 -34 9 -44 22 61 173 -73 -6 -62 -204 105 115 -49 30 -54 -109 -195 -74 50 49 24 25 -23 -135 -44 72 134 55
7216 55 64 -192 -43 23 114 53 -18 -8 14 -231 -13 157 -113 -79 139 -80 -125 -37 -109 -19 -141 42 -55 158 -16
7241 -16 186 60 33 -63 -26 145 -7 96 3 -111 -26 34 154 158 241 117 -168 -13 -152 3 -73 -127 -73 -37 96
7266 96 156 212 79 41 56 -363 -159 -130 -2 -126 -204 -247 190 53 139 128 -170 -25 -87 -167 173 -21 242 56
7290 56 -108 -20 -67 184 279 -56 -69 -141 -137 -233 -53 100 -3 -20 -6 -198 -146 -29 60 6 -107 -175 -228 -70 111
7315 111 41 175 56 -170 65 52 -28 32 -108 55 -260 -34 -105 -125 -224 -60 -59 -112 -137 0 84 68 94 -1 73
7340 73 136 44 81 37 -50 -22 14 51 -146 -51 -151 -252 -50 2 119 -57 64 46 54 -215 -192 104 -67 34 -268
7365 -268 -139 -169 -213 41 256 23 182 -309 -27 128 12 6 42 -109 -150 92 32 -23 0 -137 230 -65 21
7388 21 -75 146 121 11 84 104 129 141 -7 87 -89 -23 17 58 -89 -295 31 -197 -168 33 120 -5 101 75 154
7413 154 -79 -25 -212 41 -35 77 237 17 100 -123 0 94 88 -82 -80 -134 -22 -33 -105 18 47 -69 203 1
7437 1 154 -85 213 -20 103 -96 68 -53 -96 -52 -277 -17 43 37 -18 43 141 84 -40 29 -4 -60 -25 -187 12
7462 12 -148 115 -34 32 -38 -57 61 82 129 28 48 232 27 -132 -43 205 -26 78 -157 61 25 -10 32 66
7486 66 110 67 11 -152 -88 -53 -17 -244 81 64 -108 31 -55 97 19 -167 -207 75 57 39 117 -120 -3 55 62 -58
7512 -58 -24 126 16 31 -108 29 125 2 -146 190 -28 -52 -123 206 178 -38 35 -2 -62 24 -15 -26 57 -1 18
7537 18 -64 -12 29 57 121 48 31 27 136 -4 -178 -162 -58 3 -25 110 57 83 -43 -51 0 4 130 188 260 7 103 7
7565 7 20 -96 42 -116 84 42 -73 73 84 153 46 -23 -205 76 26 -10 -155 -100 -82 143 -91 -46 33 173
7589 173 139 56 -214 -159 -1 -50 43 32 43 -31 216 -88 39 107 -50 -146 -70 -5 199 -155 -18 -165 -10 71
7613 71 -130 207 15 -160 64 -153 -4 22 22 -38 90 -15 18 0 -110 77 -42 -9 -122 118 59 28 -46 -216
7637 -216 -19 -139 137 33 -3 -83 -157 -183 48 354 43 42 12 26 -119 163 -54 79 -81 -44 -54 -167 125
7660 125 217 -24 82 -152 -116 -36 -68 27 11 11 11 -59 -38 74 67 4 -197 94 -162 -112 26 23 -36 -182 -14 106
7686 106 107 -19 -48 27 -12 -51 -9 26 56 -12 -55 -54 73 132 -116 93 5 -137 159 17 -71 131 -17 -279 76
7711 76 54 100 292 -15 -55 69 56 -24 40 106 34 -187 37 85 222 -129 -72 46 227 -64 -177 113 -7 1
7735 1 -86 -169 79 -140 57 133 161 14 85 136 44 -193 -54 -104 -59 97 -22 51 -98 -106 -96 -20 50 70 124 38 -109
7762 -109 76 78 -150 128 39 -230 -5 -86 -83 -121 -75 140 -118 79 -21 38 -226 220 52 -61 315 -25 55
7785 55 80 -88 -68 83 31 107 -103 28 -9 -67 193 147 193 58 -28 -99 -127 52 -130 19 -50 9 -85 76 -97
7810 -97 -225 -151 199 21 -67 -247 21 -49 91 23 -89 -109 -70 122 181 51 166 167 -19 91 72 -61 -66 -100 -190
7835 -190 11 212 -139 86 -4 -30 -136 -106 157 145 37 125 112 7 101 -161 98 250 116 -42 104 -75
7857 -75 -96 118 -137 157 -80 66 -244 179 214 -39 121 -87 28 92 -74 18 -19 -190 -71 81 -59 194
7879 194 -87 27 -242 46 129 52 398 20 -38 16 -19 110 46 30 -30 9 -194 -116 212 18 215 -10 29 -216
7903 -216 -11 42 28 -18 159 -17 -75 -31 65 65 -108 48 -259 -5 123 92 -156 96 -108 200 331 -56 40
7926 40 70 -75 -118 -31 -63 93 152 19 90 -44 58 -162 -28 153 62 -138 -29 118 -4 5 93 -156 -17 -11
7950 -11 5 15 171 44 46 -204 -37 -4 -33 -20 123 -67 -229 -70 -30 134 -54 199 157 -89 -14 24 -90 -89 45
7975 45 -289 74 36 286 95 14 202 -62 4 -78 229 -216 -93 -228 30 28 93 127 -49 28 -71 -54 -161 -56
7999 -56 109 -4 -255 -224 -25 164 73 57 17 189 56 8 138 28 60 14 -89 113 21 -43 -19 -36 -111 93
8023 93 -67 41 -6 115 -61 -30 -25 -54 -133 -18 -104 -59 20 -47 -49 -21 29 74 2 9 3 -67 -54 25 -23 -141 -125 -28 125
8052 125 53 -22 -128 -226 -124 -60 -83 -13 -47 215 -92 -26 -243 284 167 36 50 -320 1 -125 182 -84 147
8075 147 -5 -144 159 -157 94 38 -121 -147 -91 126 244 113 -15 100 54 -54 -100 -9 36 -26 -65 -209 103
8098 103 11 -136 -189 136 66 -201 -147 -97 166 -31 -105 -114 222 -12 -21 0 -174 109 -93 -131 -196 -8 -256 73
8122 73 -106 -39 162 -174 94 252 3 65 -53 13 135 34 101 76 51 46 82 -23 59 254 213 -185 -50 62
8146 62 -146 -30 -80 -5 -35 4 54 3 100 32 28 185 -197 7 -140 44 257 47 -61 -8 -139 -140 50 57 -47
8171 -47 -111 -159 123 -41 171 32 12 25 29 -172 -80 -113 51 -131 -99 -63 144 72 -21 151
8191A51
$$ Imaginary data points
##PAGE= N=2
##DATA TABLE= (X++(I..I)), XYDATA
0 0 0 0 0 0 0 0 0 0 0 0 0 -8 8 -8 8 -16 16 -17 24 -31 32 -40 48 -56 65 -80 89 -105 121 -142 161 -185 209
33 209 -234 265 -299 337 -377 423 -471 523 -584 646 -714 793 -873 964 -1065 1172 -1292 1423
51 1423 -1566 1726 -1905 2105 -2332 2586 -2880 3221 -3621 4103 -4693 5433 -6394 7701 -9586
66 -9586 12561 -17969 30959 -132023 -31608 187389 -31576 56627 152359 -90150 -206529
77 -206529 44017 75438 -6403 78311 57402 -122605 -72093 33794 6107 45103 94918
88 94918 -41857 -86301 13983 -4362 -32180 69210 28543 -92446 -20203 61737 -324
99 -324 21871 60457 -51448 -94957 1776 22570 31434 86638 12059 -90761 -37433 -8557
111 -8557 -22496 87181 108223 -63525 -89701 2818 -51050 -29886 142399 85535 -91492
122 -91492 -35303 7362 -93311 1090 148741 19577 -79521 21325 -10345 -88225 47772
133 47772 107753 -34395 -48002 22330 -41424 -43021 68214 41780 -38254 -3828 -2265 -40588
145 -40588 21980 55797 -12718 -19884 3102 -35664 -8747 63897 23636 -27638 -451 -23281
157 -23281 -51396 24935 58764 -2560 -9576 -2306 -49203 -23189 47999 26251 1508 19752
169 19752 -30697 -60647 21654 43160 -8343 24986 31874 -61043 -45951 45968 10804 -22946
181 -22946 42368 12615 -69992 -9615 45367 -15280 -6573 45582 -15830 -50450 21305 23885
193 23885 -19941 16533 24326 -32296 -15088 26455 -3488 -6988 23258 -10402 -32798 11303
205 11303 13538 -13102 12440 14805 -26543 -13325 17846 -1064 320 22529 -4842 -22048 6679
218 6679 4728 -9345 16288 13913 -19869 -6721 8986 -13407 -2834 22462 -5092 -17022 12720
231 12720 -464 -20929 13216 18058 -18037 -1221 21621 -11757 -14051 20029 1806 -17449
243 -17449 13470 11249 -19644 -1166 13006 -14303 -6572 19667 -2639 -15808 8394 1670 -14592
256 -14592 8881 15333 -8244 -3121 6918 -9690 -4087 17266 3975 -8756 3208 -3335 -13959
269 -13959 5766 13948 -3854 -3780 -102 -13200 -5773 14752 7053 -2579 3553 -5824 -15103 5628
283 5628 17036 3011 1269 1117 -14829 -10919 11134 10474 1743 3641 -8384 -20340 -2722 13753
297 13753 6877 4955 2943 -14690 -15993 5244 13533 9677 8753 -3918 -19069 -8681 8898 10853
311 10853 10085 5740 -13176 -20935 -4818 9346 12294 10917 -1105 -17702 -15569 -10 11068
324 11068 16702 11825 -6796 -18915 -10198 4602 13870 16691 6042 -13457 -19992 -9312 5725
337 5725 16426 15042 -1527 -17741 -17791 -4931 10260 18981 12655 -5466 -18693 -15134 1193 16979
351 16979 20071 7174 -11074 -20133 -13251 3808 18341 17745 765 -17776 -20903 -7515 9625
364 9625 19537 14999 -3350 -20335 -18533 -1201 15422 21659 12128 -9358 -21827 -13199 3280
377 3280 15895 20138 6385 -17349 -23365 -8808 6487 17249 18409 -524 -21633 -18969 -3262
390 -3262 9816 21218 17510 -7436 -22716 -11980 2187 12520 21468 11019 -15512 -22882 -9132
403 -9132 4209 15728 19393 366 -21240 -19126 -5033 8032 20859 17069 -6557 -21011 -14184
416 -14184 -84 15236 22819 9489 -12175 -20414 -14194 1501 19863 19718 549 -14794 -19785
429 -19785 -13644 7126 22568 13331 -2657 -11899 -19654 -10101 16638 22796 5186 -3317 -9302 -19321
443 -19321 -4872 21717 16172 -2782 -5261 -12174 -18143 4106 22320 7344 -6128 -5884 -15060
456 -15060 -11621 15197 21750 2770 -5305 -8632 -16491 -2173 20617 15425 -205 -5560 -15618
469 -15618 -17725 5096 20535 9573 -1105 -7612 -17998 -12947 8970 18281 10442 -94 -10819
482 -10819 -13933 -3969 8017 14471 12055 -3419 -15227 -7842 526 2473 11811 10524 -11588 -16133
496 -16133 1481 1942 -1741 13720 8780 -17341 -11193 9777 2813 -571 13915 2151 -18525
509 -18525 -4440 10082 1226 4495 10440 -9286 -17513 1293 5676 460 10246 5783 -16022 -11074
523 -11074 5443 2362 4182 14827 1032 -16171 -5327 4881 249 5908 12775 -2021 -13882
536 -13882 -5851 1650 897 3857 6225 235 -8240 -7900 1465 5596 421 1626 5916 -2570 -8128
551 -8128 4446 6793 -5455 -867 8208 -3354 -7160 7542 2768 -11816 -874 7177 -5794
564 -5794 -2307 10772 -757 -10827 1755 3125 -5204 4818 10523 -3699 -4913 3629 -3736 -5195
578 -5195 8306 5753 -5590 69 2195 -8547 -4382 6450 850 -2768 5116 1809 -7546 -2216
592 -2216 3867 -579 480 6866 4254 -3608 -4891 -1042 510 -291 2946 7135 169 -9983 -5209
607 -5209 3014 -1984 -465 10498 3360 -11238 -4154 4847 -2757 373 11748 2167 -9721 -192
621 -192 2975 -4517 2347 8493 -3413 -7031 2268 -555 -3834 4632 2343 -7916 -1664 5028 -1864
636 -1864 742 8050 -2638 -9821 2261 6756 -565 3487 6191 -6627 -10715 536 5080 2829
650 2829 4712 1417 -8167 -9370 -1672 4689 6873 5506 -161 -5991 -7782 -2172 6937 9047 3242
665 3242 -1261 -4263 -8347 -2571 7904 6869 -817 -2235 -4686 -8328 0 8750 3542 -2226 -984
680 -984 -4840 -5687 5797 10176 609 -2653 -1448 -5895 -2897 9102 8086 -2309 -4158 -4835 -7548
695 -7548 641 10214 5078 -3528 -4634 -6423 -6032 5147 12011 4528 -3076 -4948 -6611 -3020 7226
710 7226 10313 3170 -3846 -7357 -7267 -741 7174 7493 859 -5296 -8490 -5431 1936 7722 7070 693
726 693 -6272 -7101 -1513 5102 7558 5864 -1020 -7945 -6746 337 5320 6302 3214 -4603 -9694 -4960
742 -4960 2055 5549 6244 2134 -6195 -8904 -1587 5371 6872 5685 447 -7201 -7389 127 6078 6717
758 6717 4057 -3212 -9449 -6602 1481 5620 5838 2482 -4982 -9113 -4099 3945 7247 6176 1079
773 1079 -5757 -7114 -1481 4339 7244 5465 -1306 -7533 -6486 -300 4434 5604 2646 -3806 -7710
788 -7710 -4759 1315 5913 5956 1288 -4532 -5809 -2016 3210 6930 5608 -798 -5711 -5473 -1314 3826
804 3826 5919 2646 -3966 -6486 -4674 -673 4684 6230 1315 -4481 -5431 -2518 1891 5970 5676 213
820 213 -4077 -4489 -1880 2916 6047 3251 -2449 -4997 -4524 -1628 2904 4868 1594 -3025 -4708 -3010
836 -3010 861 4979 4601 441 -2612 -3650 -2014 2251 5248 3128 -943 -3548 -4010 -1611 2481 3840
852 3840 1328 -1997 -3851 -3786 -109 3559 3336 703 -1496 -2327 -1725 1440 3909 3064 355 -2143 -2962
869 -2962 -1128 1724 2219 1210 -645 -3030 -3255 -283 1915 1711 944 -868 -2558 -1376 1244 2561
885 2561 1894 1122 -468 -2318 -765 1635 2049 580 -187 -1324 -2158 -1209 711 941 370 -611 -1378 -1171
903 -1171 374 1126 956 897 579 -726 -438 1420 1141 -31 210 35 -1019 -654 158 -161 -1144 -447 -116
922 -116 -744 -302 802 274 -642 460 1149 233 223 1158 528 -498 -67 803 292 -657 -407 -417 -760 -393
942 -393 472 43 -1256 -737 -10 -51 646 1788 332 -1325 -234 828 444 1623 2126 -523 -2444 -824
960 -824 -515 -155 1877 1380 -2397 -2735 -417 -771 218 3293 1754 -2574 -1693 637 -233 1215 3927
977 3927 909 -2634 -1109 24 -449 1167 2179 -963 -3335 -1250 -276 117 1692 1464 -1757 -2399
993 -2399 -324 1229 2235 2264 585 -1584 -1887 -315 1723 2904 1263 -1197 -2862 -3213 -661 2233
1009 2233 2374 574 -1207 -3316 -3668 700 4144 2288 741 -33 -3204 -3149 2133 4528 1099 584
1025 584 -274 -4518 -3324 3021 2816 -652 288 -862 -4819 -1911 3854 2364 -627 454 -935 -3139
1041 -3139 963 4169 1447 -348 -421 -2589 -1776 2417 3323 321 -1191 -2523 -3609 -690 2779 2908
1057 2908 704 -1502 -3669 -2324 1175 3542 3599 1514 -2162 -3602 -1522 785 3124 4040 153 -4197
1073 -4197 -3154 -1022 -824 2528 4243 -1304 -4721 -1148 -9 -788 3464 4297 -2304 -3216 1192 531
1089 531 -31 4059 2051 -4124 -2486 1280 -319 578 3135 -1033 -4740 -1563 867 344 2683 2480
1105 2480 -2444 -3228 -219 1008 2121 4007 1225 -2953 -2892 -993 276 2742 2808 -826 -2662 -3140
1121 -3140 -1986 977 3334 1707 -565 -1490 -2527 -1160 2894 3016 467 463 -1154 -3155 199 3706
1137 3706 839 -1186 500 -1900 -3684 1409 3359 -1262 -1134 491 -2644 -1762 3695 2487 -1416
1152 -1416 201 143 -2726 241 4385 1216 -1224 20 -1904 -3015 1614 2926 -360 -373 -684 -3544
1168 -3544 -1655 2623 2065 117 713 -914 -2534 249 2248 1766 1256 147 -2112 -1344 698 420
1184 420 566 1332 -1606 -2557 -254 460 -267 1310 962 -2204 -1012 1479 158 241 2246 -280 -2485
1201 -2485 601 1396 -463 1221 1404 -2230 -2364 601 -56 -412 1720 214 -2798 -599 1312 -704
1217 -704 840 2665 -315 -1980 731 628 -348 1545 1492 -1376 -1002 102 -797 -66 1165 -293 -1378
1234 -1378 -147 -411 -500 1091 774 -859 -130 662 -416 617 1780 -156 -925 719 65 -1168 527
1251 527 731 -1329 -474 446 -1077 -113 1134 -631 -1012 935 141 -846 1253 1349 -854 281 1515
1268 1515 -469 -243 1338 -350 -1378 589 490 -1552 -65 585 -1516 -912 945 -205 -626 983
1284 983 209 -919 907 1043 -288 723 804 -1088 -481 1091 41 -429 788 -576 -2093 -96 511
1301 511 -728 376 760 -1244 -1037 1123 536 -151 1456 584 -1243 153 826 -116 477 1074 -1272
1318 -1272 -1533 224 29 -178 1048 232 -1962 -563 425 -101 731 1610 -466 -1085 594 418 393 1669
1336 1669 940 -1440 -978 134 -519 158 1111 -495 -1644 -631 -333 -3 1327 1087 -644 -755 139
1353 139 -306 1002 2145 665 -817 -397 -712 -374 1262 1278 -789 -1176 -723 -1175 -59 1886 683
1370 683 -1056 -563 -509 -595 1011 1930 434 -285 -490 -902 -164 1865 1193 -384 -679 -1229 -1692 284 1170
1389 1170 78 -376 -670 -1571 -833 1548 1447 281 9 -630 -1199 197 1683 1054 112 -389 -1109 -1310
1407 -1310 360 1004 557 -253 -1277 -1722 -492 632 1152 650 -104 -1042 -926 590 1177 1256 761 -373
1425 -373 -1172 -628 723 792 583 227 -1234 -1652 -529 522 794 1089 3 -1152 -600 239 771 1090
1443 1090 1311 -518 -887 -297 476 580 1044 526 -1106 -1498 -499 77 173 454 -74 -1193 -1087 210 656
1462 656 803 864 190 -863 -528 735 1239 852 417 -275 -1069 -712 370 475 336 -210 -957 -1470 -555
1481 -555 527 771 311 120 -408 -790 191 1149 658 445 -209 -575 -819 238 553 207 -109 -423 -1011
1500 -1011 -743 169 613 -66 -344 -427 -180 -238 725 1324 358 -369 -231 291 225 750 834 -183 -988 -687 -108
1521 -108 -519 475 735 -831 -924 -84 -83 -250 1011 952 -313 -583 498 24 145 1346 417 -707 -74
1540 -74 116 -704 -62 493 -502 -914 -91 -99 -455 215 674 -471 -295 497 508 367 392 508 -203 -239 163 444
1562 444 152 -82 -218 -299 -983 -489 273 111 -527 9 8 -705 192 1126 477 65 506 96 -615 219 841
1583 841 -296 35 531 -717 -905 468 -202 -633 36 201 -671 -338 562 -119 -275 938 457 -226 529
1602 529 553 -669 -272 668 -162 -455 115 -102 -711 -321 -57 -360 -71 393 99 -242 54 32 293 510
1622 510 358 390 76 -138 -38 396 176 -338 75 -29 -566 -228 64 -606 -470 438 -21 -294 589 192
1642 192 -342 225 652 -211 210 1142 -66 -571 347 5 -780 240 590 -604 -608 -289 -296 -709 482 258
1662 258 -597 -37 51 -346 -18 865 348 -177 83 -34 -152 203 227 -124 -284 -240 -516 -261 122 -102 -160
1683 -160 -1 -192 -63 656 469 346 423 -272 -89 578 459 -34 -61 -109 -687 -541 372 45 -295 161 -143
1704 -143 -1022 -207 607 172 78 617 -47 -458 493 733 162 39 490 -565 -646 330 152 -416 11 -190
1724 -190 -953 -188 259 -126 9 205 -492 -278 326 630 395 649 165 -451 -43 408 234 -49 281 -664
1744 -664 -591 -152 -181 188 227 -214 -669 -240 311 217 519 662 -223 -362 371 163 158 719 188 -769 -328 -53
1766 -53 -272 -165 170 -472 -536 -252 145 -55 650 470 -45 -262 269 284 212 867 78 -162 17 113 -357 176
1788 176 107 -530 -616 -251 -272 -170 358 27 -164 -186 -120 1 334 556 359 -40 41 -77 29 541 248 -101
1810 -101 -564 -405 -576 -35 49 -104 -405 -146 -456 -195 279 413 54 91 290 -115 231 431 260 -114 -79
1831 -79 -486 -264 145 -113 -206 -84 -208 -560 -215 231 15 29 402 -159 -51 381 471 116 120 99 -251 -249 13
1854 13 4 -79 -135 -275 -474 -60 183 -92 135 154 -147 167 305 372 75 317 -26 -144 187 147 194 112 -36
1877 -36 -458 -216 15 -134 -132 -88 -70 -158 -124 153 162 468 388 -119 134 126 296 24 99 -16 -257 -227 -34 -210 -62
1902 -62 -15 -344 -318 -35 -47 38 156 206 -21 141 260 175 237 274 -7 -361 -30 -108 12 111 -53 -421 -223 10
1926 10 -269 -60 -105 -22 -60 -32 134 45 322 0 82 182 91 -163 81 137 -4 -216 -243 -98 -441 86 -109
1949 -109 -239 -234 196 -140 2 250 117 128 59 174 23 193 186 -122 20 -102 -52 -49 -163 -128 -163 -490 -200 43
1973 43 17 64 120 185 160 232 450 154 209 201 193 -34 -26 42 31 -44 -275 -126 -295 -115 -41 -294 -248 24 -71 -248 162
2000 162 158 102 194 299 168 115 266 27 -232 119 -88 -348 -269 -26 -107 -242 -84 -146 -309 -150 131 234 47
2023 47 100 198 -11 54 273 86 94 72 26 -306 -75 198 -186 -284 -190 -190 -204 -78 179 159 87 371 234 59 154
2048 154 217 159 240 -136 49 126 -20 10 -211 -216 -92 -387 -221 -21 -106 -108 -21 74 178 90 385 215 121 50 148
2073 148 148 205 0 145 -140 -206 -161 -296 -127 -65 11 -267 -253 76 -143 176 342 385 132 60 241 -123 90
2096 90 375 -140 -180 -67 -171 -287 -126 -114 -285 -292 -260 -6 -236 -11 90 17 -3 205 212 92 222 431 -82
2119 -82 25 77 -104 -207 -94 -260 -158 -431 22 -57 -115 79 153 -30 3 179 132 159 130 221 -241 -91 115
2142 115 -94 -169 138 60 -417 -382 -130 -147 -222 -88 103 -130 39 204 -85 67 219 107 -62 180 216 -118
2164 -118 -106 20 -25 -418 -120 -45 -157 61 -68 -197 -119 273 38 -12 5 83 3 5 158 328 56 94 95 17 85
2189 85 -43 -209 -63 -163 -455 -139 -36 -74 124 -29 -62 59 81 7 148 184 11 160 110 -135 -105 43 28
2212 28 -305 -211 -173 -213 -277 -92 -137 62 76 -28 23 191 396 100 59 251 -41 -56 105 12 -116 -68 -226 -239
2236 -239 -225 -130 -116 -99 -14 55 -29 -90 204 144 351 147 151 222 86 197 250 137 -54 -107 -7 -158 -23 -60 -175
2261 -175 27 -144 -103 -99 7 72 -174 41 32 -38 44 48 120 107 40 -148 76 -116 66 -97 -204 -308 -149 -128 9
2286 9 -106 185 -195 56 75 72 145 364 311 6 -102 111 -84 -96 12 -90 -33 -123 -38 21 -88 -8 37 -18 -17 -122
2312 -122 36 16 200 224 41 -39 47 326 -134 136 -190 -164 -49 -123 100 -144 113 -189 -162 13 219 -38
2334 -38 113 2 -148 146 -56 32 158 185 26 16 -298 -156 -51 -108 -50 -97 -112 -173 -201 -76 18 35 -222 -130
2358 -130 63 -45 18 461 87 34 -257 -29 -120 -196 -57 -33 -154 -337 -12 65 107 -30 -216 -81 53 63 312
2381 312 49 277 61 12 111 79 75 299 -50 -1 -146 -224 -251 79 -46 -200 -229 -196 -56 43 113 243 16 90
2405 90 0 -43 256 276 49 56 -141 -123 -52 -113 -74 -67 -218 -245 -127 -172 246 341 152 111 154 -257 296 486 179 101
2431 101 20 -196 -118 34 123 -2 -148 -259 -343 -214 -102 261 -55 -21 -81 116 44 123 311 43 -16 -2 32 145
2455 145 38 270 -180 -265 -312 -220 -77 280 211 -51 -66 79 -168 174 381 198 -24 -124 48 174 54 69
2477 69 237 -363 -353 -230 -93 26 105 -96 -191 -49 -12 -73 106 61 -2 20 27 -70 96 316 219 -132 -179 -157 -108
2502 -108 -30 -82 -94 -119 -279 -265 -86 103 -1 32 -79 91 141 138 372 231 17 -1 -40 343 186 155 -84 -126
2526 -126 -193 -289 53 125 118 -69 -84 -443 -53 220 355 248 174 127 -74 122 146 -36 84 -36 -36 -254 99 47
2550 47 13 -193 -103 -109 -285 148 379 267 54 81 -5 195 -69 87 154 3 116 -129 -1 -291 -194 19 -198
2573 -198 -154 -48 -190 -56 42 122 -48 -5 226 49 266 180 26 2 200 59 -54 -104 68 -96 -265 -31
2595 -31 -316 0 158 -7 -186 -44 100 78 -40 276 -14 -80 407 -29 -19 133 174 -86 -162 -350 -90 -122
2617 -122 11 53 -50 -188 -25 198 -144 114 200 136 45 275 207 233 243 193 -85 -42 92 -128 -82 -37 3 -297
2641 -297 10 17 32 -118 130 194 36 34 59 203 23 36 122 -20 -120 -37 31 -108 20 9 -429 -341 37 -115
2665 -115 -52 268 56 9 10 199 172 167 390 213 -96 -31 -228 -113 -3 255 -131 -167 51 -84 -259 -177 214
2688 214 -27 -81 112 161 62 327 214 122 122 -15 9 47 34 29 213 -236 -202 53 15 114 82 -115 -244 179 100
2713 100 238 281 253 82 -28 170 134 52 99 100 -101 -212 35 40 -97 -15 -122 -299 -299 -250 97 87 109 99 -235
2738 -235 45 -15 62 161 130 -69 -285 -78 122 77 149 -23 -34 -334 -202 -15 209 87 -156 -269 -188 124 159
2761 159 204 195 -77 -172 67 77 264 227 -235 -328 -201 -219 39 -10 150 -207 -453 -56 -85 283 451 73 -25 -66
2785 -66 -61 -102 306 305 217 -193 -138 -254 -82 406 147 -163 -444 -317 -168 118 341 123 43 -97 -205 -84 628
2808 628 286 17 -82 -241 -174 -130 161 90 -22 -318 -218 -114 91 -29 60 194 -179 -282 -80 357 409 182
2830 182 89 -262 -418 95 225 346 74 -68 -214 -161 182 211 57 89 -116 -416 -234 127 340 283 99 -52
2852 -52 -183 -15 290 316 98 -143 -404 -269 94 129 243 315 -328 -487 -131 259 178 73 132 -421 -379 102
2874 102 99 380 330 155 -330 -279 -103 56 175 72 -230 -202 -342 -268 233 270 -63 -144 -24 -143 371 406 503
2897 503 47 -185 -318 -95 109 365 144 -119 -165 -442 -407 55 273 -48 -94 -181 -249 -5 405 143 -165 -16
2919 -16 -3 -120 94 408 18 27 -126 -175 -34 -72 -31 124 31 -133 -140 10 294 293 23 -153 -116 106 -21 86
2943 86 288 248 -102 20 -103 -94 -9 279 9 -20 -263 -128 251 -92 79 34 -124 50 -56 152 115 140 15
2966 15 -198 290 -28 4 -11 -20 -191 -112 -28 8 55 177 66 -317 82 -3 -151 30 107 70 22 89 277 -120 -206
2991 -206 -73 -92 -366 -6 -47 60 -147 257 138 -46 -225 -92 68 149 114 160 -105 -181 118 -56 2 273
3013 273 159 60 -112 -148 100 23 275 -18 -151 -94 131 16 234 366 186 -252 78 -19 250 196 367 240
3035 240 -129 -65 -98 -47 92 49 -155 -573 -120 41 130 286 32 -140 -228 23 -84 314 146 278 9 -96
3057 -96 -96 192 76 39 -117 -261 -273 -133 240 -40 157 57 -226 -25 34 171 299 -54 38 -287 -243 142 203
3080 203 86 -50 -225 -437 -306 115 195 88 0 -275 -445 -94 216 253 246 -32 33 -382 144 162 316 98
3102 98 9 -378 -296 202 44 -22 11 -312 -406 -49 221 445 51 -41 -110 -375 -51 519 279 202 -94 -102 -421 -6
3126 -6 148 372 -110 -268 -379 -531 26 366 388 -209 -246 -265 -90 43 621 195 -86 -122 -217 -29 150 310
3148 310 95 -120 -489 -115 -117 80 303 -53 -273 -341 -296 36 519 148 -155 -280 -177 -84 189 353 187 -37
3170 -37 -383 -155 44 174 302 247 -281 -350 -80 49 256 407 49 -342 -233 -212 174 273 457 -9 -141 -463
3192 -463 36 55 276 52 -157 -392 -416 -70 301 242 89 -242 -253 -218 133 277 200 86 -265 -317 -28 168
3214 168 146 32 -115 -576 -344 111 82 33 -38 -145 -312 -266 210 46 362 142 -90 -196 111 142 322 89
3236 89 52 -38 -211 28 63 196 67 -137 -71 -26 -30 374 -69 194 -123 -115 -172 111 217 431 -95 -40 -243 -150
3260 -150 -22 67 287 -138 -310 -159 -186 -57 260 -74 22 114 -116 -16 153 75 316 -79 152 -70 -52 269
3282 269 215 136 -113 -50 -29 -7 155 132 -11 23 56 -62 87 74 169 61 32 -233 191 -143 150 101 -9 -90
3306 -90 14 32 163 27 84 109 -265 -200 -38 -68 159 80 72 -143 -142 2 -125 198 2 -207 86 -40 -120 -11
3330 -11 -217 -124 -292 -7 -159 -191 157 69 90 79 165 140 -111 34 377 66 -18 120 7 88 -122 263 141
3353 141 -39 -329 -231 -132 -194 74 -139 -303 -192 67 147 207 284 128 -78 -126 -18 44 111 105 -217 -292 -479 -71
3377 -71 -78 205 165 -18 -71 -199 19 163 370 172 -91 -138 -241 299 177 -10 117 -15 -126 -335 -50 121
3399 121 108 -82 -279 -126 -135 78 111 207 -59 -69 -255 114 62 245 -107 10 -257 -199 -100 38 364 142 -253
3422 -253 -299 -30 -32 190 186 -46 -190 -272 -140 105 244 381 -45 76 -157 -294 215 175 59 -194 -350 -295 12
3445 12 257 83 -109 -151 -340 -190 150 271 140 172 49 -41 -6 133 466 111 -230 -239 -455 15 219 275 -85
3468 -85 -161 -362 -170 101 169 84 -6 -2 -206 -1 211 158 134 -3 -162 -234 -84 63 181 208 -98 -270 -144 -102
3492 -102 70 -18 -139 -114 -414 -258 79 345 282 103 -87 -252 -233 196 347 157 -73 -167 54 91 -92 231
3514 231 197 -171 -169 -171 70 182 281 150 -121 -50 -36 274 214 79 -10 -142 -211 -87 9 404 115 -67 -203 -163
3538 -163 195 143 240 77 -35 -9 -12 49 259 208 -205 -137 -35 -64 60 259 145 -100 -135 -206 43 266 189 45
3562 45 -123 -127 83 -36 246 148 25 -176 -407 49 100 123 115 110 104 -340 58 62 118 -38 -157 -108 -41 61 93 67
3588 67 -55 -81 -72 -9 249 236 97 0 90 -300 -164 -140 31 -37 -12 -275 -71 88 190 82 19 -68 -163 -206 -10
3613 -10 37 160 -108 -28 101 64 -169 -5 -53 -31 -158 -156 -97 -90 152 -69 -16 -7 -110 84 61 172 6 -51 -9 -60
3639 -60 157 2 -61 13 -36 -86 14 -144 19 72 -99 114 213 83 126 119 51 10 -94 -147 29 22 3 -135 -4
3664 -4 191 205 -66 -18 14 -69 -55 -59 55 151 297 -50 115 155 132 50 138 -81 55 -54 -102 50 -131 -114 90
3689 90 -104 111 16 -137 -116 100 -44 89 144 95 230 156 -12 168 127 155 44 -116 -131 13 19 52 8 42 -111
3714 -111 -86 -60 -33 204 -23 -126 186 -155 -35 -203 100 90 62 -52 -131 -104 -243 109 -107 -158 -214 -150 18
3737 18 -130 108 8 73 120 -118 -58 -44 238 130 -50 -20 -76 118 232 -82 -103 -208 -131 123 383 118 -148
3760 -148 -13 -181 -157 326 76 369 -62 68 -98 -78 22 202 252 70 -65 -233 76 156 211 77 -120 -77
3782 -77 -113 56 133 119 49 -90 -118 -141 210 272 139 -121 -359 -139 87 160 303 22 -103 -220 9 33 122 325
3806 325 23 -117 15 66 212 273 254 29 -88 -117 -16 163 219 107 -134 -199 -79 58 84 125 -23 -347 -268
3829 -268 -236 76 167 231 -5 -246 -173 -37 166 248 101 -38 22 -204 -284 91 -33 -72 -227 -215 -311 53 364
3852 364 340 128 -30 -69 -14 104 50 -41 121 -23 -52 40 -212 -15 -21 -130 -293 -300 -61 167 47 192 -90 -88
3876 -88 -95 280 131 164 163 127 24 55 133 148 104 -207 -214 -3 -124 81 275 -76 66 -310 82 3 101 141 70 -133
3902 -133 31 63 50 107 44 94 -223 -111 102 42 -34 22 27 7 -116 123 123 -27 75 37 -36 100 69 248 -71
3927 -71 52 -39 -31 -20 -66 63 -87 4 -198 -39 -99 61 89 7 -40 91 145 96 44 239 -95 47 124 -63 28
3952 28 87 93 38 -278 -162 -89 170 209 -135 -149 14 -25 41 -107 247 -36 31 -31 -2 54 -75 35 -39 145 -97
3977 -97 12 -2 43 -318 192 164 -216 187 173 -20 121 33 -202 44 29 229 -63 135 -185 -112 -47 -47 -113 -10
4001 -10 38 -200 -18 -5 -180 -13 -221 39 84 193 31 -190 66 -200 -45 -75 152 -13 31 152 -30 99
4023 99 120 251 348 -178 -43 26 36 -75 169 119 186 -103 25 -126 -9 -23 -216 -109 111 79 -200 115 29
4046 29 -105 -79 -67 77 210 -2 -46 70 0 111 114 136 53 129 -24 -40 71 17 -164 -99 153 -151 98 1 191
4071 191 6 -140 -124 76 5 61 210 138 -163 -52 212 -107 -57 106 38 -54 -360 -120 57 178 -7 -70 -179
4094 -179 46 20 135 72 122 -182 -132 -35 48 47 124 -86 -162 -203 -192 16 -3 4 -37 2 -190 -28 -78 -32 87 -41
4120 -41 -242 101 311 51 15 110 -177 -92 -124 -164 53 -131 151 -150 -109 -85 129 77 -2 -222 -212 21 -70 98
4144 98 215 66 -33 -68 179 228 147 -48 69 -63 -167 -44 341 113 74 -104 -248 -69 289 367 75 131 66
4167 66 -201 14 -27 263 127 -90 65 -73 81 -14 96 353 -70 -198 -119 -88 60 291 -36 -252 -49 39
4189 39 -147 223 67 90 -231 -47 46 112 136 92 -235 -248 133 -117 105 31 -41 -111 39 62 -75 221 322 190
4213 190 -134 -11 -13 -147 152 146 90 -132 -1 -115 199 172 120 85 -62 -189 -23 39 68 103 -90 11 -23 53
4237 53 49 116 20 -76 5 -26 -20 -158 -46 -145 -26 -241 66 -116 -19 99 -189 22 -49 15 114 20 54 75 130 70 56
4264 56 96 148 -59 -360 -25 -278 63 75 2 -138 84 -43 123 163 154 57 86 6 -55 22 11 134 -51 -187 -4
4289 -4 18 22 1 -164 -22 -34 -40 -270 -93 -263 63 -138 -163 29 38 40 55 -61 15 61 -68 158 -17 146 -127 -36
4315 -36 -117 -251 123 47 168 -53 115 -61 21 111 94 80 87 -37 76 85 -128 26 -111 -83 30 -140 -110 272
4339 272 87 29 -163 -22 53 -88 -91 187 261 -193 -217 -49 -354 128 -120 -7 59 -22 1 -79 187 -201 29
4362 29 18 -98 59 -27 40 -82 -59 47 -19 196 -8 -13 237 128 139 -55 27 -145 -23 86 259 112 -77
4385 -77 -113 52 42 122 254 -2 22 91 83 49 48 317 89 -118 -256 228 17 52 -89 -186 -87 -45 88 347 -41
4410 -41 -31 29 -361 276 357 14 -203 174 -82 8 21 -116 100 -106 -104 -200 -200 -62 192 -171 53 70 -202 -91
4434 -91 55 170 -34 4 -116 -7 128 74 -35 15 25 -147 -94 173 125 -87 102 -23 -12 -83 131 89 144 -21
4458 -21 -197 -65 46 130 146 14 148 -123 -130 -60 55 1 9 -29 -230 -175 8 -8 142 -124 69 -191 -154 228
4482 228 66 -71 -163 -314 -56 -45 179 253 59 -72 -169 -115 81 16 59 -105 -161 -152 -225 -140 139 48 33 -43 -100
4507 -100 -32 -129 -17 87 -80 -40 -18 171 176 153 -52 -40 -182 154 71 144 -191 8 -44 -106 -203 -56 105 292
4531 292 -101 -253 -93 133 45 285 44 60 -35 -318 -115 189 106 -142 66 -43 -321 136 469 -82 -62 -110
4553 -110 64 -25 4 152 129 -113 -64 54 25 94 87 -78 -20 -9 2 12 112 26 173 -14 -235 -6 -31 -19 -30
4578 -30 -37 -147 -152 144 232 182 -167 -38 -72 -79 -160 -50 197 16 84 -9 -84 57 285 194 -150 -109 -202 -146 -39 -230
4604 -230 70 -3 28 -279 -34 51 10 -51 -150 -62 -39 49 300 27 -88 -181 -2 78 -138 -101 -83 67 -27 -54 -55 34
4630 34 -110 -86 -126 61 -42 281 113 176 99 14 24 74 19 303 53 -109 -12 -192 -166 48 111 -10 -64 1 -13
4655 -13 -97 -1 120 98 -91 -157 -48 -11 126 25 150 -35 -24 -33 -156 157 126 -47 -183 55 -182 153 18
4678 18 -38 95 17 15 130 50 57 119 -7 -70 -238 -80 68 -26 87 10 80 7 -174 19 51 -16 -79 59 74 93
4704 93 113 201 119 -120 -110 63 147 -74 44 -46 98 30 13 -96 -204 1 89 144 80 -136 -116 -46 43 217 -49
4729 -49 -42 -155 -42 6 46 -129 89 66 -242 -31 129 19 -48 129 31 -69 -3 140 175 47 47 -75 -10 -143
4753 -143 -132 120 171 -197 60 -93 44 144 23 40 -55 -282 133 70 129 73 -73 -139 -108 -180 227 109 155 -244
4777 -244 -187 -196 -183 -85 153 -25 -31 0 -221 -29 120 49 -30 -242 -77 -2 121 177 52 -52 22 61 -65 -19 156
4802 156 -20 -133 -149 -109 174 302 17 272 -129 -6 80 -21 284 6 -37 -32 -38 68 182 230 -16 -128 -106
4825 -106 -255 -213 -22 -42 -32 -109 -77 -96 52 284 224 101 -159 -28 -37 -52 72 104 27 -321 -26 -72 18 69 -33
4850 -33 10 20 -254 107 -1 94 -103 111 -170 -100 79 236 108 28 -22 -67 92 -30 67 107 -157 -140 -155 -1
4874 -1 19 158 85 -29 -260 -61 223 31 138 -185 -121 111 16 149 31 246 58 -178 -188 -64 108 104 11
4897 11 -49 36 -1 2 158 353 -101 38 -162 -55 152 -34 137 57 -139 -206 -40 136 25 122 -196 -302 -36
4920 -36 -83 85 17 81 31 -71 106 185 99 186 -15 124 -168 -82 -92 51 183 -125 -273 -34 -137 91 14 30
4944 30 9 -12 134 -64 171 386 108 -110 -1 -111 52 76 81 44 74 -124 173 48 -19 2 -40 123 121 63 103
4969 103 151 -107 32 -2 33 79 163 -8 147 -119 -53 -116 254 3 -3 -68 -24 19 -60 140 142 141 49 -72 -105 48
4995 48 178 33 31 9 -103 13 -63 -118 14 -127 -37 -46 75 52 -210 46 -57 100 25 126 -84 184 227 171
5019 171 84 54 219 154 -72 -71 -28 127 -25 59 49 -31 -121 -153 -132 132 21 -16 175 119 -10 -16 151 94 -154 119
5045 119 83 -103 36 92 -55 -189 -26 187 -21 92 128 32 45 48 2 -7 -41 41 102 43 33 90 -31 28 -140 -49
5071 -49 113 178 152 46 -138 130 -30 20 36 91 12 64 -20 84 -4 190 -34 65 -80 40 -41 135 161 46
5095 46 -80 76 113 -16 242 64 -14 172 108 -165 -71 55 245 -65 199 -140 57 -154 77 13 -78 19 -132
5118 -132 -128 4 197 99 180 -169 80 92 139 117 5 -302 -230 -167 227 -1 29 18 -26 -102 -34 -232 163 101 -50
5143 -50 -71 163 251 65 81 281 132 18 -15 98 170 38 77 131 -202 -150 -1 80 69 83 -308 -254 144 -112
5167 -112 50 57 6 -39 110 -26 89 45 79 3 -180 -3 101 12 122 124 -61 -24 -54 234 -16 321 90 40
5191 40 1 -245 50 102 -129 -134 42 -155 43 101 -118 15 -176 -3 -15 -172 -9 164 -156 -100 -265 -81 -47
5214 -47 104 -43 -263 -12 -168 202 54 -63 -108 -14 -171 -129 -15 220 202 -172 -106 -167 -100 2 108 263 -102
5237 -102 -49 -117 62 196 -21 -16 -120 -255 -67 -27 276 62 -132 -38 -187 76 49 172 -23 -82 54 -39 18
5260 18 208 87 -44 105 21 90 -64 70 31 163 -75 -6 -16 70 89 127 137 -11 10 27 78 204 72 42 -26
5285 -26 -170 106 75 118 88 20 -106 -93 -84 -29 -170 -24 -256 -40 83 -91 36 72 -85 -5 -93 -43 230 -9
5309 -9 152 -68 -1 -6 15 184 114 -131 -66 -205 88 111 -32 -37 -135 -155 -299 -66 -88 215 -13 -49 -93 -52 75 35
5335 35 -15 90 55 -112 49 100 -15 -255 21 82 65 29 139 114 -272 2 17 -61 35 171 -282 250 105 -44
5359 -44 139 -78 135 -86 31 -13 -158 -153 104 56 101 -135 94 103 110 155 210 264 -54 -30 9 32 -57 -125 -234 -60
5385 -60 -148 -43 139 -122 24 19 87 32 105 17 -35 -90 -142 13 250 29 73 -36 59 -89 -9 -29 85 -180 -136
5410 -136 -1 -4 -93 67 103 24 76 53 -62 45 197 44 -37 -59 -84 -104 162 -118 85 64 -277 -89 153 52
5434 52 -58 85 -12 -115 5 115 33 18 -209 -101 27 182 92 84 -12 -157 -76 -134 -28 8 -35 -22 142 -85
5458 -85 110 -40 85 -1 -50 -114 142 23 42 138 33 51 -5 -19 8 -146 -142 87 -91 18 49 188 -38 74
5482 74 -223 76 64 34 35 346 80 -94 -104 -69 9 -93 41 -166 -131 -86 -108 -115 92 49 8 -157 -37 61 157 -2
5508 -2 -23 113 -71 11 -100 37 58 23 -277 -44 67 -123 26 219 -147 69 -37 -61 98 21 -7 -160 0
5531 0 -82 215 175 -135 -9 -45 -56 11 156 13 -189 -166 -95 -38 11 108 107 14 5 -32 -35 187 33 35 -18 19 -5 -132
5559 -132 -7 166 159 -77 -2 13 34 144 -125 22 -20 -18 -19 -27 277 103 -24 71 39 63 61 -83 -230 46 -17 -88
5585 -88 -86 78 47 8 55 -36 118 -69 133 121 -146 -127 15 96 -18 12 -39 72 -85 138 82 25 -7 -114 -32
5610 -32 109 117 -106 -35 47 3 -22 26 -166 145 193 -184 -91 -94 -77 -40 -95 48 -52 121 -186 -35 247 -1 64
5635 64 -52 -41 16 -158 123 119 25 73 -39 57 -174 16 -35 -85 61 -82 176 220 -55 -5 255 62 151 143 218
5660 218 60 45 36 10 61 85 -22 220 -1 -38 147 -253 35 106 -31 -163 144 -78 -138 -52 -86 -10 38 -87
5684 -87 -239 8 168 -101 -34 166 -157 -177 101 140 1 83 -202 -15 8 38 -25 14 91 -91 -169 -125 71 -34
5708 -34 -31 -68 -173 40 18 -98 -106 62 166 -96 227 28 200 110 27 34 77 198 95 143 -175 -89 -75 -84 152 32
5734 32 29 38 -51 4 130 -36 31 -45 -18 -54 120 159 -5 146 -212 4 -86 4 80 127 119 -195 -117 18 45 76 124
5761 124 72 130 -125 119 -90 13 -42 59 -128 -17 64 119 253 238 159 -129 -205 -59 -165 58 63 109 -103 35
5785 35 -21 -50 -101 29 -68 -355 121 6 56 28 34 -139 -50 -5 213 69 -130 -108 -117 72 59 230 95 -51 41
5810 41 69 18 -29 52 -112 -79 43 96 112 92 148 -18 -81 -36 44 141 186 164 -222 85 76 -174 -69 20 -34 -87 -155
5837 -155 -6 -18 -110 86 -85 55 82 84 -18 97 107 -29 52 -235 94 73 16 53 -80 -121 -203 107 -53 -120
5861 -120 -7 154 92 -114 126 23 -23 108 -129 -127 -41 -233 102 -123 -159 -94 -72 76 -49 124 -64 -43 16
5884 16 109 172 135 69 -13 194 -32 83 -67 44 57 43 -97 -4 95 78 -21 -93 143 156 -84 109 -9 14 -85
5909 -85 106 32 -80 124 94 141 -44 99 -150 145 -21 -19 -78 -47 40 -62 83 4 92 100 -80 35 -60 59 -30
5934 -30 193 -55 -180 -25 -176 -180 131 47 6 134 119 -95 44 96 -80 -41 131 151 18 17 35 43 -162 -104 22
5959 22 13 80 149 -260 -69 15 -29 -110 1 -5 85 133 179 123 203 -137 -58 79 -17 186 -27 -93 90 -209 -119 81
5985 81 143 -54 32 -124 -186 124 144 -38 77 -79 -164 95 219 -24 67 -148 9 -37 78 86 79 73 98 -138 -110
6010 -110 -139 171 -48 -210 53 -35 -87 77 336 -33 104 -94 135 33 -145 -48 -314 18 -244 -53 -131 93
6032 93 -110 -200 104 -65 -313 -39 151 182 202 61 -55 28 -75 6 82 -80 0 10 -52 -34 -87 144 -63 -44
6056 -44 -2 175 67 64 87 -19 -117 -56 -19 136 193 -30 -161 -118 111 99 -17 120 59 -131 22 82 36 125 -117
6081 -117 6 105 -32 -102 -3 214 -14 61 104 134 28 -6 79 -269 -102 -122 126 -216 19 168 20 -95 -136
6104 -136 -36 298 197 -29 12 -2 8 -32 115 46 121 31 -67 -1 -27 41 253 13 132 -51 -103 -167 -90 132 129
6129 129 101 132 -89 195 96 118 -5 25 169 -16 -85 -9 138 -38 71 -141 151 68 121 -168 -124 5 -46 79
6153 79 -188 58 -181 -58 91 -120 16 116 25 -59 -89 68 62 126 -50 15 -87 46 147 174 -112 2 -13
6176 -13 115 -92 -107 184 -1 -158 -67 20 40 -92 204 198 -111 -36 -213 79 127 12 -3 252 -66 -21 98 -206
6200 -206 118 175 1 -114 -119 -97 -13 109 -143 36 -177 -155 -108 123 -93 70 -13 107 -28 -187 118 -172 74
6223 74 -174 -34 46 -17 171 335 24 -17 203 -211 -124 -102 103 69 150 -91 86 231 166 108 88 -43 -105 -28
6247 -28 131 125 -181 -15 48 -89 44 48 35 -60 26 85 -199 -102 8 42 -22 83 -58 -73 20 123 25 117 -81 -163
6273 -163 -141 20 43 61 -10 -167 -267 -175 -16 194 70 157 -27 -24 -172 -7 78 133 -86 -120 -6 -25 88 35
6297 35 -185 33 -9 -54 120 -56 54 118 -55 74 46 -47 -55 -21 72 -126 40 -36 53 168 216 -11 -1 -2 -32 49
6323 49 13 -26 140 28 2 159 -7 72 202 14 32 30 155 81 80 -17 27 132 112 34 -178 57 49 194 149 -105
6349 -105 148 121 77 -14 59 -164 101 5 81 -1 -111 -44 -17 8 -46 58 146 -204 -57 156 -109 -143 40 -194
6373 -194 21 -183 -168 -24 -12 -25 -17 -70 -99 -26 -18 39 -146 -125 -173 -138 -114 -53 -45 53 221 -214 -32 -50 63 -31 -218
6400 -218 140 99 86 -35 57 39 4 -15 -102 46 73 -45 -43 -240 -101 62 112 -65 -116 -117 110 112 -16 -141 41
6425 41 10 84 -46 -129 -25 93 30 42 -39 44 20 30 42 -147 98 -74 -227 -16 104 42 25 66 -47 -28 25
6450 25 -45 15 -32 113 22 -82 -165 -126 -66 127 62 54 -59 -137 87 16 88 55 -77 -69 32 42 30 -30 32 -104 -114
6477 -114 -67 24 -12 -79 -129 -46 -23 39 252 83 170 65 -124 -120 19 113 -107 143 149 -92 -86 -180 -28 -137 -130 -97 -39
6504 -39 -129 35 -64 200 113 -105 -191 9 41 158 135 -136 -59 -141 196 23 76 25 90 -194 -207 -282 41 54 39
6529 39 -120 -72 -128 -33 -32 89 3 21 -73 -142 45 49 201 151 -8 -308 93 -25 -29 55 88 -49 -296 206 56 45
6555 45 30 58 79 26 74 96 235 212 84 -251 -230 96 85 -51 -58 -34 -153 -47 50 140 -42 131 159 -171 -90 -41
6581 -41 34 93 -102 -17 -12 -38 49 157 21 -109 -90 -108 33 116 171 71 -17 -15 48 164 125 133 -56 36 -129 109 18
6608 18 152 82 -72 24 -33 -23 72 143 53 44 -188 77 65 129 21 -26 -98 -110 -244 73 213 -188 63 54 -148 -76
6634 -76 38 -152 7 -10 149 38 65 -34 194 -18 -71 74 -182 -71 56 6 -61 13 64 134 -24 76 -31
6657 -31 -96 -193 -57 74 -87 93 87 -240 -12 -116 70 106 -86 63 -10 176 -30 -13 -9 91 27 128 196 138
6681 138 -34 -85 72 44 63 6 85 109 42 99 79 -7 -168 -137 11 -112 -32 -31 -45 -65 -82 -125 -162 7 -40 -26 -37
6708 -37 -62 -85 -2 154 215 -253 -105 229 89 -17 -5 -18 -77 37 127 263 93 2 12 66 -149 61 92 119 -83
6733 -83 19 -83 31 103 -65 -80 34 33 68 -27 -13 31 -23 -74 82 43 142 -105 110 21 153 12 -50 5 128
6758 128 103 0 61 42 123 -66 -91 -88 111 82 -183 34 138 -66 93 97 104 37 82 -35 161 75 19 -39 -21 66
6784 66 138 218 1 -259 89 -293 142 171 -95 -13 72 -58 -123 -37 35 74 -26 -63 116 -13 54 90 -35 37 -77
6809 -77 -69 -139 184 -217 70 88 -201 -269 -115 -67 -188 -18 -52 153 -72 -35 21 -18 161 -39 -4 -97 167 32
6833 32 213 -151 80 250 -111 162 274 92 -104 -75 -1 -91 69 220 42 188 35 -17 -107 -21 106 -115
6855 -115 10 -172 1 -29 145 -21 97 90 32 -163 15 -58 -37 149 73 -77 -243 -96 -2 32 30 -122 -257 -70
6879 -70 255 -94 183 12 92 -24 66 140 -51 -23 -128 -49 251 163 84 361 145 91 -178 75 84 -47 3 128
6903 128 -235 -77 -157 48 -16 -119 -183 -83 31 -66 -69 -213 36 145 -50 -110 -185 92 148 -219 -153 -63 -40 124
6927 124 341 33 -149 -126 -180 136 100 45 46 -216 98 -64 90 -52 139 183 9 -53 -289 369 -105 126 -57
6950 -57 -33 22 -237 117 329 -47 -19 -113 -2 -30 139 184 47 13 -199 -8 47 -19 -115 96 23 -24 6 17 -17
6975 -17 142 -118 -174 -40 -150 21 18 -85 -198 -75 -114 6 162 -35 -34 17 -196 -122 72 222 7 25 -70 -188
6999 -188 32 43 91 147 100 2 144 -287 -48 118 160 -94 -13 -298 82 -5 63 -46 -117 -43 -24 68 73 72 10 4 -12
7026 -12 120 277 102 25 -8 -157 8 -134 255 72 41 -72 -75 34 293 296 116 -48 159 70 -46 17 83 -66
7050 -66 74 91 -177 187 -20 -101 23 18 -172 116 101 124 -94 6 -129 -122 112 51 16 175 113 -189 115 -88
7074 -88 75 -100 -2 78 75 -173 -146 -17 -4 108 175 -93 -178 36 131 17 202 149 -8 117 -18 197 31 70
7098 70 -54 -127 -89 -18 89 184 57 -95 -301 12 -19 40 11 158 42 16 36 11 -11 284 -27 -47 -97 -27 -34 12
7124 12 -14 117 26 105 59 16 -35 45 100 -125 -10 2 141 -94 -158 62 199 -239 -11 -61 -76 179 82 -1 -264
7149 -264 -33 382 76 -38 90 42 53 1 -47 240 75 -91 8 -78 56 1 103 -7 19 -126 -86 160 -34
7172 -34 68 15 -9 -95 27 157 -5 -12 -72 -91 -137 -32 208 97 28 -95 -196 -121 -1 16 -86 134 74 116 56
7197 56 120 -42 79 -161 86 -80 -55 -62 81 8 -84 25 -1 91 116 -57 212 -167 -104 -89 -179 220 -22 -1 48
7222 48 -17 -42 2 137 -99 85 -88 -129 -19 221 278 17 119 -247 129 100 -10 180 -92 -17 46 -135 -246
7245 -246 168 188 -14 -302 30 42 70 301 -24 71 -244 -31 151 -22 14 147 -198 -78 -73 6 266 -17 109
7268 109 24 -147 -139 195 -47 62 130 -6 -106 -93 -8 84 130 19 16 -158 24 -182 116 25 13 -114 -11 -3 240
7293 240 -192 101 38 34 80 235 276 -112 0 -6 -81 -8 -28 -47 113 178 -92 -75 -72 117 -148 -119 2 -38 -32 -15 200
7320 200 48 81 -135 -34 120 45 14 121 -26 -159 -166 -178 23 107 -51 -75 -82 -86 59 82 244 127 105 -93 -135
7345 -135 -19 110 200 98 33 -68 76 -76 124 -148 173 -71 33 -54 126 29 27 -68 -201 -4 71 34 41 -130
7369 -130 -166 -164 73 111 -1 -127 -153 -6 -178 34 64 -90 -33 -42 -60 -80 172 -88 122 34 165 -93 -76 -92 -64
7394 -64 128 109 -76 241 119 93 -46 120 83 -33 -96 -132 240 284 -16 -9 -4 28 -92 -105 65 143 88 -24 -141
7419 -141 21 134 -28 88 81 99 201 38 42 63 93 -60 -172 52 -4 -73 63 -80 -40 63 81 167 -47 -78
7443 -78 27 -78 37 208 64 256 76 113 -57 -21 -11 80 -148 25 -20 250 -219 92 333 76 144 -69
7465 -69 126 72 -77 -80 -35 121 -105 33 150 130 -165 -15 -210 -167 -129 -280 -58 124 1 24 13 67 -159 -1
7489 -1 120 227 -144 -232 -111 -153 -26 205 76 51 -8 108 -120 -86 12 -107 44 -178 -111 -25 -157 52 2 125
7513 125 17 -117 62 -43 -88 387 20 2 70 -91 -66 56 11 -67 -105 13 -1 118 256 13 -47 -25 -249
7536 -249 83 143 -46 -142 -107 -4 55 -11 -16 -184 -104 -42 -93 -160 -20 26 -75 5 80 117 -101 201 -48 -21 24 -27
7562 -27 -19 -111 304 56 186 -42 149 169 153 187 -171 -81 26 90 -17 -57 31 -69 16 -163 -174 130 -75 10 102
7587 102 12 47 163 -75 33 -68 21 -114 -4 100 8 272 -103 -39 -37 75 213 39 68 -72 -120 -127 17 165
7611 165 154 138 -114 -53 35 27 151 48 124 -76 -201 -109 -132 74 -78 145 -30 -129 151 65 194 99 51 28 80
7636 80 -180 139 -64 196 44 27 131 -13 7 10 -76 156 240 9 -123 164 65 214 130 -133 -31 23 170
7659 170 -65 96 -79 -146 -2 30 61 -8 130 55 -74 206 67 -17 23 167 -191 70 167 105 -126 58 -64
7682 -64 -118 81 53 68 75 104 123 -105 -40 -71 146 -89 -46 -109 -264 186 -117 6 26 -122 -125 37 -8 106 -74
7707 -74 197 16 -2 49 -144 -169 -107 -18 -39 -91 -136 137 74 -39 -84 103 1 14 26 -45 120 -8 -36 -55 -274
7732 -274 -37 255 -81 -2 -53 111 196 -64 -45 -54 -230 -117 -103 40 120 97 44 -74 65 7 131 269 136 67
7756 67 -5 -35 9 57 16 -100 42 -133 -6 -73 207 56 -116 -48 -148 139 -87 -10 -39 -36 3 -214 -28 13 -8
7781 -8 -16 -66 123 104 -33 21 70 -11 204 130 193 -85 16 -43 137 -36 152 7 77 69 164 33 74 107 -109 -35
7807 -35 37 -13 -179 50 -117 -17 131 102 -246 -136 -171 -26 -21 35 124 7 -55 -57 10 -79 -82 72 20 27 2 -228 -7
7834 -7 1 63 -82 -29 -242 1 -225 30 -115 40 52 -5 -32 -38 -1 17 126 13 -148 19 30 -32 233 71 -16
7859 -16 -222 -193 9 167 183 -152 -27 -165 -65 39 64 -67 -153 -89 -23 163 15 224 -136 30 26 -192 -29
7882 -29 75 165 -61 52 -6 31 -14 -24 82 121 80 -135 -112 40 134 32 32 43 -208 77 248 118 -85 -187
7906 -187 -77 -80 -21 138 -44 -52 -193 -226 -153 93 -43 -65 145 -20 -214 100 -14 -45 128 94 116 -82 -63 155
7930 155 208 81 -160 -186 -115 -14 9 -21 -32 -208 -10 175 -140 104 -19 -9 -128 -182 1 -107 99 -1 98
7953 98 84 -48 98 132 -5 -54 29 66 59 -53 9 84 -195 -58 34 10 241 -59 -25 -89 7 -31 -42 226 116 -20
7979 -20 -100 29 109 -11 288 73 61 95 -165 -12 -168 138 -38 111 -64 114 -59 -100 13 48 -80 154
8001 154 -53 -84 -120 -188 138 26 -217 106 -10 93 151 -87 14 -43 -52 -14 59 -191 -99 -145 -76 5 79 -110 -82
8026 -82 -46 -172 -88 54 160 82 -13 73 -31 -45 -94 29 -42 -185 0 -226 68 -108 57 -11 -158 7 -127
8049 -127 19 -69 37 195 -4 24 128 23 -28 -53 11 10 21 -228 -56 35 -240 -118 -183 77 141 -222 85 -43
8073 -43 -73 -72 -25 207 183 66 -8 26 26 208 114 -51 -9 -70 67 7 122 60 223 -39 100 21 -45 25 -8 -211
8099 -211 102 55 70 -48 67 60 -18 24 109 1 -160 226 59 -19 123 105 64 63 103 48 -117 22 -10 52 -94
8124 -94 -88 17 100 73 93 50 -210 -116 -19 -24 -82 8 -52 -78 94 -33 -21 141 -237 13 105 22 -5 -144 163 114 17
8151 17 -90 -81 -45 -18 -88 -54 -108 132 62 105 34 -102 37 -99 -25 81 -65 95 52 -252 206 -165 -19 -262
8175 -262 46 170 -8 -59 93 108 -105 36 288 -56 72 -103 -100 195 178 -137
8191a37
##END NTUPLES=NMR FID
##END=
