##TITLE=1H_E3d2512-1
 CDCl3
 8 sc, 
 26.12.2023
##JCAMPDX= 6.0         $$ Bruker NMR JCAMP-DX V2.0
##DATA TYPE= NMR FID
##DATA CLASS= NTUPLES
##ORIGIN= UXNMR, Bruker Analytische Messtechnik GmbH
##OWNER= root
$$ XWIN-NMR		Version 3.5
$$ Tue Dec 26 15:32:52 2023 Russian Standard Time (UT+4h)  she@DPX200
##.OBSERVE FREQUENCY= 200.1313
##.OBSERVE NUCLEUS= ^1H
##.DELAY= (6, 6)
##.ACQUISITION MODE= SIMULTANEOUS
##.ACQUISITION SCHEME= undefined
##.AVERAGES= 8
##.DIGITISER RES= 18
##SPECTROMETER/DATA SYSTEM= spect
##.PULSE SEQUENCE= zg30
##.SOLVENT NAME= CDCl3
##.SHIFT REFERENCE= (INTERNAL, CDCl3, 0, 15.7039)
##AUDIT TRAIL= $$ (NUMBER, WHEN, WHO, WHERE, WHAT)
$$ ##TITLE= Audit trail, XWIN-NMR		Version 3.5
$$ ##JCAMPDX= 5.01
$$ ##ORIGIN= Bruker BioSpin GmbH
$$ ##OWNER= she
$$ F:/spectra/data/she/nmr/H-F/1/audita.txt
$$ ##AUDIT TRAIL=  $$ (NUMBER, WHEN, WHO, WHERE, WHAT)
(   1,<2023-12-26 15:31:29.45 +0400>,<she>,<DPX200>,
      <created by zg, POWCHK disabled, PULCHK disabled
       configuration hash MD5:
       00 E9 B6 7A A2 85 ED C7 34 08 36 98 17 FE 4E 26
       data hash MD5: 16K
       48 A9 E5 35 2E 21 58 EC 53 62 CE E8 D1 AA 92 AB>)
$$ ##END=
$$ 
$$ hash MD5
$$ 7C D0 E2 15 BD BC E3 C6 C3 3B ED F4 11 95 71 59
##$RELAX= 
##$RELAX= 
##$RELAX= 
##$RELAX= 
##$RELAX= 
##$RELAX= 
$$ Bruker specific parameters
$$ --------------------------
##$DU= <F:/spectra>
##$EXPNO= 1
##$NAME= <H-F>
##$PROCNO= 1
##$TYPE= <nmr>
##$USER= <she>
##$AMP= (0..31)
100 100 100 100 100 100 100 100 100 100 100 100 100 100 100 100 100 100 
100 100 100 100 100 100 100 100 100 100 100 100 100 100 
##$AQSEQ= 0
##$AQ_mod= 1
##$AUNM= <au_zg>
##$AUTOPOS= <>
##$BF1= 200.13
##$BF2= 200.13
##$BF3= 200.13
##$BF4= 200.13
##$BF5= 200.13
##$BF6= 200.13
##$BF7= 200.13
##$BF8= 200.13
##$BYTORDA= 1
##$CFDGTYP= 0
##$CFRGTYP= 5
##$CHEMSTR= <none>
##$CNST= (0..31)
1 1 145 1 1 1 1 1 1 1 1 1 1 1 1 1 1 1 1 1 1 1 1 1 1 1 1 1 1 1 1 1 
##$CPDPRG= <>
##$CPDPRG1= <>
##$CPDPRG2= <>
##$CPDPRG3= <>
##$CPDPRG4= <mlev>
##$CPDPRG5= <mlev>
##$CPDPRG6= <mlev>
##$CPDPRG7= <mlev>
##$CPDPRG8= <mlev>
##$CPDPRGB= <>
##$CPDPRGT= <>
##$D= (0..31)
0 1.2 0 0 0 0 0 0 0 0.06 0 0.03 0 0 0 0 0.0002 0 0 0 0 0 0 0 0 0 0 0 0 
0 0 0 
##$DATE= 1703590288
##$DBL= (0..7)
120 120 120 120 120 120 120 120 
##$DBP= (0..7)
150 150 150 150 150 150 150 150 
##$DBP07= 0
##$DBPNAM0= <>
##$DBPNAM1= <>
##$DBPNAM2= <>
##$DBPNAM3= <>
##$DBPNAM4= <>
##$DBPNAM5= <>
##$DBPNAM6= <>
##$DBPNAM7= <>
##$DBPOAL= (0..7)
0.5 0.5 0.5 0.5 0.5 0.5 0.5 0.5 
##$DBPOFFS= (0..7)
0 0 0 0 0 0 0 0 
##$DE= 6
##$DECBNUC= <off>
##$DECIM= 32
##$DECNUC= <off>
##$DECSTAT= 4
##$DIGMOD= 1
##$DIGTYP= 9
##$DL= (0..7)
0 120 120 120 120 120 120 120 
##$DP= (0..7)
150 150 150 150 150 150 150 150 
##$DP07= 0
##$DPNAME0= <>
##$DPNAME1= <>
##$DPNAME2= <>
##$DPNAME3= <>
##$DPNAME4= <>
##$DPNAME5= <>
##$DPNAME6= <>
##$DPNAME7= <>
##$DPOAL= (0..7)
0.5 0.5 0.5 0.5 0.5 0.5 0.5 0.5 
##$DPOFFS= (0..7)
0 0 0 0 0 0 0 0 
##$DQDMODE= 0
##$DR= 18
##$DS= 0
##$DSLIST= <SSSSSSSSSSSSSSS>
$$ [...]
##$SUBNAM2= <"">
##$SUBNAM3= <"">
##$SUBNAM4= <"">
##$SUBNAM5= <"">
##$SUBNAM6= <"">
##$SUBNAM7= <"">
##$SUBNAM8= <"">
##$SUBNAM9= <"">
##$SW= 18.0517328524113
##$SWIBOX= (0..15)
0 0 2 0 0 0 0 0 0 0 0 0 0 0 0 0 
##$SW_h= 3612.71676300578
##$TD= 16384
##$TD0= 1
##$TE= 0
##$TE2= 300
##$TE3= 300
##$TEG= 300
##$TL= (0..7)
0 120 120 120 120 120 120 120 
##$TP= (0..7)
150 150 150 150 150 150 150 150 
##$TP07= 0
##$TPNAME0= <>
##$TPNAME1= <>
##$TPNAME2= <>
##$TPNAME3= <>
##$TPNAME4= <>
##$TPNAME5= <>
##$TPNAME6= <>
##$TPNAME7= <>
##$TPOAL= (0..7)
0.5 0.5 0.5 0.5 0.5 0.5 0.5 0.5 
##$TPOFFS= (0..7)
0 0 0 0 0 0 0 0 
##$TUNHIN= 0
##$TUNHOUT= 0
##$TUNXOUT= 0
##$USERA1= <user>
##$USERA2= <user>
##$USERA3= <user>
##$USERA4= <user>
##$USERA5= <user>
##$V9= 5
##$VALIST= <valist>
##$VCLIST= <CCCCCCCCCCCCCCC>
##$VD= 0
##$VDLIST= <DDDDDDDDDDDDDDD>
##$VPLIST= <PPPPPPPPPPPPPPP>
##$VTLIST= <TTTTTTTTTTTTTTT>
##$WBST= 1024
##$WBSW= 4
##$XGAIN= (0..3)
0 0 0 0 
##$XL= 0
##$YL= 0
##$YMAX_a= 867607
##$YMIN_a= -1134564
##$ZGOPTNS= <>
##$ZL1= 120
##$ZL2= 120
##$ZL3= 120
##$ZL4= 120
##$ABSF1= 10
##$ABSF2= 0
##$ABSG= 5
##$ABSL= 3
##$ALPHA= 0
##$AQORDER= 0
##$ASSFAC= 0
##$ASSFACI= 0
##$ASSFACX= 0
##$ASSWID= 0
##$AUNMP= <proc_1d>
##$AZFE= 0.1
##$AZFW= 0.1
##$BCFW= 1
##$BC_mod= 2
##$BYTORDP= 1
##$COROFFS= 0
##$CY= 11.3945322036743
##$DATMOD= 1
##$DC= 2
##$DFILT= <>
##$DTYPP= 0
##$F1P= 15.7292609196834
##$F2P= 12.9074282941183
##$FCOR= 0.5
##$FTSIZE= 0
##$FT_mod= 4
##$GAMMA= 1
##$GB= 0.15
##$INTBC= 1
##$INTSCL= 1
##$ISEN= 128
##$LB= 0.24
##$LEV0= 0
##$LPBIN= 0
##$MAXI= 10000
##$MC2= 0
##$MEAN= 0
##$ME_mod= 0
##$MI= 1.114404
##$NCOEF= 0
##$NC_proc= 0
##$NLEV= 6
##$NOISF1= 3.799351
##$NOISF2= 2.8
##$NSP= 1
##$NTH_PI= 0
##$NZP= 0
##$OFFSET= 15.70392
##$PC= 1
##$PHC0= -24592.94
##$PHC1= 10.65273
##$PH_mod= 1
##$PKNL= yes
##$PPARMOD= 0
##$PSCAL= 0
##$PSIGN= 0
##$REVERSE= no
##$SF= 200.130013532006
##$SI= 16384
##$SIGF1= 3
##$SIGF2= 2
##$SINO= 400
##$SIOLD= 16384
##$SREGLST= <1H.CDCl3>
##$SSB= 0
##$STSI= 0
##$STSR= 0
##$SW_p= 3612.71676300578
##$SYMM= 0
##$S_DEV= 0
##$TDeff= 0
##$TDoff= 0
##$TI= <>
##$TILT= no
##$TM1= 0
##$TM2= 0
##$TOPLEV= 0
##$USERP1= <user>
##$USERP2= <user>
##$USERP3= <user>
##$USERP4= <user>
##$USERP5= <user>
##$WDW= 1
##$XDIM= 8192
##$YMAX_p= 0
##$YMIN_p= 0
$$ End of Bruker specific parameters
$$ ---------------------------------
##NTUPLES= NMR FID
##VAR_NAME=  TIME,          FID/REAL,        FID/IMAG
##SYMBOL=    X,             R,               I
##VAR_TYPE=  INDEPENDENT,   DEPENDENT,       DEPENDENT
##VAR_FORM=  AFFN,          ASDF,            ASDF
##VAR_DIM=   8192,          8192,            8192
##UNITS=     SECONDS,       ARBITRARY UNITS, ARBITRARY UNITS
##FACTOR=    0.0002768,     1,               1
##FIRST=     0,             0,               0
##LAST=      2.2672688,     0,               0
##MIN=       0,             -1134564,        0
##MAX=       2.2672688,     867607,          0
$$ Real data points
##PAGE= N=1
##DATA TABLE= (X++(R..R)), XYDATA
0 0 0 0 0 0 0 0 8 0 0 0 0 -8 8 -8 8 -16 16 -24 24 -28 33 -40 48 -56 63 -72 84 -97 110 -124 140 -163 181
33 181 -204 228 -255 284 -318 352 -390 434 -480 530 -583 644 -707 777 -856 942 -1038 1144
51 1144 -1260 1393 -1541 1711 -1906 2130 -2397 2718 -3108 3597 -4224 5059 -6227 7947 -10687
66 -10687 15585 -26006 56766 -331926 -1134564 2684 256379 -380212 525069 826102 -559082
77 -559082 -706890 134369 -25733 77893 709722 181537 -463991 -134084 -115125 -202652
87 -202652 367163 274491 -379587 -160589 82951 -207117 159192 500426 -136615 -333066
97 -333066 140591 17332 -55940 351554 62893 -464888 -219831 -20747 -1562 414895
107 414895 339643 -273172 -224213 -61775 -255778 238656 680527 -62900 -458412 -35713
117 -35713 -265417 -335715 561998 546084 -316706 -155365 62986 -440528 -19838 716284
127 716284 102890 -371815 79628 -143149 -459048 271743 477406 -196187 -147466 107697
137 107697 -241843 -81632 406279 106917 -180885 29425 -103002 -194754 211408 196922
147 196922 -156190 -62780 -31823 -192320 108168 311329 -20834 -94892 10672 -196736
157 -196736 -87503 295690 127478 -132980 -25276 -134965 -220662 159540 257432 -7822
167 -7822 35676 -22823 -298035 -21982 303271 14543 -51225 146780 -191807 -328699 186577
178 186577 217577 -119991 86629 117565 -291611 -102440 275060 9947 -83440 171624
188 171624 -69423 -269791 102436 160522 -107089 34474 99040 -166786 -63687 162950
198 162950 -570 -40014 93542 -74787 -136278 104721 69546 -79246 47515 28515 -139829
209 -139829 -2237 122143 -8862 2915 54207 -90546 -67904 85603 8318 -27644 79906
220 79906 -27579 -123834 38370 56231 -49192 53651 61882 -100675 -22798 78906 -56194
231 -56194 -22837 116890 -32431 -104921 77973 30171 -104784 45156 84796 -80390 -12717
242 -12717 80056 -61078 -50969 81771 -12575 -55838 77049 13151 -99481 22115 59405
253 59405 -47420 13947 67222 -52642 -53138 37457 -5229 -4667 67278 -10025 -75346 11415
265 11415 20898 -23243 46141 46883 -62047 -49356 13208 -4372 27754 61363 -26256 -60078
277 -60078 2990 -4027 3979 83755 36926 -76138 -48350 1614 -10384 41802 70165 -25817
289 -25817 -70826 -26822 -17894 24881 100117 39019 -67888 -51886 -16898 -11462 56307 83065
301 83065 -13352 -77520 -55008 -23270 40472 96643 37510 -49636 -55940 -41379 -8206 74907
313 74907 86291 -16666 -85107 -67879 -24519 44801 95481 48222 -39847 -73819 -55919 8264
325 8264 91959 91862 -5797 -86053 -88420 -37000 42093 94661 62119 -28655 -94010 -77682 14005
338 14005 99558 93708 12297 -66469 -96064 -57881 36147 104544 69244 -33578 -98839 -75303
350 -75303 8275 88739 102947 30831 -67415 -104539 -54364 39029 102435 70081 -38993 -112166
362 -112166 -82171 5532 86117 112646 47082 -65780 -112187 -54220 48659 112680 73969
373 73969 -37922 -109239 -93907 -25906 75128 134587 53547 -80824 -105110 -41974 28532
384 28532 102750 106723 -15637 -120816 -99238 -24605 57280 121744 66207 -71741 -111468 -43375
396 -43375 28876 94896 109394 3363 -112662 -106736 -26090 58535 109518 54095 -67528 -107636
408 -107636 -51706 23201 99539 117135 10306 -109083 -103771 -15053 65061 97909 51801 -51992
420 -51992 -119259 -86693 23614 117654 103398 5276 -79431 -103664 -47666 69075 122782 51371
432 51371 -42423 -96415 -106724 -13471 120924 110903 -3010 -55459 -74034 -74769 35212 136767
444 136767 63491 -50415 -74372 -80259 -38416 84777 108311 -1904 -56674 -53170 -59017 21954
456 21954 128243 66530 -58263 -68697 -48382 -29849 64329 108121 2696 -83569 -67422
467 -67422 -38145 23861 112318 81909 -45024 -92101 -54890 -12476 52742 104957 45799 -73540
479 -73540 -109191 -41983 37313 75639 75477 21261 -74051 -102895 -16596 63624 65562 44449 -8548
492 -8548 -94247 -79619 30701 62285 32958 38689 -13879 -99887 -34593 77000 42051 -3097
504 -3097 19813 -36461 -85922 17093 78338 4753 -9777 5037 -63440 -41620 81619 59120
516 59120 -34028 -8845 -11939 -77607 176 107839 33364 -47701 -15982 -33469 -55889 45858
528 45858 98260 9164 -36782 -23224 -55909 -35661 67501 75490 -12000 -34838 -21267 -44555
540 -44555 -19273 60951 63814 -8106 -33597 -16859 -22710 -10414 39261 38124 -15640 -21871 57
553 57 -19616 -14177 35603 17614 -33917 3161 34308 -22767 -25478 33020 -1343 -44873 24332
566 24332 47593 -25218 -18502 22513 -27100 -31451 48035 31966 -28082 6740 10147 -54699 -15841
579 -15841 57534 8330 -26242 25958 3713 -54893 -3509 40747 -5459 -4475 34703 -6308
591 -6308 -39334 5029 9622 -21941 15675 46100 -7760 -35017 317 -6135 -30002 16516 56639
604 56639 9437 -34944 -17514 -12919 -23362 20313 60210 16141 -32202 -21727 -22061 -24162 33970
617 33970 61895 -2752 -35828 -8392 -23999 -26904 46743 56203 -25010 -33307 4779 -20188 -11469
630 -11469 52037 22042 -43524 -11876 11758 -19468 18209 53440 -24136 -56869 15394 20786
642 20786 -12739 35442 34286 -61469 -58749 25726 28275 13734 41693 -3538 -76866 -36464 33197
655 33197 34404 38114 35177 -38672 -82554 -21064 40118 44421 37155 7496 -51698 -66911 -11138
668 -11138 48792 59531 24041 -25662 -54352 -42622 6796 53833 47986 620 -37547 -50875
680 -50875 -25916 38793 66500 16157 -28081 -32269 -39698 -11099 61136 57025 -22064 -45478 -30173
693 -30173 -28623 24347 80445 23310 -49039 -34235 -24767 -16986 61431 80112 -23248 -69483
705 -69483 -26710 -16693 10117 80428 50176 -51139 -64418 -26201 -2954 52037 78313 967
717 967 -65875 -51404 -23969 17312 75504 55458 -28959 -64315 -46012 -5781 54089 70216
729 70216 13145 -39273 -54721 -46039 13765 74399 45209 -22458 -46132 -45433 -17814 45164 64244
742 64244 15447 -29566 -51049 -41356 24159 67979 28151 -17982 -34999 -53868 -19074 62221
754 62221 62971 -1833 -29039 -47490 -52571 24484 84688 30961 -24372 -31717 -57892 -37415 59710
767 59710 81941 8223 -32645 -43017 -50534 4287 68947 49988 -1224 -35590 -62866 -32488
779 -32488 44330 57727 16280 -9443 -41420 -56010 5863 60666 36899 2962 -22541 -56423
791 -56423 -28886 45097 50974 9540 -9077 -38112 -53662 5779 61408 39432 -1230 -31164
803 -31164 -52928 -23069 35450 46323 25712 -4193 -52805 -54479 13688 49872 31830 17145
815 17145 -16944 -60188 -27906 34931 38387 22679 7387 -42295 -56846 5951 42982 24672
827 24672 13992 -8476 -48730 -31378 24702 41216 25248 -736 -36998 -38323 2479 26357
839 26357 29875 24165 -17209 -52025 -19494 23973 26572 24264 8794 -35579 -41765 2652 24621
852 24621 23416 22171 -9574 -44316 -21011 19509 25104 19567 8019 -21883 -32240 -7161 18474
865 18474 27901 15994 -16635 -30531 -10775 4201 13101 26633 9829 -27726 -25834 2238 11612
878 11612 17139 19197 -7499 -28257 -11141 6698 10396 18633 10614 -19513 -24057 -87 11876
891 11876 10351 10304 -1065 -17113 -13803 1470 11391 13658 4330 -11377 -11884 803 4871 4383 8650
906 8650 3567 -11866 -11148 5093 7453 -523 55 916 -6070 -3704 4948 2197 -1986 1805 -554
921 -554 -4563 4662 6725 -6208 -6214 5216 3555 -2278 3261 3186 -6562 -6844 2603 7154 3864 -2816
937 -2816 -6168 -4067 -738 3912 7501 1698 -6303 -5264 -2693 2229 14251 8348 -13960 -10736 4958
952 4958 -1232 2346 21209 1245 -28353 -9160 9563 601 14172 20730 -19304 -30014 4480
965 4480 6035 2304 31250 12706 -40155 -23551 14639 4042 11995 33594 -8502 -43247 -10289
978 -10289 9212 6523 29730 19077 -33249 -31430 3990 4586 14545 33753 -1805 -39413 -17814
991 -17814 7730 13960 25142 13220 -21981 -27002 -8324 8912 27278 21828 -13269 -28450 -18469
1004 -18469 -2513 26350 33747 -4208 -25376 -17438 -20599 5984 54546 26181 -34418 -24981 -11269
1017 -11269 -22415 26948 64277 -979 -43933 -16887 -23001 -12097 58957 48986 -31871 -32824 -11489
1030 -11489 -32172 12128 72420 17693 -42124 -20195 -19412 -19670 43343 52565 -14917 -29467 -14710
1043 -14710 -26879 8510 56829 17150 -32098 -21318 -16741 -10146 33357 38485 -6426 -28728
1055 -28728 -28293 -13231 27951 41252 8433 -13456 -29556 -38288 8682 51633 23051 -4857
1067 -4857 -14594 -50625 -32545 47709 48599 -2269 1590 -20748 -67695 -3821 71526 25998 -8498
1080 -8498 5172 -44002 -56593 36881 57794 25 5187 -6328 -66152 -19778 62292 25400
1092 25400 -9936 12087 -29457 -56722 22230 52982 2207 -793 -2985 -47101 -17144 46345
1104 46345 26099 -3894 1136 -28425 -38605 18861 41838 12714 -877 -22644 -40758 -2807
1116 -2807 31326 23321 19131 -6105 -51394 -27383 27197 24227 19899 22851 -31748 -54491 5469
1129 5469 27274 12372 34874 8443 -61737 -31008 29729 9411 12600 40327 -21708 -62193
1141 -62193 3608 25366 -355 30753 21113 -50604 -29891 27587 4050 4481 39242 -13054
1153 -13054 -55178 4025 25932 -3859 18829 18299 -39346 -28624 20117 10921 9269 24569 -15739
1166 -15739 -40596 54 17249 8747 22881 5612 -33536 -19614 5495 7809 25286 20607
1178 20607 -24972 -26818 1587 -3571 9326 36456 69 -34976 -7544 880 -6012 27500 24627
1191 24627 -25171 -17268 7079 -13742 4299 40041 -2307 -33736 4025 3088 -16836 21917
1203 21917 25992 -25412 -16107 11652 -11918 -691 33723 -2525 -29565 6250 5613 -14618 17475
1216 17475 22298 -20073 -14335 8405 -6803 1848 22741 -3897 -18480 3319 -2231 -8430 17879
1229 17879 11537 -16226 -5139 3028 -8805 6875 16030 -7537 -6171 5640 -11054 -3965 21113
1242 21113 540 -15283 7733 1812 -15833 8496 14345 -13685 -2792 11896 -11727 -5688
1254 -5688 18414 -4266 -15512 13835 5270 -16036 8049 11678 -15142 -1291 14441 -7514
1266 -7514 -4271 12720 -8941 -12373 14908 3106 -13768 8741 6073 -17885 1096 16394 -5227
1279 -5227 -3979 8782 -8375 -8227 13100 3332 -6890 6892 -2452 -15760 5964 13151 -5008
1292 -5008 -247 3615 -13145 -4383 13707 2079 -1744 6860 -10435 -15812 11651 12881 -5013
1305 -5013 3569 2446 -17987 -5015 16900 5893 -451 3755 -12505 -15098 9762 11833 -299
1318 -299 4785 -3605 -20464 -3171 15925 7233 4091 2346 -15858 -12970 10983 10634 4042 8597
1332 8597 -7912 -24237 -1911 16540 6547 4620 2253 -17022 -15967 7420 13249 9606 6980
1345 6980 -11222 -20994 -1478 11956 9417 10794 628 -20366 -14680 6467 11676 12875 8531
1358 8531 -13849 -21652 -1576 9400 9631 14214 334 -23248 -16004 7181 12941 12979 8410 -12235
1372 -12235 -20774 -4766 9059 15255 16218 -3344 -23966 -14728 4097 11151 16570 9972 -14766
1385 -14766 -23659 -6203 8466 16693 18077 -1675 -22936 -15599 2327 11498 17903 12211 -11898
1398 -11898 -24648 -10183 9049 17820 15025 -1076 -17937 -17983 -3730 13801 21360 8626 -12986
1411 -12986 -20490 -11236 5734 20087 17147 -2309 -17574 -17640 -5743 14289 25074 9418 -13874
1424 -13874 -20217 -12927 2155 20005 20893 -420 -18702 -20242 -8066 12934 24844 11202 -10655
1437 -10655 -17930 -14083 -1795 18747 23730 1493 -18586 -17493 -6465 7180 20275 14633 -8536
1450 -8536 -20860 -12966 971 14189 20256 5529 -17933 -20010 -2828 9345 15231 15579 -2064
1463 -2064 -23659 -18115 6110 16741 14120 6831 -10946 -24114 -9972 12197 17530 12239 -279
1476 -279 -19684 -21206 1925 18170 14708 6686 -6237 -21333 -14361 10080 20033 11132 -902
1489 -902 -13640 -18895 -4355 14867 16489 5490 -5959 -16321 -15049 4347 19927 11754 -3770
1502 -3770 -9089 -11959 -8970 8864 21164 6485 -11376 -10992 -6941 -2299 13048 17176 -2894 -15015
1516 -15015 -7137 -3936 1682 17604 12191 -13306 -15224 -765 315 5482 17813 4417 -17795
1529 -17795 -11631 1818 3478 10758 13220 -6527 -17145 -4985 2072 4006 13484 8047 -13054
1542 -13054 -14531 562 4312 5098 10549 2132 -12213 -9040 2478 5740 6126 5869 -3160 -10669 -3841
1557 -3841 5157 4301 2143 2686 -3858 -10554 -553 9884 2877 -3723 908 -1800 -8046 2881 11305
1572 11305 329 -5607 556 -3473 -4974 8329 8103 -5711 -3550 2216 -6623 -3092 11592 4212
1586 4212 -8897 -781 2421 -6734 445 10285 -159 -5648 2836 -456 -5838 4410 6427 -5070
1600 -5070 -1791 5657 -3094 -6212 4697 3267 -5309 353 5689 -2668 -4839 2338 1098 -2124 3315
1615 3315 4160 -3274 -3855 1545 -286 -1383 5549 4503 -6241 -5340 2735 903 -1836 5257 3721
1630 3721 -7646 -5742 4001 1849 -115 4842 -73 -8305 -864 6115 249 983 5198 -4433 -9526
1645 -9526 3746 7826 -1651 -868 2456 -7373 -7240 7012 7498 -1312 -280 -1859 -8892 -1184 10929
1660 10929 5191 -2225 -534 -5074 -9381 3293 13059 3142 -4857 -3184 -6202 -5651 7067 11552
1674 11552 1009 -5714 -5965 -6786 -382 10907 8479 -3318 -7007 -4854 -4085 2979 12216 6494 -7018
1689 -7018 -9355 -2786 1087 5243 9632 2173 -9951 -9628 -765 4149 7704 7602 -3370 -12490 -4726
1704 -4726 4701 5249 7579 5896 -8554 -14530 57 8945 5503 5822 600 -13156 -10815 5099
1718 5099 9309 6334 4670 -6582 -15601 -3247 10342 7823 4750 2024 -11371 -13565 3090 11695
1732 11695 7401 3202 -5101 -13643 -5678 7441 9525 6694 424 -11287 -12564 1466 10061 8695
1746 8695 4183 -5108 -12363 -6158 5061 10294 9755 76 -12319 -10298 1080 6882 9787 6761
1760 6761 -6833 -14211 -5323 4057 8779 10907 219 -13521 -9192 1848 4972 10013 9678 -7004
1774 -7004 -15580 -3779 4946 6907 10558 2159 -13171 -10431 793 4980 9892 9354 -6686 -15218
1788 -15218 -4602 3706 6730 11082 3001 -11913 -11120 -1156 5101 11490 9472 -6310 -12757 -4671
1802 -4671 737 6217 12685 3305 -12025 -10507 -1633 3440 10251 8657 -5204 -11009 -4995 -441
1816 -441 7188 12456 2050 -10552 -7859 -2210 2622 11033 8000 -5872 -9304 -5273 -2561 7384
1830 7384 13425 275 -10391 -5716 -3104 64 11049 9899 -5133 -9157 -4936 -2401 6570 12339
1844 12339 1348 -7713 -5608 -4971 -537 11040 8045 -4925 -6934 -4890 -3686 5962 11256 569
1858 569 -5879 -4312 -5495 -402 11274 7174 -4927 -5214 -3649 -3805 4644 9782 1230 -5056 -4947
1873 -4947 -5711 374 9108 4520 -3249 -3085 -4717 -4639 5468 8509 387 -2639 -2910 -5662 624 8570
1889 8570 3304 -2387 -1125 -4956 -5227 5170 7319 -988 -2595 -1897 -5264 -210 7038 2832 -1514
1904 -1514 -461 -4489 -3863 5346 5665 -1322 -1067 -633 -4479 -698 5508 2043 -1625 -1052 -2988 -2303
1920 -2303 3088 2974 -578 -157 -1047 -3103 443 3862 959 -682 -639 -2066 -193 2335 607 -247
1936 -247 655 -2458 -2757 2339 2218 -1344 -50 22 -2724 278 2711 -607 -495 1809 -1937 -1741 3821
1953 3821 1634 -3327 276 1884 -2246 8 3631 -1277 -3323 799 279 -1136 2936 1754 -3868
1968 -3868 -1847 2149 -266 105 3604 161 -4676 -1364 2273 1363 1215 1407 -1691 -3501 -868 1817
1984 1817 1982 1576 -44 -3205 -3320 1021 3295 1404 102 -491 -3263 -2926 3082 5132 678 -1972
2000 -1972 -1618 -2912 -843 4584 3671 -1442 -2596 -2716 -3213 1744 6605 1756 -3992 -2338 -1967 -1944 3824
2017 3824 6740 -154 -5172 -2643 -1218 3 5378 5311 -2904 -5739 -2063 -861 1335 6588 3355
2032 3355 -6116 -5813 382 687 2034 6755 1243 -8065 -4700 2604 2226 3361 5299 -2619 -8106 -1209
2048 -1209 3165 1981 4454 2653 -6953 -7378 2005 4255 1954 3935 -313 -7947 -4511 3993 4882
2063 4882 3040 2040 -3813 -7437 -1165 5247 4146 2396 -401 -5734 -6527 1254 7060 4070 -625
2078 -625 -2474 -4793 -4588 3056 8304 2590 -3292 -3340 -3869 -2322 5888 7730 -1464 -4699 -2158 -3993
2094 -3993 -822 8771 5263 -5841 -4714 -856 -3277 2139 9213 1560 -6783 -2969 -1225 -1498 5923
2109 5923 7428 -3000 -6091 -1225 -1708 613 7491 3538 -5895 -4926 -890 -198 3368 5902 53
2124 53 -5410 -3734 -621 1979 4992 3573 -2266 -5039 -2665 1621 3501 2741 1353 -2601 -5945 -1834
2140 -1834 4845 3239 -197 316 -2943 -6013 1054 6493 1076 -865 495 -4637 -4262 5611 5108 -1820
2156 -1820 146 -23 -6481 -1347 7595 2297 -3056 471 -2444 -5495 3221 6059 -1181 -1237 439 -4623
2172 -4623 -2168 5993 2877 -2610 93 -671 -4029 907 4852 502 -1681 -514 -2397 -945 2739
2187 2739 1933 -710 -769 -1858 -1494 1694 2317 857 -118 -2201 -2269 1322 1672 212 1539 -22 -4298
2204 -4298 -1008 3706 476 -543 2080 -2021 -3795 2035 2591 -1621 1433 1610 -4288 -1469 4443
2219 4443 131 -2294 2804 -92 -4125 1342 3424 -1948 -791 1594 -2224 -1702 3298 531 -2307
2234 -2307 1040 119 -2462 1004 2906 -946 -726 630 -835 -168 2186 331 -616 265 -1262 -1004
2250 -1004 1718 816 -1022 171 -445 -1401 963 1431 -782 315 642 -2372 93 3082 -214 -1452
2266 -1452 1546 -681 -2214 2480 2273 -2081 -197 681 -2886 16 3673 -772 -2192 1204 -737
2281 -737 -2672 2634 2837 -2229 -728 915 -1823 -70 3493 8 -1653 496 -1233 -1798 2562 2039
2297 2039 -1883 -641 106 -2176 487 3009 -509 -1140 287 -1621 -776 3282 1413 -1718 59 -332
2313 -332 -2073 1539 3039 -443 -1182 -457 -2295 -193 3220 485 -1655 205 -1584 -2161 2386 3113
2329 3113 -1358 -899 11 -2276 298 3638 386 -1458 196 -2021 -1958 3045 2699 -1432 -904 -562 -2444
2346 -2444 337 3627 625 -1060 -586 -2098 -1084 3051 2187 -975 -138 -959 -2417 1303 3367 282
2362 282 -1103 -777 -2695 -741 3117 1866 -925 -247 -1948 -2486 1922 3590 458 -549 -1212 -2672
2378 -2672 -353 3250 1554 -176 -315 -3106 -2669 2496 2960 -147 0 -1137 -3693 54 3606 1517
2394 1517 -124 -198 -2942 -2479 2648 3084 243 141 -1202 -3752 -245 3519 1796 -171 -1007 -2920
2410 -2920 -1922 2235 2519 698 -70 -2352 -3440 100 3558 1966 553 -1042 -3278 -1688 2166 3045
2426 3045 1643 -104 -2990 -3077 61 2518 2154 1063 -1582 -3735 -1482 1563 2215 2629 517 -3426
2442 -3426 -3020 1263 1857 1476 2507 -1154 -4588 -1279 2377 1765 1620 906 -3199 -3765 621 2445 1577
2459 1577 1635 -918 -4154 -1724 2194 2372 1551 799 -2119 -3666 -311 2637 2398 1313 -957 -3214
2475 -3214 -2524 676 2530 2151 192 -1658 -2974 -1368 1980 3334 1236 -1232 -2016 -2015 -508 2576
2491 2576 3517 -279 -2232 -1648 -1522 172 3308 1895 -2004 -2201 -868 -1131 1259 3633 455 -2845
2507 -2845 -1236 -182 -385 2123 2909 -1000 -2860 -746 94 529 2483 1261 -2430 -2475 -143 546 1040
2524 1040 2378 330 -2830 -2160 544 1258 1567 1883 -445 -2976 -1191 1049 1156 1272 1123 -1379 -2639
2541 -2639 -121 1364 242 673 862 -1944 -2171 1099 1607 -451 637 338 -1896 -1122 2011 1078 -654
2558 -654 350 -193 -1947 98 2212 133 -1344 199 -653 -1681 957 2467 -79 -1341 33 -851
2574 -851 -907 1160 2229 -484 -922 163 -860 -776 1407 1517 -880 -712 637 -694 -945 1604 849
2591 849 -1694 0 1241 -1036 -852 1543 -158 -1173 1298 1083 -1609 -122 1269 -1069 -1029 2132
2607 2132 106 -2029 193 711 -1543 -126 2032 -276 -1436 723 195 -1310 1061 1836 -754 -1018
2623 -1018 830 -227 -923 1035 1203 -1361 -1329 829 183 -565 846 502 -1670 -886 1178 517 -366
2640 -366 848 -90 -2004 41 1877 491 -273 693 -875 -2085 821 2336 -91 -547 155 -2048
2656 -2048 -1689 1600 1924 -555 -30 -274 -2344 -648 2523 1600 -649 -42 -690 -2106 309 3008 907
2673 907 -1273 -739 -919 -1121 961 2652 165 -1670 -1020 -716 -224 1960 2418 -853 -2046 -487 108
2690 108 355 2278 1507 -2007 -2316 115 474 950 2319 167 -2775 -1836 357 643 1888 1857 -1174
2707 -1174 -3226 -848 1124 1135 2007 1420 -2101 -2985 -97 1385 1346 1651 -71 -2838 -2015 816 1688
2724 1688 1357 712 -1272 -2620 -944 1802 2147 955 -218 -1749 -2348 236 2504 1918 -68 -1274
2740 -1274 -1951 -1386 1149 2729 922 -988 -1788 -1960 -370 2331 2448 14 -1340 -1599 -1644 804 2898
2757 2898 1418 -888 -1893 -1698 -768 1552 2555 570 -1288 -1986 -1445 386 2247 1832 -321 -1756
2773 -1756 -1671 -610 1385 2199 1053 -931 -2023 -1163 776 1816 1464 -153 -1549 -1792 -285 1445
2789 1445 1476 872 -534 -2176 -1454 753 1622 1052 492 -1291 -1933 -291 1814 1419 1098 -371 -1902
2806 -1902 -1685 680 1551 1090 226 -979 -2234 -760 1170 1114 764 -55 -1883 -1424 604 1410 1144 427
2824 427 -795 -1636 -327 924 1214 734 -187 -1695 -1178 330 1131 988 445 -990 -1611 -267 656 1071
2842 1071 949 -75 -1530 -1119 505 714 1319 731 -906 -1357 -197 406 517 1224 -160 -1429 -759
2859 -759 261 372 901 897 -931 -1191 237 230 498 1245 80 -1258 -805 212 248 792 735 -700 -1037 -231
2879 -231 32 451 871 -213 -825 -389 50 81 977 672 -728 -803 -45 -274 403 915 -16 -752 -424 -255
2899 -255 7 802 288 -576 -369 -141 -369 535 644 -194 -549 243 -81 -216 843 201 -896 190 365
2918 365 -651 96 448 -558 -423 293 -193 -298 499 36 -637 148 283 -139 169 493 -422 -400 424 -28
2938 -28 -199 299 -33 -461 -114 225 50 311 71 -239 -274 258 120 308 -70 -283 -86 193 260 271 399
2959 399 -227 -555 313 140 -73 583 -106 -976 -204 794 -55 155 736 -541 -1316 381 630 123 631
2978 631 380 -1105 -785 783 566 248 803 -385 -1434 -218 673 325 216 161 -916 -1289 3 792
2996 792 385 601 -115 -1082 -582 467 620 436 2 -634 -895 -401 1041 1017 45 -773 -824 -386 198 1591
3016 1591 1002 -554 -1022 -643 -600 736 2236 678 -1457 -1024 -693 -482 1227 2037 54 -1630 -999
3033 -999 -664 -201 1817 1598 -817 -1690 -697 -575 748 2356 564 -1455 -970 -263 -163 1058 1851 -157
3051 -157 -1965 -918 183 611 1313 985 -1290 -1844 -355 675 1023 1397 209 -1661 -1895 413 1564
3068 1564 1425 1126 -409 -2407 -1450 1010 1861 1244 420 -1313 -2698 -923 1822 1990 821 -59 -1630
3085 -1630 -2337 186 2401 1494 305 -491 -1950 -1869 975 2519 779 -281 -901 -2059 -1015 1923
3101 1923 1912 154 -624 -1123 -1616 -34 2398 1397 -805 -1138 -1126 -911 1242 2508 499 -1499 -1536 -831
3119 -831 -23 2001 2334 -364 -2022 -1660 -669 648 2435 1771 -1351 -2365 -1124 147 1160 2619
3135 2619 1130 -1952 -2284 -576 639 1431 1895 181 -2228 -1658 163 661 1323 1628 -783 -2364 -779
3152 -779 930 1045 1441 736 -1395 -1951 36 1283 1026 887 -228 -1900 -1440 990 1145 745 715 -879
3170 -879 -2330 -472 1519 1570 490 0 -1325 -1843 245 2031 1332 133 -652 -1924 -1209 957 1735
3187 1735 671 -90 -921 -1721 -866 1389 1691 274 -388 -1012 -1177 -96 1453 1250 149 -765 -1043 -974
3205 -974 561 1378 638 -702 -723 -803 -521 755 1465 14 -1181 -610 -339 -2 1190 1097 -446 -1298 -683
3224 -683 -265 286 1047 724 -919 -842 -74 -180 399 1066 93 -1335 -725 -143 46 763 1026 -255 -1088
3243 -1088 -548 -17 404 977 683 -739 -766 -140 -73 236 855 327 -693 -779 -64 351 415 641 -44 -332
3263 -332 -603 -117 308 424 533 -197 -494 -568 289 431 336 248 -89 -929 -235 380 475 216 231 -382 -779 -34
3285 -34 627 465 562 -30 -766 -493 382 617 153 375 -69 -875 -424 372 392 278 276 -594 -795 -121 248 377
3307 377 531 92 -812 -667 -124 322 543 275 -64 -660 -549 145 709 496 -170 -580 -612 -399 362 712
3327 712 521 -247 -516 -695 -189 622 820 -54 -450 -434 -445 271 1005 703 -177 -635 -610 -512 136 724 195
3348 195 -516 -577 -861 -31 858 863 -294 -347 -895 -557 359 1222 694 -366 -673 -821 -160 804 926 115 -442
3369 -442 -1031 -623 362 1045 472 -266 -681 -791 -236 645 783 444 -210 -1080 -750 569 952 634 -147 -682
3389 -682 -1006 -517 625 732 438 -392 -1217 -742 458 861 620 403 -514 -960 -390 928 975 868 -332
3408 -332 -1160 -958 134 1074 720 590 -797 -1489 -765 758 1224 727 -170 -1109 -1151 -23 896 984 521
3427 521 -733 -1194 -811 633 1213 866 -275 -930 -1421 -403 974 1420 415 -834 -1232 -577 203 1397
3445 1397 1335 12 -1298 -1125 -158 856 1579 755 -961 -1668 -827 21 1052 1546 -100 -1565 -1175 -258
3463 -258 540 1536 1153 -517 -1626 -1090 180 1127 1539 93 -1335 -1305 -215 549 1406 1097 -442 -1711
3481 -1711 -1485 390 1198 1291 196 -1165 -1556 -782 772 1487 1053 -320 -1598 -1424 53 1517 1268
3498 1268 349 -907 -1729 -1461 784 1808 829 -301 -1218 -1544 -529 1340 1341 529 -560 -1523 -1268 593
3516 593 2112 1038 -551 -851 -1184 -656 738 1660 472 -989 -1197 -884 65 1334 1416 -84 -1178
3533 -1178 -1126 -416 951 1738 855 -1010 -1502 -461 426 857 1545 219 -1261 -1619 -182 514 1186 1034
3551 1034 -541 -1444 -1033 5 747 1185 869 -912 -1651 -303 413 1010 1017 653 -1238 -1308 -123 699 583
3570 583 563 -522 -1294 -802 608 798 466 419 -644 -1326 -35 963 661 211 -39 -880 -1113 248 1068
3589 1068 576 -90 -426 -1061 -695 717 1046 259 -98 -688 -1004 -442 1057 923 -63 -382 -538 -892 -251
3608 -251 1079 769 -179 -279 -523 -733 462 1219 228 -214 -20 -493 -642 602 867 -238 -351 -21 -289
3627 -289 -425 608 576 -188 -205 -106 -551 -154 614 38 -376 157 -84 -555 -72 908 190 -305 -166 -250 -281
3648 -281 283 730 173 -301 -220 -321 -232 621 557 -191 -671 -194 -412 -163 898 980 -429 -562 -129 -421 -105
3669 -105 1072 740 -318 -611 -550 -372 423 1043 498 -729 -560 -512 -404 613 1278 -5 -883 -659 -371
3688 -371 116 813 624 -262 -913 -530 -188 458 816 163 -667 -861 -153 370 729 892 21 -1271 -1009 -118
3708 -118 517 878 882 -354 -1180 -821 366 1024 1188 523 -916 -1583 -183 615 873 846 36 -1380 -1460 248
3728 248 1088 952 525 -555 -1705 -924 522 1374 986 107 -1186 -1556 -205 1036 1305 374 -308 -1463
3746 -1463 -1124 293 1422 1341 224 -1023 -1440 -486 787 1534 999 -432 -1310 -1074 -117 1444 1563 84
3764 84 -1014 -1179 -699 344 1787 1135 -669 -1841 -1277 -276 1080 1718 403 -975 -1330 -953 371
3781 371 1704 1764 -433 -1566 -1212 -544 767 1751 1047 -883 -1813 -1055 509 1542 1737 -41 -1300
3798 -1300 -1597 -857 655 1803 1177 -539 -1674 -1247 119 1560 1697 419 -1205 -1717 -900 701 1880
3815 1880 1133 -559 -1497 -1410 -270 1332 1683 646 -828 -1781 -998 824 1814 1378 5 -1169 -1552
3832 -1552 -606 1362 1782 467 -910 -1566 -1085 459 1792 1184 -158 -1119 -1645 -690 1282 1741 603
3849 603 -501 -1545 -1398 41 1591 1449 167 -1102 -1619 -813 1156 1446 820 -347 -1301 -1583 -48
3866 -48 1422 1461 436 -1118 -1686 -679 743 1192 928 -114 -1362 -1448 9 1236 1206 633 -954 -1642
3884 -1642 -703 451 1243 1106 232 -1332 -1508 -148 1100 1344 602 -680 -1491 -794 340 1031 1066 128
3902 128 -1436 -1372 -74 802 854 568 -244 -1359 -884 429 824 1022 201 -807 -930 -501 574 1069 924
3921 924 -212 -1036 -873 182 593 892 292 -665 -911 -355 283 1227 919 -561 -762 -559 -146 567 738
3940 738 390 -559 -615 -370 294 860 764 -190 -587 -619 -302 159 857 475 -473 -768 -262 -94 405 645 35
3961 35 -362 -413 -241 15 705 271 -323 -562 -321 -100 -82 466 56 -217 -527 -137 -7 403 326 10 -155
3982 -155 -67 -291 -4 220 317 -55 -196 -229 -33 -43 -217 481 247 -345 -195 155 54 104 353 -219 -30 -41
4004 -41 -144 -97 286 610 -128 -410 16 -107 -101 322 605 -217 -545 -164 -72 122 530 159 -284 -378 -356 40
4026 40 888 753 -274 -558 -474 164 346 677 493 -94 -782 -473 16 546 735 248 -491 -887 -440 87
4046 87 761 963 2 -705 -873 271 691 359 423 -127 -1031 -757 489 932 580 199 -727 -1196 -335 541
4066 541 823 446 4 -1124 -1047 611 1227 587 327 -542 -1236 -537 874 1079 675 -236 -1409 -1072 67
4085 67 1020 1214 253 -489 -1263 -1050 591 1418 858 -363 -851 -1119 -298 833 1455 409 -638 -1333 -1033
4104 -1033 303 1443 1118 -331 -889 -929 -583 436 1617 1082 -835 -1188 -475 59 881 1376 249 -1262
4122 -1262 -1389 -420 396 1398 926 -707 -1598 -796 151 723 1410 723 -1368 -1762 -137 865 1299 1136
4140 1136 -281 -1234 -1295 -280 1123 1431 646 -892 -1576 -616 703 1094 1073 360 -1095 -1775 -333 1168
4158 1168 1270 444 -206 -1238 -1331 320 1248 961 237 -751 -1513 -615 776 1142 631 -60 -868 -1393 -216
4177 -216 1463 1159 -93 -796 -911 -623 684 1314 642 -339 -1092 -1084 -190 1330 1454 88 -820 -930 -804
4196 -804 284 1341 1246 -49 -1100 -1087 -344 953 1290 719 -710 -1207 -918 247 1203 1292 202 -1234
4214 -1234 -1097 -145 311 873 892 -376 -1426 -888 220 878 828 136 -801 -846 -232 463 722 544 -290 -1277
4234 -1277 -791 98 585 690 385 -395 -1380 -587 512 1177 880 -91 -919 -923 1 642 602 486 -484 -1114
4254 -1114 -639 571 828 491 -89 -683 -847 -215 409 956 421 -373 -741 -603 154 559 657 270 -466 -620
4274 -620 -248 469 761 391 -524 -346 -337 8 392 509 -10 -423 -573 -147 378 520 441 -290 -373 -247 -226 108
4296 108 614 234 -503 -570 6 60 150 465 -32 -410 -421 267 361 439 1 -337 -30 -147 -80 -18 469 173 -290
4319 -290 -376 -77 212 148 95 174 -124 -230 -245 -50 209 42 -16 -164 -168 -10 -99 82 416 98 -175 -186 54
4342 54 194 19 187 -49 -320 -293 -71 -165 426 29 -77 -30 -78 -251 173 568 175 -164 -426 -142 -127 263
4364 263 128 180 -302 -521 -208 70 552 334 -345 -574 -598 -29 372 588 305 -444 -598 -321 310 523 355
4385 355 -113 -297 -293 -214 545 723 255 -295 -544 -374 177 677 506 94 -384 -830 -461 754 997 432 -308
4406 -308 -689 -486 -145 828 881 243 -771 -1025 -501 677 798 251 -261 -854 -799 191 1014 838 118 -703
4426 -703 -1007 -347 493 1017 480 85 -973 -816 6 941 1204 133 -606 -1056 -338 229 1025 740 47
4445 47 -853 -913 145 1007 1040 408 -533 -1236 -509 342 1017 815 10 -1186 -1220 -33 644 1033 426 -471
4465 -471 -1224 -1112 588 1154 837 -55 -1020 -1107 -260 597 1235 896 -356 -1554 -1015 511 1031 826 184
4484 184 -844 -1361 -508 633 1373 615 -485 -1247 -901 184 1057 1095 431 -925 -1291 -498 749 1292
4502 1292 672 -425 -1149 -1068 -138 921 1285 458 -977 -1363 -466 522 1339 927 -110 -931 -1108 -354 906
4521 906 1437 484 -1053 -1259 -631 457 1085 1141 -130 -1234 -1296 -366 902 1153 555 -703 -1227 -819 301
4540 301 1029 1222 29 -1247 -1224 -365 634 1189 644 -681 -1205 -806 181 1055 1056 184 -1039 -1158 -492 439
4560 439 1108 710 -58 -1168 -1228 -93 1246 957 30 -712 -940 -736 548 1120 774 -122 -999 -942 -236
4579 -236 869 921 207 -229 -954 -967 278 1225 806 -173 -781 -920 -245 653 1006 452 -357 -944 -755 121
4599 121 993 628 -59 -623 -684 -426 412 916 572 -365 -590 -756 44 685 756 49 -396 -618 -498 495 691
4620 691 762 124 -607 -448 64 286 553 600 -391 -594 -218 327 403 385 53 -507 -415 -96 192 332 550 -95
4642 -95 -744 -377 409 91 388 278 -199 -598 -250 346 369 30 -45 -311 -111 108 129 363 596 -85 -564
4663 -564 -395 373 24 -32 136 97 -178 -374 70 203 222 139 -74 -191 -120 -255 -145 255 331 134 -256 -48
4685 -48 91 131 205 311 29 -372 -106 245 156 244 231 -254 -398 -115 -3 296 334 13 -547 -499 41 209 74
4708 74 292 294 -497 -638 297 596 160 -41 -416 -550 -212 372 352 305 -39 -698 -791 -132 774 533 276 -297
4730 -297 -462 -688 129 916 892 4 -687 -596 -204 500 825 350 -353 -628 -740 119 942 892 -1 -750 -689
4751 -689 -419 503 1024 645 -476 -954 -824 1 928 763 129 -608 -716 -621 384 1010 841 -200 -1256
4770 -1256 -877 -143 638 1032 572 -672 -1307 -740 413 1065 900 -162 -886 -1251 -248 739 1167 443
4788 443 -687 -1346 -784 226 852 926 87 -996 -1531 -448 835 1269 587 -574 -1221 -865 289 970
4806 970 1306 277 -883 -1479 -550 851 1255 826 -550 -1378 -1186 97 1020 1220 326 -916 -1160 -457
4824 -457 598 1301 811 -19 -1140 -1180 -170 1036 1368 285 -1038 -1398 -506 583 1069 1061 82 -1248
4842 -1248 -1481 -104 1010 1319 310 -809 -1074 -851 470 1394 1354 -91 -1436 -1380 -276 911 1271
4859 1271 478 -704 -1136 -901 243 1299 1227 -42 -1047 -1222 -34 716 1211 812 -529 -1368 -923 412
4877 412 1014 994 53 -851 -1220 -607 584 1257 638 -394 -1163 -975 -68 929 1099 129 -801 -1124 -654 435
4897 435 1248 900 -239 -852 -711 -56 750 1198 230 -525 -1012 -692 542 972 557 -201 -695 -829 -78
4916 -78 428 965 504 -535 -896 -670 238 747 604 -54 -752 -814 -573 479 823 359 -294 -647 -494 299
4936 299 710 736 -122 -527 -873 -431 584 898 277 -93 -588 -728 -62 592 663 247 -685 -690 -284 372 571
4957 571 287 83 -677 -785 37 382 611 126 -410 -412 -429 -26 404 369 -5 -352 -661 132 429 189 182 99
4979 99 -376 -395 126 646 386 19 -262 -317 244 153 189 164 24 -612 -424 12 308 131 88 -148 -108 95 115
5002 115 201 437 61 -212 -122 180 -17 50 -54 32 60 -65 19 126 184 -40 -332 -51 80 -179 83 160 -108
5025 -108 82 -147 -238 20 -33 -31 14 30 -82 -296 -63 195 8 229 143 -35 -169 -169 -62 352 232 132 -185
5048 -185 -187 6 91 144 374 -7 -427 -187 194 231 280 -27 -88 -149 -313 146 318 77 45 -638 -339 75 507
5071 507 308 12 -76 -581 -109 441 642 58 -67 -546 -139 -95 350 580 364 -329 -444 -400 277 711 271
5092 271 -264 -506 -288 -205 486 762 75 -548 -618 -338 278 664 644 27 -619 -511 -264 432 814 64 -428
5113 -428 -733 -412 283 681 566 -184 -706 -708 -230 600 580 463 -226 -745 -430 143 513 485 195 -762 -953
5134 -953 -90 396 549 426 -120 -791 -761 135 831 841 -155 -490 -876 -250 563 746 437 -140 -725 -924 163
5155 163 915 596 66 -319 -740 -457 390 848 744 -163 -696 -646 -165 966 735 188 -359 -1003 -618 293
5175 293 987 681 -383 -669 -509 -152 503 807 407 -619 -949 -733 322 815 437 -179 -702 -778 -228
5194 -228 450 723 566 -408 -845 -543 266 414 696 123 -517 -900 -366 541 909 338 -379 -806 -396 196
5214 196 601 711 102 -538 -781 -263 430 720 305 -157 -515 -689 -88 630 752 -43 -584 -980 -120 363
5234 363 658 654 -80 -620 -761 15 607 753 223 -550 -682 -372 257 690 460 12 -741 -635 10 416 622
5255 622 114 -519 -300 -327 123 652 529 -130 -606 -661 105 503 585 204 -249 -805 -409 92 501 357 -271
5276 -271 -499 -325 15 295 541 254 -231 -664 -128 56 646 332 15 -525 -142 -222 320 641 129 -253
5296 -253 -556 -388 279 264 109 -41 -472 -461 -162 203 429 141 -310 -430 -428 -40 401 396 -129 -319 -254 -124
5318 -124 195 372 16 -53 -213 -196 -57 130 26 -42 -260 -141 -50 240 127 -38 71 -139 -341 -121 180
5339 180 300 194 -278 -85 -165 -254 40 317 -70 -80 -414 -256 172 -64 -102 7 -22 -6 -160 -103 48 93 -84
5362 -84 -121 -82 24 -368 24 252 103 -205 151 -250 -158 88 154 181 -24 -113 -159 101 281 365 -134 42 -95
5385 -95 -20 -121 262 241 106 -110 -42 -6 50 214 201 -14 -353 -294 48 303 354 -235 -158 -163 -160 239 53 161 147
5410 147 16 -92 -6 147 233 56 -246 -479 -319 114 525 351 -63 -453 -301 -71 238 614 211 -44 -419
5431 -419 -265 110 480 242 24 -445 -304 -346 236 761 314 -369 -618 -237 339 327 351 -64 -395 -179 -245
5452 -245 300 504 394 -387 -650 -414 74 418 510 200 -376 -646 -483 232 881 387 -309 -432 -463 -134 748
5473 748 930 58 -479 -703 -317 416 721 306 17 -507 -779 -284 547 640 284 -392 -588 -409 101 891
5493 891 745 96 -661 -729 -140 645 1019 489 -479 -561 -512 195 657 880 -221 -721 -917 -255 601 756 559
5514 559 -245 -601 -772 -57 761 961 -14 -661 -671 -235 434 718 635 -270 -923 -768 156 615 653 390 -601
5535 -601 -516 -343 293 801 592 -112 -917 -780 -106 641 602 320 -279 -743 -218 265 862 603 -167 -680 -611
5556 -611 -1 529 640 276 -448 -776 -426 253 727 346 66 -613 -836 -291 456 917 433 -547 -689 -546
5576 -546 113 676 780 120 -406 -550 -224 265 622 372 -459 -614 -409 116 392 620 322 -411 -775 -335
5596 -335 244 727 364 -44 -499 -404 -101 334 581 159 -535 -804 -116 208 601 641 146 -578 -593 -17 560
5617 560 694 26 -488 -483 -258 357 436 428 34 -444 -657 -9 338 568 289 -200 -410 -387 207 273 423 127
5639 127 -513 -427 -125 175 293 113 -59 -433 -362 13 397 196 58 -223 -179 -111 126 289 -44 -233 -320 -205
5661 -205 -19 250 331 -82 -135 -202 -188 80 223 181 -178 -292 -171 104 260 298 -88 -235 -14 -36 51 161 37
5684 37 -77 -116 112 36 -189 93 210 124 -99 75 148 46 -229 90 103 52 -102 71 -33 215 -183 -149 23
5707 23 250 -130 -394 29 97 18 -76 195 -187 24 110 265 146 -86 -212 -144 113 178 120 92 -223 -100 -360
5730 -360 -56 244 118 -176 -38 -135 167 164 265 264 -98 -340 -139 148 330 169 -308 -12 -233 -250 240 274
5752 274 256 46 -339 -258 -6 252 334 100 -377 -526 -131 322 375 332 -148 -409 -348 -5 348 419 105 -508
5774 -508 -440 -133 276 651 119 181 -458 -344 -138 258 555 121 -454 -459 -66 187 338 399 39 -511 -503 -250
5796 -250 802 611 191 -303 -609 -324 94 690 537 15 -396 -627 -163 396 585 167 -142 -373 -455 151
5816 151 445 723 40 -542 -569 -210 412 637 211 -174 -712 -505 101 368 706 47 -400 -580 -176 298
5836 298 735 417 -329 -366 -468 -80 467 486 60 -385 -540 -424 210 689 515 -184 -581 -336 16 574 575
5857 575 286 -207 -622 -546 318 602 360 -240 -568 -446 -277 378 592 242 -287 -783 -283 335 534 411
5877 411 150 -360 -592 -70 504 637 82 -392 -722 -236 89 404 373 -131 -445 -478 -234 503 655 317 -105
5898 -105 -523 -310 162 386 551 151 -315 -604 -5 377 677 288 -303 -431 -424 52 226 530 141 -524 -703
5919 -703 -95 173 426 504 -197 -649 -455 12 447 420 235 -517 -401 -126 44 494 391 -96 -407 -310 14
5940 14 280 326 -83 -229 -443 -204 247 517 415 -78 -411 -124 -167 214 280 141 -335 -547 -378 163 301
5961 301 278 -143 -415 -202 -118 308 431 154 -177 -484 -223 130 312 327 38 -375 -334 -246 282 288 33 -141
5983 -141 -230 -256 0 266 0 36 -149 -113 -97 187 220 148 24 151 -268 60 -99 238 82 -361 -160 -24
6005 -24 57 181 -5 -25 -33 190 -71 228 226 1 -57 -271 -62 1 136 38 18 -8 -158 168 94 96 55 122 60 -138
6031 -138 205 115 69 35 47 -192 200 160 -13 -99 50 58 -59 24 158 45 35 -124 62 -81 -44 -108 -103 1 33
6056 33 187 72 30 -159 -204 -56 159 115 -320 41 -199 17 20 13 155 162 -58 -72 21 52 12 7 -98 -171 -133 282
6082 282 88 144 -146 -250 -95 233 134 -20 -103 -337 -231 -9 202 228 109 -129 -144 -27 206 214 228 128 -306
6105 -306 -382 113 331 332 -68 -439 -117 -141 -109 315 361 -327 -403 -233 126 288 151 -8 -171 -395 -105 140
6127 140 260 353 -28 -439 -195 224 297 327 143 -210 -472 -130 12 437 72 -29 -171 -278 70 405 512
6148 512 201 -287 -332 -222 223 293 144 4 -350 -409 -76 373 310 106 -496 -277 -59 358 448 212 23 -261
6170 -261 -403 -112 488 463 64 -184 -357 -383 -51 267 449 87 -368 -386 42 533 418 245 -8 -407 -168
6191 -168 179 474 256 -99 -511 -577 -41 313 468 312 -197 -412 -562 37 583 212 -188 -485 -569 -34 286
6212 286 555 417 -398 -483 -165 174 662 438 -96 -467 -543 -157 263 525 261 -233 -528 -249 257 207 343
6233 343 -70 -482 -415 -305 155 379 299 -212 -424 -246 174 16 481 181 -422 -511 -209 169 303 137 -157
6254 -157 -500 -308 -56 332 296 74 -331 -316 -210 65 195 333 7 -419 -370 -2 570 354 215 -252 -466
6275 -466 -135 163 396 481 30 -439 -421 -75 231 250 -31 -86 -338 -251 50 431 250 7 -345 -461 -70 278
6297 278 414 213 130 -230 -300 -142 537 355 49 -269 -401 -189 104 262 183 -77 -285 -192 153 370 139
6318 139 -35 -131 -140 -179 295 312 213 -189 -283 -163 240 282 -5 141 -390 -293 -413 128 249 129 6 -257 -128
6341 -128 133 159 140 52 -105 -69 -172 66 18 -152 -229 33 -172 44 119 271 -3 91 -14 -67 -5 72 -94 -66
6365 -66 -129 -137 -107 -51 -100 -185 101 -144 -17 14 71 -85 80 -47 -134 130 206 26 -91 -102 -15 -17 -47 -28 61 156 -96
6392 -96 17 56 -165 -142 8 -12 250 -60 40 -137 -50 -181 254 -14 37 -58 -277 -11 -66 198 -66 88 -64
6415 -64 -163 -113 352 417 155 -94 10 -179 -92 -136 261 191 60 -249 -71 88 334 -80 -35 -88 -233 130 319
6438 319 438 -31 -183 -401 -59 116 163 404 90 -223 -144 -56 340 139 -60 -168 -283 -106 125 349 142
6459 142 17 -297 -290 229 366 155 12 -104 -226 -105 45 310 361 -62 -339 -371 74 219 445 176 -291
6480 -291 -206 -123 -6 347 367 -6 -129 -391 82 292 415 291 -191 -428 -108 127 358 296 17 -331 -274 -213
6502 -213 92 449 426 -82 -371 -237 -43 57 340 237 -408 -348 -229 267 208 188 -152 -266 -444 128 248
6523 248 332 281 -388 -420 -225 113 511 303 -42 -202 -269 -290 352 352 263 -412 -416 -286 56 372 298 305 -395 -335 -32
6548 -32 333 329 3 -272 -309 -445 109 223 369 -104 -613 -345 -260 274 437 373 -78 -299 -365 0 270 529
6570 529 80 -216 -373 -122 180 269 39 -10 -227 -456 -70 338 419 -64 -244 -292 -181 33 345 192 -179
6591 -179 -154 -538 5 516 236 100 -235 -337 -300 34 348 160 -125 -245 -203 -7 291 407 29 173 -542
6612 -542 -370 99 364 248 -28 -322 -148 -203 213 326 47 107 -484 -355 213 179 208 83 -191 -345 -296 171
6634 171 462 24 -163 -189 -320 48 188 104 -8 -83 -175 -87 147 294 173 -143 -220 -252 137 56 287 -74 -42
6657 -42 -259 -141 179 227 239 -204 -315 -449 30 130 306 65 -124 -48 -47 144 159 125 34 -264 -76 176 197
6680 197 142 95 -100 -131 62 69 365 -55 -98 -363 -153 77 103 2 47 -6 -158 51 67 105 272 -164 157 -43
6704 -43 68 233 185 -131 -1 -236 -133 189 -50 8 -25 61 27 35 115 -17 -14 -137 10 117 302 105 6 52
6728 52 57 55 250 130 35 71 -254 -15 181 -78 62 -87 77 16 -11 144 -220 12 -7 -153 32 307 165
6751 165 -52 -137 -136 -72 153 -72 136 -216 -168 -77 -81 22 -120 120 -271 -32 27 134 -106 118 -53 38 -4 -176
6775 -176 -9 209 -154 -57 -22 -96 -175 230 40 -120 -198 -16 16 225 -62 89 -13 -294 -3 224 193 -16
6797 -16 -171 -29 -137 -119 164 131 -214 -307 -147 51 188 212 84 -240 -285 -160 139 273 196 24 -195 -36
6819 -36 -60 229 40 182 -17 -230 72 236 203 67 -55 -78 -288 209 196 91 157 -192 -191 -288 243 132 89
6842 89 -178 -233 -236 -264 61 193 17 -12 -375 -117 25 110 21 -130 -168 -97 -183 234 363 252 -45 -318 -25 157
6866 157 277 145 53 -199 -122 -182 8 328 127 17 -173 -188 -16 113 234 246 -147 -167 -224 179 116 109 -307
6889 -307 -204 -26 13 290 92 -143 -320 -289 -125 67 324 101 -77 -286 -163 -60 12 185 52 -178 -226
6910 -226 47 116 134 39 -64 -217 -72 -23 145 90 43 -183 -155 -149 31 341 76 -76 -259 -81 8 93 272 32
6934 32 -247 -146 -157 48 276 73 -37 -68 -185 122 73 69 189 -299 -2 -47 41 34 6 -194 -187 4 -66 299 52
6959 52 -231 -199 -232 -11 -17 40 144 -221 -198 -29 -63 35 -105 -61 -103 -113 -181 230 309 210 -298 -87 -184 99 19 221
6985 221 15 45 -109 -123 162 44 225 -163 -192 -90 63 48 51 55 55 -37 22 111 21 -120 38 -183 -57 -51 111
7010 111 9 -31 -68 -155 -42 -47 150 45 190 -146 -118 -93 150 59 269 -51 161 43 74 41 126 41 -100 54
7034 54 -110 -75 110 94 -252 -7 -41 -96 158 79 -124 -187 4 -95 -58 -78 -137 -31 -32 -105 106 -123 -67 67 135
7059 135 73 -226 -14 -135 144 -187 5 232 -62 220 -71 -115 64 148 92 67 22 -71 -55 162 105 42 200
7082 200 -24 -172 79 148 -62 53 -182 62 22 -56 -3 25 6 86 54 40 199 108 -26 99 18 -67 18 141
7106 141 21 -179 -70 -255 -149 53 184 -215 -7 -8 -117 105 51 73 -111 -124 -22 -59 64 101 113 -1 47
7129 47 -136 105 -90 31 -125 -262 -191 109 67 212 161 156 23 -143 -197 61 177 25 -194 -68 261 185 137
7152 137 -28 -163 -6 13 -44 227 164 157 -44 -16 -10 108 181 126 -130 -82 -44 -17 -54 56 -15 -154 -130 81 19 220
7178 220 12 -67 -13 17 -65 85 54 -81 -135 13 -147 178 197 -64 -158 -98 -23 -22 168 82 -21 -4 -183 -124 73
7203 73 365 95 -277 -179 -133 314 169 161 165 0 -144 -76 245 334 -48 -13 -135 -65 -23 278 230 43 -327 -240 242
7228 242 78 136 203 -3 -179 28 42 307 196 -88 -3 -135 -165 189 98 147 -18 -215 -23 98 164 138 38
7251 38 -116 -115 89 30 -10 -6 -228 -136 -142 40 182 124 87 -147 -131 -136 -10 191 130 116 -63 -217 -89 376 144 117
7277 117 -74 -187 57 135 62 49 46 -85 -52 60 125 231 -130 -53 -44 -270 -47 292 228 24 -111 -155 -161 -48 182
7302 182 142 -68 31 -56 98 67 169 109 -127 -54 12 -148 -77 80 -78 -219 9 -106 78 223 -146 -146 -34
7325 -34 39 96 179 -17 -48 -10 64 69 45 167 -166 -96 -103 -22 137 -81 176 94 -82 -50 54 145 94 -51 265 4
7351 4 -168 11 59 -9 -170 -219 44 54 195 205 -19 -12 -53 -54 15 114 -95 -45 -237 -63 36 73 -6 -87 20 -189
7377 -189 126 137 42 145 -103 -81 -28 156 70 -78 101 179 119 59 -37 101 -93 -162 -175 -65 47 -29 72 -84
7401 -84 -106 74 95 146 79 83 -215 -212 281 101 14 -150 -217 -67 -90 -72 257 79 -2 52 -3 105 -184 -26 -72 -19
7427 -19 21 -111 -45 209 0 -144 -204 -46 120 -18 15 16 5 -186 -174 58 32 -93 -84 20 -174 68 -15 -114 -9
7452 -9 -159 -55 113 21 20 -148 -199 -36 52 -13 98 62 -139 -78 -92 10 188 63 -43 -313 -158 -29 -48 107
7476 107 301 49 -97 -202 -88 -26 273 28 -90 -148 -86 6 364 64 -87 -78 -368 37 109 190 44 65 -294
7499 -294 -170 30 124 260 -104 -241 -205 -41 133 241 184 66 -197 32 181 255 -19 32 -28 -155 -21 23
7521 23 50 -27 -17 -324 -121 59 168 9 18 9 -377 44 220 112 37 -71 -217 76 -112 275 94 7 -53 -147
7545 -147 67 114 161 -2 81 -148 -28 93 72 123 34 6 -105 62 -113 33 4 -176 -122 -55 92 206 46
7568 46 -35 136 -24 -197 209 210 -25 -93 -108 -163 -93 41 -97 148 -97 71 25 33 184 122 -16 69 -158 73
7592 73 92 117 -17 -147 -94 -260 8 28 129 -240 -73 -175 -128 141 168 30 -57 -385 -150 26 109 50 -125
7615 -125 -187 -78 26 37 140 105 -83 7 -99 173 106 -94 309 -213 -177 39 -8 3 45 -97 -86 -81 -22 5 -40
7640 -40 30 -148 151 -46 50 30 47 67 13 179 -17 11 146 -105 165 -106 -119 46 100 178 -132 -253 -101 -80
7664 -80 134 106 -35 -12 -29 -6 -192 -156 0 -21 93 -26 -239 24 244 -121 -101 -116 15 -152 104 -28 -76
7687 -76 -114 -21 111 44 -41 146 126 -238 -174 96 -151 138 -33 27 -100 -229 -10 -91 -383 2 101 -276 43
7710 43 -63 -180 -122 -41 58 -16 -9 -80 1 55 -16 -102 -33 -65 -4 -32 -86 15 41 16 -6 67 -71 27 -125 73 148 43
7738 43 -214 20 11 190 -109 38 0 2 -45 142 61 -6 -211 -93 -3 -14 111 -83 -11 -135 249 41 15 37 308
7763 308 31 -30 215 163 -170 61 -253 -102 -196 -9 -55 51 -29 43 52 -86 1 -91 14 173 94 160 11 218
7787 218 42 53 -186 -97 190 -78 237 94 -208 -49 -99 31 2 -78 74 -79 117 -20 8 -38 -17 9 40
7810 40 -123 -4 -25 -27 131 -120 -119 -54 -45 158 -10 -204 -59 97 65 -20 -51 52 45 129 -73 -19 -123 17 110 118
7836 118 -61 -150 102 90 -7 -78 -111 24 -8 145 85 125 -3 -133 88 40 -42 61 -110 -220 -97 -45 -10 -172
7860 -172 9 19 -164 -11 80 -2 -76 -155 140 60 110 -105 188 0 9 -189 42 -187 26 49 -140 -18 65 -37
7884 -37 43 -6 185 -243 -176 242 -151 32 -7 -27 7 -69 -32 -51 -42 -171 -67 142 -63 -69 187 21 129 2 -75
7909 -75 -105 19 180 -215 -93 -161 68 -109 141 30 -146 11 -162 -46 -37 55 -51 -93 -308 -281 154 -40 -54
7932 -54 -96 -89 -32 149 108 161 -79 -102 -39 -78 96 73 -7 -69 49 -35 -5 -108 68 -203 -116 -14 -68 -137 164 -157
7958 -157 31 -24 -137 15 186 213 -37 -31 48 -221 71 -123 -43 125 -19 -120 96 68 -69 -4 -144 -175 -37
7981 -37 -139 -118 -12 -105 -11 -33 43 84 -105 -12 57 226 140 -3 67 -52 47 -127 -147 -5 24 -44 91 25 -55 109
8007 109 -27 71 79 84 47 -144 49 -32 -47 -22 -260 207 43 -49 143 -164 -39 50 30 -140 -38 -83 -113 -96 -48
8032 -48 -63 -14 -12 -180 321 -125 -146 63 43 -8 -110 33 113 65 67 -160 64 103 105 -97 84 36 -233 -82 -22 -60
8058 -60 43 -165 74 -52 -117 -125 36 -5 -19 141 -45 133 -3 119 38 68 -216 252 136 -88 166 70 99
8081 99 -174 117 52 47 106 61 -15 128 -184 -50 99 217 -12 -13 -124 -149 220 19 18 94 49 -109 66 -103 -85
8106 -85 -80 95 -39 27 77 124 -102 10 -123 -78 55 53 -30 -34 -70 -41 204 147 -140 -200 -189 -23 27 191 91 -33
8132 -33 68 -38 -61 75 -9 -58 152 -66 -89 124 97 174 -23 -129 -57 -23 -96 69 271 135 -15 10 -61 189
8156 189 74 162 -70 -62 14 151 119 50 -53 -115 102 130 55 -67 -170 73 75 -177 146 25 -199 -63 54 -84
8180 -84 18 58 -62 217 289 -94 6 -25 14 -121 -162
8191a62
$$ Imaginary data points
##PAGE= N=2
##DATA TABLE= (X++(I..I)), XYDATA
0 0 0 0 0 0 0 0 8 -8 8 -8 16 -16 32 -32 40 -56 64 -88 104 -122 152 -177 215 -255 296 -344 400 -464 536
29 536 -616 703 -801 912 -1032 1164 -1312 1472 -1649 1846 -2057 2289 -2546 2825 -3129 3463
45 3463 -3823 4220 -4655 5127 -5649 6224 -6856 7555 -8336 9210 -10196 11314 -12595
58 -12595 14085 -15841 17945 -20515 23741 -27933 33624 -41818 54696 -77954 133016 -522181
70 -522181 -86917 867607 -191416 282745 643958 -559183 -839292 416817 390440 52104
80 52104 414265 18450 -736235 -235740 138029 -25336 292969 304810 -392438 -223758
90 -223758 254728 -3183 52485 384708 -183053 -470157 132412 190339 -98803 183773
100 183773 36976 -471107 -158646 266636 154432 272145 195284 -398474 -342723 115222
110 115222 20864 201228 519339 -185617 -679971 -54093 85939 -124723 496961 510718
120 510718 -467864 -403618 179141 -141111 -5053 652086 66196 -617093 -68661 79887
130 79887 -286440 256781 532373 -234885 -330878 154409 -54142 -82562 367561 95895
140 95895 -336945 -66625 18467 -126966 182274 221500 -199168 -141273 71363 -56541 98137
151 98137 289582 -72189 -238720 -3547 -64173 -45938 278705 118211 -246037 -103656
161 -103656 -14775 -99512 184885 285549 -83002 -132492 -24471 -188174 4760 341591
171 341591 35220 -197837 46179 -95882 -259968 213923 314092 -146412 -69159 113904
181 113904 -213628 -116908 311747 67841 -191221 74384 -11327 -245496 95972 239562
191 239562 -101887 -58975 109755 -111326 -82468 184894 36200 -110731 45007 -28345
201 -28345 -129334 97591 112930 -98357 -13591 52825 -103164 -11050 148489 -745 -64531
212 -64531 30234 -57136 -68298 99941 47806 -57984 37806 -3577 -113332 36503 102185
223 102185 -42409 13 57249 -89241 -51628 95211 -15841 -53433 92420 -6539 -121186
234 -121186 56986 73119 -93459 13268 104389 -66390 -51672 84989 -28028 -70063 78359
245 78359 21037 -74298 45939 32978 -97777 4662 85734 -36074 -22902 59362 -40350
256 -40350 -65627 51387 29479 -18431 41580 -4059 -78825 12020 54522 -15329 14808 33739
268 33739 -65123 -56238 40204 26274 10963 36419 -32114 -69585 15424 35320 6925 49658
280 49658 14310 -92287 -50781 41755 25781 28432 45236 -40574 -81487 -1417 33950 36193
292 36193 68223 4532 -99682 -58344 23454 25291 46132 51757 -43434 -93259 -23718 35373
304 35373 63319 74802 137 -85207 -58161 2396 30673 68561 50307 -57707 -102972 -33724
316 -33724 35737 71622 74012 2191 -80462 -73253 -9371 51686 88281 46693 -60801 -107824
328 -107824 -52197 30111 83617 83713 13338 -73570 -92396 -27773 65318 105255 46230 -55759
340 -55759 -102977 -71778 3774 80977 98045 20695 -79118 -96873 -21914 68789 103490 59098
352 59098 -36365 -105779 -85003 4932 84121 91584 15707 -85508 -108606 -25419 73876 107079
364 107079 67491 -24604 -109258 -96723 5141 94429 98078 13819 -91649 -112587 -33747 56308
376 56308 109550 99084 -11369 -125907 -96622 18180 79927 86644 40390 -77472 -140133
387 -140133 -54661 57197 99839 92315 7617 -110397 -102336 16743 86915 87178 45662 -60955
399 -60955 -136661 -70133 47841 99300 82251 -2406 -104271 -95731 9784 82645 95396 54578
411 54578 -57231 -136166 -70862 51734 101041 70121 -8867 -92188 -101270 -16076 90638 126197
423 126197 51060 -67009 -113731 -69711 17684 102106 99530 -12097 -103207 -94293 -37502 54668
435 54668 138478 78975 -66518 -99964 -47461 -8197 69245 122756 15180 -111070 -88672
446 -88672 -23981 23922 99909 87049 -46857 -96702 -34856 454 49740 108265 23943 -108061
458 -108061 -83698 -277 25920 71259 79424 -36526 -110415 -42604 28454 61384 91478 30885
470 30885 -94503 -106472 -12977 46301 68788 68587 -9737 -106723 -91375 17261 89987 78832
482 78832 27600 -35243 -90870 -73249 32561 98700 53219 -10953 -49876 -84958 -42589 71045
494 71045 86392 8876 -14974 -33378 -79974 -11919 98443 47283 -40648 -16949 -23953 -57645
506 -57645 32358 93506 -2024 -47373 -3914 -30273 -22165 81195 55914 -64225 -44240 4013
518 4013 -36490 12215 103634 18808 -86439 -33502 3873 -15534 52480 88775 -19578 -78520
530 -78520 -26274 -13809 -1133 74221 63743 -43473 -65962 -14213 -7468 7779 63655 47500
542 47500 -37925 -57962 -12139 3347 7464 38161 28870 -28582 -34823 4746 1397 -4486 32299
555 32299 20208 -35045 -9294 33163 -15358 -33516 27153 12348 -39900 14502 48397 -27112
567 -27112 -37013 23060 -3962 -25058 44241 36518 -40256 -16545 16598 -33438 -11687 62649
579 62649 15429 -44200 5778 10891 -45358 -2932 52802 1651 -22334 19620 -5051 -42223
591 -42223 5365 27838 -9522 7920 37124 -14284 -45910 757 14770 -11188 17675 47159
603 47159 -6260 -53326 -20410 9081 781 23520 46999 -4051 -54388 -26341 3687 3377 36212
616 36212 50126 -19347 -55941 -7867 5834 -5106 42615 46543 -39431 -52199 10981 5868
628 5868 -6490 40048 17614 -52940 -20813 29183 -1743 5524 39164 -23444 -59503 21716
640 21716 44161 -11003 8016 20586 -55760 -50324 49032 51070 -2147 5605 -16356 -69234 -17662
653 -17662 63470 44218 5722 -4114 -49989 -68065 11291 72661 43332 1938 -24758 -55595
665 -55595 -42437 26229 69182 43743 -13890 -53276 -50532 -11932 36638 57574 24673 -31928
677 -31928 -52569 -31305 8649 54282 55388 -10733 -55369 -31718 -6861 15982 59571 38494
689 38494 -47660 -60966 -8076 11677 35524 62789 -1706 -75871 -37941 11548 14537 51978
701 51978 53106 -49676 -86647 -5941 31538 29089 58990 20768 -76452 -67181 12350 38211
713 38211 49726 46039 -33017 -87002 -34902 23430 44493 60879 20915 -62557 -71871 -11703
725 -11703 36042 62861 46947 -23965 -66590 -42731 -3205 43213 71868 19322 -56237 -56113
737 -56113 -16282 17835 55627 48604 -18129 -57056 -41229 -7269 44179 64319 3640 -50570
749 -50570 -39445 -20417 13328 70164 49036 -35877 -56147 -29937 -11715 44334 79463 3897
761 3897 -64911 -42935 -22405 756 71323 69687 -28237 -67627 -34701 -10974 31960 72867
773 72867 27950 -41369 -52713 -38116 2392 64282 54982 -14107 -41358 -37494 -27446 28550
785 28550 68197 19001 -34174 -38227 -36488 -2609 59663 47946 -18468 -36369 -30080 -23872 29147
798 29147 68381 20730 -36145 -43892 -33034 4935 53254 41870 -6205 -33106 -48485 -29313
810 -29313 39279 62577 14029 -19300 -31960 -46076 -5314 56101 41472 -4874 -20233 -40252
822 -40252 -36645 28397 58609 13975 -16320 -22974 -38442 -12665 42894 42283 609 -25302 -38488
835 -38488 -23203 23672 40028 18098 -1641 -28466 -43995 -842 44769 29659 1825 -12363
847 -12363 -36917 -29908 21335 38947 14003 -2231 -21955 -39792 -7044 36844 28536 2395
859 2395 -10409 -25801 -23539 9789 30725 21457 -358 -25787 -28152 2132 20918 16072 12997
872 12997 -3740 -32449 -21530 16082 22029 9987 3853 -15718 -28066 -2485 20546 14818 8505
885 8505 -352 -21971 -19698 10965 20905 7540 79 -8154 -17219 -7651 10429 14514 6987 -4453
899 -4453 -15036 -10282 6030 10169 3611 2730 -1241 -11546 -7530 9533 10927 -1690 -3232 251
913 251 -3857 -2953 5792 3177 -4214 -971 177 -3761 1861 5390 -5929 -6968 6229 5702 -3375
928 -3375 424 2652 -4963 -4341 5784 7740 795 -5419 -6476 -1093 3150 4489 4047 -1891 -8597
943 -8597 -4375 2461 4938 9048 3092 -15652 -10898 10602 7082 289 11943 -1409 -27655 -5799
957 -5799 21666 7359 3175 9328 -20414 -29426 12339 21333 1065 13416 3047 -41095 -20786
970 -20786 30505 18029 2113 15925 -13744 -43461 -1045 30636 12764 12889 5360 -37353 -30245
983 -30245 19752 21634 8379 15780 -12005 -42732 -9957 26412 19827 11868 -916 -28164 -23178
996 -23178 8632 22071 21772 7746 -23988 -29862 -2761 15855 26569 20578 -18376 -36268 -9904
1009 -9904 3991 15878 42566 10402 -51165 -32078 11414 5169 25873 49219 -16281 -62294
1021 -62294 -12292 12513 7824 48766 34003 -51954 -49986 6966 2055 17813 59487 1950
1033 1950 -66048 -25401 10347 3570 39259 41423 -32681 -47726 -2617 2284 16747 48705 4478
1046 4478 -50645 -23968 6595 7963 30893 27152 -24483 -39738 -13535 9273 33706 32640 -11517
1059 -11517 -33798 -23867 -12830 24201 53258 9866 -33259 -25306 -26751 -7787 57588 48569 -26696
1072 -26696 -30660 -16256 -38735 11947 79431 19445 -44516 -17203 -24025 -33014 47914 66921
1084 66921 -17253 -30833 -8554 -40978 -5163 73560 28136 -38412 -11251 -15050 -37737 30197
1096 30197 62013 -9607 -30756 -7001 -27793 -6163 53665 25648 -27494 -15867 -16259 -20989
1108 -20989 29589 46798 -2455 -24664 -22353 -23722 12546 43148 16379 -8716 -20183 -41983
1120 -41983 -12425 45545 32462 -2125 -3405 -32333 -44456 21317 49178 8199 4440 -5401
1132 -5401 -55760 -22922 51388 26472 -6160 14880 -22537 -58355 13089 49479 1310 3838
1144 3838 9167 -47318 -29561 42804 21367 -9726 18513 -11922 -52497 9668 45706 -1324
1156 -1324 -2540 10486 -33868 -25892 33342 23491 -4529 6269 -16845 -38028 8382 33084 7006
1169 7006 3736 -4030 -33471 -14372 23196 17818 13014 7174 -29257 -28220 13948 14788 6760 22336
1183 22336 -6457 -41490 -6289 19573 2745 16130 16460 -30476 -24957 16509 3357 735 30128
1196 30128 -3648 -40973 2215 20179 -8899 11942 23170 -26524 -24045 19182 2761 -5564
1208 -5564 24737 -1909 -35669 3566 18578 -9986 7842 19893 -21566 -20141 15550 4909
1220 4909 -1985 16832 -3398 -23208 3368 9140 -5238 11897 10391 -19465 -10224 9367 -2204
1233 -2204 2847 13789 -8273 -13005 6581 -2393 -4379 18135 3207 -19510 3773 9400 -12207
1246 -12207 4102 16789 -11969 -9890 13090 -5146 -9433 16214 429 -18218 9469 10852
1258 10852 -15956 1668 14600 -12331 -6361 16398 -3280 -10072 11268 -2266 -13323 13143
1270 13143 8568 -15372 2548 10055 -14411 -2548 18370 -3754 -11456 6917 -2973 -9140 11980
1283 11980 6291 -10728 1767 2339 -11502 5721 16648 -5796 -7355 4038 -7263 -4086 15187
1296 15187 3611 -9074 1281 -5710 -12590 12262 16037 -8658 -5669 3201 -11672 -3163 20406
1309 20406 6998 -9251 -2083 -7239 -10225 12962 15543 -5382 -4910 -3446 -14688 598 20872
1322 20872 6225 -6839 -3937 -12056 -8411 15763 14550 -3014 -2148 -7861 -18262 4070 23678
1335 23678 6141 -6189 -3575 -13258 -10044 14534 17113 1306 -4539 -13442 -16950 5269 19461
1348 19461 7537 -550 -6198 -18349 -8299 16394 16549 4602 -1833 -15943 -17282 6744 18347
1361 18347 7277 2465 -6806 -22585 -9653 17433 17248 4157 -3133 -15798 -17182 4474 18444
1374 18444 12663 4057 -11568 -23493 -6610 16521 16466 7998 -1583 -18959 -19736 4733 19005 14229
1388 14229 5285 -11926 -24949 -9007 14546 17189 9903 -275 -18005 -21353 1201 20436 17716
1401 17716 4421 -11472 -19969 -10251 8318 19212 14627 -3679 -20877 -18025 618 15848 19112
1414 19112 6947 -13569 -21187 -9226 7822 20162 18653 -2831 -22987 -17939 392 14180
1426 14180 20266 10679 -12657 -24211 -12365 6446 20081 19919 -973 -21424 -18428 -2674 10480
1439 10480 20445 15025 -10068 -24875 -11662 7381 15760 16603 4276 -16995 -21086 -3311 12806
1452 12806 16760 11029 -5960 -23121 -15806 8173 18004 11999 3219 -11068 -22990 -8800 17570
1465 17570 21339 6280 -5950 -15952 -18146 1012 21561 16935 267 -11824 -19687 -12247 12465
1478 12465 23148 8096 -6784 -13777 -17067 -4180 18999 20804 1688 -12376 -15230 -10688 6273
1491 6273 20414 13018 -5215 -14246 -13646 -5532 12384 20046 4362 -13609 -13760 -6167 680 13024
1505 13024 17383 -1236 -18649 -10937 2117 6376 12497 11359 -9106 -18858 -3396 6499 6456 12632
1519 12632 4920 -18310 -16200 5996 9260 4917 9949 -1711 -20863 -9347 11064 9877 6411
1532 6411 5354 -10276 -17606 579 11556 6511 6727 1430 -15852 -13234 7000 10655 3755 3641
1546 3641 -2912 -13525 -6756 8142 9071 3330 254 -5695 -9321 -168 9075 5428 -817 -1142 -4016
1561 -4016 -7157 1944 10815 2270 -7375 -2040 171 -4923 2884 10687 -1431 -9436 -450 1152 -2273
1576 -2273 6826 7801 -7330 -6431 3652 -1432 -2050 10165 3866 -11333 -3500 5120 -3402 -724 9232
1591 9232 -584 -8734 978 2325 -4420 3199 7034 -4543 -4260 5444 -812 -5634 4465 5163 -5084
1606 -5084 -1557 5368 -2007 -5799 2253 2873 -2356 1208 3250 -4038 -4463 2512 2158 -709 3553 3071
1622 3071 -6113 -5126 4896 3841 -1909 2319 2311 -7386 -5354 6110 4015 -2149 1383 -308 -7460
1637 -7460 -322 7974 1191 -2504 2533 -3055 -7832 4903 9761 -2062 -4634 1467 -3882 -4877 8001
1652 8001 8226 -4353 -5059 -1548 -4896 581 11171 3659 -7568 -4154 -2115 -4270 5545 13050 485
1667 485 -9716 -4288 -1062 -390 8426 9901 -3726 -10405 -4922 -861 3719 10085 4845 -8456 -9551
1682 -9551 -1600 2011 5789 9801 1592 -10849 -9147 2074 6495 5936 5107 -2144 -11447 -7022 5045
1697 5045 8389 5232 1546 -6955 -11945 -1180 9739 6637 1856 -310 -9843 -11509 5009 13847
1711 13847 4196 -1312 -3759 -10919 -6082 10699 12177 1440 -3104 -8030 -12065 1821 14784 6587
1725 6587 -3007 -4398 -10136 -8638 8603 15055 3333 -4748 -7862 -9832 -42 12670 9511 -11
1739 -11 -5647 -11231 -7733 7192 13150 4646 -3643 -8837 -10153 -606 10561 10147 2975 -6356 -12794
1754 -12794 -6059 7884 10895 5699 -162 -10049 -12208 787 10837 8837 3881 -5388 -14780 -6199
1768 -6199 8503 8859 5316 2066 -10443 -14669 1809 11986 6905 3759 -2895 -13835 -7330 8181
1782 8181 9825 5779 2268 -10098 -14680 1070 10984 7247 4154 -2807 -13874 -8574 6211 10029
1796 10029 7935 2689 -10454 -13056 551 8506 7433 7169 -2030 -14407 -8180 5671 8395 7432
1810 7432 2895 -9539 -12065 -293 6358 7456 7733 -3233 -13401 -5930 4803 6829 8381 3221
1824 3221 -9803 -10276 439 4624 7747 9298 -4149 -14253 -4421 3856 4175 8538 5338 -9855
1838 -9855 -11416 -232 4184 7248 8693 -2612 -11456 -4798 1680 3986 9701 4967 -9099 -9295
1852 -9295 -507 2234 6373 8226 -3095 -10257 -3567 71 2676 9531 4252 -8942 -7533 392
1866 392 1274 5472 8023 -1886 -8533 -3450 -535 3488 8517 2321 -7477 -4986 -1397 -663 6061 7806
1882 7806 -3004 -6716 -2429 -1675 2444 8453 1919 -5927 -2850 -1476 -1883 6140 7170 -3534 -5869
1897 -5869 -1243 -1791 1201 6873 1587 -5119 -2541 -2111 -1980 5250 5556 -3324 -3923 192 -1881 586
1913 586 5834 2065 -3676 -1808 -1114 -1016 3448 3057 -2221 -2115 -509 -1956 888 3774 440 -2421
1929 -2421 -1026 -794 499 3004 766 -1274 227 -1429 -1660 2742 2881 -1830 -1353 501 -1613 54
1945 54 2911 -759 -2111 944 -901 -1737 3119 2099 -3786 -664 2987 -950 -685 3318 -642 -3841
1961 -3841 1137 1838 -1150 1239 1257 -4017 -2068 3174 831 -929 1732 -238 -4479 -841 3622 1838
1977 1838 -337 140 -1537 -2900 616 3349 1772 -203 -1481 -3050 -1647 2620 4033 140 -2312
1992 -2312 -1476 -2075 -1297 3640 4687 -1357 -3963 -1594 -220 757 4476 2893 -3154 -3847 -966 22
2008 22 2710 5345 -160 -5839 -2737 542 384 3445 4855 -2392 -7093 -1792 2354 2322 4044 2986
2024 2986 -4774 -6516 338 3131 2618 4232 715 -7392 -5286 3238 3665 1495 3040 -860 -8632
2039 -8632 -3677 5690 4543 1135 1564 -3847 -7484 857 6772 2612 855 208 -6647 -5884 4930
2054 4930 6765 567 -489 -2027 -7057 -2639 6568 5462 29 -1972 -4437 -5410 1712 7338 3969
2069 3969 -1347 -3080 -4902 -3491 3999 7731 1966 -4454 -4367 -2928 -1118 4683 6992 -307 -6821
2084 -6821 -3902 -499 1009 6123 5957 -3805 -7143 -954 743 1285 7420 3184 -8112 -6113 2174
2099 2174 1039 2279 7006 -385 -9410 -3238 3020 1398 4258 4691 -5167 -7638 865 2749 1939
2114 1939 5512 1765 -7676 -5462 2455 3085 3010 3480 -2250 -6831 -2468 2698 3582 3468 572 -4485
2130 -4485 -5201 -71 3960 4097 1166 -1246 -3140 -4154 702 6309 3419 -2571 -2056 -2033 -3657 2387
2146 2387 7111 -53 -4059 -1088 -2538 -2411 5938 5579 -3980 -3039 673 -3716 -258 8258 2106 -5451
2162 -5451 -1197 45 -3429 3278 6210 -2194 -4287 252 -2191 -1364 5915 3041 -4580 -2024 621
2177 621 -2320 1200 5165 -106 -3560 -636 -466 208 3209 1617 -1822 -1737 -739 -572 1911 2262 -419
2194 -419 -1724 -1839 -1153 2073 2595 -571 -209 -125 -3051 -41 4497 877 -2066 746 -833 -3262 1978
2211 1978 3528 -1790 -1004 1280 -3157 -1613 4783 1054 -3475 1491 1094 -3559 930 4226 -1646
2226 -1646 -2230 1848 -1061 -1763 3317 1135 -3190 13 838 -1959 780 3015 -1104 -2106 621 -340
2242 -340 -491 1825 608 -1312 50 -480 -509 2062 1223 -1499 -424 155 -1042 822 1809 -1255 -961
2259 -961 388 -1531 -329 2972 -344 -2702 1006 510 -1830 1914 2634 -2134 -1315 1591 -1416 -479
2275 -479 3503 -649 -3291 976 596 -2136 1920 2927 -2892 -2060 1486 -647 -328 2952 46 -2730
2291 -2730 374 485 -1078 2296 2297 -2466 -1585 813 -887 413 2573 -502 -2371 71 -515 -528 2840
2308 2840 1356 -2813 -751 757 -1067 1341 2885 -994 -2287 65 -428 319 3157 318 -2809
2323 -2809 -163 -300 -1413 2175 2842 -2191 -2362 448 -878 354 3270 221 -2647 -396 -267 -1084
2339 -1084 2979 2643 -2393 -1966 92 -946 544 3371 -89 -2677 -804 -847 -309 2736 1944 -2143
2355 -2143 -1399 -190 -947 1654 3456 -497 -2448 -722 -966 109 3397 1502 -2390 -1306 -910 -1117
2371 -1117 2196 3350 -932 -2524 -1034 -1110 608 3550 1036 -1883 -1181 -1888 -951 3425 3342 -1166 -1895
2388 -1895 -649 -1928 620 4166 1022 -2383 -1341 -2024 -1451 3294 3076 -1418 -1814 -804 -2048 1174
2404 1174 4193 1324 -2138 -1670 -1821 -307 3053 2725 -1051 -1750 -2248 -1867 1909 3972 981 -1670
2420 -1670 -1743 -2143 -414 3359 2658 -150 -1849 -2553 -1833 1961 3461 1282 -632 -2249 -3094 40 3181
2437 3181 2192 541 -1009 -3728 -2210 2524 2736 618 83 -1527 -3871 74 4329 2021 -334 -709
2453 -709 -2985 -2753 2197 3701 534 -630 -1842 -3644 -746 3702 2828 -264 -1125 -2052 -2335 1148
2469 1148 3483 1782 -557 -2105 -2428 -717 2380 2968 873 -1337 -2705 -1935 315 2926 2722 -211
2485 -211 -2815 -2037 -625 829 2648 2218 -1479 -3135 -830 317 1270 2989 889 -3083 -2150 514
2501 514 502 1434 2484 -713 -3648 -1077 1404 667 1357 1826 -1683 -3194 240 1763 1255 1457 609
2518 609 -2723 -2281 935 1855 887 831 -681 -3288 -1536 1975 1995 756 151 -1461 -2885 -477 2349
2535 2349 1786 325 -153 -1415 -2078 540 2588 706 -494 244 -1708 -1804 1629 2090 -836 -570 360
2552 360 -1485 -779 2027 966 -1378 -340 322 -1216 157 2322 117 -1850 -3 -2 -1004 1262
2568 1262 2206 -781 -1893 -305 359 -524 1025 1542 -1044 -1524 111 291 -261 1449 1249 -1132 -1121
2585 -1121 895 -112 -927 1214 1131 -1616 -758 1261 -946 -974 1436 275 -1334 681 1199 -1365 -525
2602 -525 1420 -446 -921 1926 704 -1993 -31 1588 -1202 -222 2054 -381 -1741 562 535 -949
2618 -949 420 1535 -1111 -1385 882 536 -896 862 1262 -1128 -1118 1195 944 -563 567 610 -1212
2635 -1212 -909 1363 640 -668 129 -204 -1519 28 2197 587 -1234 125 -388 -1082 1107 2534
2651 2534 -353 -1435 39 -845 -1066 1991 1959 -1243 -1402 -398 -1431 -48 2782 1245 -1820 -1009
2667 -1009 -335 -1091 694 2933 451 -2101 -1077 56 -91 1468 2093 -331 -2474 -673 346 311
2683 311 1313 1115 -1704 -2516 -35 1154 766 1564 714 -2404 -2163 1203 1706 990 1126 -292 -3114
2700 -3114 -1141 1929 1568 711 714 -1850 -2964 175 2204 1263 695 -84 -2598 -2194 1393 2587 1127
2717 1127 178 -1048 -2641 -1087 2286 2397 471 -584 -1739 -2117 192 2506 1711 -430 -1539 -1520
2733 -1520 -973 1182 2837 1052 -1260 -1865 -979 6 2035 2351 -3 -2127 -1741 -720 844 2309
2749 2309 1417 -1249 -2333 -1024 -65 1437 2639 654 -2243 -2084 -493 816 2152 2024 -574 -2589
2765 -2589 -1586 207 1602 2214 859 -1736 -2303 -1000 823 1816 1365 -280 -1772 -1628 -203 1628
2781 1628 1966 527 -724 -1736 -1186 712 2286 1360 -259 -1229 -1720 -741 1637 1932 92 -918 -1590
2798 -1590 -1620 534 2332 1020 -355 -1178 -1693 -791 1639 2044 412 -803 -1335 -1678 484 1913 1316
2815 1316 -235 -930 -1427 -1044 1391 1611 359 -609 -1314 -1208 292 1641 1120 0 -909 -1504 -544 1145
2833 1145 1278 484 -225 -1406 -1450 266 1187 823 274 -810 -1638 -575 1289 968 722 68 -1344 -1114
2851 -1114 489 1078 467 453 -461 -1641 -608 796 558 485 396 -1066 -1383 122 952 405 708 -141 -1181
2870 -1181 -415 818 449 351 228 -711 -1195 360 464 503 659 -520 -1014 -262 530 169 493 201 -999
2889 -999 -732 343 463 329 705 -422 -858 -6 299 513 585 399 -984 -579 136 -139 136 345 -544
2908 -544 -667 363 170 -374 666 319 -809 186 524 -22 -97 739 -586 -750 413 58 -371 427 534
2927 534 -744 -109 547 -247 -186 175 -311 -737 504 348 -157 187 117 -384 163 516 101 -113 83 -333
2947 -333 -257 364 -85 -52 23 -346 -301 221 268 152 22 -612 -307 328 387 -93 241 76 -1013 -252 932
2968 932 269 -195 342 -522 -1115 201 1261 -133 -79 285 -1057 -631 974 968 -91 224 -577 -1320 -58
2987 -58 1341 664 63 50 -842 -857 708 851 232 -319 -443 -951 -57 1092 887 -130 -475 -535 -489 459
3007 459 1280 938 -454 -1129 -562 -80 524 1158 589 -1228 -1367 -256 266 817 1396 -56 -1936 -1087
3025 -1087 473 360 1208 1717 -921 -2290 -575 658 521 1408 981 -1752 -2133 110 753 944 1604
3042 1604 111 -2273 -1413 583 606 974 1348 -750 -1904 -365 1305 934 760 195 -1463 -1857 479
3059 479 1669 1064 166 -682 -1829 -1402 1332 1761 528 -272 -1017 -1833 -447 2218 2222 355 -1131 -1510
3077 -1510 -1872 235 2854 1662 -431 -1389 -1729 -1310 1221 2855 938 -1113 -1326 -1340 -649 2028 2610
3094 2610 4 -1449 -1266 -976 85 2138 1596 -870 -1549 -883 -530 851 2264 582 -1758 -1626 -525
3111 -525 -18 1503 2169 -265 -2213 -1283 378 697 1879 1468 -1391 -2517 -653 1148 1404 1714 578
3128 578 -2381 -2461 -136 1561 1401 1518 -98 -2475 -2028 694 1993 1274 1087 -989 -2345 -973 1482
3145 1482 1583 1005 434 -1327 -2253 62 1864 1014 336 -93 -2033 -1677 916 1994 778 -146 -800
3162 -800 -1674 -593 1842 1540 95 -414 -1147 -1486 72 2262 1009 -568 -1063 -1331 -1150 963 2287
3179 2287 506 -1089 -1045 -1176 -377 1788 1953 72 -1114 -917 -832 102 1809 1372 -696 -1385 -894 -618
3197 -618 428 1716 1044 -1087 -1179 -551 51 909 1503 226 -1056 -975 -116 253 937 1023 -567 -1392 -585
3216 -585 315 485 834 451 -649 -1130 -118 468 728 951 111 -1243 -801 497 593 632 719 -187 -1241
3235 -1241 -635 603 474 423 494 -619 -1148 -264 540 327 712 90 -1015 -723 66 683 463 643 -50
3254 -50 -891 -668 275 558 550 226 -237 -652 -511 311 578 357 124 -445 -796 -112 401 458 21 5 -91 -566
3276 -566 -102 832 379 -222 -75 -370 -821 -113 666 333 -175 -169 -792 -374 557 676 228 -218 -244 -848 -215
3297 -215 858 549 43 -107 -538 -385 204 515 325 238 -308 -997 -249 369 602 180 88 -410 -461 -110 664
3318 664 663 375 -258 -700 -277 265 534 624 84 -567 -767 -43 382 708 369 -381 -700 -451 -40 276 961
3339 961 186 -859 -866 -128 43 788 726 -198 -831 -307 -351 383 870 397 -574 -719 -330 -25 658 835 134
3360 134 -789 -649 -28 614 1107 559 -384 -607 -549 -115 640 821 261 -808 -798 -578 431 915 509 -101
3380 -101 -849 -907 -307 779 803 85 -798 -834 -612 219 1318 648 22 -574 -1072 -299 844 1045 303 -426
3400 -426 -985 -905 138 1381 1062 42 -701 -1083 -457 753 1160 713 -75 -846 -1075 -14 1323 1083
3418 1083 67 -903 -1084 -700 676 1318 731 -346 -1055 -1154 85 1373 1166 367 -820 -1111 -414 634
3436 634 1443 801 -245 -1461 -1276 111 935 1079 264 -715 -1570 -725 399 1251 1154 -145 -1448 -1260
3454 -1260 51 958 1222 874 -532 -1663 -870 832 1220 811 142 -1294 -1706 -332 1187 1083 784
3471 784 -591 -1631 -783 556 1260 1103 412 -924 -1596 -478 1134 1555 577 -610 -1315 -1105 146
3488 146 1443 1580 33 -1108 -1462 -593 1125 1809 705 -567 -1399 -1131 -165 1377 1965 135 -1309
3505 -1309 -1482 -610 299 1644 1251 -536 -1401 -867 -280 947 1748 429 -1089 -1149 -366 156 1436 1435 4
3524 4 -1345 -1001 -191 814 1473 650 -1091 -1738 -727 223 1063 1219 -131 -1630 -1307 175 847 1192
3542 1192 917 -516 -1716 -1062 761 1398 1020 121 -880 -1834 -264 810 1087 898 -78 -1516 -1634
3559 -1634 393 1492 923 329 -243 -1349 -908 678 1283 484 -218 -691 -1301 -255 1092 845 -181
3576 -181 -199 -841 -1036 466 1470 458 -341 -715 -789 -522 649 1162 268 -648 -662 -612 -89 1073 887 -345
3596 -345 -707 -705 -723 6 1112 691 -771 -805 -259 -243 405 1123 644 -661 -514 -234 -96 669 1003 -183
3616 -183 -722 -315 -345 -547 445 1041 -320 -874 48 68 -301 425 492 -542 -331 139 -144 177 564 137
3636 137 -721 -126 169 -429 254 730 -199 -844 -247 126 -31 186 453 -7 -742 -286 224 126 702 524
3656 524 -540 -635 -132 114 142 649 579 -797 -1217 6 245 91 622 87 -776 -806 -208 353 482 1065
3676 1065 -159 -813 -747 112 220 581 823 -295 -1306 -686 319 277 539 206 -786 -1035 -163 348 484
3695 484 750 54 -981 -811 218 712 683 483 -422 -1197 -625 806 1111 284 -23 -702 -946 -415 803
3714 803 1214 365 -316 -1286 -943 294 1657 815 -17 -695 -1268 -859 759 1518 448 -468 -1185 -1199 -283
3733 -283 1378 1315 214 -865 -1414 -960 668 1759 868 -83 -936 -1408 -395 971 1812 550 -874
3750 -874 -1533 -903 308 1352 1131 130 -1091 -1257 -562 893 1605 929 -588 -1460 -933 335 1077 1190
3768 1190 611 -1212 -1723 -514 888 1535 1114 -244 -1775 -1305 106 1239 1795 559 -1302 -1792 -479
3785 -479 673 1249 1363 178 -1480 -1578 -147 1272 1566 847 -1011 -1707 -1037 277 1407 1579 269
3802 269 -1747 -1942 -589 1001 1675 939 -637 -1682 -1224 227 1684 1619 166 -1252 -1540 -598 670
3819 670 1583 1043 -381 -1436 -1576 22 1484 1918 278 -1345 -1295 -668 579 1980 1453 -367 -1758
3836 -1758 -1572 -334 1201 1703 482 -959 -1727 -1128 153 1721 1581 -236 -1705 -1271 -273 937 1871
3853 1871 594 -1047 -1577 -1127 407 1881 1270 -50 -1176 -1185 -663 761 1658 838 -699 -1723 -1438
3870 -1438 555 1487 1106 207 -710 -1529 -781 971 1657 1049 -340 -1397 -1294 -29 1174 1278 328 -775
3888 -775 -1762 -827 1008 1524 726 -255 -1102 -1228 -61 1311 1219 497 -676 -1552 -789 659 1273 869 -4
3907 -4 -958 -1368 -465 996 1136 523 -687 -998 -441 433 979 723 173 -832 -1100 -40 595 1087 369
3926 369 -189 -916 -889 103 722 791 272 -1009 -1080 -183 632 663 528 -215 -811 -726 18 695 860 412 -649
3947 -649 -719 -24 257 363 647 320 -747 -579 -50 325 549 433 -199 -521 -207 -48 136 703 239 -652
3967 -652 -616 -69 68 348 350 59 -426 -670 -89 129 216 224 -311 -139 -70 34 282 348 111 -3 -280 -186 90
3990 90 89 15 267 42 -147 -366 -27 67 16 138 148 -490 -254 145 18 473 385 -390 -498 -117 127 105 241
4013 241 315 -587 -715 17 233 199 -4 -1 -544 -88 -76 267 353 445 -513 -786 -302 275 340 406 283 -397 -658
4036 -658 -207 497 698 431 -355 -589 -661 4 475 706 189 -541 -1092 -599 599 1089 486 -208 -369 -835
4056 -835 -220 808 882 111 -229 -765 -790 369 1129 576 99 -270 -881 -351 956 1299 44 -621 -795
4075 -795 -865 -174 1022 1130 -87 -822 -1017 -498 580 1317 729 -505 -1156 -847 -312 1131 1344 80
4093 80 -1263 -1046 -279 478 1171 1248 -231 -1215 -1128 -319 674 1464 701 -1067 -1343 -571 333 907 1097 75
4113 75 -1321 -1435 123 993 1096 741 -412 -1465 -955 594 1120 987 316 -1101 -1252 -21 876 1041
4131 1041 611 -231 -1539 -1435 390 1560 902 -20 -654 -1469 -638 672 1581 980 -227 -1224 -1467 -13
4149 -13 1254 1226 225 -808 -1290 -1189 423 1574 1157 -434 -975 -1130 -554 640 1560 702 -727 -923
4167 -923 -1095 271 1300 1161 -297 -1023 -986 -533 580 1473 823 -793 -1419 -888 208 1245 1323 70
4185 70 -998 -1148 -408 684 1429 1009 -839 -1465 -767 -81 920 1500 626 -912 -1297 -484 626 1165
4203 1165 757 -72 -1178 -1241 -301 800 1188 664 -471 -1279 -440 395 912 735 240 -832 -1412 -296
4221 -296 860 996 515 -578 -1118 -733 389 805 856 224 -934 -1259 -504 934 835 264 -270 -772 -806
4240 -806 -13 975 956 -66 -633 -910 -322 605 857 466 -327 -783 -857 35 1024 903 187 -655 -674 -431 257
4261 257 778 723 -19 -813 -700 -97 454 604 92 -266 -675 -424 -22 648 675 -87 -678 -563 133 392 655
4282 655 270 -122 -681 -486 148 386 462 38 -417 -352 -166 167 248 411 55 -637 -230 165 573 361 121
4303 121 -30 -298 -268 9 368 351 -101 -228 -166 247 230 241 449 201 -468 -290 101 209 3 79 73 -111 -217
4326 -217 -158 152 180 -3 -133 -177 -14 34 161 57 85 -14 -420 -290 68 117 142 112 26 -251 -122 82 236
4349 236 345 273 -172 -126 -26 129 53 195 25 -308 -256 204 259 192 187 -166 -427 -207 220 624 591 -16 -401
4372 -401 -491 -136 117 410 277 -41 -461 -506 -94 740 495 36 -479 -297 -396 244 643 617 -7 -689 -406
4393 -406 94 774 615 145 -402 -418 -359 94 783 591 -225 -780 -597 -226 450 890 540 -307 -837 -693 432
4414 432 1044 862 -243 -603 -550 -264 474 1064 503 -355 -994 -592 231 761 694 -48 -727 -722 -476 539 1375
4435 1375 609 -456 -1011 -654 53 807 1018 370 -688 -1246 -699 724 932 641 -18 -1047 -772 74
4453 74 959 1139 402 -778 -1256 -558 575 1045 528 -199 -901 -1108 -443 1206 1202 199 -906 -1247 -646
4472 -646 398 1202 843 6 -1154 -1359 -286 1172 1127 284 -531 -1130 -734 474 1262 875 183 -1108
4490 -1108 -1022 -199 924 1425 496 -452 -1157 -976 287 1387 1478 10 -1076 -1279 -194 710 1153 828
4508 828 -358 -1260 -1067 115 874 1290 388 -898 -1244 -547 785 1049 1075 -186 -1470 -951 363 890
4526 890 924 474 -675 -1631 -831 461 1158 1076 -403 -1282 -1221 -95 749 1060 440 -411 -1828 -906 610
4545 610 1239 894 97 -1027 -1164 -471 842 1301 749 -545 -1117 -856 379 1039 659 84 -722 -1294 -666
4564 -666 776 1262 840 -407 -990 -754 156 882 980 225 -952 -839 -665 706 1122 672 -478 -1000 -783
4583 -783 -22 664 1151 256 -775 -931 -257 326 709 901 -234 -862 -811 -235 437 1044 379 -592 -731 -262
4603 -262 190 775 778 28 -833 -776 -86 491 713 414 -308 -581 -621 77 500 700 122 -706 -855 -153 374
4624 374 519 258 142 -432 -538 90 719 596 38 -103 -464 -335 155 138 255 145 -305 -654 -51 507
4644 507 341 6 -21 -128 -586 93 501 362 141 -272 -487 -203 263 218 122 22 -27 -627 -233 291 350 -191
4666 -191 -80 -91 -130 -142 140 313 -71 -117 -77 -205 -79 -77 134 -54 174 -248 -454 -62 286 101 -7 157
4688 157 -43 -333 -197 195 502 46 -95 -433 -242 -6 137 244 278 -99 -656 -255 276 465 41 7 -180
4709 -180 -600 -376 406 598 108 -427 -472 -488 165 528 400 142 -302 -675 -428 434 558 278 -224 -477 -481
4730 -481 -205 393 839 272 -584 -811 -399 276 985 727 67 -592 -770 -216 576 1268 456 -561 -879 -383
4750 -383 114 763 937 158 -904 -797 -317 574 935 526 -520 -932 -701 -68 750 1080 167 -734 -1168
4769 -1168 -405 556 961 830 -335 -1252 -1086 -41 910 1103 244 -774 -1035 -420 488 1122 911 1 -1291
4788 -1291 -1280 7 1169 1291 347 -619 -1360 -926 366 1020 952 -72 -1278 -1284 -264 1003 1037 414 -474
4807 -474 -1083 -827 209 1314 1151 -119 -746 -1314 -170 798 1351 932 -533 -1281 -1079 264 1196 1040
4825 1040 39 -1001 -1111 -590 729 1470 842 -471 -1354 -809 23 963 1068 300 -759 -1453 -856 725
4843 725 1329 827 -323 -1231 -1064 -153 1001 1443 734 -828 -1433 -583 722 1229 948 -32 -1267 -1064
4861 -1064 -157 1003 1413 482 -536 -1261 -689 496 1000 829 43 -951 -1200 -136 1038 1347 594 -754
4879 -754 -1149 -868 30 1056 1267 220 -764 -1243 -349 903 1201 399 -403 -1080 -728 147 876 936 39
4898 39 -834 -1116 -347 552 1069 646 -385 -908 -851 -217 904 1186 111 -807 -672 -366 379 922 910 -236
4918 -236 -853 -952 -182 850 997 109 -347 -834 -511 187 824 874 -94 -741 -617 16 351 737 295 -255
4938 -255 -691 -348 207 940 685 -187 -517 -445 -273 120 890 328 -420 -755 -414 91 733 283 -46 -412
4958 -412 -535 -130 290 610 368 -287 -657 -343 70 498 650 16 -399 -470 -315 152 690 219 -182 -372
4978 -372 -439 -160 463 258 -135 -176 -376 -340 24 458 182 -156 -72 -214 -261 331 412 81 -297 -61 -90 250
5000 250 -45 285 231 -141 -303 -51 138 158 33 96 -159 -44 55 -14 233 147 -41 -244 -90 119 19 -191
5022 -191 101 15 -239 103 -172 30 405 65 10 156 -9 -349 251 209 308 -97 25 -39 -212 -115 260 127
5044 127 -111 -252 -373 126 156 -62 -12 150 -276 -382 105 385 201 -164 -197 -147 -265 -84 285 232 15 -424
5066 -424 -635 -20 438 364 274 -257 -410 -298 -227 319 514 -7 -250 -430 79 403 222 446 -214 -648 -443
5087 -443 163 580 506 22 -557 -593 -110 169 441 470 -172 -883 -393 240 458 697 193 -329 -520 -372 104
5108 104 459 439 -3 -796 -439 -119 547 514 226 -345 -702 -279 320 616 385 -95 -644 -710 -199 589 593 379
5130 379 -544 -888 -456 109 780 319 -56 -583 -641 -290 645 879 329 -247 -683 -550 230 814 747 -36 -457
5151 -457 -646 -434 655 1006 269 -546 -558 -586 -102 509 709 -83 -560 -1073 -414 544 841 530 -504 -844
5171 -844 -628 -192 617 892 0 -606 -861 -220 452 682 559 -304 -807 -717 -109 726 773 103 -477 -662 -193
5192 -193 240 750 669 31 -713 -984 -46 705 761 92 -227 -718 -509 232 791 574 -43 -616 -954 52
5212 52 786 932 429 -312 -722 -588 413 917 603 -218 -564 -271 -176 453 757 379 -309 -935 -549 220
5232 220 777 726 -13 -338 -637 -314 583 1045 362 -534 -764 -405 -18 517 581 13 -472 -676 -138 342 649
5253 649 235 -305 -828 -337 -143 415 721 226 -485 -737 -266 319 587 337 -194 -508 -393 -70 370 471
5273 471 197 -426 -747 -432 75 547 367 34 -288 -666 -103 484 584 -23 -380 -528 -187 227 357 269
5293 269 121 -221 -398 -185 430 361 -27 -81 -288 -535 21 276 183 -192 -189 55 -39 22 182 48 -278 -291 -432
5316 -432 146 388 219 13 -173 -226 -195 -94 207 140 -89 -378 -199 81 146 103 -13 -262 -215 -249 -56 129
5338 129 105 -376 -110 208 87 104 69 6 26 117 -208 305 349 -41 28 88 69 -34 -165 118 -42 143 90 82
5362 82 20 62 95 -151 355 -8 -11 -23 -133 -66 161 223 64 28 -246 -32 200 129 -19 -83 -135 -25 10 115 224
5387 224 258 -130 -414 -28 238 94 151 8 -294 -249 -79 48 237 79 -301 -276 -289 -22 109 416 338 -215
5409 -215 -377 36 290 422 229 -116 -233 -342 3 157 413 383 -469 -410 -69 339 223 438 -41 -439 -353
5430 -353 -69 529 392 111 -388 -461 87 87 442 451 23 -362 -663 -25 450 401 106 -200 -509 -313 31 584
5452 584 648 49 -567 -541 182 509 699 466 13 -640 -583 200 749 556 198 -543 -509 -86 124 622 520
5473 520 -118 -823 -401 -122 659 695 -39 -379 -670 -261 178 588 742 -245 -581 -435 152 438 617 358
5493 358 -217 -601 -432 318 859 674 -383 -630 -587 -359 401 788 348 -295 -973 -447 186 631 530 -218
5513 -218 -641 -749 -144 426 925 603 -586 -667 -541 100 590 529 96 -682 -948 -247 365 802 502 -207
5533 -207 -657 -479 -57 637 633 58 -568 -934 -475 409 1119 604 -137 -640 -587 126 619 794 171 -496 -494 -270
5555 -270 319 616 540 0 -811 -888 43 639 780 237 -570 -541 -531 61 756 824 124 -737 -572 -126 633 561
5577 561 423 -483 -674 -576 -47 669 744 25 -757 -695 81 593 576 485 -128 -537 -555 234 456 678 -61 -665
5599 -665 -651 -225 260 653 557 3 -697 -555 212 644 512 -38 -266 -651 -457 408 597 392 -223 -497 -354
5620 -354 131 333 336 79 -302 -388 -443 243 568 49 -109 -362 -483 -40 205 389 271 -280 -478 -390 238 286
5642 286 109 -232 -329 -356 -116 170 472 92 -367 -350 -84 118 217 311 -132 -390 -281 -141 84 376 -37 -152
5664 -152 -193 -129 149 -34 109 137 -298 -314 -91 224 72 231 -50 -112 -19 21 53 -12 126 -262 -19 173 150
5687 150 -71 154 -109 -72 -251 240 151 291 -178 79 56 39 5 -11 33 -60 264 -80 0 -103 -60 -110 13 53
5711 53 22 -98 5 0 -255 -69 60 52 -263 -176 -7 119 172 -12 -81 49 -243 -157 285 317 130 -425 -305 -75
5735 -75 111 249 440 -112 -494 -250 -89 449 486 36 -310 -438 -274 55 313 297 140 -428 -296 98 225
5756 225 340 277 -201 -501 -228 107 428 227 44 -405 -419 -78 230 262 458 74 -457 -370 50 420 470 112
5778 112 -251 -179 -149 69 547 401 -90 -477 -498 325 299 432 132 -392 -470 -148 299 495 310 -290 -687 -398
5800 -398 -13 335 641 107 -256 -444 -398 293 326 494 -12 -741 -428 -110 250 504 296 -515 -793 -308 325
5821 325 343 492 6 -453 -629 -186 354 654 233 -381 -747 -314 91 547 562 61 -543 -690 -122 364 492
5842 492 315 -235 -699 -438 29 401 511 57 -394 -464 -95 302 620 317 -235 -724 -466 -53 467 584
5862 584 7 -407 -613 -223 25 669 283 -5 -582 -570 22 597 458 16 -398 -598 -305 125 688 404
5882 404 -70 -738 -489 -58 518 509 436 -102 -576 -531 190 610 266 -337 -623 -378 -81 382 626 369 -130
5903 -130 -457 -392 175 552 312 -59 -441 -286 -37 385 663 260 -314 -524 -394 18 299 367 -18 -394 -584
5924 -584 -184 293 544 323 -284 -482 -329 5 448 242 137 -235 -496 -271 204 347 255 -152 -287 -156
5944 -156 104 228 330 185 -344 -533 -76 271 342 326 -38 -227 -364 -109 332 387 181 -394 -128 26 114
5965 114 262 169 -88 -238 -345 -135 99 493 31 -54 -171 -193 130 209 421 39 -497 -441 -10 218 366 16
5987 16 -334 -92 -190 27 287 273 -188 -305 -455 -86 195 141 218 42 -64 -204 3 99 -15 3 -134 -311
6009 -311 -79 118 265 222 -46 -409 -92 200 227 -81 88 -184 -174 4 42 56 13 -130 -172 -5 177 -81
6031 -81 -112 70 56 -1 -24 75 80 -38 -127 -13 59 -24 98 133 62 -12 13 67 20 83 -114 48 220 15 -250 43
6057 43 -128 -161 -34 197 148 -99 -77 -120 -37 -100 58 -7 -25 -222 -277 -96 186 196 -142 -200 -187 83 153 10 176
6082 176 -46 -87 26 11 268 534 57 -259 -173 -98 218 -51 112 -81 -415 82 227 184 62 -113 -89 -172
6104 -172 -34 155 264 22 -180 -241 -132 155 334 342 52 -266 -168 -128 201 133 -3 -73 -166 -384 145 489 361
6127 361 33 -207 -430 -172 421 460 105 -138 -370 -306 12 433 430 104 -411 -306 -139 87 523 382 -277
6148 -277 -377 -241 -21 582 310 175 -362 -308 -85 49 268 317 48 -411 -365 178 330 327 248 -258 -633 -80
6170 -80 372 462 294 -75 -495 -536 31 369 465 234 -279 -369 -341 410 567 266 -62 -396 -351 -202 268 557
6192 557 213 -269 -247 -71 317 596 317 -3 -306 -306 41 339 570 149 -195 -510 -72 195 300 278 -14
6213 -14 -399 -554 -61 399 557 234 -223 -181 -489 -77 359 408 -27 -408 -581 27 385 583 215 34 -463
6234 -463 -395 196 439 614 55 -363 -418 -22 146 312 86 -12 -474 -333 187 357 306 -56 -287 -470 -293
6255 -293 367 434 165 -261 -513 -469 16 422 279 16 -321 -209 27 42 544 109 -244 -410 -437 -48 308
6276 308 227 127 -250 -419 -168 166 384 183 -202 -369 -260 -83 399 273 221 -297 -412 -299 34 296 367
6297 367 57 -316 -115 -220 150 371 55 -400 -282 -188 -109 444 205 -73 -250 -196 66 252 377 40 -151
6318 -151 -212 -42 282 234 335 -50 -386 -503 93 203 26 206 56 -192 -42 39 353 377 -126 -200 -314 46
6340 46 -25 131 -26 -201 -238 -23 -110 118 6 -113 -139 -296 46 -61 46 -3 -10 -190 -279 5 -45 -112 -210 59
6364 59 -91 -229 -146 85 129 -63 -127 82 240 135 1 -32 31 95 -162 -13 -101 -112 -35 400 108 71 -1 51
6388 51 -91 -82 -94 12 73 -220 -107 120 252 133 -2 -86 -8 -49 51 8 99 48 10 -46 -90 12 63 -129 -48
6413 -48 -256 84 54 224 275 -99 -267 -104 25 -3 119 -14 -21 -131 11 -72 181 200 6 -37 19 -173 257
6436 257 83 -43 -229 -146 -150 258 160 42 176 -98 -384 -373 129 446 201 123 -206 -92 -20 240 279 -36 -204
6459 -204 -218 -128 172 340 118 59 -409 -109 8 400 328 221 -215 -521 -202 112 301 -3 -42 -365 -248 -189
6481 -189 331 387 124 12 -367 -93 170 327 264 92 -303 -611 -281 265 505 205 -65 -360 -78 73 203
6502 203 134 37 -185 -573 -15 301 434 87 8 -244 -132 17 322 428 -113 -231 -510 -198 -63 353 282
6523 282 14 -527 -264 -68 511 458 14 -58 -376 -247 84 401 181 -4 -446 -638 -219 380 396 72 -193
6544 -193 -349 -289 158 410 365 -262 -468 -341 8 332 355 398 77 -326 -378 322 548 194 150 -274 -328 -40
6566 -40 371 289 187 -269 -797 -206 127 522 616 13 -272 -281 -221 217 372 288 37 -370 -175 -124 445 272 98
6589 98 -234 -488 -297 231 242 210 -319 -450 -342 101 421 386 11 -315 -331 -210 190 347 215 -121 -105 -312
6611 -312 -169 18 263 -62 -158 -402 -83 53 244 246 14 -290 -154 41 298 416 72 -49 -243 -206 -77
6632 -77 307 247 21 -304 -355 -91 425 365 107 -208 -254 -185 152 361 293 72 -235 -49 -36 195 203 207 -143 -125
6656 -125 -379 -39 397 162 -234 -104 61 -21 294 50 71 -6 -241 -117 132 25 38 14 -123 -192 70 40
6678 40 216 72 -133 -170 -58 76 176 146 -40 8 35 -85 78 107 102 22 -120 -284 24 -38 125 40 -189 -203
6702 -203 5 160 85 -198 -49 -152 -58 79 89 245 71 69 34 318 132 -86 17 54 18 -149 133 213 117
6725 117 27 -85 32 133 40 76 95 111 -127 -24 15 -44 73 -166 36 63 112 -14 -159 -158 -78 -23 122 110 -25
6750 -25 -238 6 56 -210 192 176 127 -212 -181 156 169 -28 -217 -137 -87 -193 -44 62 121 -169 -348 -88 68
6773 68 137 44 -53 -86 -110 131 180 175 35 -185 -111 -68 102 119 163 77 -43 -189 -147 128 76 189 -101 -115 -28 -26 78
6800 78 199 -208 -327 -101 -164 175 198 47 -58 -129 24 152 22 237 -8 -62 -200 -11 138 202 -71 -136
6822 -136 -202 -172 33 197 252 35 -182 -156 -5 -4 59 167 -124 -259 -131 12 269 33 -30 62 -270 44 247
6845 247 338 16 -36 -227 -138 86 232 160 1 -110 -44 -46 72 273 94 68 -179 -236 -23 139 18 265 42
6868 42 -324 -65 262 285 149 159 -167 -99 37 146 98 -6 -7 -54 -104 121 15 141 115 -139 -54 -1 63 53 2
6893 2 6 -278 -17 -131 244 366 -77 -113 -130 45 -63 340 141 -125 -192 -90 -95 108 55 -112 -23 -36 -30 197 140
6918 140 89 -41 -209 -15 54 103 249 -98 -117 -307 -181 8 188 78 -196 -186 -121 190 52 117 -35 -150
6940 -150 -41 -121 167 114 23 78 -71 61 69 218 211 76 -50 98 -231 -61 52 -74 -16 -143 136 49 71 32
6964 32 105 -199 -5 -27 90 147 184 -168 27 230 -81 100 210 -135 -259 -35 95 338 -31 318 -75 -161
6986 -161 -222 -71 -46 15 -5 -19 -105 62 4 138 96 -13 -42 -144 -76 69 77 -58 -201 37 78 -103 -14 105 1
7011 1 -119 -54 164 30 2 -88 -210 -8 71 -256 68 -88 -256 63 81 20 157 -102 -105 -138 57 -114 -120 157
7035 157 -68 -255 -182 108 -26 174 -19 -25 -53 46 56 -77 7 -56 18 -189 -154 240 54 31 -28 -148 -240 -9
7059 -9 147 25 -17 -84 -133 -45 -47 107 145 13 -28 -166 105 249 -68 32 -50 -19 4 14 223 -59 -132 190 -74
7084 -74 54 96 46 -112 -165 17 98 -114 95 -69 -10 -15 34 11 127 54 -74 -150 -75 87 130 63 76 15 -247 -63
7110 -63 109 120 23 -113 -104 -191 182 69 -27 -88 -63 -266 5 27 30 -80 -125 88 -169 120 -38 205 74 -91
7134 -91 144 123 174 320 -24 142 -97 -141 90 145 270 -264 -163 -35 225 312 1 125 -427 -8 -45 137
7156 137 161 12 -221 -98 -42 42 55 74 96 -262 -335 -118 152 121 57 -149 -98 -151 158 277 252 151 -119 -307
7180 -307 39 31 262 5 -48 -102 -164 185 -44 30 -39 8 -268 271 -39 172 -9 46 -123 -141 122 100 64 72 -127
7205 -127 -85 112 -18 194 100 -50 -164 -124 -47 130 233 -46 -252 -253 70 142 88 46 79 -120 -250 52 -24 86
7229 86 -227 -7 -119 -108 180 168 222 -63 -15 -259 106 198 74 -46 -40 -119 -73 339 107 88 -138 -169 -194 59
7253 59 114 132 105 -255 -139 -14 64 70 147 -51 -100 64 125 298 170 -247 -75 -269 -71 136 88 239 -248 -101
7277 -101 -180 3 274 288 63 -145 -193 -23 192 82 157 7 -202 -155 -179 240 162 139 -47 -18 -100 60 80 112
7301 112 -235 15 -290 62 72 202 6 -86 -142 -142 -100 123 94 -181 -25 114 35 117 285 -13 7 -60 2 -172
7325 -172 82 -98 42 17 -247 -7 46 -108 130 78 -35 55 79 50 -2 -107 67 -128 96 -78 33 -11 -190
7348 -190 -69 -180 -129 81 68 1 -51 -84 116 91 -15 294 -147 125 -4 -12 148 -170 111 141 -193 105 75
7371 75 87 170 99 -174 -50 66 -49 157 -302 -98 -89 48 3 51 173 -78 61 -27 29 -130 -84 -209 -139 177
7395 177 -90 -36 -3 118 -38 34 -58 -1 261 -130 -45 -29 41 208 -39 -88 -234 11 -119 -52 95 -7 -108
7418 -108 31 89 168 117 204 205 -125 -97 -153 41 0 -62 -156 -28 52 31 60 87 -138 -77 -129 -186 90 110 148 -222 -57
7445 -57 46 -22 74 48 -25 -137 -161 -153 112 123 40 -3 -159 -135 47 177 164 28 -108 -92 -30 195 38 161 -271
7470 -271 -215 -16 -187 138 135 70 66 31 18 282 160 -158 -111 -213 11 0 218 142 286 131 -104 -94 132 194
7494 194 48 -43 -127 -106 6 19 -75 118 -141 -169 -120 233 216 146 53 -277 -11 -18 134 71 42 -238 -52 -164 84
7519 84 131 196 78 -290 -161 140 278 40 79 -146 -216 -125 55 124 124 -292 -258 40 79 154 301 165 -225 84
7543 84 45 2 141 110 176 15 -148 -194 101 123 108 27 -76 -181 150 289 249 -15 -84 -110 -90 2 186 -15 85
7568 85 -137 -37 -81 118 379 -35 45 -206 -135 47 172 -58 -6 -136 -190 167 69 64 -134 -124 -105 -46 -14 141
7592 141 106 55 -169 79 -24 129 199 -60 -62 -113 -22 23 -67 28 41 -42 -143 2 207 362 28 -75 -45 77
7616 77 -5 191 27 -50 -53 24 83 18 -4 35 68 -147 164 136 217 225 -25 50 45 75 17 84 -84 -199 -124 -210 -70 41
7644 41 60 -211 -177 -43 110 5 -46 36 -207 -89 -63 -101 153 -2 -81 0 -42 100 140 13 -81 -219 45 -285
7668 -285 -154 167 -167 14 -79 -90 3 82 134 -46 -9 -93 -127 -57 38 142 78 49 -56 -11 19 -12 152 -95 43
7693 43 13 -205 187 182 53 194 58 222 -90 -6 -122 -56 -28 -103 40 263 171 -235 -29 -28 -152 -17 114 -75
7717 -75 50 -85 -11 63 -197 171 139 -35 171 -23 63 14 17 44 24 146 -165 -8 -23 159 186 -76 -29 -7 59
7742 59 71 8 -47 -95 48 -89 45 -147 -17 59 15 -42 -251 -89 -170 -57 3 -21 -96 112 120 -107 30 79 192
7767 192 -28 -144 129 155 118 86 38 -26 -28 -67 164 216 -66 20 -162 89 -79 27 -19 71 42 -68 -60 137 60
7792 60 -32 -72 -159 133 50 158 -113 275 43 -111 -69 31 142 -23 -109 -38 12 6 328 -26 40 110 133 -147 61
7817 61 79 104 17 59 -176 40 96 44 132 75 188 -80 -11 279 166 37 -113 -13 9 121 -52 -103 45 -73
7841 -73 -85 -171 -3 85 21 -257 -77 -65 -53 -61 -3 241 41 -11 22 132 85 -23 -82 -61 12 -86 140 19 22 -4 70
7868 70 -65 -235 -64 -29 42 -12 -11 152 -60 19 -155 -145 87 38 117 112 -74 47 -72 170 19 150 202 1
7892 1 -45 27 -20 172 -17 150 -78 73 62 -72 -81 86 155 -168 -33 88 -55 -43 35 -197 -21 -157 108 320
7916 320 259 83 -28 -176 34 118 22 77 -121 60 -56 52 -19 94 -220 -29 -120 -18 24 79 -86 124 -127
7939 -127 -36 -76 -156 -10 5 55 32 -107 58 -20 -84 -152 108 34 -31 76 -145 19 19 -50 -74 217 173 -11 -26 58
7965 58 -116 38 -45 136 -135 56 -27 153 -86 -15 71 -131 10 133 106 -33 26 80 -39 -37 132 -76 55
7988 55 67 36 110 28 -239 -44 41 25 174 -57 -173 -6 99 -9 -140 -6 -47 124 -127 -107 -92 131 -71
8011 -71 351 -83 -63 -69 -140 -204 55 -50 83 -78 -117 54 237 -57 -15 124 -126 -28 116 -10 129 82 62 -133
8035 -133 -101 -41 -17 170 -144 60 63 146 11 72 -119 -134 -35 -21 69 -24 20 17 30 -31 116 35 34 0 72 -62 -6 37
8063 37 79 24 -44 -161 -204 -149 -30 10 0 17 -135 -57 -65 35 -22 28 62 47 -20 -270 -77 48 -57 -63 208 -20
8089 -20 154 133 29 -197 -209 -140 72 -89 103 33 -84 -30 -36 13 52 3 9 -53 39 -37 85 26 -64 -70 -40 -72 -46 74
8117 74 -114 215 -16 -128 -38 201 78 -183 117 -90 70 -57 -114 -12 99 -167 76 -162 -130 -137 8 266
8139 266 -188 -47 -197 182 -63 39 -30 -23 70 -29 241 72 -217 234 133 -3 -9 -79 211 -159 9 116 142
8162 142 44 -71 -2 143 113 129 62 -59 -6 -111 -10 108 -52 8 -89 -37 -59 140 72 -132 -37 102 142 -6
8186 -6 -38 -106 -231 -145 19
8191A9
##END NTUPLES=NMR FID
##END=
