##TITLE=1H_E3d1007-4
 CDCl3
 8 sc, 
 11.7.2023
##JCAMPDX= 6.0         $$ Bruker NMR JCAMP-DX V2.0
##DATA TYPE= NMR FID
##DATA CLASS= NTUPLES
##ORIGIN= UXNMR, Bruker Analytische Messtechnik GmbH
##OWNER= root
$$ XWIN-NMR		Version 3.5
$$ Tue Jul 11 14:00:07 2023 Russian Standard Time (UT+4h)  she@DPX200
##.OBSERVE FREQUENCY= 200.13135
##.OBSERVE NUCLEUS= ^1H
##.DELAY= (6, 6)
##.ACQUISITION MODE= SIMULTANEOUS
##.ACQUISITION SCHEME= undefined
##.AVERAGES= 8
##.DIGITISER RES= 18
##SPECTROMETER/DATA SYSTEM= spect
##.PULSE SEQUENCE= zg30
##.SOLVENT NAME= CDCl3
##.SHIFT REFERENCE= (INTERNAL, CDCl3, 0, 15.7039)
##AUDIT TRAIL= $$ (NUMBER, WHEN, WHO, WHERE, WHAT)
$$ ##TITLE= Audit trail, XWIN-NMR		Version 3.5
$$ ##JCAMPDX= 5.01
$$ ##ORIGIN= Bruker BioSpin GmbH
$$ ##OWNER= she
$$ F:/spectra/data/she/nmr/H-F/1/audita.txt
$$ ##AUDIT TRAIL=  $$ (NUMBER, WHEN, WHO, WHERE, WHAT)
(   1,<2023-07-11 13:58:34.79 +0400>,<she>,<DPX200>,
      <created by zg, POWCHK disabled, PULCHK disabled
       configuration hash MD5:
       00 E9 B6 7A A2 85 ED C7 34 08 36 98 17 FE 4E 26
       data hash MD5: 16K
       39 14 CC E6 3A AE C8 7E DF 3C CA 51 8C 26 26 A3>)
$$ ##END=
$$ 
$$ hash MD5
$$ 82 48 43 49 52 3F B9 6E 86 16 F4 73 23 7E C0 03
##$RELAX= 
##$RELAX= 
##$RELAX= 
##$RELAX= 
##$RELAX= 
##$RELAX= 
$$ Bruker specific parameters
$$ --------------------------
##$DU= <F:/spectra>
##$EXPNO= 1
##$NAME= <H-F>
##$PROCNO= 1
##$TYPE= <nmr>
##$USER= <she>
##$AMP= (0..31)
100 100 100 100 100 100 100 100 100 100 100 100 100 100 100 100 100 100 
100 100 100 100 100 100 100 100 100 100 100 100 100 100 
##$AQSEQ= 0
##$AQ_mod= 1
##$AUNM= <au_zg>
##$AUTOPOS= <>
##$BF1= 200.13
##$BF2= 200.13
##$BF3= 200.13
##$BF4= 200.13
##$BF5= 200.13
##$BF6= 200.13
##$BF7= 200.13
##$BF8= 200.13
##$BYTORDA= 1
##$CFDGTYP= 0
##$CFRGTYP= 5
##$CHEMSTR= <none>
##$CNST= (0..31)
1 1 145 1 1 1 1 1 1 1 1 1 1 1 1 1 1 1 1 1 1 1 1 1 1 1 1 1 1 1 1 1 
##$CPDPRG= <>
##$CPDPRG1= <>
##$CPDPRG2= <>
##$CPDPRG3= <>
##$CPDPRG4= <mlev>
##$CPDPRG5= <mlev>
##$CPDPRG6= <mlev>
##$CPDPRG7= <mlev>
##$CPDPRG8= <mlev>
##$CPDPRGB= <>
##$CPDPRGT= <>
##$D= (0..31)
0 1.2 0 0 0 0 0 0 0 0.06 0 0.03 0 0 0 0 0.0002 0 0 0 0 0 0 0 0 0 0 0 0 
0 0 0 
##$DATE= 1689069514
##$DBL= (0..7)
120 120 120 120 120 120 120 120 
##$DBP= (0..7)
150 150 150 150 150 150 150 150 
##$DBP07= 0
##$DBPNAM0= <>
##$DBPNAM1= <>
##$DBPNAM2= <>
##$DBPNAM3= <>
##$DBPNAM4= <>
##$DBPNAM5= <>
##$DBPNAM6= <>
##$DBPNAM7= <>
##$DBPOAL= (0..7)
0.5 0.5 0.5 0.5 0.5 0.5 0.5 0.5 
##$DBPOFFS= (0..7)
0 0 0 0 0 0 0 0 
##$DE= 6
##$DECBNUC= <off>
##$DECIM= 32
##$DECNUC= <off>
##$DECSTAT= 4
##$DIGMOD= 1
##$DIGTYP= 9
##$DL= (0..7)
0 120 120 120 120 120 120 120 
##$DP= (0..7)
150 150 150 150 150 150 150 150 
##$DP07= 0
##$DPNAME0= <>
##$DPNAME1= <>
##$DPNAME2= <>
##$DPNAME3= <>
##$DPNAME4= <>
##$DPNAME5= <>
##$DPNAME6= <>
##$DPNAME7= <>
##$DPOAL= (0..7)
0.5 0.5 0.5 0.5 0.5 0.5 0.5 0.5 
##$DPOFFS= (0..7)
0 0 0 0 0 0 0 0 
##$DQDMODE= 0
##$DR= 18
##$DS= 0
##$DSLIST= <SSSSSSSSSSSSSSS>
$$ [...]
##$SUBNAM2= <"">
##$SUBNAM3= <"">
##$SUBNAM4= <"">
##$SUBNAM5= <"">
##$SUBNAM6= <"">
##$SUBNAM7= <"">
##$SUBNAM8= <"">
##$SUBNAM9= <"">
##$SW= 18.05172834244
##$SWIBOX= (0..15)
0 0 2 0 0 0 0 0 0 0 0 0 0 0 0 0 
##$SW_h= 3612.71676300578
##$TD= 16384
##$TD0= 1
##$TE= 0
##$TE2= 300
##$TE3= 300
##$TEG= 300
##$TL= (0..7)
0 120 120 120 120 120 120 120 
##$TP= (0..7)
150 150 150 150 150 150 150 150 
##$TP07= 0
##$TPNAME0= <>
##$TPNAME1= <>
##$TPNAME2= <>
##$TPNAME3= <>
##$TPNAME4= <>
##$TPNAME5= <>
##$TPNAME6= <>
##$TPNAME7= <>
##$TPOAL= (0..7)
0.5 0.5 0.5 0.5 0.5 0.5 0.5 0.5 
##$TPOFFS= (0..7)
0 0 0 0 0 0 0 0 
##$TUNHIN= 0
##$TUNHOUT= 0
##$TUNXOUT= 0
##$USERA1= <user>
##$USERA2= <user>
##$USERA3= <user>
##$USERA4= <user>
##$USERA5= <user>
##$V9= 5
##$VALIST= <valist>
##$VCLIST= <CCCCCCCCCCCCCCC>
##$VD= 0
##$VDLIST= <DDDDDDDDDDDDDDD>
##$VPLIST= <PPPPPPPPPPPPPPP>
##$VTLIST= <TTTTTTTTTTTTTTT>
##$WBST= 1024
##$WBSW= 4
##$XGAIN= (0..3)
0 0 0 0 
##$XL= 0
##$YL= 0
##$YMAX_a= 243964
##$YMIN_a= -193904
##$ZGOPTNS= <>
##$ZL1= 120
##$ZL2= 120
##$ZL3= 120
##$ZL4= 120
##$ABSF1= 10
##$ABSF2= 0
##$ABSG= 5
##$ABSL= 3
##$ALPHA= 0
##$AQORDER= 0
##$ASSFAC= 0
##$ASSFACI= 0
##$ASSFACX= 0
##$ASSWID= 0
##$AUNMP= <proc_1d>
##$AZFE= 0.1
##$AZFW= 0.1
##$BCFW= 1
##$BC_mod= 2
##$BYTORDP= 1
##$COROFFS= 0
##$CY= 11.3945322036743
##$DATMOD= 1
##$DC= 2
##$DFILT= <>
##$DTYPP= 0
##$F1P= 15.7292609196834
##$F2P= 12.9074282941183
##$FCOR= 0.5
##$FTSIZE= 0
##$FT_mod= 4
##$GAMMA= 1
##$GB= 0.15
##$INTBC= 1
##$INTSCL= 1
##$ISEN= 128
##$LB= 0.24
##$LEV0= 0
##$LPBIN= 0
##$MAXI= 10000
##$MC2= 0
##$MEAN= 0
##$ME_mod= 0
##$MI= 1.114404
##$NCOEF= 0
##$NC_proc= 0
##$NLEV= 6
##$NOISF1= 3.799351
##$NOISF2= 2.8
##$NSP= 1
##$NTH_PI= 0
##$NZP= 0
##$OFFSET= 15.70392
##$PC= 1
##$PHC0= -21148.98
##$PHC1= 12.45272
##$PH_mod= 1
##$PKNL= yes
##$PPARMOD= 0
##$PSCAL= 0
##$PSIGN= 0
##$REVERSE= no
##$SF= 200.130013532006
##$SI= 16384
##$SIGF1= 3
##$SIGF2= 2
##$SINO= 400
##$SIOLD= 16384
##$SREGLST= <1H.CDCl3>
##$SSB= 0
##$STSI= 0
##$STSR= 0
##$SW_p= 3612.71676300578
##$SYMM= 0
##$S_DEV= 0
##$TDeff= 0
##$TDoff= 0
##$TI= <>
##$TILT= no
##$TM1= 0
##$TM2= 0
##$TOPLEV= 0
##$USERP1= <user>
##$USERP2= <user>
##$USERP3= <user>
##$USERP4= <user>
##$USERP5= <user>
##$WDW= 1
##$XDIM= 8192
##$YMAX_p= 0
##$YMIN_p= 0
$$ End of Bruker specific parameters
$$ ---------------------------------
##NTUPLES= NMR FID
##VAR_NAME=  TIME,          FID/REAL,        FID/IMAG
##SYMBOL=    X,             R,               I
##VAR_TYPE=  INDEPENDENT,   DEPENDENT,       DEPENDENT
##VAR_FORM=  AFFN,          ASDF,            ASDF
##VAR_DIM=   8192,          8192,            8192
##UNITS=     SECONDS,       ARBITRARY UNITS, ARBITRARY UNITS
##FACTOR=    0.0002768,     1,               1
##FIRST=     0,             0,               0
##LAST=      2.2672688,     0,               0
##MIN=       0,             -193904,         0
##MAX=       2.2672688,     243964,          0
$$ Real data points
##PAGE= N=1
##DATA TABLE= (X++(R..R)), XYDATA
0@%%%%%%%%%%%%%%%%%%Mj2J6j6J6j6K2l0L2l7M5n2O0o9P9r1J04j17J32j49J68
$$ 0 0 0 0 0 0 0 0 0 0 0 0 0 0 0 0 0 0 0 4 -8 8 -8 8 -8 14 -16 16 -21 24 -28 32 -37 42 -49 55 -62 70 -79 89
39H9j88K10k35K64k95L26l61M00m44M90n39N94o53P17p90Q70r57J055j163J286
$$ 89 -99 111 -124 140 -155 171 -190 210 -234 256 -283 311 -342 375 -415 455 -502 553 -610 676
59F76j425J581j759J964k201K471k762L030l047J533J5755K28148j82143j20838
$$ 676 -749 832 -927 1037 -1164 1307 -1455 1575 -1472 61 15816 243964 61821 -59017
73e9017J54889k04592q5184L03902K3253j85705O3656l7818j09349J65245R2610
$$ -59017 95872 -108720 -193904 109998 133251 -52454 11202 -26616 -135965 29280 121890
84A21890j21281J0768k2835r8235J16901Q2829j08557K4236K8298r8381O9250
$$ 121890 609 11377 -11458 -109693 7208 90037 -18520 5716 34014 -64367 4883
95D883R4771j21480l9008O9971m1570K9408J03579p9935q4725L8556j4227L9366
$$ 4883 99654 -21826 -60834 9137 -32433 -3025 100554 20619 -64106 -25550 -39777 -411
107d11R9101q0918q3815L8421l8626M0795J62236p3022j41158O2638k2881n3590
$$ -411 98690 17772 -66043 -27622 -66248 -25453 136783 63761 -77397 -14759 -37640 -91230
119i1230J82903M2099j93545J7802O2758j06405R3917J40349j62044o9679J11304
$$ -91230 91673 133772 -59773 -41971 20787 -85618 8299 148648 -13396 -83075 28229
130B8229o5069q573J56708o3341j30843P8009J3977n9163Q7897J6088j09886K5768
$$ 28229 -36840 -45413 111295 47954 -82889 -4880 9097 -50066 37831 53919 -55967 -30199
142c0199N0404l6136M0024J5647q4846J1369M7361k1856L5432J6518q2810J051
$$ -30199 20205 -15931 24093 39740 -45106 -33737 13624 -8232 27200 43718 -39092 -38041
154c8041O0155j7114J3501K9393p3642l0271O4845N848L488L2872o3564m4970
$$ -38041 22114 5000 18501 47894 -25748 -56019 8826 14674 18162 51034 -12530 -57500
166e7500N4851J863L574N2924n8775o3040O6016R477l0007O8308j4612j02252
$$ -57500 -2649 -786 2788 55712 -3063 -66103 -87 9390 -20617 47691 33079 -69173
178f9173M6240N7403n8765L4699N0864r7109j2286Q7351l7392k0210O4761m6169
$$ -69173 -22933 34470 -24295 10404 61268 -35841 -48127 39224 1832 -18378 46383 214
190B14m9294O8169N001m1261L6665n959n1152L7485K5862l8715J6529R429m4408
$$ 214 -49080 19089 24090 -17171 19494 13535 -37617 -132 25730 -12985 3544 12973 -31435
203c1435K3926L3649l4847L778J6391l6223R720L8336k0301q587J5760k4056k586
$$ -31435 -7509 26140 -8707 -4929 11462 -24761 -15041 23295 2994 -5593 10167 -13889 -16475
216a6475L5185r809j3191J8378k0277j2319L6240p475j8880K5031j5955k4310
$$ -16475 18710 8901 -4290 14088 -6189 -18508 17732 10257 -8623 16408 453 -23857
228b3857L5278N54k8448K5835K529l6424K2035K0427l5262J0470K7780l4974j430
$$ -23857 11421 11975 -16473 9362 11891 -24533 -2498 17929 -17333 -6863 20917 -14057 -15487
241a5487L4320k6794q720L6783j8836j8191K9809j0492j8967K9936O35k5844J6249
$$ -15487 18833 -7961 -16681 20102 1266 -16925 12884 2392 -16575 13361 13996 -11848 4401
254D401M546k2850J8267J5065k6373L154J1776k0297R812K0261k1070n624J1637
$$ 4401 8947 -13903 4364 19429 -6944 -3790 7986 -12311 -2499 17762 -3308 -8932 2705
267B705j2899L772K0584j2028j3449Q887m623r99K1877m412k0174P830K77n431
$$ 2705 -10194 -6422 14162 2134 -11315 -2428 -7051 -8050 13827 9415 -10759 -2929 -2652 -8083
281h083K2558J769k4096K024M757m706J7210Q238k1887q781P264j195J0507J4031
$$ -8083 14475 16244 -7852 -5828 -1071 -5777 11433 19671 -2216 -10997 -3733 -4928 5579 19610
295A9610j8355j7527Q764K252O458J6720j3507k1946M873O995P590J4719p423
$$ 19610 1255 -16272 -7508 -5256 1202 17922 4415 -17531 -12658 -5663 1927 16646 9223
308I223k2665k763J1947R128J0736r75k2746r776J3591J1292R962l86k2001j2479
$$ 9223 -13442 -16205 -4258 4870 15606 14631 -8115 -17891 -4300 6992 16954 16568 -5433 -17912
322a7912R639J3475J1834j021j9972j5833N735J6962J1692m02j6002j9538K982
$$ -17912 -8273 5202 17036 16015 -3957 -19790 -14055 2907 14599 14197 -1805 -21343 -18361
335a8361J9529J3156J531j5139k0414L98J7857J7166L584j5636j8881l100J5365
$$ -18361 1168 14324 15855 716 -19698 -19300 -1443 15723 19307 3671 -15210 -18310 -2945
348b945K0820M301j5587j9934o693J5535K0787N466j2388k2030j0177J4254K1711
$$ -2945 17875 22176 6589 -13345 -20038 -4503 16284 21750 9362 -12668 -22845 -8591 13120
361A3120Q219j2950k1886r823R706K2894J3667j3428k1764r993O228K3369J6868
$$ 13120 21339 8389 -13497 -23320 -13614 9280 22947 9519 -12245 -22238 -16010 7359 24227
374B4227j0901k2452j1418O010K0209J9203n186k6254j3437P254J5409K0286N39
$$ 24227 13326 -9126 -20544 -14534 5675 24878 19692 -6562 -19999 -12745 2664 22950 23489
387B3489k8473j6358P071J3280J9137N654k5071k2844O268J6639J3748Q041j6870
$$ 23489 -4984 -21342 -14271 -991 18146 23800 -1271 -24115 -17847 -1208 12540 20581 3711
400C711k8146K848K1839J2171P244j1911k8454k387K2377J5796N229j0283k4577
$$ 3711 -24435 -21587 252 12423 19667 7756 -20698 -23085 -708 15088 20317 10034 -14543
413a4543q445J9714K0999L714j0881k2417j2352J6856K2081O875r067k4267j3377
$$ -14543 -22988 -3274 17725 21439 10558 -11859 -24211 -7355 14726 21601 12534 -11733 -25110
426b5110J4232J9408J1167m810k5885j5498J3627J8136J0561K014k0822k3879
$$ -25110 -10878 8530 19697 14887 -10998 -26496 -12869 5267 15828 17842 -2980 -26859
438b6859J1909K3636L544K738p991k8667L499L0108L210n045j766k2599p189K9329
$$ -26859 -14950 8686 12230 14968 6977 -21690 -18191 11917 15127 10082 8316 -14283 -21472 7857
452G857J2137j2990m219j1703j4142K2989K2713j5062j1112m719j3914J5694K8405
$$ 7857 19994 7004 2785 -8918 -23060 -71 22642 7580 -3532 -8251 -22165 -6471 21934
465B1934r200j7560m372r327P334K9138L401k2528r321k064J364K2139J3415j6788
$$ 21934 12734 -4826 -9198 -18525 -11191 17947 21348 -1180 -10501 -12565 -11201 10938 24353 7565
479G565j6951m270N105J6672R270o435j2798j4107L408K0228M922q151l417j1290
$$ 7565 -9386 -13656 -8551 8121 17391 10956 -1842 -15949 -12541 7687 12609 4458 1041 -10249
493a0249q046K1127J3841j7320m637M560j4598Q801K6808j4513j7940J2476l739
$$ -10249 -18295 2832 16673 -647 -5284 -724 -15322 -6521 20287 5774 -12166 310 -3429
506c429m881K3051l74k5020L741R734p085J3396R478k5257o486J5735n052N496
$$ -3429 -8310 14741 14367 -10653 -6912 2822 -4263 9133 18611 -6646 -13132 2603 -2449 3047
520C047J5991k0618j7381J6232L975l710J5112m362k5431M071J6979l735L441
$$ 3047 19038 -1580 -18961 -2729 1246 -2464 12648 8286 -17145 -13074 3905 170 3611
533C611Q318j6592j1321J3745Q332j925J222j554q647l837J0690Q349p465l561
$$ 3611 11929 -4663 -15984 -2239 6093 4168 5390 3836 -4811 -8648 2042 10391 2926 -635
547f35M680o538m054J2224J199j2572M700O872j1927J817J1577j2483l636J6240
$$ -635 4045 -2493 -6547 5677 6876 -5696 -996 5876 -6051 -4234 7343 -5140 -8776 7464
561G464n883r490J1159l838j0590J3776N933j1990L831L793j3057N763J4490r661
$$ 7464 1581 -7909 3250 -588 -11178 2598 8531 -3459 372 4165 -8892 -3129 11361 1700
575A700k762Q964j1849m570J5701j809p840Q184k887j1818O801O989p236K176
$$ 1700 -1062 7902 -3947 -8517 7184 5375 -2465 5719 2832 -8986 -2185 4804 -2432 -256
589b56O659r321n243P119L63j821N156J554o260n361L872N881j941K917N049j1233
$$ -256 6403 -2918 -8161 -1042 -679 -2500 2656 4210 -2050 -7411 -3539 2342 401 3318 8367 -2866
605b866p497J2209M260o323O960J354j7129J110J5783n236l247R415j0588j0372
$$ -2866 -10363 1846 6106 -217 6743 8097 -9032 -7922 7861 2625 -622 8793 -1795 -12167
619a2167J3714K856p686O712j788j1788P130Q213q028J422N115j0300J989J3189
$$ -12167 1547 4403 -3283 3429 1641 -10147 -3017 5196 -2832 -1410 3705 -6595 -4606 8583
633H583q058n979R418n159m396J4295n9j3983K244N138m461N840Q257j0730r966
$$ 8583 525 -5454 3964 -1195 -5591 8704 8645 -5338 -3094 2044 -2417 3423 11680 950 -9016
648i016N156L543K287O016l611j1091l673N981P970K412k408n383q057O82J1935
$$ -9016 -3860 -317 1970 7986 4375 -6716 -10389 -4408 3562 5974 3566 -1817 -9874 -9192 2743
663B743N530m396m124m534l901Q149J1109m139p560j09l914J759J2791o76j0813
$$ 2743 8273 3877 -247 -4781 -8682 -533 10576 6437 -1123 -1232 -5146 -3387 9404 8728 -2085
678b085o34j86j119R340L917j1444n317M599J87M121P767q951j1260N561M901
$$ -2085 -2719 -2905 -4024 5316 9233 -2211 -7528 -2929 -2742 1379 9146 195 -11065 -5504 -603
693f03J533P160m332j3144P48R464L553K693j05j1579o334J0215P996J00o07q160
$$ -603 930 8090 3758 -9386 -8638 826 4379 7072 6967 -4612 -10946 -731 7265 7365 6758 -1402
709a402q607N339J0211K810l078p048p163J197R953O188l964o939n685o06Q450
$$ -1402 -10009 -4670 5541 8351 5273 -1775 -8938 -7741 2212 8400 4436 -2503 -8188 -8794 -344
724c44P579j437p279o596O71P223O860J189o849p895M64O795O646J533n738p979
$$ -344 7235 5798 -1481 -8077 -7406 -183 6677 7866 1017 -6878 -6414 381 7027 8560 2822 -5157
740e157k245P243P706l46m703o739m886O263R399L54n829o138l815L597R505L694
$$ -5157 -7402 -159 7547 7201 2498 -4241 -9127 -2864 6535 6889 1060 -5078 -8893 -5296 4209 7903
756G903o498o931k158J934R162N940o169p313k229J464P922P138l955q990l484
$$ 7903 1405 -5526 -7684 -5750 3412 9352 3183 -4130 -6359 -4895 3027 10165 6210 -2780 -6264
771f264K293N974O831j090r573n093K308M507O749O26q957o091J690M849N820
$$ -6264 -3971 2003 8834 7744 -1829 -6922 -4614 -107 6642 7268 -1689 -7780 -6090 -1241 4579
786D579J211o174p020L06O099N444J497n030o996R6N370N359K659m761p113m95
$$ 4579 5790 -384 -7404 -7098 -999 4445 5942 912 -6084 -5988 -618 4741 7400 2639 -4474 -4969
802d969M377N494K829m493p133j567L982N287K427k692p610l184M663M768K222
$$ -4969 -592 4902 7731 3238 -3895 -5462 -1480 3807 6234 3542 -4068 -7252 -2589 2179 4401
817D401j151o966l873L857N000L087o91n855l928K397N428L193p24m095m763J446
$$ 4401 3250 -3716 -7589 -3732 1268 4355 3664 -2191 -6119 -3722 1706 4899 4175 80 -4683 -3237
833c237N606K713k67l730n417Q98N150K461M6l302n204l41M535L421o56k941l702
$$ -3237 2369 5082 4815 1085 -4332 -3434 1716 4177 4223 921 -4283 -4624 -89 3332 2676 -265 -3967
850c967j562L955M342m62k217l207j604L398M108L62j868l240j246K761L366J102
$$ -3967 -5529 -1574 2768 2306 89 -3118 -4722 -1324 2784 3146 1278 -1962 -3208 -447 2919 4021
866D021j656l091j691J751L707N10k060j604k412L27M097O45k113j788j744L13
$$ 4021 2365 -726 -2417 -666 3041 3551 1491 -113 -2525 -2198 1899 2544 431 -1357 -3101 -2788
882b788K733J734j228k171q75K13J856K560r79k034q5k28J534K397p78j578k05
$$ -2788 -55 1679 451 -1720 -2595 -2382 -526 2034 1055 -979 -1064 -1292 242 2639 1861 283 78
899G8k79P01J644K28j989j056J105l95j07J756j496k200J317M61p18L54L51j056
$$ 78 -201 500 2144 2372 383 -673 432 37 -70 1686 190 -2010 -693 -232 -950 -596 -245 -1301
917a301n35J564J74j277J005M51r45J196O36q29KO02K91m9l6N1n47M2P27l45m21
$$ -1301 -1836 -272 -98 -1375 -370 81 -864 332 968 139 141 743 1034 985 949 1000 453 495 1222 877 456
938D56m33l01N36o3k29l90j122M41Q92k03M06q88j640J240J571k79O27j03k562
$$ 456 23 -278 258 195 -34 -424 -1546 -1105 -213 -416 -10 -898 -2538 -1298 273 -6 621 518 -2044
957b044J28L313O36j244J187j792l203M056K968k991J42J85m069J000N056j129
$$ -2044 -1916 1397 2033 789 1976 184 -3019 1037 4005 1014 1156 1341 -2728 -1728 3328 2199
973B199l057R82j673k214M447K113m147j25J93k007K835L102k658j732O79l81
$$ 2199 -858 124 -1549 -3763 684 2797 -1350 -1475 -1282 -3289 -454 2648 -10 -1742 -1063 -1444
989a444J458K980j117l237L91J140N76K694n35l751q19J322J474J998q42k748
$$ -1444 14 2994 1877 -1360 -969 171 747 3441 2906 -845 -1664 -342 1132 3130 2288 -460
1005d60k550J79L575K053j691k042j897j394K556N077r20m447np23q12O280K671
$$ -460 -3010 -2831 744 2797 1106 -936 -2833 -4227 -1671 3406 2486 -1961 -1966 -2689 -3501 2779 5450
1022E450o261j471K107j994K888N698m085n243K435O92p03M592l91o715N13K932
$$ 5450 -811 -2282 -175 -2169 719 6417 2332 -2911 -476 216 -487 4105 3714 -3001 -2488 444
1038D44j204K553J033n658j075L503J55J174J032m230k423L783K393k04R39k774
$$ 444 -760 1793 2826 -2832 -3907 -404 -249 925 1957 -2273 -4696 -913 1480 1276 2215 -559
1054e59l757K797L997P32k14k791l085Q91L103L023J17m366k977J133J390K541
$$ -559 -4316 -1519 2478 3210 2996 205 -2880 -1989 1114 4137 4254 -112 -3089 -1956 -566 1975
1070A975K853l864n926K036K736q72L756N44p996j80N942j616Q27L777n415l934
$$ 1975 4828 964 -4962 -2926 -190 -1062 2694 3238 -4758 -4938 1004 -612 215 3992 -1423 -5357
1086e357O058J995k638K627j144n606L679M797l308O7P18n210J772N571k007k247
$$ -5357 701 2696 58 2685 1541 -4065 -386 4411 1103 1170 1888 -3322 -1550 4021 2014 -233
1102b33N85l466l84N945M58l830j65j579j887M913L231l122j480j371j192L652
$$ -233 352 -3114 -3498 2447 2905 -925 -1090 -2669 -4556 357 3588 466 -1014 -2385 -3577 75
1118G5L196q42j572k595j151L448K530n34m98k419k983L342L517k409j37J95m886
$$ 75 3271 2429 857 -1738 -2889 559 3089 2555 2057 -362 -3345 -3 3514 1105 968 1163 -3723
1135c723J193N935k572k599K554l136j762N893M53m752J597O09l004L814L450
$$ -3723 -2530 3405 833 -1766 788 -2348 -4110 1783 2236 -2516 -919 -310 -3314 500 3950
1150C950n045o82K680k673J986M803m149k817K524j044J70M524j669m726J214
$$ 3950 -1095 -1777 903 -1770 216 5019 870 -1947 577 -467 -297 4227 2558 -2168 -954
1165i54O45j180L701P90n151l46J617r94K465J706l375j480R93P9K028J545k287
$$ -954 -309 -1489 2212 3002 -2149 -2495 -878 -1872 593 2299 -1076 -2556 -1563 -1484 544 2089 -198
1182a98j057P74n02J661K335k347j754J933q48Q4L151k054k920K365k14j241K805
$$ -198 -1255 -481 -983 678 3013 666 -1088 845 -3 81 3232 1178 -1742 623 409 -832 1973
1199A973p08l695J129J825j786J524J160l801l00L287j470K77K549l121j675L560
$$ 1973 1265 -2430 -1301 524 -1262 262 1422 -2379 -2679 608 -862 -585 1964 -1157 -2832 728
1215G28j06q01K129j038k670K063J527j363J018K53k761M97K022j374M43N26k278
$$ 728 622 -179 1950 912 -1758 305 1832 469 1487 1740 -1021 -524 1498 124 567 1093 -1185
1232a185O9J706j046R2N34j570j40J575n50l13J099j090o32J979k58j020J710
$$ -1185 -1116 590 -456 -364 170 -1400 -1540 35 -515 -828 271 -819 -1451 528 270 -750 960
1249I60o85j219K069Qj340J293o1j674J438Q62k075P32R45j950J51J953k102o18
$$ 960 275 -944 1125 1133 -207 1086 1025 -649 789 1651 -424 308 1253 -697 -546 1407 -695 -1313
1267a313K106j675p75K187j227j207K048k27j355J564J69j498J280J031j493P76
$$ -1313 793 -882 -1657 530 -697 -1904 144 -83 -1438 126 295 -1203 77 1108 -385 391
1283C91Q69j818R26J420j617K82R82j769K26J682j186p42R54j094p57J779j13
$$ 391 1260 -558 368 1788 171 453 1435 -334 -108 1574 388 -354 600 -494 -1251 528 415
1300D15j599Q65k76j305J918N36j688O16K03j211J549J286j568N1N59j000R23
$$ 415 -1184 -319 -595 -1900 18 554 -1134 -518 -315 -1526 23 1309 -259 -208 351 -649 274
1317B74J783j213r37R00q31j47K242j025j894R16l37o65K039k21k161K34L17m53
$$ 274 2057 844 -93 807 -24 -171 2071 1046 -848 68 -269 -934 1105 884 -1277 -1043 -726 -1179
1335a179J300O92j939n56J081k82R46J418j840q02J122j63R03J420j540j339R54
$$ -1179 121 813 -1126 -1682 -601 -883 63 1481 -359 -1161 -39 -202 701 2121 581 -758 196
1352A96J46L10J314q80k067M24R46k76J067k14k436k7J193j39Q95J11k135l98
$$ 196 342 652 1966 1086 -981 -557 389 113 1180 966 -1470 -1497 -304 -443 452 563 -1572 -1970
1370a970J266N79N80L81j652q97J439Q46J80Q14j364j483J493R34j05O12r04j769
$$ -1970 -704 -125 455 836 -816 -1713 -274 572 752 1566 202 -1281 212 1146 1041 1653 749 -1020
1388a020O41J360J28k06o33j672p8J682N40n32m03j452l23J669P18k70k82j132
$$ -1020 -379 981 1109 903 270 -1402 -1480 202 742 210 -193 -1645 -1968 -299 419 149 -133 -1265
1406a265l41J568Q97l7l21q43n33J019J486j14p83o58o80P07J423o1p05j137r15
$$ -1265 -1606 -38 859 822 501 -342 -875 144 1630 1516 733 75 -605 102 1525 1464 759 -378 -1293
1425a293Q34J235j12m60j071j029P09J339L91n15p21q57Q5J971N10q53j74p38
$$ -1293 -459 776 664 204 -867 -1896 -1187 152 543 28 -693 -1550 -1465 506 1016 163 -11 -749
1443g49j92J540J096o04q46l60r4P13J152k77j413l36J09K54Q99p2j337p01K39
$$ -749 -941 599 1695 1091 245 -115 -209 504 1656 1379 -34 -370 -261 -7 892 820 -517 -1218 -979
1462i79L44Q29J05q03r58J30J096M59L12l58j190j58J424O45L7k2q43p27P74J258
$$ -979 -635 194 299 -504 -1462 -1332 -236 223 535 177 -1013 -1171 253 898 935 913 70 -657 117 1375
1482A375k1o07k19r92qJ358Q7p40n27m10k76P04P35m84r96O9J25K60Q00p4p14
$$ 1375 1354 747 528 -464 -472 886 973 233 -294 -704 -980 -276 459 -25 -1021 -952 -827 -567 233 159 -555
1503e55k93L61O92L54k3k18p62K84J113Q7j00j62r88j47J138L40o61k77k69j050
$$ -555 -848 -487 205 559 536 318 -444 -160 953 1040 940 778 -210 -357 781 1121 460 183 -86 -1136
1523a136P99J191r20n52K84q75q0J847l34j166N95j71o62J254J100j391n2Q80
$$ -1136 -337 854 -66 -618 -334 -1209 -1289 558 224 -942 -347 -518 -1180 74 1174 -217 -269 611
1541F11p42M4J667q62q85O76Q9n00P03p3q27l7K89l1j47J5n12j38J32J64J39j73
$$ 611 -131 -87 1580 718 -167 509 598 98 801 728 -99 -136 153 122 -25 -10 -522 -660 -528 -364 -225 -398
1563c98m52K04J25J03Q71m15p30M69K68j47R15J63j041J47N78n27L70R23j322
$$ -398 -850 -646 -521 -418 453 38 -692 -223 45 -102 813 976 -65 82 660 133 503 1426 104
1582A04m16J032o52m99J473q23j346J143L0j316J054N52j427K44J189j102p6J310
$$ 104 -312 720 68 -431 1042 219 -1127 16 46 -1270 -216 336 -1091 -847 342 -760 -836 474
1600D74p33m16J288l64p59R00L6l10N70J79o13Q6J83l24K87K91o08j91R9m26K93
$$ 474 -259 -675 613 249 -510 390 426 116 686 865 252 338 521 197 484 775 167 -24 75 -351 -58
1621e8K02m75Q8j95l76M52J92m43L54J8n09M77N03n28K08O09m92Q1Q18p47m56
$$ -58 144 -331 -243 -438 -814 -362 -170 -613 -259 -241 -750 -273 230 -298 -90 519 27 108 926 179 -277
1642b77J299m14o94J053l86j182R18M53r90K34M87j421J39J184p05l64P12r21
$$ -277 1022 608 -86 967 581 -601 317 770 -220 14 501 -920 -781 403 -302 -666 46 -875
1660h75k98J077J51m09M40k98m77O84M45j77R9Q7n32M36M95k73M1j71n04M38J90
$$ -875 -1173 -96 55 -354 86 -212 -689 -5 440 263 362 449 -83 353 848 575 616 445 -59 379 569
1681E69m76J34j87o96N95K65n45N1j5o52L32Q86o29l28O69p46q6J428j55p46O66
$$ 569 93 227 40 -656 -61 204 -341 -290 -305 -957 -625 261 -368 -696 -27 -773 -859 569 414 -332 334
1702C34l67n41J351M01j015N0L84p41L63J157r88q06P00n68j64J066m02r94K44
$$ 334 -33 -574 777 1178 163 213 597 -144 219 1376 388 -418 282 -286 -450 616 214 -780 -536
1721e36n4k24P85J03q25J48K18j55N83M57p96o2M61j0M05M06o33l63M94k46M90
$$ -536 -590 -814 -29 74 -751 -603 -385 -540 43 500 -296 -358 103 93 498 904 271 -92 402 156 646
1742F46K52n79m19K17lO9M96o79q08M53J35j31M65k77r38M20L37j0N44L6r24K07
$$ 646 898 319 -100 117 114 183 679 0 -808 -355 -220 -351 114 -163 -1101 -681 -344 -354 190 226 -698 -491
1764d91O29l5L04L75n81n57P26K96j55K91k97q02O34J10k87K03k77o51J79M89
$$ -491 138 103 407 782 201 -356 370 666 511 802 505 -297 337 447 160 363 86 -565 -386 103
1784A03r5k34p0m90M2N50k0j17J14l18J0O56K0P8P9m21O5M51K75j81N0k50k47
$$ 103 8 -226 -296 -786 -744 -194 -214 -331 -217 -535 -525 131 151 229 308 -113 -48 403 678 497 547 297 50
1807E0L01K81k89p7k20m02K69L75m89l8p7m74K41M87p7k67R1k55Q1N18J80l49
$$ 50 351 632 343 266 46 -356 -87 288 -201 -239 -316 -790 -549 -62 -139 -406 -315 -570 -489 29 209 -140
1829a40K40j09k8M40K98l79J2o9j20M09R5l07k18n6j84O6L30l01m28J89k20R1
$$ -140 100 -9 -37 403 701 322 334 265 145 554 649 342 124 68 -116 -50 280 -21 -449 -260 -480 -389
1851c89L02j09l52J26j16K43L57n7j96j03K22N8L21J41k80r8J51J8L23J42n90
$$ -389 -87 -196 -548 -422 -538 -295 62 5 -191 -294 -72 -14 307 448 168 70 221 239 562 704 114
1872A14N9P5k12K51O2m97j54M7J17j52J52j50l81J97J78n8J94J62n03K55L22l8
$$ 114 173 248 36 287 349 -148 -302 -255 -138 -290 -138 -288 -669 -472 -294 -352 -158 4 -499 -244 78 40
1894D0R7O7j38PK61J63q8L8m5j79J24O9j93P7l90j90J99L8r2J3k58j30J69n0R0
$$ 40 137 204 66 73 334 497 409 447 402 223 347 416 223 300 -90 -280 -81 -43 -135 -122 -380 -510 -341 -391 -301
1919c01nr0O1J5J71J33l1L1rK07L5R9M9J9j46J86J52k52L3p1j34k60K15J12l95
$$ -301 -306 -396 -335 -320 -149 -16 -47 -16 -25 182 217 316 365 384 238 424 576 324 357 286 152 -108 107 219 -176
1944a76o0k9j15J65J34k90l9O2k4j9K60J38j51q2K90j8J66J70k89J39J16J87p
$$ -176 -236 -265 -380 -215 -81 -371 -410 -348 -372 -391 -131 7 -144 -226 64 46 212 382 93 232 348 535 528
1967E28j59L3k40m1J73l9k51R5k90j87M15j75k74N3Pj59L8L86m0l23L62o3o1K81
$$ 528 369 402 162 121 294 255 4 99 -191 -378 37 -138 -412 -359 -352 -511 -473 -87 -127 -450 -88 -151 -212 69
1991F9Q2j05Q7J09n3L8K85j58k65J74J60l02K83j92k74q8K04o6j69J4j15k11O6
$$ 69 151 46 133 242 189 227 512 354 89 263 423 121 404 212 -62 -150 54 -12 -181 -167 -282 -493 -427
2014d27L64k15j52J08n2K3M60l5j42M4J56j5O2L93k03k71L28k02j09M54j51m82
$$ -427 -63 -278 -430 -322 -374 -351 109 74 -68 -24 132 117 179 572 369 98 426 224 115 569 418 -64
2036f4J96N9j91q8K18l02k89L52j41l69M11m7l75M40J33k77J02L43l40J81K13
$$ -64 132 191 0 -88 130 -172 -461 -109 -250 -619 -208 -255 -630 -190 -57 -334 -232 111 -229 -48 165
2057A65J44k20J37J80k82L25J54l63n2J16j47%J86k1m02j22J35k41M2J99j02m37
$$ 165 309 89 226 406 124 449 603 240 188 304 157 157 343 322 -80 -202 -67 -308 -266 -67 -169 -606
2079f06K18j8n9L19J73k17o7L44r4r5N51j86l15M19N3k68K44K62l74n3J77k49
$$ -606 -388 -406 -465 -146 27 -190 -257 87 -7 -102 449 263 -52 367 420 152 396 658 284 231 408 159
2101A59k52M15j23m59K44r3k83P8J78k75O1J07j3j86J57P8r5K35K76k42M3N9J10
$$ 159 -93 322 199 -260 -16 -109 -392 -314 -136 -411 -350 -243 -256 -442 -285 -207 -302 -67 209 -33 10 69 179
2124A79m7J58K61k64nK04j72j12L05l03l25K46r7l67N02r4m05j54L29q6j57L65
$$ 179 132 290 551 287 282 486 314 202 507 204 -121 125 28 -339 163 69 -336 -490 -161 -247 -404 -39
2146c9o5m13M28J16k23L54Q2l75J43K98n6p7L05r5l38K68P3l32K32J79n95J90
$$ -39 -104 -517 -89 27 -196 158 240 -135 8 306 250 173 478 383 45 313 386 54 286 465 -130 60
2168F0J62l69o7J23j37j97K45j6k20M8J81j20J05K09m3j66J26J41J27j86L64j11
$$ 60 222 -147 -214 -91 -228 -425 -180 -196 -416 -368 -187 -307 -202 7 -36 -202 -76 65 192 6 370 259
2190B59j10K16o6p1K00p1j32j31j1R1k39j0n0k65K07Q5k25j5L9p9J0J27L3MJ8
$$ 259 149 365 299 228 428 357 225 94 83 174 -65 -75 -125 -390 -183 -98 -323 -338 -299 -378 -368 -241 -208 -204 -186
2215a86K17j40K24J81l43J56K39k97J77J84o2j21K5R4j73m1J38l31J3j3k27J8
$$ -186 31 -109 115 296 -47 109 348 51 228 412 350 229 254 348 175 134 272 -59 -46 -59 -286 -268
2237b68K64k20j06O7p1pJ68K5l3OO2R0K5K56j37j57L58m8R3K5j53L7j47J41j5
$$ -268 -4 -224 -330 -263 -334 -341 -173 -148 -181 -175 -113 -23 2 258 121 -36 322 274 367 392 239 276 129 270 255
2262B55l5j50j4r6p4k9J79j23l15J46j20R0J71j17m7J49j28OM31p9q8P1J60j56
$$ 255 220 70 56 -40 -114 -143 36 -87 -402 -256 -376 -286 -115 -232 -279 -130 -258 -252 179 100 12 83 243 87
2286H7J63K30j86j58J51J07k47J98j30j55k0p9k0R9k01o5m5j8P4j02J04q6n1J17
$$ 87 250 480 294 136 287 394 147 345 215 60 40 -39 -59 40 -161 -226 -271 -289 -215 -317 -213 -299 -350 -233
2310b33Q7LJ46j70P7J20P6J77L2r7l8K5J43qj1j05k12J45kj56K09k11l61K07p2
$$ -233 -146 -143 3 -167 -90 30 106 283 315 218 180 205 348 340 329 224 12 157 155 -1 208 -3 -364 -157 -229
2335b29l5K48k40j69J87j7J56L8K17l64pL27j03P1K93k64m6L18j54j9J83k54m9
$$ -229 -264 -16 -256 -425 -238 -255 -99 -61 156 -208 -215 112 9 80 373 109 63 381 227 208 391 137 88
2358H8K5J8N1n4O5m07%J32j23J19k6l02M1J70j64L30P8k14j10J74J39L4L17j83
$$ 88 113 131 182 128 193 -214 -214 -82 -205 -86 -112 -414 -373 -203 -367 -37 41 -173 -283 -109 30 64 381 198
2382A98j33J36j4R6N1m8l21J78M4q3R7l6l19O0J5m9P9o7k33r2K61L6q3K05l19
$$ 198 65 201 187 283 334 286 -35 143 187 104 201 165 -154 -94 -79 -128 -49 -116 -349 -441 -180 -144 -227 -22 -341
2407c41j9L70L0L0R5j14j44J27L08M6q5J4l17rM26j80J8m0k96j86K06J09N1j84
$$ -341 -360 10 40 70 165 51 -93 34 342 388 303 317 0 -9 417 237 255 215 -81 -267 -61 48 99 -85
2431h5l29kK52P1O7j74k41Q6J90K04n5l4jj52L41J74j39J43j74j52J48K17k5j21
$$ -85 -414 -416 -164 -93 -26 -200 -441 -355 -165 39 -16 -50 -51 -203 138 312 173 316 142 -10 138 355 330 209
2455B09l6k28j20L04P5k10o9k06j23M46j64j83J08k36j39N26J45k03k0m4n1J69
$$ 209 173 -55 -175 129 204 -6 -75 -281 -404 42 -122 -305 -197 -433 -572 -46 99 -104 -124 -168 -219 -50
2477e0M46p2k61K9p6J5M27L9l82J6q1k1J73P0j25m81L3J23J25J21q7k37j35K6
$$ -50 396 324 63 92 16 31 458 497 115 131 50 29 202 272 147 -334 -301 -178 -53 68 -19 -256 -391 -365
2501c65K95J12j22j49l3nM27O7L2j61q7q7L67J99j60k13L5j06P5K77r7m31J80
$$ -365 -70 42 -80 -229 -262 -267 160 227 259 98 11 -76 291 490 330 117 152 46 121 398 301 -130 50
2524E0j38j76M27P8n64j82K22kJ49L13l33l94L34J63P2J36L4l42O4L07L0N7Q3
$$ 50 -88 -264 163 241 -323 -505 -283 -285 -136 177 -156 -550 -216 -53 19 155 189 -153 -89 218 248 305 388
2547C88k27j26Q8K75k45j1r5k12M5L36j46j39m5q9k56K01K75j68r5K0kk9L35J
$$ 388 161 35 123 398 153 142 47 -165 -120 216 70 -69 -114 -203 -459 -258 17 -151 -246 -226 -228 -257 78 79
2571G9k12J02O9m1J98K39j79l01K17R6j31J02J52m43J27N3q0j10K17k53k84L32
$$ 79 -133 -31 38 -3 195 434 255 -46 171 267 136 238 390 -53 74 127 47 -63 154 -99 -383 -51
2593e1R0l84K23J11m86K97K03j37K9K42l04r3L09L45l76J37K18l69N4M01l03r4
$$ -51 39 -345 -122 -11 -497 -200 3 -134 -105 137 -167 -260 49 394 18 155 373 4 58 459 156 62
2615F2J57j65k4J0J88k79q4R1j01j37L16j30k23J59J1o9J13K16j70j84K89p1m0
$$ 62 219 54 30 40 228 -51 -135 -44 -145 -282 34 -96 -319 -160 -149 -218 -105 111 -59 -243 46 -25 -65
2638f5L19J7l31J98J92j61M0J03q9k36J37K04k68j7J91l94j1J92j74J5Oj28j73
$$ -65 254 271 -60 138 330 169 209 312 223 -13 124 328 60 43 234 -160 -171 21 -153 -138 -132 -260 -433
2661d33K62R8j25J06K8j87N9K87k7j44K30o8j84L68J11j42j62J66k66Q2L65k52
$$ -433 -171 -73 -198 -92 -64 -251 -192 95 68 -76 154 86 -98 270 381 239 77 243 -23 59 424 172
2683A72k44J09j97J2J71Q0k65o9N6K6l5K46k23j54J01J56q1K45r5o1k7Q9K59J1
$$ 172 -72 37 -160 -148 23 103 -162 -231 -175 -149 -184 62 -161 -315 -214 -58 -139 106 11 -50 -77 12 271 282
2707B82k9l2k18J03K36N5j45j31j47j19K42M2n3l27J93l18O0M10j14k42P6k44
$$ 282 253 221 3 106 342 397 252 121 -26 -145 97 139 86 -241 -48 -366 -306 104 -10 -252 -176 -420
2729d20J68L30J85l02j46J20J7P5L70k25k14J22Q1M0K37j14k98j32Q0Q7R8Rk76
$$ -420 -252 78 263 -39 -185 -65 -48 27 397 172 -42 80 161 201 438 324 26 -106 -26 61 159 168 -108
2752a08j59J27o5J71Q5k85j08J5J50J92K23l19l1j54R3M03P7k56n7j25K44J80
$$ -108 -267 -140 -205 -34 51 -234 -342 -327 -177 15 238 -81 -112 -266 -173 230 307 51 -6 -131 113 293
2774B93J54j89l18J49r1M9L62k64m81K5P8J19L22k03l05k35J92J91K09J4k54k23
$$ 293 447 258 -60 89 -2 47 409 145 -336 -311 -233 -114 208 5 -300 -535 -343 -152 57 71 -183 -406
2796d06K54J60J61J52k01l07J70K36J25Q9j22j99k39K83J13J0r4m76q8K65J05
$$ -406 -152 8 169 321 120 -187 -17 219 344 433 311 112 -127 156 269 279 185 -291 -379 -114 -9
2817iK24j75m11p2K10J71K25o5m12j70K55L11K48j13k30l52K60M01J37K6l22l61
$$ -9 215 40 -371 -443 -233 -62 163 98 -314 -484 -229 82 330 217 -13 -365 -105 296 433 459 137 -224
2839b24K27K51Q6J1k07m12mL04J01qk03j93k40L94K34m9j70k20pL40J93n8j29
$$ -224 3 254 340 351 144 -268 -272 32 133 125 -78 -271 -511 -117 117 68 -102 -322 -329 11 204 146 17
2862A7qm09L80L29J19j79k77j76K84M14j56j02k33j62kM49m7j05j80l38J21K75
$$ 17 9 -400 -20 309 428 249 -28 -204 80 494 338 236 3 -159 -161 288 241 136 -44 -382 -261 14
2884A4Q5j35k67j78J69J93K43j23j25q2j6L66K55k12j35k2j87L39K70j28j97j23
$$ 14 99 -36 -303 -481 -312 -119 124 1 -124 -206 -222 144 399 187 52 30 -157 182 452 324 127 4
2906Dl4m9M00j21k58r1K6k8K82l9k14o4j51l1L08J62j67n9l8K8J65J37P2l34J01
$$ 4 -30 -79 321 200 -58 -149 -123 -151 131 92 -122 -186 -337 -368 -60 102 -65 -124 -162 -134 31 168 240 -94 7
2931GkJ35K25k02m9q9j25L21J06k78R9j31j18j6K05l7j84m1q6m9K85M5k59J0J27
$$ 7 5 140 365 163 114 25 -100 221 327 49 148 17 -101 -117 88 51 -133 -174 -260 -309 -24 21 -238 -228 -101
2956a01j66J42K38j27j13Q0J5J06K34m6j40R5n0j82K05lk23kM1j2K4MPj63Qk2
$$ -101 -267 -125 113 -14 -127 -47 -32 74 308 262 122 217 167 -15 190 187 -36 -38 3 -9 15 19 26 -137 -129 -151
2982a51j34K91O5l31J05Q0j21J75J13pj60N8K7R1RQ2o2j30J62N0n0M8j91j01m1
$$ -151 -285 6 71 -260 -155 -75 -196 -21 92 85 -75 -17 10 101 110 192 130 0 162 212 162 210 19 -82 -123
3007a23K45k0m3l5m2k81K76O6j68Mo5j49J9L92P0k36P8l2l4K28J41j24j85J2L1
$$ -123 122 102 59 24 -18 -299 -23 43 -125 -121 -186 -335 -316 76 146 -90 -12 -44 -78 150 291 167 -18 -6 25
3032B5J06K78j92j53j19N0P4J67R5m67j66J46j4J22K19l08k02j8J95K38o6k0j34
$$ 25 131 409 217 64 -55 -5 69 236 331 -136 -302 -156 -170 -48 171 -137 -339 -357 -162 76 10 -10 -144
3055a44k25M56L54k77Q8k31k67K15L37J86j92k67p0q4L68K19l56k22p2j58K74
$$ -144 -369 87 441 164 252 21 -246 -31 306 492 300 33 -37 -121 247 466 110 -112 -184 -342 -68
3076f8L88m12j08j52K0J17L72L0m53j18L28j15L01L00m56k93K11K01K14J35j42
$$ -68 320 -92 -200 -352 -332 -215 157 187 -266 -384 -56 -171 130 430 -26 -319 -108 93 307 442 300
3097C00l36l04N15R2L9j06m77k6L19J93O9k86l11p0r4N36J03l16J1l13L4M46M12
$$ 300 -36 -340 175 267 306 200 -277 -303 16 209 278 -8 -319 -389 -483 53 156 -160 -149 -462 -428 18 430
3120D30l78j32j63J11K84K70Lm39n0L8M7L79O9m09k98Q4K02J04J11k34m89j7M21
$$ 430 52 -80 -243 -132 152 422 425 -14 -64 -26 21 400 469 60 -238 -154 48 152 263 29 -460 -477 -56
3143e6P8R0j47l69j29M72K16P6m0l44j91K07M20Q3j38o2m10jN73K05k81j87j86
$$ -56 22 112 -35 -404 -533 -61 155 231 191 -153 -344 -137 283 366 228 166 -244 -245 328 533 252 65 -121
3166a21m8K34L54k13n17K4l9J23L87L9m05j65P7J06L73J3j98l74Q7K73J48K49
$$ -121 -169 65 419 206 -311 -287 -326 -203 184 223 -182 -347 -270 -164 209 222 24 -350 -263 10 158 407
3188D07k49m37J04K78K38P0n4l77j65J56M22l9l27p1l63R7N54J9j95m20j27J80
$$ 407 158 -279 -175 103 341 411 357 -20 -185 -29 393 354 27 -44 -407 -310 244 263 68 -352 -479 -299
3210b99L05K65k07l61N4m2K14M77r1m61J13o1K46K72Pl47l11K62O4J35K00l78
$$ -299 6 271 64 -297 -243 -285 -71 406 315 -146 -33 -94 152 424 431 84 -227 35 99 234 434 56
3232E6m00K17N2K09N2k60k66O7R8K78k0j51j36k56K48L46J8j07lk60R1L25P2q
$$ 56 -344 -127 -75 134 186 -74 -340 -273 -175 103 83 -68 -204 -460 -212 134 152 45 42 -218 -127 198 270 262
3256B62k59o0RK87K01j55l71r6J44J19J04ml47j06j2K29M6J40k07k27J56K1R6
$$ 262 3 -57 -48 239 440 285 -86 -182 -38 81 185 181 -166 -272 -284 -55 -9 131 -76 -303 -147 -126 -30
3279c0R5j21o1QJ22J63p1m5l9j14K28O8n2M3j91j02J2J00J27Qk38N5p5J30K8p2
$$ -30 65 -56 -117 -109 13 176 105 60 21 -93 135 203 151 194 3 -99 -87 13 140 148 -90 -35 -110 20 48 -24
3305b4l1j04l4J92k4Q9j15l4p5J75L2JJ30j20L1j5J2J42o6l4n3o5N4k0J29j21
$$ -24 -55 -159 -193 -1 -25 64 -51 -85 -160 15 47 48 178 58 89 74 86 228 162 128 75 10 64 44 173 52
3331E2j61J52j30p4J50P6j27k02J26KK13n5k9j39j8J56j5J27Lj61J49p8Q1J85
$$ 52 -109 43 -87 -161 -11 65 -62 -264 -138 -136 77 22 -7 -146 -164 -8 -23 104 107 -54 95 17 98 283
3355B83n7j60p1j4M5J39j6m2k70p4J14Q2J02j82k08J27m3K65J85l54j67J59P9
$$ 283 226 66 -5 -19 26 165 149 107 -163 -237 -123 -41 61 -121 -329 -202 -245 20 205 -149 -316 -157 -78
3378g8J66J72j32k50q0J01K87J76n2l98mJ46K15J74k01l28j79J33J88L20l12j31
$$ -78 88 260 128 -122 -202 -101 186 362 310 -88 -92 54 269 443 242 -86 -265 -132 56 376 64 -67
3400f7k87K0M37OJ22l84j34L7J53L38L4k36k36J9J92L00P8k28l10nK03L12L1j91
$$ -67 -354 -334 103 109 231 -153 -287 -250 -97 241 275 39 -197 -178 14 314 392 164 -146 -151 52 364 395 204
3424B04l96j49L14J76J79j70m62r2R9M21J70k68l88K7J02M10J36j39k75j82J93
$$ 204 -192 -341 -27 149 328 158 -304 -396 -297 124 294 26 -362 -335 -233 177 313 174 -101 -283 -90
3445i0K69K43j69j82m79L04M17N7j16k59k93R2K77K99j42l71j24j29L33L67j25
$$ -90 179 422 253 71 -408 -104 313 370 254 -5 -298 -206 71 370 228 -143 -267 -396 -63 304 179
3466A79j99m76L4L57M20r8l43k55K34m5M02K62l22l55q4K76L70J8r9m03j60K13
$$ 179 -20 -496 -462 -105 315 217 -126 -381 -147 -192 210 472 150 -205 -289 -13 357 375 276 -127 -287 -74
3488g4M71kk18m60j41K86K46J34j60k60k66J08L74K88k82k44q1k3L68L82k25k08
$$ -74 397 395 177 -283 -424 -138 108 242 82 -178 -444 -336 38 326 44 -200 -281 -304 64 446 221 13
3510A3k57N2L41K47ol85j95J01J85L98r8l30k92NJ64K50K1j93l68j36M10K50L2
$$ 13 -244 -192 149 396 390 5 -190 -89 96 494 396 66 -226 -221 -57 193 214 21 -347 -483 -73 177 209
3533B09j95k93o0J07M48Q1j49k85j26J85K97J65j96k74j84Q5K79K26j66q3l82
$$ 209 14 -279 -339 -232 216 297 148 -137 -263 -78 219 384 188 -86 -270 -185 94 320 154 71 -311
3554c11Q8K40K07r7l29JJ02o3L84l9l73k15J92J5K82J13k70j19n7L08O6Q9k6k77
$$ -311 -223 17 224 127 -202 -201 -99 -162 222 183 -190 -405 -213 -198 84 197 -73 -192 -249 59 125 214 188 -89
3578h9j3L40l0Q9k9l68j38J47M09r8j69j47j63R1L49j08j67q2m5rK10J30J2k73
$$ -89 -102 238 208 297 268 -100 -238 -91 318 220 51 -96 -259 -168 181 73 -94 -176 -221 -230 -20 110 122 -151
3602a51J5J34j42L70j24j35n0Q5j8L14m0j43j69r9K30j1K8N3l48L3J20l7J50q3
$$ -151 -136 -2 -144 226 102 -33 -83 2 -16 298 258 115 -54 -153 77 66 94 147 -201 -168 -48 -85 65 -18
3626a8k27J5J16N5N3N7j68o7k5K32P6L8n1j45m8L02j07P5q0m1J8n9J78k8k06N0
$$ -18 -245 -230 -114 -59 -6 51 -117 -184 -209 23 99 137 86 -59 -107 195 88 163 83 42 60 1 179 151 -55 -5
3652eL2L9j14n5M8qLr0N3K2N3j60J55Lj3l0J43q6j09J21O7o2J13j4m8J8J13j84
$$ -5 27 66 -48 -103 -55 -63 -60 -150 -97 -75 -22 -182 -27 -24 -37 -67 76 -10 -119 2 69 7 120 106 58 76 189 5
3680EQ6P9j13lp8mo0J66L4k25j6j6L9R2M2k00j3m7K80J6J1L2k09r7K55J77j69
$$ 5 91 170 57 54 -24 -28 -88 78 112 -113 -129 -145 -106 -14 28 -172 -185 -232 48 64 75 107 -102 -199 56 233 64
3707F4M4m3k18J27K98l4j82rj14o1K68M4j56j74L9j29J85K50j03j26k61J24J66
$$ 64 108 65 -153 -26 272 238 56 47 -67 -128 140 184 28 -146 -107 -236 -51 199 96 -30 -291 -167 -1
3730aJ43Kk11j83J34J30L03j03k86j42N3L02K8K41l19j95j55M51J6m2j37l38R4
$$ -1 142 144 -67 -250 -116 14 317 214 -72 -214 -161 141 169 410 91 -104 -259 192 208 166 29 -309 -215
3753b15K01J18m6o7l04J4J17L09J95l56k25M1J74L10J14j98k45k40L03K06J23
$$ -215 -14 104 58 -9 -313 -299 -182 127 322 -34 -259 -218 -44 266 380 182 -63 -303 0 206 329
3774C29k9m79K1O9J92K01o6l88j95K10K46K14k60j80k18M0L41J62q1k95k02J26
$$ 329 300 -179 -158 -89 103 304 238 -150 -345 -135 111 325 65 -115 -333 -293 48 210 129 -166 -368 -242
3796b42L53J23N9l23j94K1K20L88k4l14j19j00K30K99O1l66m41J41J99J03J91
$$ -242 111 234 293 -30 -224 -203 17 405 381 67 -52 -152 78 377 438 72 -369 -228 -29 74 265
3817B65k57k43p3K37J84J06p5m40j5J24K83R4j13j92k51K31L65J06q2k29k78K11
$$ 265 8 -235 -308 -71 113 219 144 -296 -311 -187 96 190 77 -115 -366 -135 230 336 254 25 -253 -42
3839d2J99J85o8k62j65J13J35K02j30k32k41Q9J70L44q7k61k39J4K82J81J1l51
$$ -42 157 342 274 12 -153 -40 95 297 167 -65 -306 -217 -47 297 210 -51 -290 -276 6 187 198 -153
3861a53j44J54K34J52K9l23j41O3J68J84M7k61j62m6L05J66o9j16k74q4P6L70
$$ -153 -297 -143 91 243 272 -51 -192 -129 39 223 270 9 -153 -199 106 272 203 87 -187 -271 -195 175
3883A75R0k12k67r9K56J33J25q0k56j66K20J80PK5J0l29O2K77J87j44n4k99J21
$$ 175 265 53 -214 -313 -57 76 201 121 -135 -301 -81 99 106 131 141 -188 -126 151 338 194 140 -159 -38
3906c8J38J95j94j34j89J59o1K45r1q9j61k0J73J59j43l7p3j13L09Q9j15O7j82
$$ -38 100 295 101 -33 -222 -63 -124 121 30 -59 -220 -240 -67 92 -51 -88 -161 -274 35 124 9 76 -106
3929a06M2J28Q8m3J01j40q0RK12P7k61j40J9J8R0J46j00j62o0J69r0J36j17j50
$$ -106 -64 64 152 109 210 70 -10 -1 211 288 27 -113 -94 -76 14 160 60 -102 -162 7 -83 53 -64 -214
3953b14M1Q4P6M2j5n4j0L0J00M6j8j25N9JN7M6L6m4j21q7J66m5J5l5j66N5k8J73
$$ -214 -173 -89 -13 29 14 -40 -50 -20 80 126 108 -17 42 43 100 146 182 138 17 -70 96 51 66 31 -135 -80 -108 65
3981F5r2O4q7r2K8Q7k7k3M5r9O9M6P1j1j31J43q9J17N9j10N2m7K4R3k43K01j4
$$ 65 -27 37 -50 -142 -114 -27 -54 -77 -32 -131 -62 -16 55 44 -87 56 -33 84 143 33 85 38 62 155 -88 113 99
4008I9r3m5J7p1K8l7k2P5j7n3j8Q4r5J63M2q6Q5q2O2R5l2n5N2m5J75j53l8j9R3
$$ 99 6 -39 -22 -93 -65 -102 -124 -49 -66 -119 -137 -53 -148 15 57 -29 56 -26 36 131 99 44 96 51 226 73 35 16 109
4037A09r9Pn6m8l9n6K13n5N4m5j27j5M5P4J48j49Q6j18l1J49O7o5j12K6M5J35
$$ 109 10 17 -39 -87 -126 -182 31 -24 30 -15 -142 -157 -112 -38 110 -39 47 -71 -102 47 114 49 -63 -37 8 143
4063A43k3J7l5Oj04J17J13j65m6j30nJ37R6q3n4j06p7J89Q4r7k9p4j03J91K06
$$ 143 120 137 102 108 4 121 234 69 23 -107 -112 25 121 38 -16 -122 -199 -10 74 -23 -52 -126 -229 -38 168
4088A68p3q0j91kJ52K23j3p6j74j55K48K65j30j49k3j63K05J55r3j25j10p3J07
$$ 168 95 15 -176 -178 -26 197 184 108 -66 -221 27 292 162 13 -10 -173 32 187 94 -31 -141 -214 -107
4111a07J08J48o9k71j3J31P7J90o4k31q5J68O6J11k1j57n0J38J41m9rr3k20J08
$$ -107 1 149 80 -191 -204 -73 4 194 130 -101 -186 -18 48 159 138 -19 -69 69 210 161 152 59 -161 -53
4135e3J32L5Nj46j59n8K13J39j15J6k63M3K98l5p0p1Qo3J35K46j12p6k24J45J15
$$ -53 79 114 119 -27 -186 -244 -31 108 -7 9 -254 -211 87 52 -18 -89 -81 -144 -9 237 125 49 -175 -30 85
4160H5J78k9l05J20j34J21J50O7k71j75l3J15R2R9l5j88rk1J17J85p8j16k11K39
$$ 85 263 234 -71 49 -85 36 186 253 -18 -193 -226 -111 -19 80 45 -143 -152 -173 -56 129 51 -65 -276 -37
4184c7J24N6r2r6j19Q9K81M6m0k43p3P3J39J77k81Oj37J40l7J74l6k98k03K76
$$ -37 87 143 51 -45 -164 -75 206 252 212 -31 -104 -31 108 285 4 10 -127 13 -24 150 114 -184 -387 -111
4208a11J11N4K0j06j12r5K33O8N2p7j50L6P6J34o2mp2q6J92K7O4r9j26o6R4J56
$$ -111 0 54 74 -32 -144 -239 -6 62 114 37 -113 -77 -1 133 71 67 -5 -91 101 128 192 93 -33 -99 -5 151
4234A51l2j55j74J57J2Q6J4p3j30L4n2K70Jj33j01J9N1N6J44r9n3p2P1J64o2k4
$$ 151 119 -36 -210 -53 -41 45 59 -14 -144 -110 -162 108 109 -24 -125 -106 -55 1 145 46 -7 -79 -8 156 94 70
4260G0K5j80Q2P5J9K3k3j64m1P5P3k9j30l0P3P3O2j18K4o4M7J20J6j5j3q4J18
$$ 70 95 -85 -3 72 91 114 91 -73 -114 -39 34 5 -125 -155 -82 -9 53 -65 -41 -105 -58 62 78 63 50 -34 84
4287H4m9K6O8j35j5j9J41m0O9o6j35k0J46j56O6M1p2m0M3N7j07P8kl5R6l4OJ07
$$ 84 35 61 129 -6 -21 -40 101 61 130 64 -71 -91 55 -101 -35 6 -66 -106 -63 -6 -113 -35 -37 -72 24 -10 -4 103
4315A03p2m9J7O1O5j72L6K2j1Q5j4o5m1j2R4j08M8J63j17p1k4J0P6j4p0M9M0l6
$$ 103 31 -18 -1 60 125 -47 -11 11 0 85 71 6 -35 -47 47 -61 -13 150 33 -38 -62 -52 24 10 -60 -11 29 -7
4343gq2M9M6M5m8OP1j49J54n8j7R9l6mN2l6l5l3o1Q9k8P8k4p8n5K3PK3p7p6J14
$$ -7 -89 -40 6 51 3 9 80 -69 85 27 10 109 73 69 121 85 50 17 -44 45 17 95 71 -7 -62 -39 -32 -9 -86 -162 -48
4374d8n4mJ31L8j06R9l0j22J10k9Q0m0K5k2L4MKJ1j3m6O1m1k4oj7k0rj5Q0k6p5
$$ -48 -102 -106 25 63 -43 56 26 -96 14 -15 65 25 50 28 62 66 68 79 66 20 81 40 16 10 -7 -27 -36 -51 29 3 -72
4405g2l9m6J84K4k4j35MP4J49K5r6k5j4N8J49k9j83j4lP2P5j56j7j3J3o0j1J59
$$ -72 -111 -157 27 51 27 -108 -104 -30 119 144 48 23 9 67 216 187 4 -10 -13 59 134 -22 -39 -52 -39 -99 -110 49
4433D9qk31J70j21K00K2p8p6L4n9M5J85j66L2O1q4J84K3n3l6j35J6R8N8K0k29
$$ 49 41 -190 -20 -141 59 81 3 -73 -39 -98 -53 132 -34 -2 59 -25 159 182 129 93 -42 -26 72 130 150 -79
4459g9KkK0L4K9j47%K9P7J8O5p9j35O8J04J19n0pj48mJ05J5J14j30p6M6%J67N6
$$ -79 -77 -79 -59 -25 4 -143 -143 -114 -37 -19 46 -33 -168 -100 4 123 73 66 -82 -86 19 34 148 18 -58 -12 -12 155 211
4488B11j76j95R3j9J40J39j77j85jJ68j6Q4o5p6JQ0l4P9K9r7q4M8J68N0k5j42
$$ 211 35 -160 -67 -86 54 193 16 -169 -170 -2 -18 66 1 -75 -74 6 -28 51 80 -17 -101 -53 115 165 140 -2
4514bk5M2J05m1K8j29p1O3J44J27j36j64J9j28J34J65p2j68pL6M0O5Q4j69j10
$$ -2 -27 15 120 79 107 -22 -93 -30 114 241 105 -59 -40 -168 -34 131 59 -109 -116 -80 -40 25 109 -60 -170
4539a70J07J3J73j7m9j10J16J6K3m9L7j47M7k6J11K5n8j03l9P4Q3k1r4r1o5P5
$$ -170 -63 -50 123 106 57 -53 63 79 102 53 90 -57 -10 -36 75 100 42 -61 -100 -26 57 36 -58 -149 -214 -139
4565a39J66J23q3j37l1N2J69P5j02j87m0O4J96Rj2j57lM0R2RO6j82j2N4j52K42
$$ -139 27 150 67 -70 -101 -49 120 195 93 -94 -134 -70 126 135 123 -34 -37 3 95 104 170 -12 -24 30 -122 120
4591A20Pr5j38o0Q1K00j84N3j11j61M16j07j1L2j21L4J6M6pj07R8j3N6R6j2p6
$$ 120 127 32 -106 -166 -85 115 -69 -16 -127 -288 128 21 10 42 -79 -45 -29 17 10 -97 1 -12 44 140 128 52
4617E2j66J27o6J61l5n0j54K3Q4j01J18l0o9j4L5Q0Pj6n6oJ65p7N1j12K5Q0j00
$$ 52 -114 13 -53 108 73 23 -131 -108 -24 -125 -7 -37 -106 -120 -85 -5 2 -14 -70 -76 89 12 63 -49 -24 56 -44
4644d4K07l7q9r6krJ80l6j2j6P9j67J15o6j5l9K6j4O6n5o4P0q8R5Q8r8QJ1k8P8
$$ -44 163 126 37 -59 -61 -70 110 74 62 46 125 -42 73 7 -8 -47 -21 -35 31 -24 -88 -18 -106 -11 77 -21 -13 -2 -30 48
4674D8R2r3N0m1o7J13Mo7o0NN6k6J2p0J3P0o8K7j13Q9n3N3p7K00k14J11L5jK0
$$ 48 140 47 97 56 -11 102 106 39 -21 -16 40 14 26 -44 -31 39 -29 -2 -115 -26 -79 -26 -103 97 -117 -6 29 28 48
4703D8L4l2r4J28l3p6J01l1r4j9N7K9k3R5l2j69R2K8mQ0j25Op2L0j2J18q3M4K3
$$ 48 82 50 -44 84 51 -25 76 45 -49 -68 -11 18 -5 90 58 -111 -19 9 5 85 -40 -34 -106 -76 -88 30 -53 -9 14
4732A4j37J42J28j89oJ3M6J8N4j16j5P1rO7M8j35l2N5N2k9j25J22j91m5K09l3
$$ 14 -123 19 147 -42 -48 -35 11 29 83 -33 -48 23 14 81 129 -6 -38 17 69 40 -85 37 -154 -199 10 -23
4758b3J11k06J18j06J06JJ78j84pJ8m6O9J28m2j07J1l2J12K7L3j54p8p7J52O3
$$ -23 88 -118 0 -106 0 1 179 -5 -12 6 -40 29 157 115 8 19 -13 99 126 159 5 -73 -150 2 65
4783F5L4k15J8l7P9Q6JQ8l18O5J6Q2Q7p0n0j9J29l2J04O7k44L0J7J23p9Q1k28
$$ 65 99 -116 -98 -135 -56 30 31 119 -199 -134 -118 -36 51 -19 -69 -88 41 9 113 180 -64 -34 -17 106 27 108 -120
4810a20J8P6P5j0j9q7l6n1J29K4J07j50n2P0N2J9K3j81m2Q2P0N6K6o4l0QK3K4
$$ -120 -102 -26 49 39 20 -67 -103 -154 -25 -1 106 -44 -96 -26 26 45 68 -113 -155 -73 -3 53 79 15 -15 -7 16 40
4838D0Qk7j53J34m6J19Lj2j65N4J5P4J07k36J0k2JJ34K4p7o8q3J51J60j03O4n9
$$ 40 48 21 -132 2 -44 75 78 66 -99 -45 -30 44 151 -85 -75 -97 -96 38 62 -15 -83 -166 -15 145 42 106 47
4865D7j67R2J64l4m2j05pn2J84O4J9o4j60q2J12Q8l3k01k9J07N4O2N4j15j17K0
$$ 47 -120 -28 136 102 60 -45 -52 -104 80 144 163 99 -61 -143 -31 57 24 -177 -206 -99 -45 17 71 -44 -161 -141
4891a41J42%M9m6j03K0J85L2p1k0o6o4J03J52q2n7r8qJ6J99l6j96N8j68J35R0
$$ -141 1 1 50 4 -99 -79 106 138 67 47 -19 -83 20 172 90 33 -65 -73 -57 142 106 -90 -32 -200 -65 25
4917B5O2r4o9qk5P2M7k4lrn6J02N9n4J4j75J63o6O9J31j18n3J7L6M2M5k04oJ9
$$ 25 87 -7 -76 -84 -109 -37 10 -14 -17 -26 -82 20 79 25 39 -136 27 -39 30 161 43 -10 7 43 85 130 -74 -80 -61
4946f1O8K3l2J4j16k8N5J7Q9K9j14j04M4J73J92j84j05K2M3J04q5L8p2o6O0P1
$$ -61 7 30 -2 12 -104 -132 -77 -60 29 58 -56 -160 -116 57 249 65 -40 -18 25 129 44 82 10 -56 4 75
4972G5Rm1r7K2N2N6r3kK1o1j8J20k8p2J02r0MP6j5p9N3o0K1ON1o3P6q3J40q0O6
$$ 75 84 43 -54 -32 20 76 -17 -19 2 -59 -77 43 15 -57 45 -45 -41 35 20 -59 -6 -66 -45 -39 12 -51 25 -58 82 2 68
5003F8l4N6n3n2N9n0j02J08m6o9O9L4m5L6o0n0J29k8l1L3PQ7k5o9P8m0l7J18m0
$$ 68 34 90 37 -15 44 -6 -108 0 -46 -115 -46 -12 -57 -21 -81 -131 -2 -30 -61 -28 -21 66 41 -28 50 10 -27 91 51
5032E1o5p3O9R2j01O6k0p0M1j04J54l7%pJ7k07J70Qn1o4J88q4n9J40j50O2N1K4
$$ 51 -14 -87 -18 74 -27 39 19 -51 -10 -114 40 3 3 -4 13 -194 -24 -16 -67 -131 57 -27 -86 54 -96 -34 17 41
5060D1n2J26L4n0k1J0K2J8r4o6P8po0J73j27l6p5Q7j4K3pj37M6J82k21J12J12
$$ 41 -11 115 149 99 78 88 110 128 34 -32 46 39 -21 152 25 -11 -86 1 -13 10 3 -134 -88 94 -127 -15 97
5087I7j40J6P0N1j8l2j1N2j83J66m3O9n5n5LN0N9j0q0j09Q0PQ4n3j15K9n4O5J20
$$ 97 -43 -27 43 94 76 44 33 85 -98 68 25 94 39 -16 -13 37 96 86 6 -103 -23 -16 68 15 -100 -71 -125 -60 60
5116F0m2L2j64O9O8K2Q2j01n9k1J11M0J72k98n8O6L5M3R2k4k14k3m2J23J00j83
$$ 60 18 50 -114 -45 23 45 127 26 -33 -54 57 97 269 -29 -87 -21 14 57 149 125 -89 -112 -154 -31 69 -114
5142a14J7q5J0K48Ko2j6j50O8J82k3Jq3j28J46J65m2N3r7j76O9Q0J13j45o2l6
$$ -114 -97 -182 -172 76 78 16 0 -150 -82 100 77 78 -5 -133 13 178 136 189 92 -84 -15 65 178 33 -29 -65
5168f5j8J26M6l1j81K8J11m0n8J2jj4Q4q0J74M3j66m8n6R1K54j17o1J4j64J25
$$ -65 -83 43 89 58 -123 -95 16 -24 -82 -70 -71 -85 -1 -81 93 136 -30 -78 -134 -43 211 94 33 47 -117 8
5194HK8P4k4j13r8Q1M2O7o3r9j1R7L6m7J29k25J6m3O4J48K4j14p1L1N3m2J45j07
$$ 8 36 110 86 -27 -125 -44 -2 65 2 -97 -108 -11 25 -22 107 -118 -102 -145 -81 67 91 -23 -94 -63 -10 -52 93 -14
5222a4m1m1O9O7L5K1j8j80J44L1l6q3m8q6K33lLj35l6J17j4J22J5j34n8O6j8Q
$$ -14 -55 -96 -27 40 75 96 78 -102 42 73 37 -46 -94 -180 53 50 53 -82 -118 -1 -15 107 122 -12 -70 -4 -22 -14
5250a4P6r0K6J3p9K12n6Rj08N5M6r4N0q3O8K9j54L2N4Oj39R8p9J63l7p3O6q6J9
$$ -14 62 -28 -2 11 -68 144 88 97 -11 44 90 -4 46 -37 31 60 -94 -62 -8 -2 -141 -43 -122 41 4 -69 -3 -89 -70
5279g0k0J10J4r6n8J28Q2jn0p1M4j16J50J44j60Q5j16p2J5J37n2L4n7m8K9k1J8
$$ -70 -90 20 34 -62 -120 8 90 89 39 -32 12 -104 46 190 30 115 -1 -73 -58 79 27 61 4 -44 -15 -36 -18
5306a8O8j71J2J28j05J04N3j03j5P5P6j13LR5j01O2j31J87j5n4L0m6L4J12j36
$$ -18 50 -121 -109 19 -86 18 71 -32 -47 28 104 -9 -6 89 -12 50 -81 106 91 37 67 21 55 167 31
5331C1q6Q0KJ7jj88J68p1j1K1j8qj2rR6R5j61R6M7j68K9J00R9j02n5RK8j4J0m1
$$ 31 -55 25 27 44 43 -145 23 -48 -59 -38 -56 -64 -76 -85 11 106 -55 41 88 -80 -51 49 148 46 -9 0 28 14 24 -17
5361a7P8p6J06p5J0O2j40q9P9k0PR8l9J16j47R8j3k5l2l0P6J3j34K23j71J63m3
$$ -17 61 -15 91 16 26 88 -52 -141 -62 -82 -75 23 -16 100 -47 51 38 13 -19 -49 27 40 -94 129 -42 121 78
5388G8n9J7q0p4Q1Q4jm3Q0j06p3O6P0J1k3j04J0J00o3J75j15l2j0N4n7J17k7o1
$$ 78 19 36 -44 -118 -37 47 46 3 83 -23 -96 -30 40 51 28 -76 -66 34 -29 146 31 -1 -11 43 -14 103 76 15
5416A5J02k45Q2J13k5j9p6J06m8R8k46J37M3j23J28L3rj37j5P1j5Q0j26J0Q8j25
$$ 15 117 -128 -46 67 42 23 -53 53 5 103 -143 -6 37 -86 42 75 66 -71 -86 -15 -30 50 -76 -66 22 -103
5442a03J64k6N2j47p2J27N8R5r3qp5m5J3K01m3q2o9J5k6J42o7j20J18n6J28o1
$$ -103 61 35 87 -60 -132 -5 53 148 55 47 -28 -73 -60 141 98 16 -53 -38 -64 78 11 -109 9 -47 81 20
5468B0j06M8q7O8J5J69j37q7j6J30o2P0N5q5J9m2J28P4r5j28J0l0Q0Q3j30J9m8
$$ 20 -86 -38 -125 -57 -42 127 -10 -97 -113 17 -45 25 80 -5 14 -28 100 174 79 -49 -39 -69 11 94 -36 -17 -65
5495f5k2J16o5PO2j26Q4j4P5m9J37r4j69P9J30l6r0M9n7N1Q2J00j44l1j88N4K21
$$ -65 -87 29 -36 -29 33 -93 -9 -23 52 3 140 46 -123 -44 86 50 -40 9 -48 3 85 185 41 10 -178 -124 97
5522I7j12N2K3j90R2J32k7J1j68n1K4K18m5q0O3j04O9M9O9p5k4j07N9J18J7p2
$$ 97 -15 37 60 -130 -38 94 67 78 -90 -141 -117 101 56 -24 39 -65 4 53 122 47 23 -84 -25 93 110 38
5548C8K5n5p3J18M0j1j3r7j48J77jj4M5j72r8K45L9J12j18j56J9P7J21J3j29L1
$$ 38 63 8 -65 53 93 82 69 -28 -176 1 0 -14 31 -141 -239 6 45 157 39 -117 -98 -21 100 113 -16 15
5574A5j9n3K13nj5o5j46J31q6Q3J6j65R6L5kn1K5j00J2k5qK79k02nk6j1J24K5
$$ 15 -4 -57 156 151 136 71 -75 56 -30 53 69 -96 0 35 33 -18 7 -93 -81 -106 -114 165 -37 -42 -68 -79 45 70
5602G0o2o1J1j05J10R1p0QL1j8nj1J38j24M4m0j24M3N9Pj02kO8J02r8MJ2l8J13
$$ 70 8 -53 -42 -147 -37 54 -16 -8 23 5 0 -11 127 3 47 7 -117 -74 -15 -8 -110 -112 -44 58 -40 -36 -24 -62 51
5631E1n7n3M3r3K3L8L1J00o3P1r3j05J33N1j38J09n5K2L7m4L5j16M1jNPj9L2J6
$$ 51 -6 -59 -16 -109 -86 -48 -17 83 20 91 -2 -107 26 77 -61 48 -7 15 52 8 43 -73 -32 -33 -28 -21 -40 -8 8
5660HM4p7o4M3M9j8j70Q9J11K8j31M9J13k8p3J35p3p4J31l2r3P3j8J0jn1M4N5
$$ 8 52 -25 -89 -46 3 -15 -185 -96 15 43 -88 -39 74 46 -27 108 35 -39 92 60 -33 40 22 32 31 -20 24 79
5688G9j42M6l8N8j0p2N1o0J15q7M6M6j26J03n3j1Q2J1j13J99N6j52l5P5k5n5m2
$$ 79 -63 -17 -55 3 -7 -79 -28 -88 27 -60 -14 32 -94 9 -44 -55 27 38 -75 124 180 28 -7 68 43 -12 -54
5715e4J56o1p7M0N2m9j15L1M2j4mK5n3J66n1p0L9P9j18J04p0j1J08j70O8R2j12
$$ -54 102 41 -36 4 56 7 -108 -77 -35 -49 -53 -28 -81 85 34 -36 3 82 -36 68 -2 -13 95 -75 -7 85 -27
5742b7k4K6l8R7l4R4r7pL6q3j5L4o4lJ66p6J09lj26M2Qjj5j5N5q1P5j2P1J6j32
$$ -27 -51 -25 -63 34 0 94 -3 -10 26 -57 -72 -38 -102 -105 61 -15 94 91 -35 7 15 14 -1 -16 39 -42 33 21 92 108 -24
5773b4M2J08m1n7J1l8jM1N6j84J68j25J20n3K3Qr6Oo7k5K5J58q6J26r0J4K5rJ5
$$ -24 18 126 85 28 39 1 0 41 97 -87 81 -44 76 23 46 54 -42 -36 -103 -128 -103 55 -31 95 5 19 44 35 50
5802E0J8j46J12J03j52j7L2j5J00K4j42M6j1N0m4jRO1j39O4pj68J89O2L2q9k8
$$ 50 68 -78 34 137 -15 -32 0 -15 85 109 -33 13 2 52 8 7 16 77 -62 2 -5 -173 16 78 110 21 -7
5829gr4J24L0Kl2l7LJ06o5J4r7j8O7nlK6o2j7l2R9k2pL1r5PP3j8J16r4j1j1m1
$$ -7 -101 23 53 55 23 -14 -11 95 30 44 -53 -71 -4 -9 -12 14 -48 -65 -97 2 -20 -27 4 -91 -84 -11 -29 87 -7 -18 -29 -70
5861g0J71j01M6J2j27J32l0j8N0K9RMl5k9j63R8M8o6J2nN1j07m4J59L5j33K1j00
$$ -70 101 0 46 58 -69 63 33 15 65 94 103 107 72 43 -120 -22 26 -40 -28 -33 18 -89 -133 26 61 -72 -51 -151
5889a51R1j7M5J34j99J30j29J17J34o7m2L0o5l8M5J2N8L9m9%n2N0K2j87K1P5j4
$$ -151 -60 -77 -32 102 -97 33 -96 21 155 88 46 76 11 -27 18 30 88 127 78 78 26 76 98 -89 -68 7 -7
5916gK9J02j35m2n4J31J9j06M2m1P6Kqj28R4%M5J1M0r9P1j17J23p0M2M6q4p9O4
$$ -7 22 124 -11 -53 -107 24 43 -63 -21 -62 14 16 8 -120 -26 -26 19 30 70 -29 42 -75 48 -22 20 66 -18 -97 -33
5945c3p1J52j22J7O0o6O3l7P8o1p6PM1m3J85l2k1j36K13m2j56K11q2k0r3J20k0
$$ -33 -104 48 -74 -57 3 -63 0 -37 41 -20 -96 -89 -48 -91 94 62 41 -95 118 76 -80 131 49 29 -64 56 36
5972C6l1Pj11P7J02q2N2p0Kk9QP9p7q1K1P4j8m1J72jj88O5J52q2n6L6m2R3j2M8
$$ 36 5 12 -99 -22 80 -2 50 -20 -18 -47 -39 40 -37 -118 -97 -23 -41 -82 90 89 -99 -34 118 36 -20 16 -26 67 55 103
6002A03K0j75K7J09o9p5R2j71M4J04j3J8K8n2j11J37r8J13p8K4MJ02j48J21q6
$$ 103 123 -52 -25 84 15 -60 32 -139 -95 9 -4 14 42 -10 -121 16 -82 31 -47 -23 -19 83 -65 56 -30
6027c0Q9j42P1mJ00l5o6M0M1p6KJ7M0K7j55R0m8M5j05J15p4P0M3j20K3R4j23J14
$$ -30 59 -83 -12 -16 84 49 -17 23 64 -12 -10 7 47 74 -81 9 -39 6 -99 16 -58 12 55 -65 -42 52 -71 43
6055D3o5KnK4k0K9KJ16o9k9j7j75K62o2M0j54NJ06lnk1j02J40mo9J58j56l5P6
$$ 43 -22 -20 -25 -1 -21 8 10 126 57 28 11 -164 98 36 76 -78 -73 33 30 25 4 -98 42 38 -31 127 -29 -64 12
6084A2j27J98j5o6J36p3N7l6p2L7n1M9K0q3R3j03O6P8j78L8J15K1J4j48j9j3J72
$$ 12 -115 83 68 2 138 65 122 86 14 51 0 49 69 -14 79 -24 42 120 -58 -20 95 116 130 -18 -37 -50 122
6111A22j41J5j1OM4o1j2J22o0OJ40j82O4n6J19j07P1j2Lk3j63J47K6p8M2j2Q2
$$ 122 -19 -4 -15 -9 35 -26 -38 84 24 30 170 -12 52 -4 115 8 79 67 70 47 -116 31 57 -21 21 9 91
6138I1l6j7PL5r7n1J5J9N9r8P0j7L7p7N0kq0J43m9J15k52N2J07rM1o7J4oN3R5
$$ 91 55 38 45 80 -17 -68 -53 -34 25 -73 -3 -20 17 -60 -10 -12 -92 51 2 117 -135 -83 24 15 56 -11 3 -3 50 145
6168A45j98OR0J8p9K0m0LP7j13R5m9m4mKP5n1J06j36J58j50onQ6O2K8m5L0o0K9
$$ 145 -53 -47 43 61 -18 2 -38 -35 42 -71 24 -25 -69 -73 -71 4 -47 59 -77 81 -69 -75 -80 6 68 96 51 81 21 50
6198E0LM4l7j64Q5L9J4m3O7l2o0P8p1M0j10N6R7K2j08N4j09P8M9n7lJ2J49j88
$$ 50 53 97 60 -104 -19 20 34 -9 58 26 -34 44 -27 13 -97 -41 56 78 -30 24 -85 -7 42 -15 -18 -6 143 -45
6226d5R5l3J86n8j61L2l2N5J03j66L7m6k8M9N4L5j49K7P3p5L9J08n7p5Jj0J06
$$ -45 50 17 203 145 -16 16 -16 39 142 -24 13 -33 -61 -12 42 77 -72 -45 28 -47 -8 100 43 -32 -31 -41 65
6253F5N1n5o9J71k0n9j04Q1m2qm7O0N0M6j74N1L7rn9l7J06j18M4R8n9m8lK3k8
$$ 65 116 61 -8 163 143 84 -20 61 19 11 -36 24 74 120 -54 -3 34 25 -34 -71 35 -83 -39 59 0 -48 -51 -28 -56
6282e6j8P6P2Om3rL6P%j05K5P5j09k6P0M1j5q2J2NL3N6j09M8o9M4l7m1K02j10
$$ -56 -74 2 74 80 37 28 64 71 71 -34 -9 66 -43 -69 1 42 27 -55 -43 -38 -5 51 -58 -10 -79 -35 -72 -113 89 -21
6312b1q6R9m0MR3l5J1mO9l6m5lJ4j43J81OJ1mn0O0qm4j2r5rK7N2q1J24j0l1J5
$$ -21 -107 -8 -48 -44 49 14 25 21 90 54 9 6 20 -123 58 64 75 71 21 81 73 29 17 -78 -87 -60 -8 -89 35 25 -6 9
6344Io4J16m0J1qn5lJ04m6O8p1n8N3K4l0lj21J47k1j16K41j88O0m6q7M8O8l1j9
$$ 9 -55 61 21 32 24 -31 -34 70 24 92 21 -37 16 40 10 7 -114 33 12 -104 137 -51 9 -37 -124 -76 -8 -39 -58
6373e8n4N8J3N0j3q0J23N7k3N3p5r6K18k29K2N4J09k28O3k%J62j93O3r3L0K6k2
$$ -58 -112 -54 -41 9 -4 -84 39 96 73 126 51 -45 173 -56 -34 20 129 -99 -36 -38 -38 124 -69 -6 -99 -69 -43 -65
6401f5P9r9l9k4O6J33j88L6Q7%n9J87o5n8R7k4j0J4N1p8pj4mL3l3p4pL1N8q1J
$$ -65 14 -85 -124 -148 -82 51 -137 -101 -14 -14 -73 114 49 -9 88 64 54 68 119 41 34 20 16 49 16 -58 -65 -34 24 -57 -56
6432e6K4n1J32k09J82m4k9j61J09N0l9L3Q5m3K6L3l3O8N3l1j08k8J41r2R4n1j18
$$ -56 -32 -83 49 -160 22 -22 -51 -212 -103 -53 -92 -59 26 -17 9 42 9 77 130 99 -9 -37 104 12 106 55 -63
6459f3J71j67J68n8M6j49K5O8j04K1K3O9p0r1N5J12j13K06r0m1k3P3on7n4J19
$$ -63 108 -59 109 51 97 -52 -27 41 -63 -42 -19 50 -20 -111 -56 56 -57 149 59 18 -5 68 62 5 -49 70
6485G0P1n8q5Q9Mq9mk2K9p7M8J19k23J82j8l1N5q3J42q9j08J41q3q2J27m3J2o2
$$ 70 141 83 -2 87 91 2 -2 -24 5 -72 -24 95 -128 54 36 5 60 -23 119 30 -78 63 -20 -102 25 -18 -6 -68
6513f8M7Qk7oJ52m9q1J22m3j97J30N1Lj34j3L1L8j0p0J26j9L7j01P4J24n6n3m3
$$ -68 -21 -13 -40 -46 106 57 -24 98 55 -142 -12 39 42 -92 -105 -74 -36 -46 -116 10 -9 28 -73 1 125 69 16 -27
6541b7N5n4L6MM3j5j21J36j21M3J46j55n1J34k5jr1N1M6J4k6o9O7j05L6L5L1j
$$ -27 28 -26 10 14 57 42 -79 57 -64 -21 125 -30 -81 53 28 27 -64 -13 33 47 21 -48 19 -86 -50 -15 16 15
6569A5o0m5jN2L4O4n5n2rJ26n2K7N1j03Rmn5J49j42Lr2J58k7OK4l3O2j24R0q4
$$ 15 -45 -90 -91 -39 -5 59 4 -48 -57 69 17 44 95 -8 1 -3 -58 91 -51 -48 -140 18 -9 -3 21 -12 50 -74 16 -68
6599f8K0OR3j15L7j05J11l5K1jkJ07k3m1l6L0j6J37j18O7j7j69J11N3Lr0J39j85
$$ -68 -48 -42 51 -64 -27 -132 -21 -56 -35 -36 -38 69 46 5 -31 -1 -17 120 2 69 52 -117 -6 47 50 -40 99 -86
6627h6J33j24P0l2l4j2J22n4m9J13q0M6qK3j0o5J92k27P4j3J0K8N5j09k8l7K38
$$ -86 47 -77 -7 -39 -73 -85 37 -17 -66 47 -33 13 5 28 18 -47 145 -82 -8 -21 -11 17 72 -37 -65 -102 136
6654A36o3k6q9PN6%j2p2L7j7p5J06J1K3j5j12J25RJ10j35J4M0j17N8J63j81L7
$$ 136 73 47 -42 -35 21 21 9 -63 -26 -43 -118 -12 -1 22 7 -105 20 29 139 4 18 58 -59 -1 162 -19 18
6681A8j7OL4Q0j52J0ml5L2RJ6mk2n5O3lJ20j00p3m4J51l4K8O7o9KjR7n0l3k9m0
$$ 18 1 7 41 121 -31 -21 -25 -60 -28 -19 -3 -7 -29 -84 -21 -24 96 -4 -77 -121 30 -4 24 91 22 24 23 120 70 37 8 -32
6713c2P0Mm9k7O0p1L8p1M5nJ17r7Mo8J23K0j27k3k8J51n6K5L9l5j55J89K6p7J40
$$ -32 38 42 -7 -34 26 -45 -7 -78 -33 -38 79 -18 -14 -82 41 61 -66 -89 -117 34 -22 3 42 7 -148 41 67 -10 130
6742A30j69Q4j6l9o1J16Rj06J00q2J6l0j6j8M9J2L6l8m4p0L1J13Kl2N6l7m3M8
$$ 130 -39 45 29 -10 -71 45 54 -52 48 -34 -18 -48 -64 -82 -33 -21 15 -23 -67 -137 -106 7 9 -23 33 -4 -47 1
6770AO4p4J44o0lm6O5k05Q9O0n8R0M1k3p9Om3j4J15l8j3n3j80R6Q7P7O9j06j21
$$ 1 65 -9 135 75 72 26 91 -114 -25 35 -23 67 108 85 6 12 -31 -45 70 32 19 -34 -214 -118 -31 46 115 9 -112
6799a12J11J33r8j2K2o3jm5J15m8J09j32l9J18l1M0j23N2j11J9J02mpo0j1j0J1
$$ -112 -1 132 34 22 44 -19 -20 -65 50 2 111 -21 -60 58 27 67 -56 -4 -115 -96 6 2 -5 -65 -76 -86 -75
6826g5O0o7J00p3J34k8k5J2j17J0k0J79j2r4O6k1O6J00j43l1j4Nn0l1J94p5l6
$$ -75 -15 -82 18 -55 79 51 26 38 -79 -69 -89 90 78 -16 50 29 95 195 52 21 7 12 -38 -69 125 50 14
6853A4o4Jj4N7j8K8L5m4NrN3l6pnO6j00O6L9k0Jj05m9J39K2lk4k3%PO9r5m1N8
$$ 14 -50 -49 -63 -6 -24 4 39 -5 0 -9 44 8 1 -4 62 -38 28 67 47 48 -57 -106 33 55 52 28 5 5 12 81 -14 -55 3
6886CJ1q0O5k9j9M0k0K9Ol1rq2J37j9o6QK9n7R9L0p7J24p7k4n2K62j17K1Mo5m6
$$ 3 14 -66 -1 -30 -49 -9 -29 0 6 -25 -34 -116 21 2 -64 -56 -27 -84 15 45 -32 92 15 -9 -61 201 84 105 109 44 -2
6917bQ1q0P2m2o8L9l8mlpM2j9P9k1q0J48r9J00p6P0n3k8j5N2o2pL3m5l3J18j61
$$ -2 79 -1 71 29 -39 0 -38 -42 -45 -52 -10 -29 50 29 -51 97 -2 98 22 92 39 11 -4 48 -14 -21 12 -33 -66 52 -109
6948a09Ml9J47j5K4kn0k7J46q7K0Oo2N2J5M4m8lM9k2N7j24J36j90J36oK4l7K7
$$ -109 -105 -144 3 -12 12 10 -40 -67 79 -8 12 18 -44 8 23 67 19 16 65 43 100 -24 112 -78 58 52 76 39 66
6977F6l8m5j3J07j14L8l3l4Q5o4QQ2o6J5J09j16P2j58L8J12m6LM4j2o6L3n1Q6
$$ 66 28 -17 -30 77 -37 1 -32 -66 19 -45 -37 45 -21 -6 103 -13 59 -99 -61 51 5 8 52 40 -26 7 -44 42
7005D2N6m2m5lML4l5N5l0j33P6l8J8L4M0j00M7q8J19L1j10N6m2L8J15nk1j03k9
$$ 42 98 56 11 8 12 46 11 66 36 -97 -21 -59 -41 -7 33 -67 -20 -108 11 42 -68 -12 -54 -16 99 94 73 -30 -59
7034e9Q5o3R9o9M1N2l6j1k3p8M5J8q6Q3p1J2PnN4l4N5N1j14KN2j7q2O3L8j0p5
$$ -59 26 -37 62 -7 34 86 50 39 16 -62 -17 1 -85 -2 -73 -61 -54 -59 -5 -39 16 67 -47 -45 7 -10 -92 -29 9 -1 -76
7065g6K04k6N1j92Rl1K20q4kl5m6n8nQR7l2m1O4j40O7J18j56P7l2pJ27o5N8o0
$$ -76 128 102 153 -39 -30 -61 159 75 73 38 -8 -66 -71 -63 34 2 -39 25 -115 -48 70 -86 -9 -41 -48 79 14 72 12
7094A2j00J69k0r3J69j17l1M0l5O9j76J35N6o7k2QN0j19j1l1P2P9Jo3L6o3m9J31
$$ 12 -88 81 61 -32 137 20 -11 29 -6 63 -113 22 78 11 -11 -3 47 -72 -83 -114 -42 37 38 -25 11 -52 -101 30
7122C0J0q7Q5l9m5J1L9Q5n9l3Pq4J67J6m3n7k1J7k5J20j16P4j28P9m0J9N7j80
$$ 30 40 -47 38 -1 -46 -35 4 89 30 -3 4 -80 87 103 60 3 -18 -1 -26 94 -22 52 -76 3 -37 -18 39 -141
7150a41l9J37J28q5o6pM0P9J41k39M0L0q4J09K2m6M2M8j91J19n2l4O9o6M5q0J31
$$ -141 -180 -43 85 0 -66 -73 -33 46 187 -52 -12 18 -66 43 65 19 61 109 -82 37 -15 -49 20 -46 -1 -81 50
7177E0q0ml2J35j54L7J18o2j24J1j8J05N5l5m8M7m4qJ78j09O9n6O1j02J8M0j22
$$ 50 -30 -34 -66 69 -85 -48 70 8 -116 -105 -123 -18 37 2 -46 1 -43 -51 127 18 87 31 92 -10 8 48 -74
7204g4J23j31Q0J0O4j19l3M0LJ15j69RK9j4r7K65j52M4J0m5J0l2J27o4%o5R3n8
$$ -74 49 -82 -2 8 72 -47 -80 -40 -37 78 -91 -82 -53 -67 -164 101 -51 -7 3 -42 -32 -64 63 -1 -1 -66 27 -31
7232c1N1l9N2j0k7k2J01m7M2j56lJ06OJ2k2M2K3j25P1K1N9j42n9N9R9qj6k8k2
$$ -31 20 -19 33 23 -4 -26 75 28 70 -86 -89 17 23 35 13 55 78 -47 24 45 104 -38 -97 -38 61 53 37 9 -13
7261a3P9J9o0n7r4Q8K0k4N2l0Q9o1o8K3rL2l0k4M3l9O1k8n0O5QJ2Q6j35K1Q8j08
$$ -13 66 85 25 -32 -126 -38 -18 -42 10 -20 69 8 -60 -37 -46 -14 -44 -68 -25 -64 -3 -31 -81 -16 -8 4 90 -45 -24 64 -44
7292d4K7J6J2pl9m2Q0P2Nj17RP4n4n1N3r4J31j09J10j54P2RQL5q8M1J6NK20k80
$$ -44 -17 -1 11 4 -35 -77 3 75 80 -37 -28 46 -8 -59 -6 -100 31 -78 32 -122 -50 -41 -33 2 -86 -45 -29 -24 196 -84
7322h4N0L8m1N8j5n5Q1L0Njj54O2j7O8j3Q5m4R8k47k7J54n0P7l7o7J80j23j0q3
$$ -84 -34 4 -37 21 6 -49 32 62 67 66 -88 -26 -43 25 12 97 53 151 -96 -123 31 -19 58 21 -46 134 11 1 -82
7351h2J56p6M3j9O6p2j5K8j15P9m8J53j05k0O0o3j7P2Ok8m8M8k4K1nOr0K9P4J6
$$ -82 74 -2 41 22 88 16 1 29 -86 -7 -55 98 -7 -27 33 -30 -47 25 31 3 -45 3 -21 0 -5 1 -89 -60 14 30
7381C0k1j17O6L2MJ56j26M7Q9j54J6Q9r4n9J25j08j8M2j9J5n4R9K1q0p0J6Q1j70
$$ 30 9 -108 -42 -10 -6 150 24 71 160 6 22 111 17 -42 83 -25 -43 -1 -20 -5 -59 40 61 -19 -89 -73 8 -162
7409a62J92k4Q4j11J5l6K5J70l0j59P0k4n0J91k12O6Rp5l9M7J32o0m1l6k5N2M9
$$ -162 30 6 90 -21 -6 -42 -17 153 123 -36 34 10 -40 151 -61 5 14 -61 -100 -53 79 19 -22 -58 -83 -31 18
7436A8k8N1l1L9q5Ll4J07m6J9P2j20nP8Jj11O1J33q4kr5J52q7l4M6M7Ln1k5k6
$$ 18 -10 41 10 49 -36 -33 -67 40 -6 13 85 -35 -40 38 39 -72 -11 122 38 36 -59 93 6 -28 18 65 68 17 -8 -34
7466c4j3lP3m2j6j4lJ5j7kP6r5J10P2j18o0J49Mk4l4r1L8K3l9m3O0P1O5o9j30
$$ -34 -47 -50 23 -19 -35 -49 -52 -37 -54 -56 20 -75 35 107 -11 -71 78 82 58 24 -67 -29 -6 -45 -88 -28 43 108 39 -91
7496i1O3O1m7J19n6j21M6P1jLq0j22J95j12Q2K2p2J7o7J39RN9j59J00o7J30m3
$$ -91 -28 33 -14 105 49 -72 -26 45 44 47 -33 -155 40 -72 10 32 -40 -23 -90 49 58 117 -42 58 -9 121 78
7523G8m7q3L1k3L5rL5Nl5j28N2M0P4J4j33R5p2J16Q2j43l6p0J12m0Kjk4O0j0R9
$$ 78 31 -52 -21 -44 -9 -18 17 22 -13 -141 -89 -49 25 39 -94 1 -71 45 127 -16 -52 -122 -10 -50 -48 -49 -73 -13 -23 76
7553G6jM5r2J9K6O7j29n0O7o3k1Q9J9mj1j29J43r6N5M9j00L2Q8m3j4lk5l2j3J29
$$ 76 75 120 28 47 73 140 11 -39 28 -35 -56 33 52 48 37 -92 51 -45 10 59 -41 -9 79 36 22 19 -6 -38 -51 78
7583G8oM1n9j5N0q4l6N7L0r3L1j6J9RK4p3j00J55o0k0N5j29J7J14L8J7p1k6L3
$$ 78 72 113 54 39 89 5 -31 26 56 -37 -6 -22 -3 6 30 -43 -143 12 -48 -68 -13 -142 -125 -11 27 44 -27 -53 -20
7612b0o5J25P3L4p9j52QM9J22r1N4j02%J57j70O5J8q3jJ26l3O5j08n4M2o5J67
$$ -20 -85 40 113 147 68 -84 -76 -27 95 4 58 -44 -44 113 -57 8 26 -57 -58 68 35 100 -8 -62 -20 -85 82
7639H2j2Jr7r6J58L2k4j16Q0j33J39M4N1j34Mq3N3L5J6m4o6R2J4R2n9q0P9l4o3
$$ 82 70 71 -26 -122 36 68 44 -72 8 -125 14 58 109 -25 -21 -104 -51 -16 0 -44 -110 -18 -4 88 29 -51 28 -6 -69
7668f9O6K8nK7k18J41O8Np7J01r6P9O8k3l9j61J44m2m1J47j04P2j79K2N8K7P2
$$ -69 -3 25 20 47 -171 -30 38 43 -34 67 -29 50 118 95 56 -105 39 -3 -44 103 -1 71 -108 -86 -28 -1 71
7695G1j53j17J54N9P9l3j33O5o5O7J2j9L5j0lP3r0P4rr2N1ON1KPm1M5j54N7N8
$$ 71 -82 -199 -45 14 93 60 -73 -8 -73 -6 6 -13 22 12 9 82 -8 66 57 -35 16 22 73 75 82 41 86 -68 -11 47
7725D7j07O4j9L9L1l3N8k4J4p9K5k5MM8q1P4j97J42j3M2j10J53j81J89JM8p0J3
$$ 47 -60 4 -15 24 55 22 80 56 70 -9 16 -9 -5 43 -38 36 -161 -19 -32 10 -100 53 -128 61 62 110 40 53
7753E3r4Q5j39J18k7J02j49O3l7K9O0lj4n1p3J36j00l3M9jJ52p7N5j23J9pP5m9
$$ 53 -41 44 -95 23 -4 98 -51 12 -25 4 64 61 47 -4 -77 59 -41 -74 -25 -26 126 49 104 -19 0 -7 68 19
7781A9j2O5j00j2k2J41l0K8o3n5j6J18m4p3J06n6j5j71K64K0j3l7Jk4r0J87k3
$$ 19 7 72 -28 -40 -62 79 49 77 14 -41 -57 61 17 -56 50 -6 -21 -192 72 92 79 42 43 19 -71 116 93
7808I3M7j57J45j01R1j01K5J18j34pO6n2j12R7J6l1jrr9NL8J6J32j6m6j8q0m0
$$ 93 140 -17 128 27 118 17 42 160 26 19 85 33 -79 18 34 3 2 -7 -106 -101 -63 -47 85 69 23 5 -75 -115
7836a15J44Jl3k7j2m6J29M5Qq8pJ8N7r5P7o7p4P2O0k6m4l3Q7j43P0O4o3Q3j0j15
$$ -115 29 30 -3 -30 -42 -88 41 86 94 6 -1 17 74 -21 56 -11 -85 -13 47 21 -23 -56 31 -112 -42 22 -41 42 32 -83
7866h3J4J18M1j04q9P1M6K7nl4q5J21n1M7J32j18j06L0k2%K7J1Q3Oj37J77j42
$$ -83 -69 49 90 -14 -103 -32 14 41 36 2 -83 38 -13 34 166 48 -58 -28 -50 -50 -23 -12 71 77 -60 117 -25
7893b5R7j88m4J82J9J5J7j77K8Q8m3N4k7Pn1k5O4P4r3R4k52J42O1P3q3r0pJ17
$$ -25 72 -116 -160 22 41 56 73 -104 -76 12 -31 23 -4 3 -48 -73 -9 65 -28 66 -186 -44 17 90 7 -83 -90 27
7921B7j5M8k4n4k1J7N2n9oO7n7l9J19J7q0J04j01j91J53J15K3Pr8J4l7J46K3j09
$$ 27 12 60 36 -18 -39 -22 30 -29 -35 32 -25 -64 55 72 -8 96 -5 -196 -43 72 95 102 4 18 -19 127 150 41
7949D1j17J7P4L4j2l8k6M4j33P0K6p8R9K1q6O8O0o7K9M9q3m2J52j45P4L6j11M2
$$ 41 -76 -59 15 49 37 -1 -27 17 -116 -46 -20 -98 1 22 -64 4 64 -3 26 75 -8 -50 102 -43 31 67 -44 -2
7977bm6J46n5q3k2N2J9rj2p5K6l0K19j70L9m5j04K34O1j29l9k1lJ9R9p4Q7r1n0
$$ -2 -48 98 43 -40 -62 -10 9 0 -12 -87 -61 -91 128 -42 -3 -48 -152 82 143 14 -25 -46 -49 -30 69 -5 82 -9 -59
8006e9LL2J29k9j46O2K6NmJ21r9r9QJ67j02o6M1qq9O7L3J54j13o4p4J09L4Nm7
$$ -59 -56 -24 105 76 -70 -8 18 23 19 140 41 -58 -50 117 15 -51 -10 -18 -107 -40 -7 147 34 -30 -104 5 39 44 -3
8035co9M9L6o2P3k6r4R8K4l1R1n3p7q6R3Q0q0R3j26Q9o4O9l1K4K1j00K1L5P6j03
$$ -3 -72 -23 13 -49 24 -2 -96 2 26 -5 86 33 -44 -130 -37 43 -37 56 -70 19 -45 24 -7 17 38 -62 -41 -6 70 -33
8065c3J05j01P2k0J20j25r6k2P2J1K4Q7k6J5j44J34lr6p6O9O8oj18P0M9M3j34
$$ -33 72 -29 43 23 143 18 -78 -100 -28 -17 7 94 68 83 -61 73 70 -26 -102 -33 35 29 -89 -19 30 73 -61
8092f1j1O7N8PK4j01o2J03J42j06n9M2j4l6M0rK5j11J16j36J11p6N7r9MP1ON9
$$ -61 -72 -5 53 60 84 -17 -79 24 166 60 1 43 29 -7 33 24 49 -62 54 -82 29 -47 10 -89 -85 -14 -8 51
8120E1l7l7kO3l3r7R1Q1j73O4K1m0J14Nj31R0j2j5J2m5K6pllK0M5qp0O4Km2J1
$$ 51 14 -23 -25 38 5 -92 -1 80 -93 -29 -8 -48 66 71 -60 30 18 3 15 -30 -4 -11 -14 -17 3 48 40 -30 34 36 -6 5
8152El4O7j33J33q1O8q8M6k3KO6J39p2n0j25L8L6O6j9p2O9q0J19j08R6K0j31O
$$ 5 -29 38 -95 38 -43 25 -63 -17 -40 -38 28 167 95 45 -80 -42 -6 60 41 -31 38 -42 77 -31 65 85 -46 -40
8180d0j09J48pN6j14Q2o1J00k3KL
$$ -40 -149 -1 -8 48 -66 16 -45 55 32 34 37
8191C7
$$ Imaginary data points
##PAGE= N=2
##DATA TABLE= (X++(I..I)), XYDATA
0@%%%%%%%%%%%Qj6J6j6K4l2M0m8N6p2Q8j04J20j36J60j84K08k41K81l23L66m19
$$ 0 0 0 0 0 0 0 0 0 0 0 0 8 -8 8 -8 16 -16 24 -24 32 -40 48 -56 64 -72 88 -96 112 -129 152 -171 195 -224
33b24M75n34O03o80P62q52R51j060J178j309J453j606J775j960K160k381K623
$$ -224 251 -283 320 -360 402 -450 501 -559 619 -690 763 -843 932 -1028 1132 -1249 1374
50A374k887L181l507L868m271M724n240N830o510P310q263R421j0867J2728j5225
$$ 1374 -1513 1668 -1839 2029 -2242 2482 -2758 3072 -3438 3872 -4391 5030 -5837 6891 -8334
65h334J8767k4217L3755n5132J85431k8427l01377K08204q0070j01061K70754
$$ -8334 10433 -13784 19971 -35161 150270 121843 -179534 28670 -51400 -152461 118293
76A18293O8921k79749K9742O4472q6351J14844J17562j69508m2643M7334n9276
$$ 118293 187214 -92535 -62793 1679 -84672 30172 147734 -21774 -64417 -17083 -76359
87g6359P9304J10294j27051k9503P2518o8028K0559J07923j07005o9262J07277
$$ -76359 2945 113239 -13812 -43315 29203 -38825 -18266 89657 -17348 -86610 20667
98B0667J815k0726Q0275o7074j06245O7392M0549p36O4887p0410j07630O8391
$$ 20667 22482 1756 82031 14957 -91288 -23896 16653 15917 80804 10394 -97236 -28845
110b8845L1548J792J10385o5726j74614O9578O9780n6167J15186N1578k09709
$$ -28845 2703 4495 114880 49154 -125460 -55882 13898 -42269 72917 124495 -85214
121h5214j8657J40827o2560K1520J36225j42588j16991J49840M688o0118J23184
$$ -85214 -103871 36956 -25604 -4084 132141 -10447 -127438 22402 27090 -33028 90156
132I0156l4501j59766P6240P7224p2534M3988L8906j10826O428Q7300l6423n274
$$ 90156 55655 -104111 -27871 49353 -23181 20807 59713 -51113 -44685 42615 6192 918
144I18K7885p2368j601P5752j9239o305K1238o6811p910Q0930r087k5578K4563
$$ 918 28803 -43565 -45166 30586 11347 5042 26280 -40531 -48441 32489 23402 -2176 22387
157B2387m8973l1418P9808K1968l4216J4025l9303m5236O8153K9016k8994K7682
$$ 22387 -26586 -58004 21804 43772 9556 23581 -15722 -60958 7195 36211 7217 34899
169C4899l5693o6633O8645M2246n2096K9892O107r4890L2128Q8922n4930j2875
$$ 34899 -794 -67427 1218 43464 -8632 21260 27367 -67523 -35395 53527 -1403 -14278
181a4278N8503p3538l4844J02009j2824n6863N6421j5849o1654O4632K9508n9075
$$ -14278 44225 -29313 -64157 37852 25028 -31835 24586 8737 -52917 11715 41223 -17852
193a7852J8399J8138m8569K5291M2694m2480m808K6320l4968Q233M3301l4085
$$ -17852 547 18685 -29884 -4593 38101 -4379 -9187 17133 -17835 -9602 33699 -386
205c86j7054K7821k3287k966M1402j7674k6278J9483r342r519L4002l589k7248
$$ -386 -17440 10381 -12906 -15872 25530 7856 -18422 1061 -8281 -17800 16202 12613 -14635
218a4635J5728l524j6940L2675L984l0870J8177J932k7564K9302J4539l5035J3721
$$ -14635 1093 -2431 -19371 13304 17288 -13582 4595 6527 -21037 8265 22804 -12231 1490
231A490J6339l4329J0487L0881l1346o117L3842k5549j7017L7975j4241k3682
$$ 1490 17829 -16500 -6013 24868 -6478 -12595 21247 -4302 -21319 16656 2415 -21267
243b1267L4771o351l0336K7032L892k5953K2904J0340l0162Q973J7006k0593Q161
$$ -21267 13504 7153 -23183 3849 7741 -18212 4692 15032 -15130 -6157 10849 -9744 -1583
256a583K1316k4582o307K1455j2844m65K2620j8037j4462J8077m524m105J8072
$$ -1583 19733 -4849 -11156 10299 -2545 -3010 19610 1573 -12889 5188 664 -3441 14631
269A4631r760j9489J1024M803n317J4048k187k3977O498J1827p058J2748L876
$$ 14631 4871 -14618 -3594 1209 -4108 9940 7753 -16224 -9726 2101 -4957 7791 11667
282A1667k6198N77J6868k994P844O948k1837r048J6592N112K634P867j6310j7993
$$ 11667 -14531 -13954 2914 -80 7764 14712 -7125 -16173 419 5531 8165 16032 -278 -18271
296a8271J5221J1357j219P567j2411k2434J0437J5971J635M093r757k1451K537
$$ -18271 -3050 8307 7088 14655 2244 -20190 -9753 6218 7853 11946 2189 -19262 -16725
309a6725J9472P329n66o375j8902m728K1415J2741j629o550j8266o376J8927J5146
$$ -16725 2747 10076 9510 3135 -15767 -20495 920 13661 12032 5482 -12784 -19160 -233 14913
323A4913J908q466j8812q098J4840J8889L738j0812j6456j1128J0354K2380N564
$$ 14913 16821 8355 -10457 -18555 -3715 15174 18912 8100 -8356 -19484 -9130 13250 18814
336A8814j1044j6862j3302Q972K2172R508q220j9101j3245P838K0106J3991n930
$$ 18814 7770 -9092 -22394 -13422 8750 18258 10038 -9063 -22308 -14470 5636 19627 13697
349A3697k1030j3596N678K0976J6554n462j9217j5832J441K1372J8213l442j9949
$$ 13697 -7333 -20929 -15251 5725 22279 16817 -2400 -18232 -16791 4581 22794 19352 -597
362e97j8247J682J8355J8464J902k1445k1233J664J6011J9139N876k0051k2960
$$ -597 -18844 -17162 1193 19657 21559 114 -21119 -19455 -3444 15695 21571 1520 -21440
375b1440m89J6566J9094P563j4749k5694m835J9840J7398Q062q415k7936r676
$$ -21440 -21929 -5363 13731 21294 6545 -19149 -23984 -4144 13254 21316 12901 -15035 -24711
388b4711K0863J7701P483n077k5704j6281J7329K2747M866n970j8208k0819J0655
$$ -24711 -3848 13853 21336 16259 -9445 -25726 -8397 14350 19216 13246 -4962 -25781 -15126
401a5126K8406N563q843j4572k0862N839K9020J0649r445j5174j7237J764K5652
$$ -15126 13280 18843 10000 -4572 -25434 -19595 9425 20074 10629 -4545 -21782 -20018 5634
414E634J7558q815j8356j4884k96K3138K0515n786j8053j8071l064K2900J8994
$$ 5634 23192 14377 -3979 -18863 -19159 3979 24494 18708 655 -17416 -20480 2420 21414
427B1414k276j4299k1932o629K2386J9583j605j0434j8750j4789J8410K7175l775
$$ 21414 19138 4839 -17093 -23722 -1336 18247 16642 6208 -12542 -27331 -8921 18254 14479
440A4479j2303p391j7430O863L3357Q38j9295l392r938j831K9664J1137k3090
$$ 14479 2176 -5215 -22645 -15782 17575 18413 -882 -4274 -14212 -16043 13621 24758 1668
453A668r860K53m555J9650K0590k1308j9750M870j415J2020K3396j4692k6634
$$ 1668 -8192 -7939 -12494 7156 27746 6438 -13312 -8442 -9857 2163 25559 10867 -15767
466a5767J541M692P766K1569k970k9246q069J1340P131J4653O746k2427j6960
$$ -15767 -14226 -9534 -1768 19801 16831 -12415 -20484 -9144 -2013 12640 19386 -3041 -20001
479b0001P234J2733J3463L134j3799j2829l889R123J9849J735j6164n837k187
$$ -20001 -12767 -34 13429 16563 2764 -10065 -13954 -4831 15018 16753 589 -5248 -7435
492g435k069J7580J2205k1206j1604J1382n244K365K2606j3019k5021J4395P771
$$ -7435 -9504 8076 20281 -925 -12529 -1147 -6391 -4026 18580 5561 -19460 -5065 2706
505B706q796J4889K038k6302K526J9557m982K386Q923k1299q877K3377J561n254
$$ 2706 -6090 8799 10837 -15465 -12939 6618 1636 4022 12945 -8354 -17231 6146 7707 2453
519B453J1195j4904j8445K0320J2030j0253N420j684k2786M553K3166l625p384
$$ 2453 13648 -1256 -19701 619 12649 2396 7816 6132 -16654 -12101 11065 7440 56
532E6N294j2061j0620J6879J0889p854l564j192n470j05J0641P416q999o913O202
$$ 56 5350 -6711 -17331 -452 10437 2583 -981 -2173 -7643 -7748 2893 10309 1310 -5603 599
547E99j143m164J0566L251j3202J399J0378q859l198J2819p567q703J5363j821
$$ 599 -544 -4708 5858 9109 -4093 -2694 7684 -1175 -4373 8446 879 -7824 7539 5718
561E718j4614R093K680j1675R716Q616j4204j639Q370q903J445J5685q186r621
$$ 5718 -8896 197 2877 -8798 918 9534 -4670 -6309 2061 -6842 -5397 10288 2102 -7519
575g519J0098m870o867J6071J759j2521N591J859j0465N656J0352p273k694O803
$$ -7519 2579 -2291 -9158 6913 8672 -3849 1742 3601 -6864 -1208 9144 1871 -823 5980
589E980o955o510Q944K818m571K355M64o548l653N116O568k540k267L090p517
$$ 5980 -975 -7485 1459 4277 -294 2061 2525 -4023 -7676 -2560 4008 1468 -799 2291 -5226
604e226o526J3005P299r400J148L652j2529J54J8430k522j0394P744m358j0931
$$ -5226 -11752 1253 8552 -848 300 3952 -8577 -8423 10007 7485 -2909 4835 477 -10454
618a0454J3687P273j1562J929K428j0473M810J0840q407m136O744o473j950J2495
$$ -10454 3233 10506 -1056 873 3301 -7172 -2362 8478 71 -4065 2679 -3794 -5744 6751
632F751n510j0585R709N56p120J0909J889j5065J540J0649k648R70O458r239r760
$$ 6751 1241 -9344 365 921 -6199 4710 6599 -8466 -6926 3723 1075 2045 8503 -736 -10496
647a0496R172P621j109J548m313r896K44R285O727j844o950n084l228L326J1281
$$ -10496 -1324 6297 5188 6736 2423 -7473 -7229 2056 8783 6939 -11 -5095 -8323 -4997 6284
662F284K611r269o063n60Q90P158Q594o543j0503K073K482J602R761j260j2941
$$ 6284 8895 -374 -6437 -6997 -6107 1051 9645 3102 -7401 -5328 -2846 -1244 8517 7257 -5684
677e684R1N921K24N715K513j1646n271Q846L362l17L461p607j0892P955Q773k136
$$ -5684 -5593 328 552 6267 8780 -2866 -8137 709 4071 3754 7215 -392 -11284 -3329 5444 3308
693C308R64m200j1360K918J2782J828l816k603p870l029J2335Q633n015n053m900
$$ 3308 4272 72 -11288 -8370 4412 6240 2424 -179 -8049 -11078 1257 9890 4875 -178 -5078
708e078m070Q237J0961j270p652n745k205M817R609K877q087p907j500L486Q205
$$ -5078 -9148 -911 10050 8780 1128 -4617 -6822 -2005 7604 10481 2394 -5513 -7013 -3527 4678
723D678M237n979q533l544M499Q201L220l527p801n383M385Q836L928k940p300
$$ 4678 8915 2936 -5597 -9141 -4642 3559 6779 3252 -4549 -9932 -5547 3289 7217 4277 -3023
738c023m895K368Q732O225l936p518l434J66P493Q220l489q814m131R58N620P389
$$ -3023 -7918 -5550 3182 9407 5471 -2047 -5481 -5315 2178 10398 6909 -1905 -6036 -5078 542 7931
754G931m22r284o544K320N083O351K054q801q001K400N181O148L339o619r156
$$ 7931 7509 -1775 -8319 -5999 -916 5435 7489 -1312 -9313 -6913 -1732 4416 7755 1136 -8020
769h020M25O724N817K847l829r241k333P229N628K622k143r364l973N954O234
$$ -8020 -7595 -871 4946 7793 3964 -5277 -7610 -381 5247 7869 5726 -3638 -7611 -1657 4577
784D577K355k335p353m983L351P507K821k863o166n206K849P438L092j640n647
$$ 4577 6932 4597 -2756 -7739 -4388 3119 5940 3077 -3089 -8295 -5446 1992 5084 3444 -2203
799b203n660K754O965L702o56n673n319J839O593M200q31m717n697k96O865M692
$$ -2203 -7863 -5109 1856 5558 4902 -771 -6090 -4251 2342 6542 5711 994 -4703 -4999 1866 6558
815F558j549l837n522j752O029M887o23l495n391j950M580N421N04l486m357k075
$$ 6558 5009 1172 -4350 -6102 -73 4814 4191 696 -4695 -6645 -2065 3356 3860 374 -3983 -6058
831f058L279O159J149l368l545k777K980O272J151k725l188l076J847N530K015
$$ -6058 -2779 3380 4529 1161 -2384 -5161 -2181 4091 5242 2517 -671 -3747 -1900 3630 5645
846E645l036l922j811L74M324L185k664m018j755r2L881L208j999l221k227L95
$$ 5645 2609 -1313 -3124 -2750 1574 4759 2095 -1923 -3678 -3770 111 3319 1320 -1901 -4128 -3733
862c733L623K679n53k827k363L11L050L284k85l283j160q5J250L708L00l446j665
$$ -3733 -110 2569 2016 -811 -3174 -2863 187 3471 3186 -97 -1257 -1342 -92 3616 3916 470 -1195
879a195%R13K584O78k455k579q7J213J404J156j654k785L90R22J078J610j105
$$ -1195 -1195 -282 2302 2980 525 -2054 -2141 -928 476 1632 -22 -2807 -2417 -1495 -417 1193 88
896H8k128L88P71J044J169R8j848o63J874O03n74J263p13k256J406J339j212l44
$$ 88 -2040 -1652 -881 163 1332 1430 -418 -1081 793 1396 822 2085 1372 -884 522 1861 649 305
914C05M83j071o08J143L23j715J61Q39j144K75Q81j141o2P63L15r9p4J92P1J03
$$ 305 788 -283 -891 252 575 -1140 -979 -140 -1284 -1009 -128 -1269 -1331 -568 -253 -352 -426 -234 -163 -60
934f0R07N6n44J73m5P37M9n08l2p93M79R75n08n53o27j304R61J601p68q24l24
$$ -60 847 903 359 532 487 1224 1273 765 733 -60 419 1394 886 333 -294 -1598 -637 964 196 -628 -952
955i52j586J90L154O14k658J35Q0k117L348L732l660j471J730k072O93N016r98
$$ -952 -2538 -2348 806 1420 -1238 -1103 -1023 -3140 208 3940 280 -1191 539 -1533 -840 4176 3178
972C178m291P85P07j472L067K393m948j549K128j093J297K638l249k787J568P71
$$ 3178 -1113 -328 379 -1093 1974 4367 -581 -2130 -2 -1095 202 2840 -409 -3196 -1628 -857
988h57O10J659j416l335R34K501L48J167n19l523P0L082J584M38j315k521r21
$$ -857 -247 1412 -4 -3339 -2405 96 444 1611 1092 -2431 -2361 721 2305 2743 1428 -1093 -2014
1005b014J827L257J265l175k690m05L34K514L355k077n576n8K143k17L595K000
$$ -2014 -187 3070 4335 1160 -1530 -1935 -1601 913 4268 2191 -3385 -3443 -1300 -1517 2078 4078
1021D078o850k613M548R0Q65M178l923n514L555L463j443K476N8o197N60N643
$$ 4078 -2772 -5385 -837 -747 118 4296 373 -5141 -1586 1877 434 2910 2968 -3229 -2669 2974
1037B974r49j54J114m752j224M696P48j386m1l151j959M281K602k358r65j598
$$ 2974 2025 1871 2985 -1767 -2991 1705 2453 1067 1026 -2125 -4084 197 2799 441 -524 -2122
1053b122k502L253M395j052k267k196j470K586L832J182j494m149j660L311K722
$$ -2122 -4624 -1371 3024 1972 -295 -2491 -3961 -1375 2457 3639 2145 -2004 -3664 -353 2369
1068B369R50O65l607m807K805M907j331K25M80o727p32P568n56l047K536l642
$$ 2369 3319 3984 377 -4430 -1625 3282 1951 2176 2656 -4071 -4803 2765 2209 -838 1698 -1944
1084a944m021O130L249m537K03R27m327K854N837l748k317K274k699Q02O185k024
$$ -1944 -5965 165 3414 -1123 -920 7 -4320 -1466 4371 623 -1694 580 -2119 -1317 4868 2844
1100B844m155J224q31l12N229M52n553q11R50q14L697K542m932k773O06K45L050
$$ 2844 -1311 -87 -918 -1230 3999 4451 -1102 -1913 -963 -1777 1920 4462 -470 -3243 -2637 -2392 658
1117F58K535k833k764q77L29L627K402k168j685r17j164L377L853k821k251J419
$$ 658 3193 360 -2404 -3281 -2952 675 3077 909 -776 -1693 -2857 520 4373 1552 -699 720
1133G20k507N81N942j859m875K445l90k349M747J085n939K68K678k537J792L392
$$ 720 -1787 -1206 4736 2877 -1998 447 57 -2292 2455 3540 -2399 -2131 547 -1990 -198 3194
1149C194n047k193M114q74m0M073l396m024L739J117p82L260j106n095J721L223
$$ 3194 -1853 -4046 68 -806 -846 3227 -169 -4193 -454 663 -119 3141 2035 -3060 -1339 1884
1165A884j173J751Q57m949p42L648l48L75J336l622j804K126N33P94P30k598j687
$$ 1884 711 2462 3319 -1630 -2372 1276 928 1303 2639 -983 -2787 -661 -128 666 1396 -1202 -2889
1182b889J842L89M80J653k181k188K495Q53q96K357r99l298K548J767j899J578
$$ -2889 -1047 -658 -178 1475 -706 -2894 -399 454 -442 1915 916 -2382 166 1933 34 1612
1198A612M20l538R57K984j724l75J638l239j026L823o43j871J956k062k269L525
$$ 1612 2032 -1506 -549 2435 711 336 1974 -1265 -2291 1532 889 -982 974 -1088 -3357 168
1214A68Q83k359J322k14k650J969K444j675j81R50j978N26K761j083m88R61j709
$$ 168 1051 -1308 14 -200 -2850 -881 1563 -112 -293 657 -1321 -795 1966 883 395 1356 -353
1231c53p5K188n90r63Q82j357l48J538l05j262P47o47j092J671K36j795J054J59
$$ -353 -428 1760 1170 207 1089 -268 -616 922 617 -645 102 -545 -1637 34 270 -1525 -471 -312
1249c12j546J758Q07j999J068Q40j643J088J548j881O0J803j411l98K174j195
$$ -312 -1858 -100 707 -1292 -224 616 -1027 61 1609 -272 -212 1591 180 -218 1956 761
1265G61j522K223n86j687J863k45k161J644L61j963Q53P50j789M88J414j529R
$$ 761 -761 1462 876 -811 1052 807 -1354 290 651 -1312 -459 291 -1498 -1010 404 -1125 -1116
1282a116J362j389L08J902j297o47J657r86k26K023p53j167J159k33p86J671J94
$$ -1116 246 -1143 -835 1067 -230 -877 780 -206 -432 1591 838 -329 830 597 -189 1482 1676
1299A676k051L94O21j331J139R28k201k35J071j215P15J360j925n23J061n18M01
$$ 1676 -375 19 640 -691 448 1376 -825 -1060 11 -1204 -489 871 -1054 -1577 -516 -1034 -633
1316f33J546r21j492J429J20l15J818m58k033R84R28o88J372L3k288J65J275m93
$$ -633 913 -8 -1500 -71 49 -266 1552 1094 -939 45 973 285 1657 1690 -598 -433 842 349
1334C49M42L49j843r18J522J20j38P22j597j113J540L49j04J004j374j253J390
$$ 349 791 1140 -703 -1621 -99 21 -117 605 -992 -2105 -565 -216 -320 684 -690 -1943 -553
1351e53R88kO30n39j733P97J785j89l1r6j859J26J953n7l32r6j806l05J684L54
$$ -553 435 433 1063 524 -1209 -412 1373 1184 1153 1057 -802 -676 1277 1220 888 792 -1014 -1319 365 719
1371G19l57l21j418o13J574R01n54j9q67j215J684J622q18j56l93j021J141J840
$$ 719 362 41 -1377 -1990 -416 485 -69 -88 -955 -2170 -486 1136 318 162 -231 -1252 -111 1729
1389A729l60p80l06r52L51J859K90j343n09o98j31J660N12j220p04p38q1J464
$$ 1729 1369 589 283 -669 -318 1541 1831 488 -21 -719 -850 810 1322 102 -602 -1340 -1421 43
1407D3O59q33q06o28J36J242J067m53r55m50PJ271J349m68r76n58q6J141J245
$$ 43 702 -131 -937 -1565 -1429 -187 880 427 -528 -978 -971 300 1649 1181 205 -353 -439 702 1947
1426A947o08r76p67l84R53J268j96j425p06k77K53J543K49j600o00N9J7J239R77
$$ 1947 1339 363 -404 -788 165 1433 1237 -188 -894 -1171 -918 625 874 -726 -1326 -1267 -1250 -11 966
1445I66j182r14N3O24P29R35m27j281J9Q65L45P55k65j502k19P81N35J87k40j047
$$ 966 -216 -1130 -1077 -453 276 1211 784 -497 -478 387 732 1487 1222 -280 -499 282 817 1004 764 -283
1465b83p34L63J194N8n37n92j039L5J696M50o85m04o63j77J014J393k69j142Q9
$$ -283 -1017 -654 540 598 61 -531 -1570 -1535 161 611 -74 -478 -1141 -1318 -304 1089 820 -322 -233
1484b33j73J73J543K52j226m15J34J37O27N67p92j094N0N59N4K67l16j108j87
$$ -233 -406 -233 1310 1562 336 -79 55 192 819 1386 594 -500 -450 109 163 430 114 -994 -1181
1503a181O38M05o0k17k73l93M51J072p0n99o7k02J96J102M97r17l81K74k77M72
$$ -1181 -543 -138 -198 -415 -688 -1081 -630 442 372 -227 -294 -496 -300 802 1299 382 1 275 -2 470
1523D70J255q91j219O13l06k42J337k30j654K19M96q14P98Q84j328q93J200j45
$$ 470 1725 834 -385 228 -78 -320 1017 787 -867 -648 -152 -966 -168 716 -612 -1505 -305 -450
1541d50m02J334k88j184R00N60n16M10L11p28Q1O58J0j76K6j96j89K94J65k93
$$ -450 -852 482 194 -990 -90 470 -46 364 675 -53 28 686 696 520 546 350 161 455 620 327
1561C27k80o10L27K16k55L94l48q47K96N66l35M69J02r35O3R72J6j07Q83q70p10
$$ 327 47 -563 -236 -20 -275 119 -229 -1076 -780 -214 -549 -80 22 -913 -850 122 138 31 914 44 -666
1582f66J422q8p36J179l0j630R92O61j208L62P63j421j42J349r91q56J223l13
$$ -666 756 668 -68 1111 1081 -549 443 1104 -104 258 1021 -400 -542 807 -184 -1040 183 -130
1600a30j033J044k4j071O89M74n60M13N13p99J08O27k9MM10m29j76N11j31J29
$$ -130 -1163 -119 -143 -1214 -525 -51 -611 -198 315 -484 -376 251 222 226 636 207 31 542 411 540
1620E40L96o78n6K16m05J34K30n32n8K07n21R5M59n61l75P35l05m55R54k43o49
$$ 540 936 258 202 418 13 147 377 -155 -213 -6 -527 -432 27 -534 -909 -174 -479 -934 20 -223 -872
1641h72J106J01q81P50L24r61O46J209j127j09N63o19m16J462m01r90N68l48p44
$$ -872 234 335 -546 204 528 -433 213 1422 295 186 749 130 -286 1176 775 -215 353 5 -739
1660g39J059Q7q45J49j03n47N38M78m69j56J06j63M04N22k76kO3j72K28M99k08
$$ -739 320 407 -438 -289 -392 -939 -401 77 -392 -548 -442 -605 -201 321 45 43 106 -66 162 661 453
1681D53m3P8m55M72M18o01j51K32o28R4Q24n75q10N06k55m27J064n0j259M12M65
$$ 453 410 488 33 505 923 322 171 403 -225 -131 693 118 -692 -186 -441 -868 196 146 -1113 -701 -236
1702b36o84Q59P43j263p4R39m57J45J279p56r26P95J33k39Q12j65j166K72L70
$$ -236 -920 -61 682 -581 -655 284 -173 -28 1251 495 -431 364 497 258 1070 905 -261 11 381
1721C81k00L21j8j024r0M80o3k7J42m85n03O78K21%K95n66l05O85Q8J91L67l85
$$ 381 181 502 484 -540 -630 -150 -213 -240 -98 -583 -1086 -408 -187 -187 108 -458 -763 -78 10 201 568 183
1743A83l58L32M66o6K48m08o46M07N62m82L88j73j045L00P00l64r4O1q52k5P07
$$ 183 -175 157 623 557 805 397 -249 158 720 238 626 453 -592 -292 408 44 -50 11 -841 -866 -159
1764a59N4j97J61n24k92P53N87m51J01k0m81P23N89m35M6L8n87M54M12j59m46
$$ -159 -105 -302 -141 -665 -957 -204 383 -68 33 13 -468 255 844 409 455 493 -94 360 772 613 167
1785A67K6l20Q3L85j24n16R7m74O7N93n9l54j2j87j2O31J50k78l3j30Q0N04M12
$$ 167 193 -127 -44 341 217 -299 -202 -676 -609 -16 -75 -429 -441 -628 -640 -9 141 -137 -170 -300 -220 284 696
1808F96m65j66K80k87L20N86m72l26Q2k23J25L58k24o72J45m6j15K78J36n11j98
$$ 696 231 65 345 58 378 964 492 166 248 25 150 508 284 -388 -243 -289 -404 -126 10 -501 -699
1829f99K29lK82K72m12j23L37K6L29K22k19k73K81P6N2K24m0m45J33J68q6J62
$$ -699 -470 -473 -191 81 -331 -454 -117 -91 238 460 241 -32 249 325 377 601 561 116 249 417 331 493
1851D93k42m23J1J23q5Q7k19l54Q0J90k9L6J48k48j44M22K02m5J99l56J3L74P6
$$ 493 251 -172 -161 -38 -123 -36 -255 -609 -529 -339 -368 -332 -184 -432 -576 -154 48 3 202 -154 -141 233 309
1874C09Q2J12k61j06K42R1j13N1j18m00j1K87k33n3O7l36j13K12q5QM4k45J27
$$ 309 391 503 242 136 378 469 356 407 289 -111 -122 165 -68 -121 -54 -390 -503 -291 -376 -368 -324 -569 -442
1897d42K62M8n0J0M1m3L49J38j20J26Mj58K57J13k35k0q9l2K6Q0q0k66k58P5k7
$$ -442 -180 -132 -182 -172 -131 -174 175 313 193 319 323 165 422 535 300 280 191 159 185 265 185 -81 -339 -264 -291
1922b91J06n2j07o6o2Q4K60k30J80k9m6J82L40r1r0J39j5k9K53J55l43Q6J24k47
$$ -291 -185 -237 -344 -410 -472 -388 -128 -358 -178 -207 -253 -71 269 178 88 227 212 183 436 591 248 334 458 211
1946B11K3K40l62k17j9N9o3k4j31j76K9J54k6j49J59k18O9L03J72j25N1J07ON8
$$ 211 234 474 112 -105 -124 -65 -128 -152 -283 -459 -430 -276 -302 -451 -292 -510 -441 -138 34 -91 -40 67 73 131
1970A31L82l9k99K26p8j85L03J20l53l0M8k28m6J60r5n65K04K14k91J76J28l98
$$ 131 513 474 175 401 323 138 441 561 208 178 226 -2 -48 112 17 -548 -344 -130 -421 -245 -117 -515
1992e15M1K64j62J7L83j07j43K79K93j94J08J47k03j4M32k61p6K6o3j4j04P3j31
$$ -515 -474 -210 -372 -355 28 -79 -222 57 350 156 264 411 208 194 626 365 289 315 252 238 134 207 76
2015G6l20J59j0k86K54L1l75k5K09p7J7L84j83k17K29J02k5K90K28n93K57K96
$$ 76 -244 -85 -95 -381 -127 -96 -471 -496 -287 -364 -347 37 -146 -363 -134 -32 -57 233 461 -132 125 421
2037D21k08J45J81k10l50L21L7l15K02o4m69J40K13l59o3K68k80j10K28N9l29
$$ 421 213 358 539 329 -21 300 337 22 224 160 -309 -169 44 -315 -378 -110 -390 -500 -272 -213 -542
2058e42Q7M44k44J61K83j66j08L72j26Q3J77J22l35k00M04r9j68K80j54m61K98
$$ -542 -455 -11 -255 -94 189 23 -85 287 161 244 421 543 208 8 412 313 145 425 271 -190 108
2079A08K3k09n8J96l58j86K56m9k44L65pm48M42K73l94K78J72k08p7M19q3j02
$$ 108 131 -78 -136 60 -298 -484 -228 -277 -521 -156 -163 -611 -169 104 -290 -12 160 -48 -125 294 211 109
2101A09L02q5k96K87K50l90o2K31k91p3K44k23k32PJ02l44J25K15k31n7K85k7
$$ 109 411 326 30 317 567 177 115 346 55 -18 226 3 -229 -222 -120 -464 -339 -124 -355 -412 -127 -154
2123a54j03J21J30k83J25K91J71l06L54k8l57L53J02j80Q2Q9m18LL41j82k93K96
$$ -154 -257 -136 -6 -289 -164 127 298 -8 346 318 -39 314 416 236 318 407 -11 -8 333 151 -142 154
2145A54o5n97L98J36l76k3K78k78j08L64J1k64J85K64l33L61J79l72K81K41k61
$$ 154 89 -508 -110 26 -350 -373 -95 -373 -481 -117 -106 -370 -185 79 -254 107 286 -86 195 436 175
2166A75K9K71p9k96K51P9k46M5P8l35j38L11k71j01J65k60q8P1J37j38lJ96n0
$$ 175 204 475 396 100 351 430 184 229 307 -28 -166 145 -126 -227 -62 -322 -410 -339 -202 -340 -343 -147 -197
2189a97j03L26o9J7J99m0m8O2J40nm9R1j3k17J30J39k07j07P6k54J1J56j27k16
$$ -197 -300 26 -43 -26 173 133 85 147 287 282 233 324 311 94 224 363 156 49 125 -129 -118 38 -89 -305
2213c05j7K08l56J37L23l11n0K41r0m5L71l3j57J71N2o8L5K96k78J4K74j55j29
$$ -305 -322 -114 -470 -333 -10 -321 -371 -130 -220 -265 106 73 -84 87 139 71 106 402 124 138 412 257 128
2236A28J20p3k68K83j03j04j77J57j20k46J54J4r6J73j08q2J49J35k1L8Q7q7j2
$$ 128 248 175 -93 190 87 -17 -194 -37 -157 -403 -249 -235 -331 -158 -266 -348 -199 -64 -85 -47 40 -47 -59
2259e9J70J67O2j34J05P4j35M1rj03j32R4l7q8Q4j69j33%o5j01K76j11j59MJ15
$$ -59 111 278 340 206 311 385 250 291 282 179 47 141 104 16 100 -69 -202 -202 -267 -368 -92 -203 -362 -358 -243
2284b43j5J23R9o4j96L38N1M1K22k37k13L15J14o4Q3Pj26r5J24j8j43nl95M6J00
$$ -243 -258 -135 -36 -100 -296 42 93 134 356 119 -94 221 335 271 354 361 235 140 264 246 103 98 -297 -251 -151
2309a51Mo5J7j49o2K39j21P0L6o7M3J03J38P1m7L1J0K31n7O8j0r2j39J85j9p4
$$ -151 -147 -212 -195 -344 -406 -167 -288 -218 -182 -249 -206 -103 35 106 59 90 100 331 274 342 332 240 101 286 267 193
2335A93J73k68k01N2q3M5P4j96k1j90K60K8j69K88k04k77M02J92j83K66j37j15
$$ 193 366 98 -103 -51 -134 -89 -15 -211 -232 -422 -162 -134 -303 -15 -219 -496 -94 98 -85 181 44 -71
2357g1K73J07L4l5M0k48J4K46q6o6K2k65j36L31q6p9o6k42j8J84k9p5J74j26j67
$$ -71 202 309 343 308 348 100 114 360 274 208 230 -35 -171 160 74 -5 -71 -313 -331 -147 -176 -251 -77 -203 -370
2382c70P9K81o6J21Q2l04K32K36j24J45m7k30J62L6L3r5Lj38j28K38j6j35J4l51
$$ -370 -291 -10 -76 45 127 -177 55 291 167 312 265 35 197 233 266 171 174 36 -92 146 130 -5 9 -342
2406c42j49K89J65k23j2m1j27K60K77k10m6J07o2R7K96J11l80J84j22K7L61n9
$$ -342 -491 -202 -37 -260 -272 -313 -440 -180 97 -113 -159 -52 -114 -17 279 390 10 194 72 99 460 401
2428D01q9j29j02n1J57J14k32j53k56K3K05K03k59j95q5l7L05O8lm3q6j50L39
$$ 401 312 183 81 30 187 301 69 -84 -340 -317 -112 91 -168 -363 -448 -485 -180 -112 -115 -158 -244 -394 -55
2451e5L50j82Oj67J7J82L34o8k57j06k1o9L59L4m09J9o3k74M23J66m85j86M1Q0
$$ -55 295 113 119 -48 -31 151 485 417 160 54 33 -36 323 357 -52 -33 -96 -370 53 219 -266 -452 -411 -331
2475c31K5L48q6m05J49J28J9M27ml89R9J18J53M6Q6o7k40QK48j1p7k8l20L4Q4
$$ -331 -306 42 -44 -449 -300 -172 -153 274 270 -119 -20 98 251 297 383 316 76 84 332 321 244 216 -104 -70 14
2500A4K07j58j45j70j59K9L55j6l55J14rJ7K84L46l07l51K81R9KM04j88l59P1
$$ 14 221 63 -82 -252 -411 -382 -27 -43 -398 -284 -293 -276 8 354 47 -304 -23 76 78 482 294 -65 6
2523FL37j85L48k7o08nK99j15J1J19l42m01L34K34k72J13L6m39J50M43r5k7Qj
$$ 6 343 158 506 479 -129 -134 165 50 61 180 -162 -563 -229 5 -267 -154 -118 -557 -407 36 -59 -86 -78 -79
2547g9j08Q8M97k09j09N4k14J19L30pj73o7j51P2J07J48k02k83J8K2j90K84r5
$$ -79 -187 -99 398 189 80 134 -80 39 369 362 189 122 -29 43 150 298 96 -187 -169 -147 -337 -53 -148
2570a48j87j0J22RJ76lr8l49L40L59j78K4J52k33N1L34q3q1J35j26l01L09K76
$$ -148 -335 -345 -223 -214 -38 -41 -139 -488 -148 211 33 57 209 -24 27 361 278 197 332 206 -95 214 490
2593D90m07r4J90m13M4L36j27j97L5k15L9J04K33k23o7J00j5rM47j39k38K48J1
$$ 490 83 -11 179 -234 -190 146 19 -178 -143 -358 -319 -215 18 -205 -272 -172 -187 -196 251 112 -126 122 133
2616A33j96L40J37l57mK82k26k3L96j95l80P9MK0L4Jj91j10J56p4n3J61L7l35
$$ 133 -63 277 414 57 53 335 109 86 482 287 -93 -14 -10 10 44 45 -146 -256 -100 -174 -227 -66 -29 -364
2640c64J12J78N0O7K3j55k4J42K59j73M2O9j66k0K87r1k06l8N0p1M4K09l04j82
$$ -364 -252 -74 -24 43 66 -89 -113 29 288 115 157 226 60 40 327 236 30 -8 42 -29 15 224 -80 -262
2664b62J41j85n5M52j60l95K94m3p9K41J45j04k52L61M1j56L21M4m63K22J21j04
$$ -262 -121 -306 -361 91 -69 -464 -170 -213 -292 -51 94 -10 -262 99 140 -16 305 349 -114 108 229 125
2686A25J48L0k13k62K37O2j69J49j96k62J28K64o4m7qk38JO1J79o7J5K2r7J03
$$ 125 273 303 90 -172 65 127 -42 107 -89 -351 -223 41 -23 -70 -78 -316 -315 -254 -75 -142 -127 -105 -202 -99
2710i9K86jj31O9n9m9K83rm7j66m5J40j27K68q4m45J15J5j76K67R7l31q9N3M8
$$ -99 187 186 55 124 65 16 299 290 243 77 32 172 45 313 229 -216 -101 -86 -262 5 102 -229 -318 -265 -217
2735b17L9J97r7k91J03L45QK01o8l73J57J11J26J87j24k02k57J90K41P6o2m78
$$ -217 -178 19 -78 -369 -266 79 87 288 220 -153 4 115 241 428 304 102 -155 35 276 352 290 -188
2757a88J9j08L29J16k07j20k17J35J30J19J2k48j2r7K46K04J45j75k38J31J52
$$ -188 -169 -277 52 168 -39 -159 -376 -241 -111 8 20 -228 -240 -337 -91 113 258 83 -155 -24 128
2778A28J68J63k91k17L1K26J1J15j14m25JJ08K93m5q2m37j78L77K89o8q3j28l82
$$ 128 296 459 168 -49 -18 208 219 334 220 -205 -204 -96 197 152 70 -367 -545 -168 121 53 -30 -158 -540
2801e40L22K60P8m9j54l00K57K75J88Rj85k06l7M70R6q8j76l99j20N13k1Ok34
$$ -540 -218 42 120 71 -83 -383 -126 149 337 346 161 -45 -82 388 484 396 220 -179 -299 214 193 199 -35
2824c5l88N0K55K00Lk33k17j56K58M14j75k1j32j17K63L50q4r8p8j55J53L81N4
$$ -35 -423 -373 -118 82 85 -148 -365 -521 -263 151 -24 -45 -177 -294 -31 319 235 137 59 -96 57 438 492
2847D92l36p7k07R4K85J64m50j10m4k76N66J75l80j51j52J4K96K73q6l06m2n8
$$ 492 156 79 -128 -34 251 415 -35 -145 -189 -465 101 276 -104 -255 -407 -393 -97 176 90 -216 -258 -316
2869c16K11L29N4l94M5O0kN55j34k48k23p5K80J38O6j78l51m6O5M04k3k17k19
$$ -316 -105 224 278 -116 -71 -11 -13 542 408 160 -63 -138 142 280 346 168 -183 -229 -164 240 217 0 -219
2892b19j12K9J69L10k68k92J61K2K39J42m6k76N4O9K20R5M4l39j22K45rK32K2
$$ -219 -331 -302 -133 177 -91 -383 -222 -200 39 181 135 -141 -87 -18 202 297 341 2 -120 125 116 348 370
2915C70m37l9R5NJ15O4k06k14L9Q1J63lj86j75O7R2J16K22j60k72J79J16Q8M6
$$ 370 -67 -106 -11 -6 109 173 -33 -247 -208 -127 36 33 -153 -328 -261 -169 -53 169 9 -263 -84 32 120 166
2939A66n1n2o4J02N9J57j10j06j34J68j54O1J71l26nJ27k76M7J77j07j04Q3p6
$$ 166 115 63 -1 101 160 317 207 101 -33 135 -19 42 213 -113 -118 9 -267 -220 -43 -150 -254 -171 -247
2962b47J8J63J0r3jK60ln1J51k08K2J35j2j07K74j49j62R1j25L7K02J6k80o8Q1
$$ -247 -229 -66 -56 -149 -150 110 107 56 207 -1 21 156 144 37 311 162 0 91 -34 3 205 221 -59 -127 -46
2987d6O8j60J28k41j8R3L2J16o1J96k37o7J23J49L7k2Nj75J51J89M7q2k13o9j08
$$ -46 22 -138 -10 -251 -269 -176 -144 -28 -89 107 -130 -197 -74 75 112 90 95 -80 71 260 307 225 12 -57 -165
3012a65K71K21l08q4J6j29J10J19L3j83k56J50oJ64K40l59n1Q3j0K31K59k42k07
$$ -165 106 327 19 -65 -49 -178 -68 51 84 -99 -355 -205 -211 -47 193 -166 -217 -134 -144 87 346 104 -103
3035a03n1J93J94R2l2l11j21K72L2J25j7l55o2M7J60J69j72k34j81j38M07K46
$$ -103 -154 39 233 325 293 -18 -139 133 165 290 273 -82 -144 -97 63 232 60 -174 -355 -493 -86 160
3057A60k62o6m5j11K28K06J23k51j02k3R1L80J57m27j46m5Q0L91K23l70l50J8
$$ 160 -102 -168 -213 -324 -96 110 233 -18 -120 -143 -52 328 485 58 -88 -133 -53 338 561 191 -159 -141
3079a41O8J95J19j65l63j70L36O2J27L6m34k76M65J61J14q3k7l94O8O23N6q8j58
$$ -141 -73 122 241 76 -287 -457 -121 -59 68 104 -330 -606 -141 20 134 51 24 -370 -302 321 377 289 131
3102A31l29N4L65K43j65j99j60j23J62M09l7n15j04J4j6L81J97l21m23j10M04
$$ 131 -198 -144 221 464 299 100 -60 -183 -21 388 351 -164 -268 -254 -270 111 308 -13 -436 -546 -142
3123a42Q9K75k30l61j21M25J14K71o2m05j16L14J86J77q2l27k59J40M06K4p4j88
$$ -142 -53 222 -8 -369 -490 -65 49 320 258 -147 -263 51 237 414 332 5 -254 -114 292 316 242 54
3145E4l13q8L80K69k74j04l58o3L79M19j00m98mL6R8M42J45n30j26KK78K59J91
$$ 54 -259 -347 33 302 28 -76 -434 -497 -118 301 201 -297 -301 -265 -167 275 420 -110 -236 -234 44 303 494
3168D94k55m32q5L33J67J29m4m81j96L20J15L07j49m88k78L88K64K7k09j50k86
$$ 494 239 -193 -278 55 222 351 307 -174 -370 -50 65 372 223 -265 -543 -155 109 136 -73 -223 -509
3189e09K26M06J84r0k90j31q7L54L81n6l02k78J9K15L64K3m34k29N8J51K38J05
$$ -509 -283 123 307 217 -73 -204 -291 63 444 388 86 -192 -173 42 406 429 -5 -234 -176 -25 213 318
3211C18l19m73K19J52Q4K67k09n39OM33J36J69k23j40k47L43K79N6k7k08k64K31
$$ 318 -1 -474 -255 -103 -19 248 39 -500 -494 -61 75 244 21 -119 -366 -23 256 312 285 77 -187 44
3233D4K94l5p8j57k42L9K25K16j90j71j69j55K07L44j04k58j68MK46K58n3j98
$$ 44 338 303 225 68 -174 -135 90 306 116 -55 -224 -379 -172 172 68 -190 -358 -354 -108 150 97 -101
3255a01j23J04K75O6Rr0j87q8K81J57%k43j28L4K7L08p3j1k04k98J77J64j02L0
$$ -101 -224 -120 155 221 230 140 -47 -135 146 303 303 60 -68 -34 -7 301 228 217 13 -285 -108 56 -46 -16
3279a6j04k54K44J06j3j6p7j2q0J41J22n1L5n2m1J43J22n7J7j51N5O8M6J03k36
$$ -16 -120 -374 -130 -24 -37 -53 -130 -142 -222 -81 41 -10 25 -27 -68 75 197 140 157 6 61 129 175 278 42
3304D2q5k3L7L1j5N9j07k6L6Q7j56O4l2l8M5m3J25Q7J8j09M6kO9J8n8M4Ll5J2
$$ 42 -43 -66 -29 2 -13 46 -61 -87 -51 36 -120 -56 -88 -126 -81 -124 1 88 106 -3 43 41 110 128 70 114 117 82 94
3333I4r4J78J1k25Kk3l7J38kl1k45J1R8P5L5r9j45R9J18oK18n9j54o7l5M14p9
$$ 94 0 178 189 -36 -34 -57 -94 44 42 11 -234 -223 -125 -50 -15 -114 -259 -160 -42 -48 170 111 -43 -110 -145 269 190
3360A90n6j53j32J72K45l0Q3k62k68O4J59L9J60l39j96MJ99J72K9l8k91k3J72
$$ 190 134 -19 -151 21 266 236 319 57 -211 -147 12 51 211 -128 -324 -320 -121 51 80 42 -249 -272 -100
3383a00K53k5j57j44p9K86K41J36k29k11o1J20K69R2k30k97j30J93M01M8l91k14
$$ -100 153 128 -29 -173 -252 34 275 411 182 -29 -90 30 299 391 161 -136 -266 -73 328 376 -15 -229
3405b29j28J68K95Q0k14k37j15J86K90O3l5l74p9J13K90L38k40j96k19M3N03J14
$$ -229 -357 -189 106 186 -28 -265 -380 -194 96 159 124 -250 -329 -216 74 412 172 -24 -243 -200 303 417
3427D17j11j81m85J74K02L12m9j86l23p3K82J55J81l94l49M6Q3N55r6j43k27j58
$$ 417 306 125 -360 -186 16 328 279 93 -230 -303 -21 134 315 -79 -428 -382 -299 256 160 17 -210 -368
3449c68K07L96O2j72j84k02K64K80K80k62m27j15J23L28L20l61l68j59J12L74
$$ -368 -161 235 297 125 -59 -261 3 283 563 301 -126 -241 -118 210 530 169 -199 -358 -246 128
3469A28K27k03l19l84K51L08J46L0m25k50K42K89L52j27l07k10r2M21L79q0k64
$$ 128 355 152 -167 -551 -300 8 154 184 -241 -491 -249 40 392 265 -42 -252 -344 77 456 376 112
3490A12m02J5L76L19J8l58l49n2L06K71J64m01l58l9K06J97K63l45m36Q2J58M10
$$ 112 -290 -275 101 420 438 80 -269 -321 -15 256 420 19 -339 -378 -172 25 288 -57 -493 -411 -253 157
3512A57J04m0m80q6K03K99K10j67k96k77L69K39J55j4m56j56nL74K59j44k47m11
$$ 157 261 221 -259 -345 -142 157 367 200 -96 -373 -4 235 390 376 -80 -236 -241 133 392 248 1 -410
3534d10K4M25K51j35k37k38r6K84K21P9l36k9m6Q4M20J06m44j11R1J36K47J70
$$ -410 -386 39 290 155 -82 -320 -416 -132 89 168 -168 -197 -243 -159 261 367 -77 -188 -97 39 286 456
3556D56j93l42q3K57M3R5L6l98k06L06J82K5j29l41p5J15K97K9J5j86k09MK37
$$ 456 263 -79 -162 95 138 233 269 -129 -335 -29 153 178 49 -292 -367 -252 45 74 89 -97 -306 -302 -65
3579f5J95K8k32j62M0K71J59oj58m3j35K61P4K4l45n1oR1J70ok9l63N7J65J06
$$ -65 130 158 -74 -236 -196 75 234 228 70 27 -108 153 227 251 -94 -145 -151 -60 110 104 75 -288 -231 -66 40
3604D0mJ6l72J04J14J92L9o8p7j08R4K95j64O2j22k31J37K47K2j67J09k45q2K11
$$ 40 36 52 -320 -216 -102 90 129 61 -16 -124 -30 265 101 163 41 -190 -53 194 216 49 158 -87 -169 42
3628D2J32q2j41j13kJ02J44j76M6o0j26N4K08j6l3Oj35K36p6J25Lj09Q2J07j76
$$ 42 174 92 -49 -162 -164 -62 82 -94 -48 -108 -234 -180 28 12 -21 -15 -150 86 10 135 138 29 111 218 42
3653D2N0M8j28o7J30l7P6r6M7j01J0P3k06j7J15n6K1l7J01k1k7J22j72P7K9l3
$$ 42 92 140 12 -55 75 38 114 18 65 -36 -26 47 -159 -176 -61 -117 -96 -133 -32 -53 -80 42 -130 -53 -24 -57
3679e7J51O9K8j84J3R1j4N4p6j59J24J13l0j11Q5j28j56N3Q9n2O7j63n9M6K55
$$ -57 94 163 191 7 20 111 97 151 75 -84 40 153 123 12 97 -31 -187 -134 -45 -97 -30 -193 -252 -206 49
3704D9K3q0n3n6j32K19K40j39j15n4pL24K5N8j16k70n1R8L55j02k35j11O6pK17
$$ 49 72 -8 -61 -117 -249 -30 210 71 -44 -98 -105 219 244 302 186 -84 -135 -37 318 216 -19 -130 -64 -71 146
3729A46k9j97j37o7J65K38j42J0k98N8J06J49K91j79j54k01J79L16R6k47j61j73
$$ 146 117 -80 -217 -284 -119 119 -23 -13 -311 -253 -147 2 293 114 -40 -241 -62 254 350 103 -58 -231
3751b31J28L48J4j8k44k65J2L29J41j0l49j64J00J55J97R7l16l02N0L16J90M8
$$ -231 -103 245 259 241 -3 -268 -256 73 214 204 -145 -309 -209 -54 143 240 -76 -378 -328 -12 178 226
3773B26k21k63lK90K48Q6k06k91q2K34J69O3k25k32n5J48L75k7j68l07l4J01K69
$$ 226 5 -258 -261 29 277 363 157 -134 -216 18 187 250 25 -207 -262 -114 261 234 66 -241 -275 -174 95
$$ [...]
8191c8
##END NTUPLES=NMR FID
##END=
