##TITLE=1H_E3d1007-3
 CDCl3
 8 sc, 
 11.7.2023
##JCAMPDX= 6.0         $$ Bruker NMR JCAMP-DX V2.0
##DATA TYPE= NMR FID
##DATA CLASS= NTUPLES
##ORIGIN= UXNMR, Bruker Analytische Messtechnik GmbH
##OWNER= root
$$ XWIN-NMR		Version 3.5
$$ Tue Jul 11 13:50:48 2023 Russian Standard Time (UT+4h)  she@DPX200
##.OBSERVE FREQUENCY= 200.13135
##.OBSERVE NUCLEUS= ^1H
##.DELAY= (6, 6)
##.ACQUISITION MODE= SIMULTANEOUS
##.ACQUISITION SCHEME= undefined
##.AVERAGES= 8
##.DIGITISER RES= 18
##SPECTROMETER/DATA SYSTEM= spect
##.PULSE SEQUENCE= zg30
##.SOLVENT NAME= CDCl3
##.SHIFT REFERENCE= (INTERNAL, CDCl3, 0, 15.7039)
##AUDIT TRAIL= $$ (NUMBER, WHEN, WHO, WHERE, WHAT)
$$ ##TITLE= Audit trail, XWIN-NMR		Version 3.5
$$ ##JCAMPDX= 5.01
$$ ##ORIGIN= Bruker BioSpin GmbH
$$ ##OWNER= she
$$ F:/spectra/data/she/nmr/H-F/1/audita.txt
$$ ##AUDIT TRAIL=  $$ (NUMBER, WHEN, WHO, WHERE, WHAT)
(   1,<2023-07-11 13:49:33.59 +0400>,<she>,<DPX200>,
      <created by zg, POWCHK disabled, PULCHK disabled
       configuration hash MD5:
       00 E9 B6 7A A2 85 ED C7 34 08 36 98 17 FE 4E 26
       data hash MD5: 16K
       BC 32 AD C6 78 5B 07 5F 09 B5 0F 53 76 7C 8F E6>)
$$ ##END=
$$ 
$$ hash MD5
$$ E6 A4 5E AA AA C3 74 49 7B 2E 08 9A 9D 29 AB 6E
##$RELAX= 
##$RELAX= 
##$RELAX= 
##$RELAX= 
##$RELAX= 
##$RELAX= 
$$ Bruker specific parameters
$$ --------------------------
##$DU= <F:/spectra>
##$EXPNO= 1
##$NAME= <H-F>
##$PROCNO= 1
##$TYPE= <nmr>
##$USER= <she>
##$AMP= (0..31)
100 100 100 100 100 100 100 100 100 100 100 100 100 100 100 100 100 100 
100 100 100 100 100 100 100 100 100 100 100 100 100 100 
##$AQSEQ= 0
##$AQ_mod= 1
##$AUNM= <au_zg>
##$AUTOPOS= <>
##$BF1= 200.13
##$BF2= 200.13
##$BF3= 200.13
##$BF4= 200.13
##$BF5= 200.13
##$BF6= 200.13
##$BF7= 200.13
##$BF8= 200.13
##$BYTORDA= 1
##$CFDGTYP= 0
##$CFRGTYP= 5
##$CHEMSTR= <none>
##$CNST= (0..31)
1 1 145 1 1 1 1 1 1 1 1 1 1 1 1 1 1 1 1 1 1 1 1 1 1 1 1 1 1 1 1 1 
##$CPDPRG= <>
##$CPDPRG1= <>
##$CPDPRG2= <>
##$CPDPRG3= <>
##$CPDPRG4= <mlev>
##$CPDPRG5= <mlev>
##$CPDPRG6= <mlev>
##$CPDPRG7= <mlev>
##$CPDPRG8= <mlev>
##$CPDPRGB= <>
##$CPDPRGT= <>
##$D= (0..31)
0 1.2 0 0 0 0 0 0 0 0.06 0 0.03 0 0 0 0 0.0002 0 0 0 0 0 0 0 0 0 0 0 0 
0 0 0 
##$DATE= 1689068972
##$DBL= (0..7)
120 120 120 120 120 120 120 120 
##$DBP= (0..7)
150 150 150 150 150 150 150 150 
##$DBP07= 0
##$DBPNAM0= <>
##$DBPNAM1= <>
##$DBPNAM2= <>
##$DBPNAM3= <>
##$DBPNAM4= <>
##$DBPNAM5= <>
##$DBPNAM6= <>
##$DBPNAM7= <>
##$DBPOAL= (0..7)
0.5 0.5 0.5 0.5 0.5 0.5 0.5 0.5 
##$DBPOFFS= (0..7)
0 0 0 0 0 0 0 0 
##$DE= 6
##$DECBNUC= <off>
##$DECIM= 32
##$DECNUC= <off>
##$DECSTAT= 4
##$DIGMOD= 1
##$DIGTYP= 9
##$DL= (0..7)
0 120 120 120 120 120 120 120 
##$DP= (0..7)
150 150 150 150 150 150 150 150 
##$DP07= 0
##$DPNAME0= <>
##$DPNAME1= <>
##$DPNAME2= <>
##$DPNAME3= <>
##$DPNAME4= <>
##$DPNAME5= <>
##$DPNAME6= <>
##$DPNAME7= <>
##$DPOAL= (0..7)
0.5 0.5 0.5 0.5 0.5 0.5 0.5 0.5 
##$DPOFFS= (0..7)
0 0 0 0 0 0 0 0 
##$DQDMODE= 0
##$DR= 18
##$DS= 0
##$DSLIST= <SSSSSSSSSSSSSSS>
$$ [...]
##$SUBNAM2= <"">
##$SUBNAM3= <"">
##$SUBNAM4= <"">
##$SUBNAM5= <"">
##$SUBNAM6= <"">
##$SUBNAM7= <"">
##$SUBNAM8= <"">
##$SUBNAM9= <"">
##$SW= 18.05172834244
##$SWIBOX= (0..15)
0 0 2 0 0 0 0 0 0 0 0 0 0 0 0 0 
##$SW_h= 3612.71676300578
##$TD= 16384
##$TD0= 1
##$TE= 0
##$TE2= 300
##$TE3= 300
##$TEG= 300
##$TL= (0..7)
0 120 120 120 120 120 120 120 
##$TP= (0..7)
150 150 150 150 150 150 150 150 
##$TP07= 0
##$TPNAME0= <>
##$TPNAME1= <>
##$TPNAME2= <>
##$TPNAME3= <>
##$TPNAME4= <>
##$TPNAME5= <>
##$TPNAME6= <>
##$TPNAME7= <>
##$TPOAL= (0..7)
0.5 0.5 0.5 0.5 0.5 0.5 0.5 0.5 
##$TPOFFS= (0..7)
0 0 0 0 0 0 0 0 
##$TUNHIN= 0
##$TUNHOUT= 0
##$TUNXOUT= 0
##$USERA1= <user>
##$USERA2= <user>
##$USERA3= <user>
##$USERA4= <user>
##$USERA5= <user>
##$V9= 5
##$VALIST= <valist>
##$VCLIST= <CCCCCCCCCCCCCCC>
##$VD= 0
##$VDLIST= <DDDDDDDDDDDDDDD>
##$VPLIST= <PPPPPPPPPPPPPPP>
##$VTLIST= <TTTTTTTTTTTTTTT>
##$WBST= 1024
##$WBSW= 4
##$XGAIN= (0..3)
0 0 0 0 
##$XL= 0
##$YL= 0
##$YMAX_a= 262163
##$YMIN_a= -204144
##$ZGOPTNS= <>
##$ZL1= 120
##$ZL2= 120
##$ZL3= 120
##$ZL4= 120
##$ABSF1= 10
##$ABSF2= 0
##$ABSG= 5
##$ABSL= 3
##$ALPHA= 0
##$AQORDER= 0
##$ASSFAC= 0
##$ASSFACI= 0
##$ASSFACX= 0
##$ASSWID= 0
##$AUNMP= <proc_1d>
##$AZFE= 0.1
##$AZFW= 0.1
##$BCFW= 1
##$BC_mod= 2
##$BYTORDP= 1
##$COROFFS= 0
##$CY= 11.3945322036743
##$DATMOD= 1
##$DC= 2
##$DFILT= <>
##$DTYPP= 0
##$F1P= 15.7292609196834
##$F2P= 12.9074282941183
##$FCOR= 0.5
##$FTSIZE= 0
##$FT_mod= 4
##$GAMMA= 1
##$GB= 0.15
##$INTBC= 1
##$INTSCL= 1
##$ISEN= 128
##$LB= 0.24
##$LEV0= 0
##$LPBIN= 0
##$MAXI= 10000
##$MC2= 0
##$MEAN= 0
##$ME_mod= 0
##$MI= 1.114404
##$NCOEF= 0
##$NC_proc= 0
##$NLEV= 6
##$NOISF1= 3.799351
##$NOISF2= 2.8
##$NSP= 1
##$NTH_PI= 0
##$NZP= 0
##$OFFSET= 15.70392
##$PC= 1
##$PHC0= -21152.09
##$PHC1= 16.25272
##$PH_mod= 1
##$PKNL= yes
##$PPARMOD= 0
##$PSCAL= 0
##$PSIGN= 0
##$REVERSE= no
##$SF= 200.130013532006
##$SI= 16384
##$SIGF1= 3
##$SIGF2= 2
##$SINO= 400
##$SIOLD= 16384
##$SREGLST= <1H.CDCl3>
##$SSB= 0
##$STSI= 0
##$STSR= 0
##$SW_p= 3612.71676300578
##$SYMM= 0
##$S_DEV= 0
##$TDeff= 0
##$TDoff= 0
##$TI= <>
##$TILT= no
##$TM1= 0
##$TM2= 0
##$TOPLEV= 0
##$USERP1= <user>
##$USERP2= <user>
##$USERP3= <user>
##$USERP4= <user>
##$USERP5= <user>
##$WDW= 1
##$XDIM= 8192
##$YMAX_p= 0
##$YMIN_p= 0
$$ End of Bruker specific parameters
$$ ---------------------------------
##NTUPLES= NMR FID
##VAR_NAME=  TIME,          FID/REAL,        FID/IMAG
##SYMBOL=    X,             R,               I
##VAR_TYPE=  INDEPENDENT,   DEPENDENT,       DEPENDENT
##VAR_FORM=  AFFN,          ASDF,            ASDF
##VAR_DIM=   8192,          8192,            8192
##UNITS=     SECONDS,       ARBITRARY UNITS, ARBITRARY UNITS
##FACTOR=    0.0002768,     1,               1
##FIRST=     0,             0,               0
##LAST=      2.2672688,     0,               0
##MIN=       0,             -204144,         0
##MAX=       2.2672688,     262163,          0
$$ Real data points
##PAGE= N=1
##DATA TABLE= (X++(R..R)), XYDATA
$$ plain form
0 0 0 0 0 0 0 0 0 0 0 0 0 0 0 0 0 0 0 0 4 -8 8 -8 8 -8 15 -16 17 -23 24 -28 33 -39 44 -51 57 -65 74 -82 92
39 92 -103 116 -129 144 -160 176 -196 218 -239 263 -293 321 -354 389 -429 472 -520 571 -631 696
59 696 -773 859 -955 1067 -1197 1339 -1484 1585 -1432 -186 17904 262163 65756 -62532
73 -62532 102344 -115988 -204144 119934 141552 -55576 10950 -31826 -142174 36844 128272
84 128272 -6 13449 -15523 -115835 13436 93069 -25101 4997 30829 -71475 13246
95 13246 109245 -28285 -64503 9090 -39768 -815 110099 17696 -68693 -25834 -41151 8187
107 8187 108445 11221 -72011 -28907 -73663 -19191 154401 60577 -86782 -12501 -44073 -92183
119 -92183 109545 132407 -77389 -41497 17786 -92888 27682 161270 -30192 -87666 32134
$$ packed form
0@%%%%%%%%%%%%%%%%%%Mj2J6j6J6j6K3l1L3m0M7n2O1p2Q3r5J08j22J39j56J74
39I2j95K19k45K73l04L36l72M14m57N02n56O14o75P43q18R01r92J091j202J327
59F96j469J632j814K022k264K536k823L069l017J246J8090K44259j96407j28288
73f2532J64876k18332q8156L24078K1618j97128O6526m2776j10348J79018R1428
84A28272j28278J3455k8972j00312J29271P9633j18170L0098K5832j02304Q4721
95A3246R5999j37530l6218P3593m8858L8953J10914r2403q6389M2859j5317M9338
107H187J00258r7224q3232M3104m4756N4472J73592r3824j47359P4281l1572m8110
119i2183K01728K2862k09796L5892N9283j10674J20570J33588j91462n7474J19800
$$ plain form
130 32134 -47510 -41050 126046 38935 -92182 1774 7389 -48229 51144 49271 -67529 -26314
142 -26314 19625 -17830 35247 40420 -54844 -30339 17673 -9957 32022 40980 -50785 -36765
154 -36765 27403 4728 25646 49854 -38805 -59276 15035 14089 20569 52650 -22541 -60044 3981
167 3981 1130 9753 60024 -16229 -72338 8134 8897 -18270 58830 26040 -80334 -14711 37155
180 37155 -28480 19344 59308 -50974 -42929 47285 -4565 -13375 51846 -13037 -52414 28507
192 28507 20846 -19634 25591 7969 -41996 8109 25518 -16435 8160 8785 -37308 528 29195
205 29195 -12954 -1703 11392 -29822 -10489 27298 -556 -5424 9650 -18798 -12818 23998
217 23998 5347 -4621 14982 -12533 -17895 22711 7587 -8888 17869 -5059 -23228 17108
$$ packed form
130C2134p9644O460J67096q7111j31117R3956N615n5618R9373j873j16800M1215
142b6314M5939l7455N3077N173r5264K4505M8012k7630M1979Q958r1765J4020
154c6765O4168k2675K0918K4208q8659k0471P4311r46O480L2081p5191l7503O4025
167C981k851Q623N0271p6253n6109Q0472P63k7167P7100l2790j06374O5623N1866
180C7155o5635M7824L9964j10282Q045R0214n1850q810O5221o4883l9377Q0921
192B8507p661m0480M5225j7622m9965N0105J7409m1953K4595O25m6093L7836K8667
205B9195m2149J1251J3095m1214J9333L7787k7854m868J5074k8448N980L6816
217B3998j8651r968J9603k7515n362M0606j5124j6475K6757k2928j8169M0336
$$ plain form
229 17108 8756 -17274 14395 7275 -28263 5024 17694 -21774 -967 21316 -20141 -10884 20648
242 20648 -13524 -12003 22830 -5358 -15096 16482 -3543 -15656 19254 9457 -14923 7554 5927
255 5927 -15224 9784 17184 -10926 -1092 5604 -13907 4387 17648 -8658 -7545 3003 -11751
268 -11751 -1455 16672 -2137 -12259 -1796 -7816 -2916 17098 3238 -13173 -1237 -4545 -4482
281 -4482 19903 11023 -13446 -5212 -1186 -2659 16511 15763 -9134 -11007 -2803 -2567 12360 18502
295 18502 -7996 -17955 -4021 -2472 7258 18726 -3887 -21236 -9976 -1632 8147 17924 604
308 604 -19857 -12867 1114 9255 17733 7830 -17198 -17067 2466 12851 18472 9158 -14358 -17740
322 -17740 -1900 11806 19538 9637 -13951 -21614 -5927 11922 17008 8719 -11297 -24634 -11446
$$ packed form
229A7108q352k6030L1669p120l5538L3287J2670l9468K0807K2283m1457R257L1532
242B0648l4172J521L4833k8188r738L1578k0025j2113L4910r797k4380K2477j627
255E927k1151K5008P400k8110R834O696j9511J8294J3261k6306J113J0548j4754
268a1751J0296J8127j8809j0122J0463o020M900K0014j3860j6411J1936l308O3
281d482K4385q880k4469Q234M026j473J9170p48k4897j873Q204K36J4927O142
295A8502k6498r959J3934J549R730J1468k2613j7349J1260Q344R779R777j7320
308F04k0461O990J3981Q141Q478r903k5028J31J9533J0385N621r314k3516l382
322a7740J5840J3706P732r901k3588p663J5687J7849N086q289k0016j3337J3188
$$ plain form
335 -11446 10457 18226 11098 -9943 -24233 -12492 9007 20271 13710 -6795 -21195 -14292 7902
348 7902 24411 16931 -4996 -20376 -15657 6498 22495 18035 -1261 -20944 -19555 3314 22016
361 22016 17981 -3851 -21754 -20549 -2619 19687 21530 -1915 -21187 -21167 -4855 18937 22785
374 22785 671 -19004 -19984 -5075 17230 26996 7436 -19317 -19977 -3879 13493 26654 12019
387 12019 -18168 -21555 -5671 9783 24002 14448 -17022 -26453 -7288 9544 17926 15242 -10770
400 -10770 -29508 -11177 10931 17124 14623 -7512 -27561 -12364 11965 19638 15542 -3350 -23931
413 -23931 -16119 11070 23440 15544 -2562 -21168 -17778 7164 21897 17810 -852 -23274 -20423
426 -20423 3605 18029 18121 1810 -23118 -22733 120 14254 17129 7738 -18477 -26028 775 16780
$$ packed form
335a1446K1903P769p128k1041j4290J1741K1499J1264o561k0505j4400O903K2194
348G902J6509p480k1927j5380M719K2155J5997m460j9296j9683J389K2869J8702
361B2016m035k1832j7903J205J7930K2306J843k3445j9272K0J6312K3792L848
374B2785k2114j9675r80J4909K2305R766j9560k6753o60J6098J7372J3161j4635
387A2019l0187l387J5884J5454J4219r554l1470r431J9165J6832Q382k684k6012
400a0770j8738J8331K2108O193k501k2135k0049J5197K4329P673m096j8892k0581
413b3931P812K7189J2370p896j8106j8606L390K4942J4733m087j8662k2422K851
426b0423K4028J4424R2j6311k4928L85K2853J4134K875r391k6215p551K6803J6005
$$ plain form
440 16780 11564 9738 -7518 -26774 -3792 21322 12279 5433 -2205 -21163 -8831 20640 15587
453 15587 -502 -3430 -15982 -14496 16743 21019 -3272 -8883 -13149 -16191 10476 23540 474
466 474 -12025 -12674 -14650 4932 25349 9008 -13343 -13186 -9719 448 21149 17740 -6090 -15672
480 -15672 -10557 2635 16068 13420 1321 -10840 -16110 -381 16355 8953 -1320 -4880 -14801
493 -14801 -8678 15068 10917 -8757 -3912 -4596 -13597 8656 18899 -8691 -11451 3045 -5523 1324
507 1324 18628 349 -15311 102 2631 157 15756 6341 -17180 -4620 6648 -1161 10968
520 10968 11638 -16154 -14111 6270 1637 3019 12396 -6345 -20296 -1133 7542 508 6928 3476
534 3476 -14780 -10035 6750 7031 2964 2693 -1823 -7828 -3449 8731 8574 -2021 -828 2306 -4787
$$ packed form
440A6780n216j826j7256j9256K2982K5114r043o846p638j8958J2332K9471n053
453A5587j6089k928j2552J486L1239M276k4291n611m266l042K6667J3064k3066
466D74j2499o49j976J9582K0417j6341k2351J57L467J0167K0701l409k3830r582
480a5672N115J3192J3433k648j2099j2161n270J5729J6736p402j0273l560r921
493a4801O123K3746m151j9674M845o84r001K2253J0243k7590k760J4496q568O847
507A324J7304j8279j5660J5413K529k474J5599r415k3521J2560J1268p809J2129
520A0968O70k7792K043K0381m633J382R377j8741j3951J9163Q675p034O420l452
534C476j8256M745J6785K81m067k71m516o005M379J2180j57j0595J193L134p093
$$ plain form
549 -4787 -1275 9265 1224 -6644 3387 2164 -7791 2422 4390 -9621 -756 8831 -5713 -4932
563 -4932 4731 -6583 -6270 9477 3104 -6121 2798 -1424 -8727 6552 9295 -4113 2165 3919
577 3919 -9358 -316 11410 -69 -1403 6098 -4024 -7768 4678 3765 -3343 3150 2256 -8201
591 -8201 -4437 2420 -1111 0 3867 -648 -6923 -5214 1985 3023 592 4739 1659 -9579 -4035
606 -4035 8251 3809 502 6491 -1728 -11036 2589 9354 -659 2544 3837 -9703 -4682 7940
620 7940 467 -1872 3747 -5515 -7972 4766 2871 -4987 1225 -563 -7320 3619 6387 -6027
634 -6027 -1872 3817 -4485 1460 10942 -1435 -8055 1738 2584 280 8087 5279 -8297 -6697 2438
649 2438 3357 5279 4821 -4951 -9945 -4082 3909 6458 2870 -2787 -8251 -8357 1484 8671 4162 -2435
$$ packed form
549d787L512J0540q041p868J0031j223r955J0213J968j4011Q865R587j4544P81
563d932R663j1314L13J5747o373r225Q919m222p303J5279K743j3408O278J754
577C919j3277R042J1726j1479j334P501j0122l744J2446r13p108O493q94j0457
591h201L764O857l531J111L867m515o275J709P199J038k431M147l080j1238N544
606d035J2286m442l307N989q219r308J3625O765j0013L203J293j3540N021J2622
620G940p473k339N619r262k457J2738j895p858O212j788o757J0939K768j2414
634f027M155N689q302N945R482j2377o620R793Q46k304P807k808j3576J600R135
649B438R19J922m58r772m994N863P991K549l588n657n464j06R841P187m509o597
$$ plain form
665 -2435 -4865 -6338 -1947 8395 8392 -2094 -4418 -2383 -2194 5846 10081 -544 -5770 -1649 -1241 3019
681 3019 8645 724 -8816 -3880 1253 1096 5413 2666 -9657 -8141 1848 2998 4170 3396 -7295
696 -7295 -10098 821 6553 4906 3741 -2783 -10121 -2429 9007 7829 2817 -1390 -7857 -4793 6244
711 6244 9208 3574 -2878 -7528 -6080 2700 8682 3861 -4062 -7489 -6610 162 7309 5082 -3137
726 -3137 -8261 -6088 1280 6412 5815 -229 -6897 -6067 1618 7412 6827 733 -5455 -6034 718 7959
742 7959 6802 552 -4649 -6725 -1818 7117 6872 -731 -5860 -6789 -3034 4414 7048 474 -6769 -7003
758 -7003 -3155 3500 8016 1936 -6078 -5932 -2236 3307 8629 4708 -4335 -6527 -1891 3805 7493
773 7493 5738 -2575 -7175 -2903 2376 6053 5622 -2362 -7936 -4343 1197 4641 4207 -1721 -7248 -5843
$$ packed form
665b435k430j473M391J0342lj0486k324K035J89Q040M235j0625n226M121M08M260
681C019N626p921r540M936N133j57M317k747j2323J516R989J150J172p74j0691
696g295k803J0919N732j647j165o524p338P692J1436j178n012m207o467L064J1037
711F244K964n634o452m650J448Q780N982m821p923l427Q79O772P147k227q219
726c137n124K173P368N132n97o044o668Q30P685N794n85o094o188n79O752P241
742G959j157o250n201k076M907Q935k45p603n129r29L755P448K634o574p243k34
758g003L848O655M516o080q014J46L696N543N322l921r043k192M636N696L688
773G493j755q313m600M272N279L677m31p984n574L593N540L444m34n928n527J405
$$ plain form
789 -5843 500 4851 4198 -908 -6304 -5121 1101 4872 5334 1081 -4996 -4436 1364 5415 5862 1513
805 1513 -4306 -4408 533 4552 5143 1637 -4391 -6089 -904 3829 3583 1116 -3949 -6691 -2341 2715
821 2715 3573 1469 -3103 -5961 -2392 2859 4389 2090 -1466 -4220 -2301 3195 5058 3037 -308
836 -308 -3595 -2238 2922 4479 2580 -84 -3587 -3529 1217 3968 1889 -1522 -3593 -3793 -475 3066
852 3066 1761 -1422 -3160 -3550 -513 2897 2153 -413 -2404 -2486 368 3043 3023 1089 -1234 -1891 252
869 252 3305 3081 294 -853 -1406 -1184 1893 2863 -137 -1922 -2168 -1563 491 1448 -17 -2032 -2509
886 -2509 -1433 -8 1382 492 -1619 -1350 -515 317 1940 1453 -325 -282 243 793 1946 1915 82 -668
904 -668 557 903 373 1015 574 -1601 -913 531 -335 -992 -469 -798 -1440 -576 -32 -840 -785 55 -625 -159
$$ packed form
789e843O343M351o53n106n396J183O222L771M62m253o077N60N800M051M47m349
805A513n819j02M941M019N91l506o028j698N185M733k46k467n065k742M350N056
821B715Q58k104m572k858L569N251J530k299l556k754J919N496J863k021l345
836c08l287J357N160J557j899k664l503N8M746K751k079l411k071k00L318L541
852C066j305l183j738l90L037L410p44k566j991q2K854K675k0j934k323o57K143
869B52L053k24k787j147n53K22L077R70l000j785k46O05K054R57j465k015m77
886b509J076J425J390q90k111K69Q35Q32J623m87j778M3N25N50J153l1j833p50
904f68J225L46n30O42m41k175O88J444q66o57N23l29o42Q64N44q08N5Q40o80M66
$$ plain form
924 -159 610 -159 -160 525 696 861 657 744 603 569 1000 946 461 173 7 486 339 -120 -488 -751 -746 -179 -267
947 -267 -301 -1015 -2010 -946 666 -59 -439 -218 -1535 -1438 1225 1960 74 262 83 -1590 930 3601
965 3601 1050 -307 713 -1108 -822 2964 2314 -1370 -954 -446 -1691 516 2327 -1087 -2429 -1105
981 -1105 -1521 -130 1811 -591 -2363 -1109 -552 188 1957 859 -1693 -929 825 1407 2183 1604 -1260
998 -1260 -1239 802 1969 2383 1049 -1281 -1999 -938 1637 2418 -50 -2112 -2313 -2052 -245 2764 1140
1015 1140 -3164 -2858 -1026 -999 1809 3395 -1533 -3292 54 278 1277 4113 927 -3103 -487 1803
1031 1803 913 2538 2156 -2390 -2106 1526 1045 879 1191 -2387 -2987 594 712 99 302 -2281 -3533
1048 -3533 141 1996 366 -265 -1204 -2855 -334 3008 2201 413 -1021 -2067 87 2573 3200 1902
$$ packed form
924a59P69p69jO85J71J65k04Q7j41l4M31n4m85k88j66M79j47m59l68k63NN67q8
947b67l4p14r95J064J612p25l80K21j317R7K663P35j886J88j79j673K520K671
965C601k551j357J020j821K86L786o50l684M16N08j245K207J811l414j342J324
981a105m16J391J941k402j772J254N57P40J769j098k552P64J754N82P76n79k864
998a260K1K041J167M14j334k330p18J061K575P81k468k062k01K61J807L009j624
1015A140m304L06J832K7K808J586m928j759L346K24R99K836l186m030K616K290
1031A803q90J625l82m546K84L632m81j66L12l578o00L581J18o13K03k583j252
1048c533L674J855j630o31r39j651K521L342q07j788j434j046K154K486O27j298
$$ plain form
1064 1902 -1427 -2502 -76 1711 2195 2338 -738 -4064 -1455 1694 466 629 688 -4005 -3649 1743
1080 1743 1134 -571 976 -1652 -3721 954 2802 -133 339 207 -2254 452 3815 741 -515 771
1096 771 -1422 -97 3664 1294 -1307 -380 -1422 -1110 2486 1862 -2000 -2036 -1402 -1762 1143 2510 -1014
1113 -1014 -2551 -1746 -1194 1045 2416 524 -1187 -1703 -961 1872 2851 994 -200 -706 -1295 1256 3219
1130 3219 815 -615 228 -1725 -580 2976 693 -2181 -307 -945 -1910 1405 1267 -2542 -1602 -97
1146 -97 -1265 519 1974 -1524 -1919 809 -144 541 2791 -182 -2132 905 1111 667 2511 948 -2061
1163 -2061 -387 1230 319 1498 1100 -2167 -1805 429 -123 421 585 -1826 -2300 -570 -100 525 650
1180 650 -1306 -1486 -150 153 712 1623 -201 -1037 893 826 578 1950 373 -1191 885 1190 -58
$$ packed form
1064A902l329j075K426J787M84J43l076l326K609L149j228J63N9m693L56N392
1080A743o09j705J547k628k069M675J848k935M72j32k461K706L363l074j256J286
1096G71k193J325L761k370k601R27j042L12L596o24l862l6O34l60K905J367l524
1113a014j537Q05N52K239J371j892j711n16P42K833R79j857j194n06n89K551J963
1130C219k404j430Q43j953J145L556k283k874J874o38r65L315j38l809R40J505
1146i7j168J784J455l498l95K728r53O85K250k973j950L037K06m44J844j563l009
1163b061J674J617r11J179l98l267L62K234n52N44J64k411m74J730M70O25J25
1180F50j956j80J336L03N59R11j824q36J930o7k48J372j577j564K076L05j248
$$ plain form
1197 -58 1126 433 -1770 -366 974 -469 -294 178 -1905 -1583 798 -327 -892 286 -1310 -1786 917
1214 917 750 -509 646 82 -1191 689 1645 265 627 862 -580 398 1676 329 184 672 -737
1231 -737 -377 910 -199 -472 -122 -1092 -793 167 -475 -879 -224 -760 -974 233 -4 -825 259 180 -581
1250 -581 818 808 -247 602 805 -200 897 1312 -141 338 1151 -204 -189 942 -302 -773 553 -475
1268 -475 -964 338 -523 -1450 -25 -148 -1252 -132 -4 -1042 -27 386 -531 66 645 -289 422 1359
1286 1359 63 154 999 40 239 1473 321 -302 433 -104 -433 665 86 -1087 -358 -395 -1096 92
1304 92 95 -1260 -621 -293 -891 97 521 -721 -506 346 94 570 1216 24 -420 787 554 476 1430 361
1324 361 -713 284 476 37 755 168 -1218 -560 10 -557 75 -35 -1364 -1166 -47 -415 -91 171 -1070
$$ packed form
1197e8J184o93k203J404J340j443J75M72k083L22K381j125n65J178j596m76K703
1214I17j67j259J155n64j273J880R56j380L62K35j442R78J278j347j45M88j409
1231g37L60J287j109k73L50r70K99R60o42m04O55n36k14J207k37q21J084p9p61
1250e81J399j0j055Q49K03j005J097M15j453M79Q13j355J5J131j244m71J326j028
1268d75m89J302q61r27J425j23j104J120J28j038J015M13r17N97N79r34P11R37
1286A359j296R1Q45r59J99J234j152o23P35n37l29J098n79j173P29l7p01J188
1304I2Lj355O39L28n98R88M24j242K15Q52k52M76O46j192m44J207k33p8R54j069
1324C61j074R97J92m39P18n87j386O58N70n67O32j10j329J98J119l68L24K62j241
$$ plain form
1343 -1070 -816 352 295 500 898 -322 -519 855 1091 697 1047 218 -537 473 1112 586 463 -44 -1182
1362 -1182 -453 560 -91 -135 -513 -1481 -954 130 -6 -432 -520 -1220 -741 335 613 75 77 -459 -663 1014
1382 1014 1314 520 436 50 -334 814 1419 671 147 -336 -761 59 895 109 -658 -651 -1171 -695 512 60
1402 60 -860 -881 -1128 -482 591 277 -258 -476 -531 -14 867 1069 265 -122 -11 251 1102 1246 461 -187 -370
1423 -370 -147 602 909 -26 -614 -883 -739 25 456 -229 -1017 -1120 -935 -281 600 55 -853 -589 -334 102
1443 102 878 795 -168 -200 133 589 1016 1036 282 -327 74 599 671 610 -150 -745 -475 46 58 -53 -495 -1106
1465 -1106 -1048 -361 242 -18 -459 -811 -992 -106 629 469 44 -123 -345 133 1045 1233 423 -115 191 92
1485 92 579 1173 492 -326 -306 -160 -46 249 163 -621 -951 -523 -176 -86 -11 -692 -909 -432 37 242 -10 -239
$$ packed form
1343a070K54J168n7K05L98j220j97J374K36l94L50q29p55J010O39n26j23n07j138
1362a182P29J013o51m4l78r68N27J084j36m26q8p00M79J076K78n38Kn36k04J677
1382A014L00p94q4l86l84J148O05p48n24m83m25Q20Q36p86p67Pn20M76J207m52
1402F0r20k1k47O46J073l14n35k18n5N17Q81K02q04l87J11K62Q51J44p85o48j83
1423c70K23P49L07r35n88k69J44P64M31o85p88j03J85O54Q81n45r08K64K55M36
1443A02P76q3r63l2L33M56M27K0p54o09M01N25P2o1p60n95K70N21J2j11m42o11
1465a106N8O87O03k60m41l52j81Q86P35j60m25j67k22M78R12J88q10n38L06r9
1485I2M87N94o81q18K0J46J14K95q6p84l30M28L47R0P5o81k17M77M69K05k52k29
$$ plain form
1507 -239 -322 -10 509 964 517 63 63 288 664 1125 662 -111 -70 23 -105 666 581 -770 -826 -307 -655 -266
1529 -266 413 -572 -1238 -418 -433 -542 367 168 -905 -359 480 11 302 1004 -103 -173 710 532 397 850
1549 850 213 -54 302 445 183 26 -93 -355 -259 59 -293 -352 -489 -668 -350 -244 -256 -109 -619 -712 159
1570 159 175 25 496 88 -289 358 768 418 674 689 -187 205 896 64 111 878 -308 -647 484 26
1590 26 -654 241 -172 -1152 -273 26 -910 -406 354 -606 -434 434 -272 -435 523 337 -16 610 359 75
1610 75 512 666 295 470 447 -162 75 264 90 192 47 -429 -275 -303 -329 -162 -377 -661 -256 -349 -603 -120
1632 -120 -25 -470 -188 314 -273 200 529 -49 180 1006 260 98 790 202 -154 981 570 -397 221 163
1652 163 -594 62 601 -613 -634 -238 -849 -591 347 -387 -712 -138 -520 -443 409 277 -192 -13 24 172 622
$$ packed form
1507b39q3L12N19M55m47m54%K25L76M61m63p73M1R3j28P71q5j351n6N19l48L89
1529b66O79r85o66Q20j5j09R09j99j073N46Q39m69K91P02j107p0Q83j78j35M53
1549H50o37k67L56J43k62j57j19k62R6L18l52n9j37j79L18J06j2J47n10r3Q71
1570A59J6j50M71m08l77O47M10l50K56J5q76L92O91q32M7P67j186l39J131m58
1590B6o80Q95m13r80Q79K99r36N04P60r60J72Q68p06j63R58j86l53O26k51k84
1610G5M37J54l71J75k3o09K37J89j74J02j45m76J54k8k6J67k15k84M05r3k54M83
1632a20R5m45K82N02n87M73L29n78K29Q26p46j62O92n88l56J135m11r67O18n8
1652A63p57O56N39j214k1L96o11K58R38p34l25N74l82P7Q52j32m69J79L7J48M50
$$ plain form
1673 622 714 61 380 290 228 726 623 66 223 2 -106 444 130 -459 -260 -246 -602 24 161 -886 -702
1694 -702 -152 -536 -142 565 -360 -598 273 69 66 980 425 -458 371 672 318 765 912 -402 -166 611
1714 611 89 244 520 -505 -773 89 -160 -306 143 -656 -994 -232 9 -198 -47 -255 -632 -145 295 125
1734 125 382 258 -307 255 673 616 571 267 -210 178 553 479 423 28 -470 -361 234 38 -264 -55 -849
1755 -849 -911 133 50 -296 -207 -546 -791 -45 447 -23 -2 35 -365 255 909 448 202 378 -63 176 760
1776 760 575 40 86 -146 -142 414 310 -229 -384 -417 -591 -69 137 -439 -601 -537 -602 6 340 -261 -302 -132
1798 -132 -74 263 672 287 25 159 155 490 807 582 -9 -21 -17 40 577 258 -432 -325 -356 -320 109 -88 -575
1821 -575 -659 -413 -396 -170 136 -307 -526 -138 21 103 521 109 -66 207 312 460 765 361 93 114 263
$$ packed form
1673F22R2o53L19r0o2M98j03n57J57k21j08N50l14n89J99J4l56O26J37j047J84
1694g02N50l84L94P07r25k38Q71k04lR14n55q83Q29L01l54M47J47j314K36P77
1714F11n22J55K76j025k68Q62k49j46M49p99l38P62K41k07J51k08l77M87M40j70
1734A25K57j24n65N62M18n7m5l04m77L88L75p4n6l95m98J09N95j96l02K09p94
1755h49o2J044q3l46Q9l39k45P46M92m70K1L7m00O20O54m61k46J76m41K39N84
1776G60j85n35M6k32MN56j04n39j55l3j74N22K06n76j62O4o5O08L34o01m1J70
1798a32N8L37M09l85k62J34mL35L17k25n91j2MN7N37l19o90J07l1L6M29j97m87
1821e75q4K46J7K26L06m43k19L88J59Q2M18m12j75K73J05J48L05m04k68K1J49
$$ plain form
1842 263 307 362 262 -308 -390 173 -197 -69 -84 -632 -540 -269 -265 -91 -120 -484 -448 -141 51 43 156 17 -211 99
1866 99 330 368 540 355 52 298 383 306 422 178 -219 -55 182 171 -85 -215 -483 -429 -158 -189 -405 -288
1888 -288 -395 -428 -16 -73 -80 4 -56 -84 260 396 293 199 178 252 432 499 321 215 323 -72 58 208 -19 -91
1912 -91 -185 -211 -201 -193 -264 -371 -466 -477 -296 -120 19 -283 -147 -124 -92 257 207 99 221 160 196 640 442 185 245
1937 245 240 253 203 258 203 -122 13 -74 -201 -114 -220 -581 -306 -187 -269 -357 -261 -397 -333 -61 -11 -22 -44 121 -34
1962 -34 293 344 230 237 187 277 232 327 381 69 -4 268 -133 -16 159 -174 -465 -237 -202 -286 -168 -218 -520 -496 -104
1987 -104 -177 -93 70 -224 -261 240 222 48 247 220 55 214 551 337 97 295 140 125 303 205 -239 -109
2009 -109 -250 -175 -168 -154 -290 -534 -326 -111 -278 -105 -73 -380 -263 33 52 154 214 220 -118 210 541 128 336
$$ packed form
1842B63M4N5j00n70q2N63l70J28j5n48R2K71MJ74k9l64L6L07J92qJ13j39k28L10
1866I9K31L8J72j85l03K46Q5p7J16k44l97J64K37j1k56j30k68N4K71l1k16J17
1888b88j07l3M12n7pQ4o0k8L44J36j03r4k1P4J80O7j78j06J08l95J30J50k27p2
1912i1r4k6J0Qp1j07r5j1J81J76J39l02J36K3L2L49n0j08J22o1L6M44j98k57O0
1937B45nJ3n0N5n5l25J35q7j27Q7j06l61K75J19q2q8R6j36O4K72N0j1k2J65j55
1962c4L27N1j14Pn0R0m5R5N4l12p3K72m01J17J75l33k91K28L5q4J18n0l02K4L92
1987a04p3Q4J63k94l7N01j8j74J99k7j65J59L37k14k40J98j55j5J78r8m44J30
2009a09j41P5PJ4j36k44K08K15j67J73L2l07J17K96J9J02O0Ol38L28L31m13K08
$$ plain form
2032 336 409 -132 27 452 306 7 265 41 -360 -46 53 -314 -430 -121 -513 -423 -17 -200 -380 -215 -249
2053 -249 -250 -3 240 -240 -94 242 182 188 488 257 39 152 395 312 263 248 35 -176 109 144 -114 22 -185
2076 -185 -496 -303 -33 -206 -388 -105 -303 -410 -67 233 -284 -62 277 -179 81 480 105 52 363 178
2096 178 81 516 471 -105 164 334 -59 -8 256 -254 -388 26 -153 -408 -6 -285 -523 -264 -46 -248 -196
2117 -196 19 -164 -337 76 240 -35 118 233 103 251 412 573 252 167 292 -150 199 328 -28 -128
2137 -128 62 -208 -343 92 -106 -449 -246 -140 -495 -264 25 -318 -394 156 -110 -103 140 128 -51 260 514
2158 514 -34 221 521 208 162 519 112 -13 346 52 -221 71 53 -42 -177 -60 -269 -325 -54 -261 -446
2179 -446 -96 -232 -365 -223 107 41 1 123 57 103 331 344 269 257 375 182 207 376 247 73 123 70 -140
$$ packed form
2032C36P3n41J59M25j46k99K58k24m01L14R9l67j16L09l92R0M06j83j80J65l4
2053b49jK47K43m80J46L36o0OL00k31k18J13K43q3m9j5k13k11K85L5k58J36k07
2076a85l11J93K70j73j82K83j98j07L43L00n17K22L39m56K60L99l75n3L11j85
2096A78r7M35m5n76K69J70l93N1K64n10j34M14j79k55M02k79k38K59K18k02N2
2117a96K15j83j73M13J64k75J53J15j30J48J61J61l21q5J25m42L49J29l56j00
2137a28J90k70j35M35j98l43K03J06l55K31K89l43p6N50k66PK43j2j79L11K54
2158E14n48K55L00l13m6L57m07j25L59k94k73K92j8r5j35J17k09n6K71k07j85
2179d46L50j36j33J42L30o6m0J22o6M6K28J3p5j2J18j93K5J69j29j74N0n3k10
$$ plain form
2202 -140 -90 -54 -170 -314 -43 -257 -298 -192 -291 -344 -195 -32 -248 -121 69 -74 -127 252 136 33 357 309
2224 309 120 277 364 190 106 339 139 3 203 17 -198 -20 -168 -321 -115 -120 -253 -282 -256 -194 -361 -202
2246 -202 -72 -70 33 -23 -96 94 220 202 253 40 73 263 264 208 174 19 86 168 67 26 134 -62 -157 -136 -158 -224
2272 -224 -135 -189 -486 -222 -138 -223 -52 -142 -216 -96 151 81 82 247 139 -57 379 369 123 300 256 34 261 310
2296 310 19 44 -7 -193 -1 28 -126 -265 -296 -297 -402 -124 -110 -251 -132 -203 -216 192 -71 41 136 -50 28 216
2320 216 284 237 296 196 160 180 431 77 107 84 -330 55 212 -176 -205 -144 -411 -126 -135 -246 -68 -218 -286 -126
2344 -126 39 22 -129 128 -10 -41 307 250 159 281 234 59 312 405 109 101 89 -96 -5 78 -192 -117 -107 -358
2368 -358 -228 -38 -256 -311 -263 -364 -298 -41 -6 -162 -57 27 -124 117 360 119 88 223 65 216 497 186
$$ packed form
2202a40N0L6j16j44K71k14m1J06r9n3J49J63k16J27J90j43n3L79j16j03L24m8
2224C09j89J57Q7j74q4K33k00j36K00j86k15J78j48j53K06nj33k9K6O2j67J59
2246b02J30KJ03n6p3J90J26j8N1k13L3J90Jn6l4j55O7Q2j01m1J08j96r5K1k2o6
2272b24Q9n4k97K64Q4q5J71r0p4J20K47p0JJ65j08j96M36j0k46J77m4k22K27M9
2296C10k91K5n1j86J92K9j54j39l1jj05K78J4j41J19p1j3M08k63J12R5j86P8J88
2320B16O8m7N9j00l6K0K51l54L0k3m14L85J57l88k9O1k67K85rj11J78j50o8J60
2344a26J65j7j51K57j38l1L48n7r1J22m7j75K53R3k96qj2j85R1Q3k70P5J0k51
2368c58J30J90k18n5M8j01O6K57L5j56J05Q4j51K41K43k41l1J35j58J51K81l11
$$ plain form
2390 186 188 307 29 -13 235 -9 -82 -124 -266 -329 -64 -87 -345 -248 -267 -334 -109 69 -335 -89 -28 -93 164 230
2414 230 17 -5 105 150 240 422 310 28 231 148 6 103 101 -86 2 -133 -247 -28 -12 -234 -253 -270 -147 -71
2438 -71 -77 -181 -212 -178 26 100 229 109 -36 168 -19 282 420 198 125 122 99 338 318 197 -138 -115 -87 -128 17
2463 17 -84 -409 -340 -234 -263 -35 -68 -291 -322 -91 -1 -80 111 11 -179 75 174 179 302 268 -96 8 299 271
2487 271 210 208 -117 -86 -26 137 -23 -211 -203 -286 -215 -37 -105 -63 -286 -315 -194 -34 142 -49 -233 -91 115 74
2511 74 233 293 93 -3 326 337 205 381 154 -201 63 273 33 69 -60 -309 -299 98 -85 -234 -103 -312
2533 -312 -364 -135 66 -203 -42 37 -136 -64 234 176 -61 16 29 102 324 414 55 21 59 144 140 259 40 -138
2557 -138 -83 -46 -110 -113 -20 -197 -443 -139 -148 -173 -116 -144 -283 -153 8 87 -57 54 66 -100 205 333 155 270
$$ packed form
2390A86KJ19k78m2K48k44p3m2j42o3K65k3k58R7j9o7K25J78m04K46O1o5K57O6
2414B30k13k2J10M5R0J82j12k82K03q3j42R7kj87Q8j35j14K19J6k22j9j7J23P6
2438g1oj04l1L4K04P4J29j20j45K04j87L01J38k22p3lk3K39k0j21l35K3K8m1J45
2463A7j01l25O9J06k9K28l3k23l1K31R0p9J91j00j90K54R9NJ23l4l64J04K91k8
2487B71o1kl25L1O0J63j60j88Qq3P1J78o8M2k23k9J21J60J76j91j84J42K06m1
2511G4J59O0k00r6L29J1j32J76k27l55K64K10k40L6j29k49J0L97j83j49J31k09
2533c12n2K29K01k69J61P9j73P2K98n8k37P7J3P3K22R0l59l4L8Q5mJ19k19j78
2557a38N5L7o4lR3j77k46L04rk5N7k8j39J30J61P9j44J11J2j66L05J28j78J15
$$ plain form
2581 270 222 -52 128 330 126 40 175 19 -99 114 -9 -243 -206 -155 -191 -196 -31 -160 -234 -194 -176 -146 36 145
2605 145 -121 -58 150 131 199 329 129 42 174 294 96 232 265 38 -63 125 23 -115 -56 -100 -295 -90
2627 -90 -163 -226 -247 -131 -288 -263 -107 -113 -92 -114 30 -169 125 196 138 124 70 89 220 331 360 206 29 202 50
2652 50 75 116 -33 -249 11 -106 -94 -103 -145 -308 -331 -132 -145 -183 97 -117 -120 75 122 -35 122 254 3 104
2676 104 287 222 190 291 21 -231 239 236 38 119 -32 -190 -175 35 -99 -191 -119 -323 -279 -48 -108 -126 -72 -91
2700 -91 -108 8 87 16 -10 12 182 193 293 218 202 25 86 167 192 209 56 -92 -133 57 -6 -49 -20 -126 -354 -80
2726 -80 -56 -212 -47 -49 -229 -180 12 -22 25 28 -66 -7 251 327 130 122 189 11 155 214 184 -30 29 -78 -60 57
2752 57 -12 -88 -93 -245 -145 -4 -45 -173 -234 -175 -211 -12 -13 -16 -25 -148 -20 253 224 178 202 83 9 340 248 212 43
$$ packed form
2581B70m8k74J80K02k04q6J35j56j18K13j23k34L7N1l6nJ65j29p4M0J8L0J82J09
2605A45k66O3K08j9O8J30k00q7J32J20j98J36L3k27j01J88j02j38N9m4j95K05
2627i0p3o3k1J16j57K5J56oK1k2J44j99K94P1n8j4n4J9J31J11K9j54j77J73j52
2652E0K5M1j49k16K60j17J2rm2j63k3J99j3l8K80k14lJ95M7j57J57J32k51J01
2676A04J83o5l2J01k70k52M70lj98Q1j51j58J5K10j34r2P2k04M4K31o0j8N4j9
2700i1j7J16P9p1k6K2J70J1J00p5j6j77O1Q1K5J7j53j48m1J90o3m3K9j06k28K74
2726h0K4j56J65kj80M9J92l4M7Lr4N9K58P6j97qO7j78J44N9l0k14N9j07J8J17
2752E7o9p6nj52J00J41m1j28o1N9l6J99jlrj23J28K73k9m6K4j19p4L31r2l6j69
$$ plain form
2779 43 -65 -145 215 214 -118 -115 -152 -363 -126 44 -100 -180 -264 -244 -124 60 -105 -189 -182 -213 -42 284 264 56 17
2804 17 5 157 329 424 172 -73 -10 25 98 305 3 -127 -237 -186 -38 71 -33 -286 -332 -336 -51 33 -23 -260
2828 -260 -267 -198 23 172 154 -156 -24 48 150 447 364 65 66 64 136 293 260 62 -147 -155 -34 128 -38 -37 -343
2853 -343 -292 -113 -65 27 -127 -417 -283 -179 -9 85 133 -28 -138 110 193 263 220 -12 31 81 221 253 192 -29
2877 -29 -151 24 25 156 47 -207 -171 -139 -138 138 -66 -177 -245 -153 -20 -11 124 -81 -184 -125 142 177 321 91
2901 91 -17 -38 191 250 238 5 -6 -90 144 87 76 30 -175 -211 -110 2 -136 -118 -200 -380 -134 -37 -25 -14 -160
2926 -160 -86 -36 -23 123 125 33 -77 -11 250 250 197 68 43 26 161 59 77 23 -53 -66 -35 -65 -69 -66 -182 -207 -137 -69
2954 -69 -113 5 -33 -241 14 25 42 63 -14 13 153 171 157 80 65 90 12 165 209 120 95 -54 -153 4 92 -39
$$ packed form
2779D3j08q0L60jl32Ll7k11K37J70j44q0q4K0J20J84j65q4Pl1J71L26k0k08l9
2804A7j2J52J72R5k52k45O3L5P3K07l02j30j10N1J48J09j04k53m6mK85Q4n6k37
2828b60pO9K21J49j8l10J32P2J02K97q3k99JkP2J57l3j98k09qJ21J62j66Jl06
2853c43N1J79M8R2j54k90J34J04J70R4M8j61j10K48Q3P0m3k32M3N0J40L2o1k21
2877b9j22J75JJ31j09k54L6L2JK76k04j11o8R2J33RJ35k05j03N9K67L5J44k30
2901I1j08k1K29N9j2k33j1q4K34n7j1m6k05l6J01J12j38J8q2j80K46R7J2J1j46
2926a60P4N0J3J46Kr2j10O6K61%n3j29k5j7J35j02J8n4p6j3L1l0mLj16k5P0O8
2954f9m4J18l8k08K55J1J7K1p7K7J40J8j4p7j5K5p8J53M4q9k5j49r9J57Q8j31
$$ plain form
2980 -39 -52 -69 -79 -269 -125 -79 -113 -121 -154 -97 100 34 11 59 -49 99 19 174 200 135 -8 114 77 126 219 131 -4
3007 -4 -41 -5 59 18 -21 -87 -264 -111 -92 -185 -17 -93 -268 -214 -114 74 -20 67 -76 -26 142 153 176 222 213 67 38
3034 38 170 199 238 166 -52 -75 36 124 20 -164 -175 -127 -147 -46 -193 -220 -108 -203 -157 14 111 -53 -93 -83 30
3059 30 156 167 78 4 -72 130 313 159 229 25 -89 61 179 -3 10 -196 -313 -68 28 -73 -149 -152 -216 -239
3083 -239 -23 -26 -211 -135 -242 -159 36 160 64 -30 -49 -26 200 198 308 65 -8 17 -20 191 248 -38 -210 -92 -79
3108 -79 -20 87 -21 -317 -287 -114 -59 -58 2 -225 -291 -161 87 133 -19 -30 -50 119 284 291 108 133 -75 67 232
3133 232 320 167 34 -50 -23 20 189 22 -203 -241 -81 -48 3 -7 -113 -288 -230 39 -28 34 77 -86 -55 97
3157 97 171 169 16 -30 30 175 169 194 98 -1 -124 -15 151 -75 -13 -159 -193 -195 113 -10 -94 -217 -304 -134 -1 10
$$ packed form
2980c9j3j7j0j90J44M6l4ql3N7J97o6k3M8j08J48q0J55K6o5j43J22l7M9R3q8j35
3007dl7L6O4m1l9o6j77J53J9r3J68p6j75N4J00J88r4Q7j43N0J68J1K3M6rj46k9
3034C8J32K9L9p2k18k3J11Q8j04j84j1M8k0J01j47k7J12r5M6J71R7j64m0J0J13
3059C0J26J1q9p4p6K02J83j54P0k04j14J50J18j82J3k06j17K45R6j01p6lo4k3
3083b39K16lj85P6j07Q3J95J24r6r4j9K3K26kJ10k43p3K5l7K11N7k86j72J18J3
3108g9N9J07j08k96L0J73N5JO0k27o6J30K48M6j52j1k0J69J65Pj83K5k08J42J65
3133B32Q8j53j33q4K7M3J69j67k25l8J60L3N1j0j06j75N8K69o7O2M3j63L1J52
3157I7P4kj53m6O0J45oK5r6r9j23J09J66k26O2j46l4kL08j23q4j23q7J70J33J1
$$ plain form
3183 10 -97 -94 -176 -94 -25 162 100 -93 10 48 107 235 169 -64 -84 41 199 98 71 42 -119 -89 13 56 -184
3208 -184 -139 -255 -244 -123 -6 -151 -119 -214 -154 -93 68 1 30 0 -66 -31 120 146 100 53 81 -43 33 202 39
3233 39 -23 -42 14 40 -6 0 -164 -197 -132 -92 -95 -82 -166 -229 -18 -77 99 -32 -49 -86 39 55 164 69 147 161 -47 64
3261 64 172 226 79 15 -71 13 19 14 -61 -12 -28 -47 -21 32 -15 -221 -34 -128 -40 119 -3 -65 -4 59 72 77 119 65 54
3290 54 154 75 83 95 18 19 75 49 -28 35 -41 -101 -116 -40 -41 7 -84 -141 16 -196 -53 -76 -35 -8 -75 -11 50 49 0 149
3320 149 11 124 104 80 149 14 123 32 40 57 -16 -170 -34 -49 -71 -96 4 -218 -75 -147 -158 -111 23 12 -134
3345 -134 -76 -82 50 43 23 89 7 34 221 136 187 21 41 31 143 100 77 27 29 -16 -67 -13 -33 -65 -105 -137 -184 23 6
3374 6 6 -61 -152 -78 -21 38 65 51 76 45 68 7 136 88 49 138 36 165 127 115 -56 13 13 86 103 -125 -240 -195 -176
$$ packed form
3183A0j07Lq2Q2O9J87o2j93J03L8N9J28o6k33k0J25J58j01k7k9j61L0J02M3k40
3208a84M5j16J1J21J17j45L2r5O0O1J61o7K9l0o6L5J51K6m6m7K8j24P6J69j63
3233C9o2j9N6K6m6Oj64l3O5M0lJ3q4o3K11n9J76j31j7l7J25J6J09r5P8J4k08J11
3261F4J08N4j47o4q6Q4Onp5M9j6j9K6N3m7k06J87r4Q8J59j22o2O1O3J3NM2n4j1
3290E4J00p9QJ2p7JN6k6p7O3p6o0j5P6jM8r1n7J57k12J43k3M1K7o7O4O1jm9J49
3320A49j38J13k0k4O9j35J09r1QJ7p3j54J36j5k2k5J00k22J43p2j1M7J34j1j46
3345a34N8oJ32pk0O6q2K7J87q5N1j66K0j0J12m3k3n0Km5n1N4k0l2m0l2m7K07j7
3374F%o7r1P4N7N9K7j4K5l1K3o1J29m8l9Q9j02J29l8j2j71O9%P3J7k28j15M5J9
$$ plain form
3403 -176 -14 -105 -174 -160 -195 -105 -62 116 2 -108 11 33 86 75 90 84 -50 86 134 181 53 13 -97 71 87
3428 87 -70 -72 -174 -177 -161 49 45 -15 -179 -178 -124 -30 102 51 -89 -150 -82 113 110 18 -2 -72 44 285 46 75 33 -36
3456 -36 -18 185 168 182 -40 -111 -32 -18 48 29 -176 -223 -142 21 -49 -24 -143 -154 4 -77 -18 63 86 -47 19 109 182
3483 182 125 110 -30 98 70 199 115 56 -1 -84 -32 72 32 -112 -94 -186 -182 83 -91 -78 -180 -233 -78 88 -18
3508 -18 -67 -75 -144 -27 145 231 146 74 4 115 178 223 130 -80 -56 -41 30 118 22 26 -258 -47 -142 48 -35 -122 -184 -111
3536 -111 54 -90 115 -26 -34 -120 8 175 70 27 3 -45 115 351 212 23 129 38 10 83 98 42 -150 -86
3560 -86 -19 -69 193 -69 -224 -163 -68 -7 -30 -111 -166 -145 -30 60 89 91 -2 -51 85 137 154 33 109 -6 61 215 28
3587 28 222 -52 -40 -97 -23 60 -3 -110 -98 -102 -118 10 -20 -132 -35 -56 -41 37 19 -68 -181 46 72 -25 104 -12
$$ packed form
3403a76J62r1o9J4l5R0M3J78j14j10J19K2N3j1J5oj34J36M8M7j28m0j10J68J6
3428H7j57kj02lJ6K10mo0j64JN4R4J32n1j40o1O8J95lr2k0p0J16K41k39K9m2o9
3456c6J8K03j7J4k22p1P9J4O6j9k05m7Q1J63p0K5j19j1J58q1N9Q1K3j33O6R0P3
3483A82n7j5j40J28k8J29q4n9n7q3N2J04m0j44J8r2MK65j74J3j02n3J55J66j06
3508a8m9qo9J17J72Q6q5p2p0J11O3M5r3k10K4J5P1Q8r6Mk84K11r5J90q3q7o2P3
3536a11J65j44K05j41qq6J28J67j05m3k4m8J60K36j39j89J06r1k8P3J5n6j92O4
3560h6O7n0K62k62j55O1R5O1k3q1n5K1J15R0K9Kr3m9J36N2J7j21P6j15O7J54j87
3587B8J94k74J2n7P4Q3o3j07J2mj6J28l0j12R7k1J5P8j8q7j13K27K6r7J29j16
$$ plain form
3613 -12 -30 123 133 93 119 236 -125 -104 6 29 24 -21 41 -51 10 -58 -127 -69 -120 -100 -190 96 -52 -32 48 21 20 -68
3641 -68 94 14 107 -50 30 33 95 226 -2 65 50 51 33 121 30 -8 -105 65 -164 -140 39 -110 -168 -17 -44 -115 -10
3668 -10 30 -127 10 -8 3 34 127 -80 -10 100 38 29 215 15 -97 -36 -33 57 104 93 -72 -61 -12 -27 20 59 -63
3695 -63 -209 -45 -151 54 72 -114 -87 -82 -21 157 24 44 67 -25 118 215 94 53 115 -121 25 159 121 5
3719 5 -136 -150 -124 79 48 -68 -262 -90 -168 -30 74 -8 -178 -152 8 47 71 60 -131 -103 -81 30 152 145 -43
3744 -43 -115 -12 87 151 142 202 -92 -95 14 208 74 -66 -299 -105 -47 29 0 -140 -169 -280 -95 65 151 -42 -220
3769 -220 -59 5 150 306 16 -83 -145 20 241 176 -21 -59 -193 73 143 219 119 -232 -192 -63 146 204 -73
3792 -73 -170 -303 -163 128 130 -11 -294 -261 -153 88 289 214 -145 -272 -36 177 301 266 -66 -196 -145 165 342
$$ packed form
3613a2j8J53J0m0K6J17l61K1J10K3nm5O2r2O1o8o9N8n1K0r0K86j48K0Q0k7jq8
3641f8J62q0R3j57Q0LO2J31k28O7j5Jj8Q8r1l8r7J70k29K4J79j49n8J51k7p1J05
3668a0M0j57J37j8J1L1R3k07P0J10o2rJ86k00j12O1LR0M7j1j65J1M9j5M7L9j22
3695f3j46J64j06K05J8j86K7NO1J78j33K0K3r2J43R7j21m1O2k36J46J34l8j16
3719Ej41j4K6K03l1j16j94J72p8J38J04q2j70K6J60L9K4j1j91K8K2J11J22pj88
3744d3p2J03R9O4rO0k94lJ09J94j34j40k33J94N8P6k9j40k9j11J85J60Q6j93j78
3769b20J61O4J45J56k90r9o2J65K21o5j97l8j34K66P0P6j00l51M0J29K09N8k77
3792g3r7j33J40K91Kj41k83L3J08K41K01p5l59j27K36K13J24l5l32j30N1L10J77
$$ plain form
3815 342 149 9 -246 -248 75 233 117 -53 -327 -238 15 179 94 -59 -248 -227 77 288 134 66 -210 -189
3837 -189 -16 420 244 66 -123 -269 39 274 338 37 -129 -260 -89 97 237 11 -203 -317 -140 120
3857 120 212 -2 -120 -318 -149 174 224 72 -139 -232 -139 124 254 118 -32 -218 -70 152 359 206 -170
3878 -170 -49 -197 -12 233 79 -82 -161 -291 5 90 92 -107 -240 -170 -86 167 197 -64 -112 -112 12 145 247
3901 247 113 -59 -232 51 223 269 30 -50 -123 -18 231 91 -23 -267 -173 -105 141 37 -45 -252 -333 -41
3923 -41 77 104 68 -209 -216 -61 25 143 157 -4 -196 6 -25 177 208 13 -57 38 115 199 84 -40 -75 -132 7
3948 7 -2 44 18 -208 -211 -80 35 -10 -79 -153 -96 117 20 96 -84 -83 -5 -15 64 132 35 20 66 17 262 229 99 42 -35
3977 -35 38 -14 24 -57 -137 -87 -120 -56 -95 116 -75 -179 -71 82 27 -70 -32 3 -39 53 20 38 24 5 15 25 -41 75
$$ packed form
3815C42j93j40k55kL23J58j16j70k74Q9K53J64q5j53j89K1L04K11j54o8k76K1
3837a89J73M36j76j78j89j46L08K35O4l01j66j31J71J86J40k26k14j14J77K60
3857A20R2k14j18j98J69L23N0j52k11r3R3K63J30j36j50j86J48K22K07j53l76
3878a70J21j48J85K45j54j61p9j30K96Q5Kj99j33P0Q4K53L0k61m8%J24J33J02
3901B47j34j72j73K83J72M6k39q0p3J05K49j40j14k44R4O8K46j04q2k07q1K92
3923d1J18K7l6k77pJ55Q6J18J4j61j92K02l1K02L1j95p0R5P7Q4j15j24l5n7J39
3948GrM6k6k26lJ31J15m5o9p4N7K13r7P6j80JP8j0P9O8r7j5M6m9K45l3j30n7p7
3977c5P3n2L8q1q0N0l3O4l9K11j91j04J08J53n5r7L8L5m2R2l3J8j4j9J0J0o6J16
$$ plain form
4005 75 61 103 84 28 127 -72 54 48 -50 -87 -117 -40 29 -82 -46 -51 -41 38 -63 19 111 24 -39 111 94 34 117 157 -111
4034 -111 -54 108 138 50 68 49 -48 11 -17 -30 -82 -46 -127 0 31 39 -66 -151 -71 -226 -22 119 -22 -9 -159 -71
4060 -71 -31 123 135 20 -116 45 101 185 130 11 -55 -98 134 110 95 -101 -145 -204 24 128 -2 60 -183 -252 3
4085 3 47 115 100 -134 -304 -119 47 197 100 -127 -233 -77 303 254 111 -35 -60 -54 168 273 116 -135 -174 -273
4109 -273 -66 227 134 -156 -304 -110 4 156 79 -182 -392 -216 147 217 196 22 -231 -145 138 281 277 31
4131 31 -175 -155 108 322 270 -41 -100 -341 58 267 254 -87 -242 -344 -52 158 161 -15 -267 -304 -121 205 321
4154 321 169 -202 -267 -36 125 145 314 -116 -357 -48 272 347 122 -57 -253 -198 251 281 241 -48 -293 -208
4176 -208 64 298 43 -164 -147 -413 13 282 190 -179 -322 -265 134 304 284 -82 -257 -180 7 282 325 -25
$$ packed form
4005G5j4M2j9n6R9j99J26or8l7l0P7O9j11L6nJ0P9j01Q2R2q7o3J50j7o0Q3M0k68
4034a11N7J62L0q8J8j9r7N9k8j3n2L6q1J27L1Qj05q5Q0j55K04J41j41J3j50Q8
4060g1M0J54J2j15j36J61N6Q4n5j19o6m3K32k4j5j96m4n9K28J04j30O2k43o9K55
4085CM4O8j5k34j70J85J66J50r7k27j06J56L80m9j43j46k5OK22J05j57k51l9r9
4109b73K07K93r3k90j48J94J14J52p7k61k10J76L63P0k1j74k53Q6K83J43mk46
4131C1k06K0K63K14n2l11n9k41L99K09j3l41j55j02K92K10Lj76k52l7J83L26J16
4154C21j52l71o5K31J61K0J69m30k41L09L20P5k25j79j96N5M49L0m0k89k45Q5
4176b08K72K34k55k07J7k66M26K69r2l69j43N7L99J70k0l66j75P7J87K75M3l50
$$ plain form
4198 -25 -183 -114 157 287 227 17 -135 -188 -1 203 191 23 -230 -268 -4 89 159 40 -284 -277 -126 228 309 99
4222 99 -126 -176 -124 258 312 137 -81 -213 -96 188 280 222 -169 -261 -38 22 118 75 -173 -230 -78 80 187 71
4246 71 -177 -289 -145 77 157 140 -18 -203 -208 73 311 217 66 -164 -149 -42 111 247 36 -56 -207 77 140
4269 140 207 60 -245 -168 19 142 59 -3 -183 -187 -64 91 98 -48 -77 -171 -109 57 75 87 -17 -154 53 158
4293 158 231 30 -13 -37 -43 142 101 163 -2 -103 -92 58 26 62 -80 -144 -171 -59 22 57 -121 -67 -130 -50 118 -25
4319 -25 0 -4 -43 36 -20 182 33 -39 77 -13 121 108 64 -126 -49 47 18 -32 118 -100 -85 -114 -52 -34 -29 -92 -87 -65
4347 -65 -62 -29 -32 17 3 66 10 70 -59 163 86 -11 -43 85 148 24 116 23 58 -86 -34 14 11 54 -109 -111 -148 -183 50
4376 50 43 -88 -63 -27 -13 -12 10 -97 -47 -25 -12 101 101 49 -165 5 65 15 83 -11 -126 -113 -11 -15 50 34 -19 -176
$$ packed form
4198b5j58O9K71J30o0k10j52n3J87K04j2j68k53l8K64R3P0j19l24PJ51L54Q1k10
4222I9k25n0N2L82N4j75k18j32J17K84R2n8l91r2K23O0R6m3k48n7J52J58J07j16
4246G1k48j12J44K22Q0j7j58j85nK81K38r4j51k30J5J07J53J36k11r2j51K84O3
4269A40O7j47l05P7J87J23q3o2j80mJ23J55Pj46k9r4O2J66J8J2j04j37K07J05
4293A58P3k01m3k4oJ85m1O2j65j01J1J50l2L6j42o4k7J12Q1L5j78N4o3Q0J68j43
4319b5K5ml9P9n6K02j49p2J16r0J34j3m4j90P7R6k9n0J50k18J5k9O2J8No3NK2
4347f5LL3lM9j4O3n6O0j29K22p7r7l2J28O3j24R2r3L5j44N2M8lM3j63kl7l5K33
4376E0pj31K5L6J4JK2j07N0K2J3J13%n2k14J70O0n0O8r4j15J3J02mO5j6n3j57
$$ plain form
4404 -176 -75 14 0 -80 6 -64 -8 24 103 11 -48 14 22 51 129 79 -70 -160 -52 127 114 132 9 -77 -51 127 129 107
4432 107 -77 -249 -169 24 140 90 -2 -170 -147 -107 114 112 -79 -167 -107 23 283 170 18 -58 -71 76 143 146 77
4457 77 -124 -94 -26 233 169 99 -159 -245 -57 153 202 13 -203 -232 -55 0 81 -20 -77 -340 -117 127 260 105
4481 105 -11 -92 10 87 268 127 -46 -181 1 77 329 222 -102 -141 -121 119 153 210 -64 -198 -104 75 194
4504 194 66 -1 -249 -110 16 204 189 -49 -135 -252 11 252 194 40 -235 -123 26 167 241 9 -177 -169
4526 -169 -24 84 206 -58 -140 -192 -33 15 176 13 -338 -287 -202 -14 181 191 -89 -307 -49 155 201 169 -138
4549 -138 -188 -110 50 157 124 -86 -122 -116 6 209 125 64 -208 -261 53 88 118 -184 -274 -191 46 94 129 11 -216
4574 -216 -279 50 99 284 -82 -180 -201 -12 211 199 73 -131 -214 137 240 98 80 -97 -141 -20 110 44 88
$$ packed form
4404a76J01Q9j4q0Q6p0N6L2P9r2n9O2QK9P8n0j49r0J08J79j3J8j23q6K6J78Kk2
4432A07j84j72Q0J93J16n0r2j68K3M0K21kj91q8O0J30K60j13j52p6j3J47O7Lo9
4457G7k01L0O8K59o4p0k58q6J88K10M9j89k16k9J77N5Q1j01n7k63K23K44J33j55
4481A05j16q1J02P7J81j41j73j35J82P6K52j07l24l9K0K40L4N7k74j34R4J79J19
4504A94j28o7k48J39J26J88j5k38q6j17K63K41n8j54k75J12J49J41P4k32j86Q
4526a69J45J08J22k64q2n2J59M8J61j63l51N1Q5J88J95J0k80k18K58K04M6l2l07
4549a38n0P8J60J07l3k10l6OJ22K03q4o1k72n3L14L5L0l02r0Q3K37M8L5j18k27
4574b16o3L29M9J85l66r8k1J89K23j2j26k04q3L51J03j42j8j77m4J21J30o6M4
$$ plain form
4597 88 -205 -152 -180 82 148 -62 -132 -182 -70 61 160 -1 3 -174 -21 6 45 229 -58 -46 4 128 111 27 42
4622 42 -123 -49 74 174 -16 -87 -163 -180 -20 90 -71 38 -115 -160 -23 9 92 -74 -56 -116 -62 106 72 67 46
4647 46 -51 -86 36 109 -28 -46 4 10 32 29 -9 -65 -24 29 -4 87 -72 -96 -136 -28 11 4 -26 53 -38 -69 106 33 65
4676 65 33 -68 -4 69 21 36 -69 -35 111 79 31 26 -34 -103 -75 -73 -116 -9 -14 -102 -24 -46 -39 -38 -59 -79 97 -10 -160
4705 -160 73 -79 103 126 55 -48 -54 31 108 132 57 82 -25 45 49 24 112 12 -85 -80 0 -67 -32 -86 46 -37 77
4732 77 84 -53 -5 -105 -54 37 150 94 -50 -104 -57 -9 143 120 -33 -118 43 60 119 203 20 -154 -147 41 20 48
4758 48 -86 -136 -57 77 13 8 -98 -96 -23 -23 96 65 91 -41 -97 -5 84 185 127 -85 -52 13 80 79 45 -97 -67 -83
4786 -83 95 82 12 -127 -239 -12 59 -70 -83 -162 -146 -42 53 88 105 -82 -139 -104 100 121 108 4 -178 -57 78
$$ packed form
4597H8k93N3k8K62O6k10p0n0J12J31R9j61Mj77J53K7L9J84k87J2N0J24j7q4J5
4622D2j65P4J23J00j90p1p6j7J60J10j61J09j53m5J37L2Q3j66J8o0N4J68l4nk1
4647D6r7l5J22P3j37j8N0OK2ll8n6M1N3l3R1j59k4m0J08L9pl0P9r1l1J75p3L2
4676F5l2j01O4P3m8J5j05L4J46l2m8no0o9K8Km3J07nq8P8k2PJk1k0J76j07j50
4705a60K33j52J82K3p1j03oQ5P7K4p5K5j07P0Mk5Q8j00r7NQ0o7L5n4J32q3J14
4732G7Pj37M8j00N1R1J13n6j44n4M7M8J52k3j53q5J61J7N9Q4j83j74PJ88k1K8
4758D8j34n0P9J34o4nj06KP3%J19l1K6j32n6R2Q9J01n8k12L3O5O7jl4j42L0j6
4786h3J78j3p0j39j12K27P1j29j3p9J6J04R5L5J7j87n7L5K04K1j3j04j82J21J35
$$ plain form
4811 78 277 128 39 -188 -87 -67 100 145 65 -149 -230 1 32 19 -42 -55 -216 33 -8 47 161 -131 -160 38
4835 38 86 149 2 -31 -122 -114 34 146 3 -118 -7 -45 130 167 127 -119 -100 -57 -76 51 -3 -86 -113 -54 23 -6
4861 -6 107 -188 -197 -11 -43 255 136 16 -174 -132 40 79 102 -36 -92 -94 86 63 110 178 -73 -162 -89 -30 139 -18
4887 -18 -192 -125 34 0 92 48 -111 -203 -20 44 173 84 -142 -171 -79 -14 171 11 -29 -107 -69 130 154 165 63
4912 63 -95 -71 80 70 75 -128 -101 -113 23 8 52 -87 -63 -45 111 51 120 -43 16 -158 -17 99 12 43 -132
4937 -132 -90 -28 97 133 -2 2 -60 -6 75 38 -91 23 -37 3 38 128 -3 -53 -179 27 59 -75 85 -24 -83
4962 -83 -107 33 108 -1 5 -58 -1 65 125 72 -58 -30 -63 49 149 49 35 -85 -58 50 67 53 17 -51 -52 -44 -93 16
4990 16 -33 -112 -38 49 -17 -12 -76 -29 -10 53 49 110 -92 -7 -67 21 63 4 64 -33 -2 34 -46 35 84 36 98 6 1 40 -97
$$ packed form
4811G8J99j49q9k27J01K0J67M5q0k14q1K31L1j3o1j3j61K49m1N5J14k92k9J98
4835C8M8O3j47l3r1QJ48J12j43j21J11l8J75L7m0k46J9M3j9J27n4q3k7N9P7k9
4861fJ13k95rJ86l2K98j19j20j90M2J72L9K3j38n6kJ80k3M7O8k51q9P3N9J69j57
4887a8j74O7J59l4R2m4j59r2J83O4J29q9k26k9R2O5J85j60m0p8L8J99K4J1j02
4912F3j58K4J51j0Nk03K7j2J36j5M4j39K4J8J56o0O9j63N9j74J41J16q7L1j75
4937a32M2O2J25L6j35Mo2N4Q1l7j29J14o0M0L5R0j31n0j26K06L2j34J60j09n9
4962h3k4J40P5j09Oo3N7O6O0n3j30K8l3J12J00j00j4j20K7J08J7j4l6o8jQm9J09
4990A6m9p9P4Q7o6No4M7J9O3mO1k02Q5o0Q8M2n9O0r7L1L6q0Q1M9m8O2r2nL9j37
$$ plain form
5021 -97 -44 -64 -14 -77 -24 -35 -38 0 1 -51 -76 17 90 9 21 14 35 41 -21 36 88 -6 -56 -10 51 98 46 84 -9 -32 -18 -132
5053 -132 -34 73 -105 -130 -1 109 -107 -90 25 -35 -42 -47 -12 50 20 -8 -12 -5 -23 39 -69 -37 36 67 53 -83 -16 1
5081 1 11 -79 47 -50 -22 -9 96 95 61 14 -89 -99 -97 -53 135 101 79 -16 -127 8 93 130 -56 -90 11 23 -22 19
5109 19 -7 16 -70 -95 4 17 -195 -63 -11 -93 -21 122 26 -66 -32 -99 106 34 21 -40 68 99 52 167 95 -28 -27
5136 -27 38 208 -10 75 -51 -105 -23 60 -19 68 -85 -90 -97 -101 -68 -75 -18 -57 -118 10 41 -25 31 -131 15 9 158 71 -60
5165 -60 -33 -57 -61 85 59 130 -96 -10 12 47 114 -23 -3 -131 -41 0 -11 10 -25 -5 -113 -14 43 -57 0 -70 45
5192 45 25 74 10 38 -48 -6 124 30 14 -129 8 42 74 56 45 -92 -112 -151 56 125 11 -9 -69 -100 -83 -15 58
5219 58 -83 -92 -39 -33 55 76 90 -24 -109 146 5 29 6 24 43 9 142 41 -6 97 5 -81 82 81 -139 -174 -79
$$ packed form
5021i7N3k0N0o3N3j1lL8Jn2k5R3P3q1J2pK1Oo2N7N2r4n0M6O1M7n2L8r3k3J4j14
5053a32R8J07j78k5J29J10k16J7J15o0pnL5O2l0k8mPj8O2j08L2P3L1j4j36O7J7
5081AJ0r0J26r7K8J3J05jl4m7j03j0KM4J88l4k2r5j11J35Q5L7j86l4J01J2m5M1
5109A9k6K3q6k5R9J3k12J32N2q2P2J43r6r2L4o7K05p2j3o1J08L1m7J15p2j23J
5136b7O5J70k18Q5j26n4Q2Q3p9Q7j53npmL3pN7l9o1J28L1o6N6j62J46oJ49q7j31
5165f0K7k4mJ46k6P1k26Q6K2L5O7j37K0j28R0M1j1K1l5K0j08R9N7j00N7p0J15
5192D5k0M9o4K8q6M2J30r4j6j43J37L4L2j8j1j37k0l9K07O9j14k0o0l1J7O8P3
5219E8j41rN3OQ8K1J4j14q5K55j41K4k3J8J9l4J33j01m7J03r2q6J63jk20l5R5
$$ plain form
5246 -79 -82 -54 -66 -123 -53 -90 25 -14 -24 7 69 -73 -50 27 137 42 -15 -77 13 5 59 34 -78 -45 98 55 118 19 -96
5275 -96 -77 27 -10 170 -16 -23 -151 -114 -4 84 87 -95 -10 46 84 55 19 51 -63 38 85 111 5 -78 -49 16 84
5302 84 83 -61 -12 12 -95 38 -8 66 -3 -64 4 -63 52 -7 34 -52 -14 -20 -13 55 -53 6 16 32 31 93 -8 -1 -100 3
5332 3 73 36 -52 45 -78 -20 68 -45 -38 87 -48 50 -38 -4 -38 -26 -4 -6 62 96 -74 -31 -47 37 53 58 17 17 43 34 5
5363 5 198 -36 87 -76 -66 21 9 29 -72 -8 41 -94 -46 -65 -70 5 -82 1 25 -97 18 7 114 40 44 75 14
5390 14 28 26 -14 89 -1 -60 -46 43 146 -110 -21 -37 3 18 -51 -43 -132 -115 88 82 -72 -7 -30 -93 -20 67 3 -65 -91
5419 -91 -1 8 37 43 50 -24 27 -12 -1 29 49 92 -71 55 13 100 -61 -31 -61 33 -26 86 -30 -76 -27 54 44 51 -55
5448 -55 60 16 25 2 59 -45 60 -5 -131 99 79 -35 -6 -52 -18 29 63 75 48 16 -63 -67 52 19 -101 9 -108
$$ packed form
5246g9lK8j2n7P0l7J15l9j0L1O2j42K3P7J10r5n7o2R0qN4k5j12L3J43m3O3r9j15
5275i6J9J04l7J80j86pj28L7J10Q8Lj82Q5N6L8k9l6L2j14J01M7K6j06q3K9O5O8
5302H4jj44M9K4j07J33m6P4o9o1O8o7J15n9M1q6L8oPO8j08N9J0J6jO2j01Pr9J03
5332CP0l7q8R7j23N8Q8j13PJ25j35R8q8L4l4J2K2kO8L4j70M3j6Q4J6Nm1%K6rk9
5363EJ93k34J23j63J0Q7j2K0j01O4M9j35M8j9nP5q7Q3K4j22J15j1J07p4ML1o1
5390A4J4km0J03r0n9J4Q9J03k56Q9j6M0J5o9Qq9J7K03oj54O5k3o3P3Q7o4o8k6
5419i1R0RK9OPp4N1l9J1L0K0M3j63J26m2Q7j61L0l0R4n9J12j16m6M9Q1j0Pj06
5448e5J15m4Rk3N7j04J05o5j26K30k0j14K9m6L4M7L4J2k7l2p9mJ19l3j20J10j17
$$ plain form
5475 -108 -109 6 -75 -9 -43 -47 23 63 -47 14 32 12 -1 95 -32 128 -53 -16 8 90 102 -76 -75 -9 12 106 19 -31
5503 -31 -4 -108 79 25 61 -30 -64 -175 -127 -41 130 26 8 -56 -34 69 101 -20 86 -83 -59 -56 140 114 -61
5528 -61 -139 -107 19 32 41 5 81 -66 -73 2 53 -47 -89 -126 -94 66 -122 49 -44 -22 141 39 39 119 -59 -92 26
5555 26 -40 71 15 -20 -76 -24 47 93 -22 -66 -122 -22 -111 -71 1 27 16 -19 -48 -55 -49 -97 -183 24 -5 -72 38 -56 -4
5584 -4 8 -82 149 65 20 68 40 98 7 -17 6 -57 -57 -33 -52 35 -103 23 -91 4 22 59 -32 -57 51 55 64 56 -7 -28
5614 -28 80 196 -33 -9 61 58 11 60 41 17 -39 -8 -84 -28 64 -38 -31 -83 -59 -49 47 -10 -111 -22 48 -53 114 -61
5642 -61 2 -1 -23 16 88 91 103 -55 51 26 -5 83 37 -50 62 -15 -70 -57 -121 9 -74 -21 -75 82 -32 -64 102 53
5670 53 -56 91 10 -6 -30 -84 52 88 -27 -8 -12 -2 67 30 124 39 98 121 -35 108 -53 74 -52 13 -10 0
$$ packed form
5475a08jJ15q1O6l4mP0M0j10O1J8k0j3R6j27J60j81L7K4Q2J2j78JO6K1R4q7n0
5503c1K7j04J87n4L6r1l4j11M8Q6J71j04j8o4K2J03L2j21J06j69K4LJ96k6j75
5528f1p8L2J26J3Rl6P6j47pP5N1j00m2l7L2J60j88J71r3K2J63j02%Q0j78l3J18
5555B6o6J11n6l5n6N2P1M6j15m4n6J00q9M0P2K6j1l5k9pOm8q6K07k9o7J10r4N2
5584dJ2r0K31q4m5M8k8N8r1k4K3o3%K4j9Q7j38J26j14R5J8L7r1k5J08MRqo3k1
5614b8J08J16k29K4P0lm7M9j9k4n6L1p6N6R2j02Pn2K4J0R6n7j01Q9P0j01J67j75
5642f1O3lk2L9P2LJ2j58J06k5l1Q8m6q7J12p7n5J3o4J30q3N3n4J57j14l2J66m9
5670E3j09J47q1j6k4n4J36L6j15J9mJ0O9l7R4q5N9K3j56J43j61J27j26O5k3J0
$$ plain form
5696 0 -23 -127 -98 -160 -64 -46 0 -11 32 11 -34 -29 -26 -14 -24 -46 -2 42 -7 70 43 96 3 124 -29 26 29 31 30 -52 34 -29
5728 -29 -20 -104 -54 -31 -60 82 35 -26 -69 30 24 6 -56 -54 49 -24 31 10 -50 -62 -86 -21 16 4 -40 21 44 -35 -5 4 0 10
5760 10 105 -11 54 -50 -97 -67 17 -2 9 -26 -54 -16 -8 27 100 -73 16 31 63 -19 32 -60 -5 133 -39 45 54 -9 -79
5789 -79 -106 39 13 -92 -139 -120 8 23 107 -27 -78 -33 32 22 -11 16 84 -96 35 78 -37 14 102 -15 -31 71
5815 71 -97 -22 -72 -17 -31 -1 29 105 27 12 23 42 24 34 25 -97 -6 -27 -82 52 10 51 75 48 60 -1 13 4 9 11 93
5846 93 90 23 60 -110 -34 -16 -38 46 -131 -25 5 60 -17 19 -55 -126 -25 18 -29 -3 30 -19 -19 -15 -29 -11 -22 10 19 -25
5876 -25 -10 110 -18 -38 33 -41 16 43 -46 -24 -33 18 -39 90 5 -46 -93 -8 -104 -115 67 -117 -12 -6 -17 129 27
5903 27 -100 -72 7 81 30 33 -16 105 36 1 101 11 -70 -95 18 33 -74 -53 -8 -157 -20 -52 99 34 -48 -110 -85
$$ packed form
5696@k3j04K9o2R6J8M6j1M3k1m5NLJ2j0k2M4M4m9P7k7N3r3J21j53N5LKjq2Q6o3
5728b9Rq4N0K3k9J42m7o1m3R9oj8o2KJ03p3N5k1o0j2k4O5L7j2m4O1K3p9L0RmJ0
5760A0R5j16O5j04m7L0Q4j9J1l5k8L8QL5P3j73Q9J5L2q2N1r2N5J38j72Q4Ro3p0
5789g9k7J45k6j05m7J9J28J5Q4j34n1M5O5j0l3K7O8j80J31M3j15N1Q8j17j6J02
5815G1j68P5n0N5j4L0L0P6p8j5J1J9j8J0rj22R1k1n5J34m2M1K4k7J2o1J4rNKQ2
5846I3lo7L7j70P6J8k2Q4j77J06L0N5p7L6p4p1J01M3m7K6L3m9%Mj4J8j1L2Rm4
5876b5J5J20j28k0P1p4N7K7q9K2rN1n7J29q5n1m7Q5r6j1J82j84J05Oj1J46j02
5903B7j27K8P9P4n1Lm9J21o9l5J00r0q1k5J13J5j07K1M5j49J37l2J51o5q2o2K5
$$ plain form
5930 -85 21 62 51 -114 -33 -39 74 57 -3 -21 13 83 34 -33 48 -61 -24 158 67 -25 -46 -115 -27 25 27 9 -90 3 -53
5959 -53 -60 20 29 -90 -56 -36 70 90 -11 103 43 48 63 18 16 152 -8 -28 -43 8 -20 55 58 28 -95 64 -47 -23
5987 -23 -30 1 1 14 10 -62 -39 -41 -54 -71 9 -5 -60 0 41 69 129 0 47 0 4 73 118 22 116 -52 -26 -65 4 -17 -97 -19
6019 -19 -4 -88 32 2 -52 11 -18 57 50 -106 75 15 -39 117 7 -20 28 -3 -47 2 23 -32 118 -24 -40 -88 32
6046 32 45 -42 41 -23 -3 -122 -6 -34 -79 158 16 -40 -59 -41 12 65 48 73 -4 -100 6 -27 -1 -18 30 -9 4 -113
6074 -113 54 14 52 -45 44 -4 59 58 -156 11 -121 -16 -8 13 -66 -147 40 -59 -34 -37 10 20 -12 -5 -10 36 11 -154 22
6103 22 113 -59 -5 -12 -71 -8 -56 14 142 67 -41 -15 50 -151 16 -55 -11 41 -7 61 31 -62 -42 25 36 7 81 -66
6131 -66 65 -15 -119 -32 22 63 32 31 85 5 -82 -29 66 -69 59 31 26 -6 -52 -98 -102 4 5 -48 19 26 -23 2 14 125
$$ packed form
5930h5J06M1j1j65Q1oJ13j7o0j8L4P0m9o7Q1j09L7J82r1r2k1o9Q8N2Kj8r9R3n6
5959e3pQ0Rj19L4K0J06K0j01J14o0NJ5m5kJ36j60k0j5N1k8P5Ll0j23J59j11K4
5987b3pL1%J3mp2K3kj3j7Q0j4n5O0M1K8O0j29M7m7MO9M5r6R4j68K6l9O9k1q0P8
6019a9J5q4J20l0n4O3k9P5pj56J81o0n4J56j10k7M8l1m4M9K1n5J50j42j6m8J20
6046C2J3q7Q3o4K0j19J16k8m5K37j42n6j9J8N3N3j7K5p7r6J06l3K6j7M8l9J3j17
6074a13J67m0L8r7Q9m8O3jk14J67j32J05QK1p9q1J87r9K5lM7J0l2PnM6k5j65J76
6103B2R1j72N4pn9O3m8P0J28p5j08K6O5k01J67p1M4N2m8O8l0r3K0O7J1k9P4j47
6131f6J31q0j04Q7N4M1l1jN4q0q7N3R5j35J28k8nl2m6m6mJ06Jn3O7Pm9K5J2J11
$$ plain form
6161 125 61 -6 -5 66 63 -43 89 -58 -87 -22 107 -23 32 -40 -42 -20 -3 35 -62 15 -84 -51 17 16 -43 -3 25 -29 -49
6190 -49 -87 -19 63 24 14 -8 -28 84 29 19 68 63 -33 57 149 -34 -39 -38 53 16 -46 -61 -64 -82 -68 -41 -5 4 21 -79 -75 -130
6222 -130 39 -67 4 138 -105 43 10 -80 69 107 116 16 -9 -7 146 28 99 107 -103 -69 -124 16 59 -19 -87 -10
6248 -10 -102 -58 -87 -56 -91 8 -4 68 27 21 21 -103 7 29 78 138 -23 61 65 -76 62 3 -82 -13 -11 -132 58 23 -42
6277 -42 -28 44 105 29 -11 -121 -48 -27 40 -87 -33 -46 -69 20 -144 23 -4 35 -81 2 93 14 -31 56 11 54 -71
6304 -71 43 -7 -141 -50 -50 4 -106 8 -6 20 -36 26 13 -65 -46 -86 22 -72 91 -1 -20 -9 -86 13 44 37 -3 -39
6332 -39 -13 40 -4 -21 -71 61 -61 -49 -25 175 8 8 -181 -31 -6 -43 -85 -118 -65 5 61 -23 10 54 -35 32 -11 -22
6360 -22 127 -16 32 -6 105 15 54 18 18 143 34 -39 58 -54 52 -85 111 77 15 -98 -15 -92 24 -60 31
$$ packed form
6161A25o4o7JP1lj06J32j47k9O5J29j30N5p2kK2J7L8r7P7r9L3O8jn9M0K8n4k0
6190d9l8O8Q2l9j0k2k0J12n5j0M9nr6R0R2j83nJR1l7o2j5lj8J4K7L6RJ7j00Mn5
6222a30J69j06P1J34k43J48l3r0J49L8Rj00k5KJ53j18P1Qk10L4n5J40M3p8o8P7
6248a0r2M4k9L1l5R9j2P2m1o%j24J10K2M9O0j61Q4Mj41J38n9q5O9Kj21J90l5o5
6277d2J4P2O1p6m0j10P3K1O7j27N4j3k3Q9j64J67k7L9j16Q3R1p9m5Q7m5M3j25
6304g1J14n0j34R1%N4j10J14j4K6n6O2j3p8J9m0J08r4J63r2j9J1p7R9L1pm0l6
6332c9K6N3m4j7n0J32j22J2K4K00j67%j89J50K5l7m2l3N3P0N6q4L3M4q9O7m3j1
6360b2J49j43M8l8J11r0L9l6%J25j09p3R7j12J06j37J96l4o2j13Q3p7J16q4R1
$$ plain form
6385 31 -79 -55 -29 33 64 -68 -32 -51 -32 -49 -57 -45 17 -164 69 55 5 13 10 -49 0 7 -24 28 24 -53 -49 -33 -32 -93 92
6416 92 -82 89 29 37 -45 12 126 122 35 15 165 39 -23 -88 -71 -16 32 -142 31 72 8 -5 119 -98 -107 -69 67
6443 67 -22 9 -69 -131 7 -90 -79 -25 71 2 1 -4 -9 10 80 53 53 -17 24 -26 -49 -36 -90 48 33 -70 60 -110 -31 -130
6473 -130 -71 -71 -22 -22 24 -112 14 16 152 18 -111 58 3 64 1 62 104 4 -67 77 56 -61 -26 78 -66 8
6499 8 -71 6 139 21 48 -15 -11 5 -8 -97 -50 -47 -57 -38 -36 -72 23 -41 8 37 -28 23 13 91 86 72 -53 -57 7 2 17 -19
6531 -19 -40 -98 99 -1 13 -121 -26 -22 -51 13 12 -114 0 81 -87 35 7 17 -2 57 -57 -38 3 -28 57 122 -68
6558 -68 30 -14 -2 -23 -21 -5 -48 108 -63 -9 65 -19 59 5 -20 -17 43 45 13 -6 30 -13 24 -6 5 81 -43 15 22 -15 93
6589 93 37 45 4 5 81 116 38 -12 -28 -26 9 102 -85 -94 -28 -47 43 80 -68 36 26 16 82 -19 8 90 -53 -38 60 10
$$ packed form
6385C1j10K4K6O2L1j32L6j9J9j7qJ2O2j81K33j4n0Qln9M9Pl1N2mp7MJ6Jo1J85
6416I2j74J71o0Qq2N7J14mq7k0J50j26o2o5J7N5M8j74J73M1o4j3J24k17rL8J36
6443F7q9L1p8o2J38r7J1N4R6o9jnnJ9P0k7%p0M1n0k3J3n4J38j5j03J30j70P9r9
6473a30N9%M9%M6j36J26KJ36j34j29J69n5O1o3O1M2j00p1J44k1j17L5J04j44P4
6499Hp9P7J33j18K7o3MJ6j3q9M7Lj0J9Kl6R5o4M9K9o5N1j0P8nj4j25mO4nJ5l6
6531a9k1n8J97j00J4j34R5Mk9O4jj26J14Q1j68J22k8J0j9N9j14J9M1l1Q5O5j90
6558f8R8m4J2k1KJ6m3J56j71N4P4q4P8n4k5LO0Kl2j9L6m3L7l0J1P6j24N8Pl7J08
6589I3n6Qm1JP6L5p8n0j6KL5R3j87rO6j9R0L7j48J04j0j0O6j01K7Q2j43J5R8n0
$$ plain form
6619 10 -28 -13 58 -130 61 8 55 -63 12 -54 1 -56 47 63 -17 10 46 -94 -93 38 -148 77 -16 -38 -20 13 22
6646 22 54 126 52 -73 101 -76 -11 -26 146 95 -6 33 61 74 20 36 8 -13 -36 12 -3 3 -161 -133 -49 -60 -36 -114
6674 -114 -49 -15 -20 12 15 11 25 -46 -82 43 113 161 153 31 -84 -23 164 77 -6 -53 -61 -22 -10 -68 25 -23 -21 -60 77 2
6704 2 -42 -94 -73 -95 -125 79 -37 -102 26 61 12 126 22 43 -81 16 -27 -68 48 -22 -8 -80 12 -69 47 20 -23
6731 -23 -38 -99 -38 -51 -33 -80 108 -104 28 33 -61 -71 11 -31 -27 106 18 37 96 52 -72 37 115 -22 -19 79 2 -35
6759 -35 -92 -88 -69 -86 -174 -21 108 -19 -159 -47 -54 -2 74 26 -101 -2 -21 151 144 34 53 -11 50 13 33 31 -127 -44
6787 -44 107 -59 -23 99 60 12 54 -53 3 -14 15 -61 -45 28 5 34 6 -95 -65 35 12 51 114 -94 62 -13
6813 -13 -52 85 82 -65 -124 14 63 122 115 14 -82 14 39 43 85 -79 -12 -1 -23 15 29 -131 -58 -156 34 104 -4 15
$$ packed form
6619A0l8J5P1j88J91n3M7j18P5o6N5n7J03J6q0K7L6j40JJ31j86K25r3k2J8L3R
6646B2L2P2p4j25J74j77O5j5J72n1j01L9K8J3n4J6k8k1k3M8j5Oj64K8Q4j1K4p8
6674a14O5L4nL2LmJ4p1l6J25P0M8qj22j15O1J87q7q3m7qL9J2n8R3m8Kl9J37p5
6704Bm4n2K1k2l0K04j16o5J28L5m9J14j04K1j24R7m3m1J16p0J4p2R2q1J16k7m3
6731b3j5o1O1j3J8m7J88k12J32Nr4j0Q2m2MJ33q8J9N9m4j24J09P8j37LR8p7l7
6759c5n7MJ9j7q8J53J29j27j40J12pN2P6m8j27R9j9J72pj10J9o4O1l7K0kj58Q3
6787d4J51j66L6J22l9m8M2j07N6j7K9p6J6P3k3K9k8j01L0J00k3L9O3k08J56p5
6813a3l9J37lj47n9J38M9N9pj01r6R6K5MM2j64O7J1k2L8J4j60P3r8J90P0j08J9
$$ plain form
6841 15 113 27 -68 84 57 73 -17 34 -32 50 -43 41 -41 19 17 -65 -97 50 -40 -50 -99 -21 -3 -173 -38 -59 -87 -17 45
6870 45 -93 -104 -23 -48 2 21 122 9 6 1 6 78 182 37 18 120 -120 -38 4 -65 -31 -17 39 -19 8 38 -22 1
6898 1 -67 -94 99 36 3 -47 -92 69 20 47 -40 9 65 -5 120 109 5 -14 78 -27 32 -36 7 -34 -54 -14 -5 -20 -4
6927 -4 -114 -77 -106 -74 -131 19 -60 55 73 96 92 -7 23 -23 23 27 100 42 70 69 41 -7 90 88 27 -21 -71 -94 3 36 -8
6958 -8 -85 -64 -32 -25 -91 57 41 -49 -64 46 79 40 -72 -24 28 86 82 140 47 -60 21 -12 29 33 51 -14 -130 -7 76
6987 76 24 -83 -107 -33 -48 52 -38 -121 18 -53 104 46 54 56 5 -68 12 -29 99 156 55 -17 86 27 30 11 13 2 52
7016 52 -128 20 22 -57 -123 -17 113 -94 7 -35 -86 -10 -6 -92 -18 3 30 99 34 -65 75 9 105 -43 -72 -27 64
7043 64 42 53 -10 5 3 -42 50 -140 -60 114 14 10 13 -11 -21 -30 -110 119 8 -29 -11 -91 57 87 55 61 59 -5 5 37
$$ packed form
6841A5R8q6r5J52k7J6r0N1o6Q2r3Q4q2O0kq2l2J47r0j0m9P8J8j70J35k1k8P0O2
6870D5j38j1Q1k5N0J9J01j13lnNP2J04j45j9J02k40Q2M2o9L4J4N6n8K7L0o0K3
6898Ao8k7J93o3l3n0m5J61m9K7q7M9N6p0J25j1j04j9R2j05N9o8M3m1k0M0Rj5J6
6927dj10L7k9L2n7J50p9J15J8K3mr9L0m6M6MP3n8K8jk8m8R7ko1m8n0k3R7L3m4
6958hp7K1L2Po6J48j6r0j5J10L3l9j12M8N2N8mN8r3j07Q1l3M1MJ8o5j16J23Q3
6987G6n2j07k4P4j5J00r0q3J39p1J57n8QKn1p3Q0m1J28N7j01p2J03n9Lj9Kj1N0
7016E2j80J48Kp9o6J06J30k07J01m2n1P6Mq6P4K1K7O9o5r9J40o6R6j48k9M5R1
7043F4k2J1o3J5km5R2j90Q0J74j00mLk4j0rq0K29j11l7J8q0J48L0l2Oko4J0L2
$$ plain form
7073 37 71 41 -63 -59 23 -44 17 17 -33 -10 -77 26 56 -125 67 -34 -35 -51 -7 -111 88 -56 32 -26 -7 -16 9 70
7101 70 36 -36 -1 112 -6 -23 -20 -37 49 6 8 -2 -11 -30 -14 86 33 -109 -32 63 49 71 -55 -45 -66 -23 -85 39 39
7130 39 -120 -57 -45 36 -11 59 39 -79 76 -24 26 111 -4 -90 -20 -16 -13 32 9 -81 -121 -14 -28 -6 -25 -116 -3 -58
7158 -58 -31 107 -109 15 -14 -132 110 125 -39 38 -12 -19 125 46 2 -33 -21 10 29 180 -121 24 20 -120 26
7183 26 89 -1 -18 -62 -46 -89 -95 106 -101 -44 -104 44 -26 97 46 20 -21 -74 69 103 81 16 -9 -7 25 130 50 48 -55
7212 -55 -12 -22 -81 56 -30 -94 -133 62 95 101 -14 61 45 -80 1 23 -31 36 -3 -7 8 98 22 30 -43 36 40 57 -34 29
7242 29 -31 47 23 -97 20 -37 5 -39 76 -2 15 -35 4 -102 58 -6 -9 132 15 108 127 20 57 60 -35 -30 73
7269 73 84 -90 63 107 23 -15 25 55 -17 -92 26 76 14 -17 22 -85 -17 -90 65 108 99 43 52 -112 82 181 95 21
$$ packed form
7073C7L4l0j04MQ2o7O1%n0K3o7J03L0j81J92j01jj6M4j04J99j44Q8n8J9rK5O1
7101G0l4p2L5J13j18j7Lj7Q6m3Kj0rj9J6J00n3j42P7R5j4K2j26J0k1M3o2J24%
7130C9j59O3J2Q1m7P0k0j18J55j00N0Q5j15q6P0MLM5k3r0m0J07j4K2j9r1J13n5
7158e8K7J38k16J24k9j18K42J5j64P7n0pJ44p9m4l5J2L1J9J51l01J45mj40J46
7183B6O3r0j7m4J6m3oK01k07N7o0J48p0J23n1k6m1n3J43L4k2o5k5KL2J05q0kj03
7212e5M3j0n9J37q6o4l9J95L3Oj15P5j6j25Q1K2n4O7l9mJ5R0p6Qp3P9MJ7r1O3
7242B9o0P8k4j20J17n7M2m4J15p8J7n0L9j06J60o4lJ41j17R3J9j07L7Lr5NJ03
7269G3J1j74J53M4q4l8M0L0p2p5J18N0o2l1L9j07O8p3J55M3rn6Rj64J94R9q6p4
$$ plain form
7297 21 -30 5 -17 -36 69 15 -123 11 114 78 11 -14 43 -11 -35 50 -39 -61 -86 -91 -71 83 106 11 -86 -103 16 -49
7325 -49 20 7 -32 76 9 -50 54 126 10 39 -5 87 -59 81 -72 -74 -72 -49 104 -58 -60 -123 51 -53 23 82 -16
7352 -16 -108 38 -80 51 -53 -65 -50 -102 -7 101 88 59 -70 64 -1 43 162 42 -25 26 -51 40 119 -21 9
7377 9 48 19 6 51 -17 -41 -27 -21 -9 38 -25 -32 -101 -38 8 63 102 18 46 63 22 93 -47 8 75 31 121 104 -143 5
7407 5 -45 48 6 -38 106 -23 5 92 -33 -107 -38 8 -8 15 -18 113 42 35 98 45 25 -32 36 144 69 -26 -94 69
7435 69 38 37 -17 -48 -34 -76 -17 -3 -26 -37 -60 -6 -23 -6 -29 21 -43 -44 61 33 -111 58 27 -62 -58 115 21 59 -29 10
7465 10 10 35 108 -21 -54 -11 40 31 -7 -100 -65 30 18 -46 -13 -2 0 -11 -39 -52 23 -15 -46 31 0 2 91 -34 -73 8 0 -10
7497 -10 45 61 14 38 -30 21 -3 35 53 85 -126 43 -4 -27 -33 81 57 35 76 24 -36 -9 22 28 12 19 118 115 -152 19
$$ packed form
7297B1n1L5k2j9J05n4j38J34J03l6o7k5N7n4k4Q5q9k2k5nK0J54K3r5r7j7J19o5
7325d9O9j3l9J08o7n9J04P2j16K9m4R2j46J40j53kKK3J53j62ko3J74j04P6N9r8
7352a6r2J46j18J31j04j2J5n2R5J08j3k9j29J34o5M4J19j20o7N1p7R1P9j40L0
7377IL9k9j3M5o8k4J4OJ2M7o3po9O3M6N5L9q4K8J7m1P1j40N5O7m4R0j7k47J48
7407En0R3m2m4J44j29K8Q7j25p4O9M6j6K3l3J31p1pO3n3k0n7O8J08p5r5o8J63
7435F9l1jn4l1J4m2N9J4k3j1k3N4j7J7k3N0o4jJ05k8j44J69l1q9MJ73r4L8q8L9
7465A0%K5P3j29l3M3N1rl8r3L5R5j2o4L3J1Kj1k8j3P5l8l1P7l1KQ9j25l9Q1qj0
7497a0N5J6m7K4o8N1k4L8J8L2k11J69m7k3oJ14k4k2M1n2o0K7L1Oj6PR9lk67J71
$$ plain form
7527 19 64 53 70 -136 -146 -51 38 80 167 -47 -14 -118 86 38 -30 0 -60 31 45 105 -31 -17 -18 -68 47 33 -1 69
7555 69 -52 -83 -58 9 23 -26 -73 -65 4 32 30 25 -33 -113 14 4 40 3 -103 -12 3 82 -29 33 -17 15 -95 33 86
7584 86 35 9 -51 -21 141 88 -55 23 62 -100 52 -26 3 72 -113 -62 -48 78 55 -22 -2 -89 -49 -68 21 -86 -36
7611 -36 70 -20 7 17 23 -30 -7 6 65 -12 12 -6 -42 81 57 45 -51 -3 -42 -66 22 127 46 45 -123 6 71 -49
7639 -49 7 22 -93 -73 12 -5 32 2 19 -41 73 43 -89 21 -95 -23 -6 167 50 19 61 52 24 146 27 -21
7665 -21 -19 -64 -56 -48 -35 26 -31 -51 -28 78 -65 128 58 126 -51 4 -70 140 -121 -74 9 -57 38 -15 -1 -10 37 -20 42
7694 42 86 -66 83 -56 38 95 10 71 -44 -17 -22 7 83 8 73 -34 32 139 6 20 -52 -40 -89 -12 51 -2 18
7721 18 105 88 32 -93 -71 -111 -62 -67 -24 -10 -18 -9 -92 -62 15 -63 10 64 8 -107 -88 -25 47 21 -61 -32 101 76 -37 49
$$ packed form
7527A9M5j1J7k06j0R5Q9M2Q7k14L3j04K04m8o8L0o0R1J4O0j36J4jn0J15j4l4P0
7555F9j21l1K5O7J4m9m7QO9K8knn8q0J27j0L6l7j06R1J5P9j11O2n0L2j10J28N3
7584H6n1k6o0L0J62n3j43P8L9j62J52p8K9O9j85N1J4J26k3p7K0q7M0j9Q9j07N0
7611c6J06r0K7J0On3K3J3N9p7K4j8l6J23k4j2r6M8l9k4Q8J05q1jj68J29O5j20
7639d9N6J5j15K0Q5j7L7l0J7o0J14l0j32J10j16P2J7J73j17l1M2rk8J22j19m8
7665b1Km5QQJ3O1n7k0K3J06j43J93p0O8j77N5p4K10k61M7Q3o6R5n3J4rM7n7O2
7694D2M4j52J49j39R4N7q5O1j15K7nK9P6p5O5j07O6J07j33J4p2J2m9P7O3n3K0
7721A8Q7j7n6j25K2m0M9nM3J4qRq3L0P7p8P3N4n6j15J9O3P2k6q2K9J33k5j13Q6
$$ plain form
7751 49 1 34 91 87 -48 12 -22 90 31 -4 -36 -58 -36 153 28 37 -18 8 40 -101 -68 -51 -60 -23 68 9 -28 -4 -30
7780 -30 36 74 41 -23 129 -1 26 -88 21 114 10 -32 7 91 65 -55 -112 84 -13 -37 42 117 18 72 31 -19 45
7807 45 -81 8 56 -6 123 9 86 -96 -16 6 16 6 25 -58 46 7 109 -12 -55 19 -10 42 7 -48 65 36
7833 36 -80 93 -40 -20 -89 -72 16 -29 136 75 -28 26 19 34 38 127 128 -72 0 73 -19 21 200 61 52 33 -144 48
7861 48 67 -56 -57 86 -12 -22 -80 -40 -67 -36 26 92 102 30 -45 -62 166 44 71 63 -21 37 36 25 31 -2 -8 76 -58 41
7891 41 -26 54 -52 -23 -139 -30 -15 12 -6 -7 113 -33 170 -61 10 43 -40 49 64 43 86 -30 -80 13 50 29 118
7918 118 -58 -155 7 14 33 -81 -54 -84 -84 52 7 -65 -62 -2 5 67 79 88 -57 42 -19 91 112 138 40 -19 -44 31 7
7947 7 52 -30 24 -21 -49 11 70 1 9 -26 69 56 39 76 40 11 -28 26 -54 -49 -37 14 -62 -8 -11 3 -127 -22 93 51 32
$$ packed form
7751D9m8L3N7mj35O0l4J12n9l5l2k2K2J89j25Rn5K6L2j41L3J7rL7R1n9l7K4k6
7780c0O6L8l3o4J52j30K7j14J09R3j04m2L9Q4k6j20n7J96r7k4P9P5r9N4m1n0O4
7807D5j26Q9M8o2J29j14P7j82Q0K2J0j0J9q3J04l9J02j21m3P4k9N2l5n5J13k9
7833C6j16J73j33K0o9J7Q8m5J65o1j03N4pJ5MQ9Jk00P2P3r2M0J79j39rj9j77J92
7861D8J9j23jJ43r8j0n8M0k7L1O2O6J0p2p5j7K28j22K7qq4N8jj1Ol3oQ4j34R9
7891D1o7Q0j06K9j16J09J5K7j8jJ20j46K03k31P1L3q3Q9J5k1M3j16n0R3L7k1Q9
7918A18j76r7J62PJ9j14K7l0%J36m5p2LO0PO2J2Rj45R9o1J10K1K6r8n9k5P5k4
7947GM5q2N4m5k8O0N9o9Ql5R5j3j7L7l6k9l9N4q0NJ2N1p6N4lJ4j30J05J15m2j9
$$ plain form
7978 32 -43 9 -21 -108 12 68 17 -61 -29 24 55 94 -28 -143 -49 -14 75 38 62 15 -45 37 91 118 25 79 70 50 102
8007 102 74 -4 -28 79 -77 32 93 15 37 -42 20 11 28 -70 29 80 1 12 -7 4 -19 -14 -55 -10 -5 6 -89 15 62
8036 62 1 -26 -1 16 10 97 1 75 84 71 -60 -41 25 33 36 55 -46 -1 -87 67 -74 35 -72 -49 20 16 -47 -63 9 -101
8066 -101 2 90 -124 3 54 79 -32 -62 10 99 59 -15 24 50 122 28 2 -62 -73 50 -19 5 -47 -25 -18 -59 14 -81
8094 -81 -69 -110 70 -4 -53 37 -60 39 101 -26 2 -24 -23 18 38 -29 43 2 -14 24 -87 -44 25 -11 30 82 21 -32 -112
8123 -112 -11 84 28 9 -28 -64 -35 87 25 -79 -19 34 112 60 25 -12 67 -80 76 -2 -23 -2 32 -17 -13 -19 159 29
8151 29 58 -13 6 -66 -24 87 0 -69 5 -19 -83 -58 61 -54 77 105 90 -127 50 24 -53 31 -5 81 76 -2 -50 36
8179 36 -33 5 0 55 87 -10 45 -21 108 33 -56 85
$$ packed form
7978C2p5N2l0q7J20N6n1p8L2N3L1L9j22j15R4L5Q9l7K4m7o0Q2N4K7r3N4rk0N2
8007A02k8p8k4J07j56J09O1p8K2p9O2rJ7r8R9N1p9J1j9J1k3Nm1M5NJ1r5J04M7
8036F2o1k7K5J7oQ7r6P4Rj3j31J9O6QLJ9j01M5q6J54j41J09j07K3O9mo3j6P2j10
8066a01J03Q8k14J27N1K5j11l0P2Q9m0p4L9K6P2r4k6o4j1J23o9K4n2K2Pm1P3r5
8094h1J2m1J80p4m9R0r7R9O2j27K8k6JM1K0o7P2m1j6L8j11M3O9l6M1N2o1n3q0
8123a12J01R5n6j9l7l6K9J22o2j04O0N3P8n2l5l7P9j47J56p8k1K1L4m9MoJ78j30
8151B9K9p1J9p2M2J11q7o9P4k4o4K5J19j15J31K8j5k17J77k6p7Q4l6Q6np8m8Q6
8179C6o9L8nN5L2r7N5o6J29p5q9J41
8191H5
$$ Imaginary data points
##PAGE= N=2
##DATA TABLE= (X++(I..I)), XYDATA
$$ plain form
0 0 0 0 0 0 0 0 0 0 0 0 0 8 -8 8 -8 16 -16 24 -25 32 -40 48 -56 64 -80 88 -104 120 -139 160 -184 208 -240
33 -240 272 -304 344 -384 432 -481 537 -595 664 -736 814 -899 995 -1098 1210 -1334 1469
50 1469 -1619 1783 -1965 2168 -2398 2654 -2945 3282 -3676 4137 -4694 5374 -6239 7365 -8904
65 -8904 11147 -14725 21330 -37537 160546 127870 -193384 29781 -55817 -161639 127195
76 127195 197632 -100207 -66839 670 -87045 38504 156423 -25433 -65949 -18630 -80728
87 -80728 8633 118670 -20776 -45068 31699 -41618 -11569 99086 -26308 -95064 22949
98 22949 19546 2451 91030 11410 -99555 -22172 18251 20297 86507 910 -107045 -25889
110 -25889 2965 9831 129842 44654 -140263 -52813 16099 -43608 86519 124619 -104713
$$ packed form
0@%%%%%%%%%%%Qj6J6j6K4l2M0m9N7p2Q8j04J20j44J68j92K24k59K99l44L92m48
33b40N12n76O48p28Q16r13J018j132J259j400J550j713J894k093K308k544K803
50A469l088L402l748M133m566N052n599O227o958P813q831J0068j1613J3604j6269
65h904K0051k5872L6055n8867J98083l2676l21254K23165q5598j05822K88834
76A27195P0437k97839L3368O7509q7715J25549J17919j81856m0516M7319o2098
87h0728Q9361J10037j39446k4292P6767p3317L0049J10655j25394o8756J18013
98B2949l403j7095Q8579p9620j10965P7383M0423K046O6210q5597j07955Q1156
110b5889K8854O866J20011q5188j84917Q7450O8912n9707J30127L8100k29332
$$ plain form
121 -104713 -102750 46004 -28318 9605 143229 -31261 -138302 31982 22823 -32728 103933
132 103933 47731 -117780 -19487 53059 -26204 28605 55268 -65784 -40193 48981 3497
143 3497 8530 31002 -54702 -43012 38168 8494 5671 26218 -49232 -45348 42998 23385 -1107
156 -1107 23225 -38245 -61433 31926 44840 7170 24726 -23375 -63548 16849 38455 6495
168 6495 35238 -12847 -74051 12884 47368 -11280 27826 22290 -79958 -26728 61909 -7914
180 -7914 -10485 45724 -42313 -59540 51486 19594 -33290 30936 -1822 -58041 23981 41049
192 41049 -24096 5458 16233 -36085 2624 39837 -11567 -7311 16032 -23939 -2868 38621
204 38621 -7200 -17177 12476 -17563 -12943 31004 3576 -20198 3178 -10494 -14694 22431 8871
$$ packed form
121a04713J963J48754p4322L7923J33624j74490j07041J70284r159n5551J36661
132A03933n6202j65511R8293P2546p9263N4809K6663j21052K5591Q9174m5484
143C497N033K2472q5704J1690Q1180k9674k823K0547p5450L884Q8346j9613k4492
156a107K4332o1470k3188R3359J2914l7670J7556m8101m0173Q0397K1606l1960
168F495K8743m8085o1204Q6935L4484n8648L9106n536j02248N3230Q8637o9823
180g914k571N6209q8037j7227J11026l1892n2884O4226l2758n6219Q2022J7068
192D1049o5145K9554J0775n2318L8709L7213n1404M256K3343l9971K1071M1489
204C8621m5821r977K9653l0039M620M3947k7428k3774K3376j3672m200L7125j3560
$$ plain form
217 8871 -17649 3518 -5697 -19306 19802 15204 -16844 6662 3148 -21790 14297 20420 -16254
230 -16254 5518 15320 -21705 130 26582 -12839 -9384 23721 -10969 -18608 21353 -2817 -19303
243 -19303 18605 1166 -23399 9955 4183 -19188 11429 12288 -20081 -1802 10925 -12352 2933
256 2933 19033 -10436 -8800 10914 -5239 1661 19867 -5657 -12391 7875 -1089 -838 16592
269 16592 -420 -16446 -512 1682 -1435 12771 1745 -19284 -4959 3027 -3410 12059 6733
282 6733 -20643 -10353 5932 1462 10584 10528 -14268 -14337 4673 6725 10797 13507 -9789 -18868 3846
297 3846 10809 8350 13268 -6087 -22555 -3294 10874 10127 10308 -6106 -23132 -9545 9985 11468
311 11468 7780 -3127 -21735 -15544 10155 16472 8863 -2388 -19110 -14917 8391 18508 14049
$$ packed form
217H871k6520K1167r215j3609L9108m598l2048K3506l514k4938L6087O123l6674
230a6254K1772R802l7025K1835K6452l9421L455L3105l4690p639L9961k4170j6486
243a9303L7908j7439k4565L3354n772k3371L0617Q59l2369J8279J2727k3277J5285
256B933J6100k9469J636J9714j6153O900J8206k5524o734K0266q964K51J7430
269A6592j7012j6026J5934K194l117J4206j1026k1029J4325P986o437J5469n326
282F733k7376J0290J6285m470R122n6k4796o9J9010K052M072K710k3296r079K2714
297C846O963k459M918j9355j6468J9261J4168p47J81j6414j7026J3587J9530J483
311A1468l688j0907j8608O191K5699O317p609j1251j6722M193K3308J0117m459
$$ plain form
324 14049 256 -17770 -16159 6393 21133 15142 -576 -15582 -18518 730 20781 17099 -152
337 -152 -17471 -21709 -2742 17610 17183 1059 -17767 -22091 -5656 15525 21202 4237 -17811
350 -17811 -21973 -6116 16104 23324 7821 -12626 -21034 -8696 15970 25583 9955 -13438 -21937
363 -21937 -8501 12312 24163 14346 -12731 -25295 -12132 8263 22010 14489 -12250 -26017
375 -26017 -13877 6633 20396 17059 -6967 -27688 -16844 8411 19627 18104 -234 -24981
387 -24981 -18282 8305 19972 19152 3986 -22137 -21841 6659 22304 16273 3646 -16526 -25794
400 -25794 -720 22698 15599 939 -15811 -25835 -4241 21205 16972 678 -15043 -24290 -8230
413 -8230 19333 22504 2655 -15025 -20831 -7935 17743 24484 7512 -11713 -22302 -9872 17237
$$ packed form
324A4049j3793j8026J611K2552J4740n991j5718j5006k936J9248K0051l682j7251
337a52j7319m238J8967K0352m27j6124j8826m324J6435K1181N677j6965k2048
350a7811m162J5857K2220P220j5503k0447q408J2338K4666R613j5628k3393q499
363b1937J3436K0813J1851r817k7077j2564J3163K0395J3747p521k6739j3767
375b6017J2140K0510J3763l337k4026k0721J0844K5255J1216j523j8338k4747
387b4981O699K6587J1667q20j5166k6123K96K8500J5645o031j2627k0172r268
400b5794K5074K3418p099j4660j6750j0024K1594K5446m233j6294j5721r247J6060
413h230K7563L171j9849j7680n806J2896K5678O741j6972j9225j0589J2430K7109
$$ plain form
426 17237 23904 9769 -8488 -23513 -14073 13493 21796 9891 -4859 -21613 -20576 8958 23347
439 23347 5547 -5842 -12994 -22263 818 26335 8808 -9110 -8980 -15323 -2993 24316 15014
452 15014 -10367 -10010 -7712 -4215 20266 21669 -9730 -16149 -5089 -3169 14515 22892 -5818 -20754
466 -20754 -9022 -2314 9674 21477 738 -23646 -14935 82 7139 17139 8701 -16786 -19710
479 -19710 -3332 10193 16530 7397 -8068 -13140 -8830 7115 20157 7501 -8400 -7246 -6714
492 -6714 -839 17386 12011 -12470 -9025 1617 -5602 6778 17144 -10588 -18199 4497 1700
505 1700 -1795 12193 -2200 -20081 -1201 9493 224 7335 3461 -18134 -5673 14378 3718
518 3718 4024 8072 -14193 -13006 13769 10556 331 6536 -5335 -17887 2802 15421 1306
$$ packed form
426A7237O667j4135j8257j5025R440K7566Q303j1905j4750j6754J037K9534J4389
439B3347j7800j1389p152r269K3081K5517j7527j7918J30o343J2330K7309r302
452A5014k5381L57K298L497K4481J403l1399o419J1060J920J7684Q377k8710j4936
466b0754J1732O708J1988J1803k0739k4384Q711J5017P057J0000q438k5487k924
479a9710J6378J3525O337r133j5465n072M310J5945J3042j2656j5901J154N32
492f714N875J8225n375k4481L445J0642p219J2380J0366k7732p611K2696k797
505A700l495J3988j4393j7881J8880J0694r269P111l874k1595J2461K0051j0660
518C718L06M048k2265J187K6775l213j0225O205j1871j2552K0689J2619j4115
$$ plain form
531 1306 -689 79 -13843 -8800 10682 8309 -2581 -3715 -5036 -7110 -1636 8602 6709 -5498
545 -5498 -5319 2218 -1651 -933 8831 2956 -7059 2182 6042 -4683 1205 7882 -5359 -2023 10544
560 10544 -2774 -7761 5132 -1378 -6483 7935 3861 -10004 -1836 1006 -7456 3526 9278 -6605
574 -6605 -5085 3520 -6645 -2031 12211 784 -6205 3889 -820 -6201 6249 7843 -2652 958
588 958 3649 -5587 -2961 6464 2418 -696 2394 -1521 -6802 -3496 3717 3841 -1393 -782 -1412 -9196
604 -9196 -4118 8992 4220 -4423 675 -1854 -9499 2805 12354 -391 -2797 3274 -5862 -3437
618 -3437 11111 4376 -3970 2632 -1632 -5904 5814 6042 -5323 -1229 1784 -5561 1122 6395 -6506
633 -6506 -5963 4259 -2391 -2078 7326 -2679 -11028 1308 6015 -100 3447 2713 -8750 -5708 7278
$$ packed form
531A306j995P68j3922N043J9482k373j0890j134j321k074N474J0238j893j2207
545e498J79P537l869P18R764n875j0015R241L860j0725N888O677j3241L336J2567
560A0544j3318m987J2893o510n105J4418m074j3865Q168K842q462J0982N752j5883
574f605J520Q605j0165M614J4242j1427o989J0094m709n381J2450J594j0495L610
588I58K691r236K626R425m046l114L090l915n281L306P213J24n234O11o30p784
604i196N078J3110m772q643N098k529p645J2304R549j2745k406O071r136K425
618c437J4548o735q346O602m264m272J1718K28j1365M094L013p345O683N273j2901
633f506N43J0222o650L13R404j0005q349J2336M707o115L547p34j1463L042J2986
$$ plain form
648 7278 7031 3304 1859 -5123 -7331 1688 8774 6860 -43 -5616 -6782 -3386 5265 9215 807
663 807 -7455 -6857 -3669 651 7237 4871 -6671 -8478 -1149 961 4538 6994 -3302 -8385 -124
678 -124 3444 3989 6647 -238 -8475 -1549 6727 4071 3127 1197 -8222 -5909 6541 6215 1012 -657
694 -657 -7702 -8400 3557 8358 1392 -2921 -5972 -8832 -283 10442 5424 -3815 -5441 -6338 -1366
709 -1366 8877 8817 -387 -5875 -5547 -585 7160 9499 1750 -6522 -6012 -964 4746 8128 2582 -6407
725 -6407 -8116 -2735 4502 6417 1552 -5068 -8606 -4571 4017 7007 2334 -4458 -7480 -4019 3726
740 3726 8277 4154 -3570 -5869 -3025 2785 9080 6115 -3349 -6380 -2911 2527 7196 6185 -2155
755 -2155 -8065 -4673 1731 5588 5488 -1920 -9095 -5714 1067 4468 5393 -264 -8173 -7000 896 5996
$$ packed form
648G278k47l727j445o982k208R019P086j914o903n573j166L396Q651L950q408
663H07q262N98L188M320O586k366j1542j807P329K110L577K456j0296n083Q261
678a24L568N45K658o885q237O926Q276k656r44j930r419K313J2450l26n203j669
694f57p045o98J1957M801o966m313l051k860Q549J0725n018r239j626q97M972
709a366J0243o0r204n488L28M962P745K339p749q272N10N048N710L382n546q989
725f407j709N381P237J915m865o620l538M035Q588K990m673o792l022L461P745
740C726M551m123p724k299K844N810O295k965r464l031L469N438M669j011q340
755b155n910L392O404L857j00p408p175L381O781L401R25n657p909J173P896N100
$$ plain form
771 5996 5665 1253 -5263 -6859 498 6414 6292 2972 -3810 -6700 -280 6151 6077 2424 -3343 -6527
787 -6527 -2444 4204 5729 1535 -4056 -7035 -3350 3085 4671 1386 -3193 -6843 -4010 3133 5271
802 5271 2530 -2193 -5732 -3016 3326 6041 3664 -744 -4461 -3554 2920 6770 3616 -834 -3718
817 -3718 -4102 1042 5523 3386 -935 -4461 -5120 -423 4114 2951 -1391 -4335 -4664 -1353 3376 3850
833 3850 -496 -3494 -3892 -1150 4148 4365 431 -1741 -2689 -1021 3886 5098 1439 -2253 -2473 -725
849 -725 2312 4157 1467 -2630 -3288 -1899 1016 3110 693 -2844 -3656 -2353 547 2341 786 -1860
865 -1860 -2990 -2047 717 2998 1933 -1170 -1784 -312 646 2964 3275 -109 -1823 -360 1012 2245
881 2245 2094 108 -1846 -1487 36 1096 1017 -408 -2555 -2191 -525 78 617 -440 -2213 -1739 -278
$$ packed form
771E996l31m412o516j596P357N916j22l320o782k890O420O431p4l653n767l184
787f527M083O648J525m194n591k979L685O435J586l285m579l650K833P143K138
802E271k741m723l539K716O342K715k377m408l717R07O474L850l154m450k884
817c718l84N144M481k137m321l526o59M697M537j163m342k944l29L311M729M74
833C850m346k998l98K742N298K17l934k172r48J668M907J212l659l692k20J748
849g25L037J845k690m097o58J389K915K094k417l537q12J303K900J794j555k646
865a860j130R43K764K281j065l103o14J472R58K318L11l384j714J463J372J233
881B245j51j986j954L59J523J060p9j425k147L64J666O03N39j057j773M74J461
$$ plain form
898 -278 266 955 572 -782 -1132 750 1570 656 885 997 -472 151 1896 1043 9 375 323 -408 108
917 108 721 -484 -979 -251 -596 -961 -220 -793 -1299 -694 -364 -526 -666 -457 -193 -78 255 576 225 194
937 194 502 979 1189 541 459 656 616 1141 917 177 -227 -958 -129 1279 49 -1052 -1032 -1573 -1498 656
957 656 1072 -1538 -1916 -647 -1386 54 2744 -124 -2339 -57 -50 -93 2961 2470 -1526 -1035 1248 644
975 644 1476 2967 -326 -2279 201 568 493 1710 -676 -2787 -950 263 -48 548 -576 -2911 -1859
992 -1859 738 800 332 -291 -2198 -1572 1446 2281 1280 202 -1417 -911 1114 3040 2784 -204 -1939
1009 -1939 -821 581 1646 2852 710 -3495 -2706 606 630 970 1722 -2879 -4675 29 1332 26
1025 26 1430 -735 -4428 -1046 2655 1145 795 1078 -2376 -1683 3036 2558 580 1004 -1122 -1494 2403
$$ packed form
898b78N44O89l83j354l50J882Q20r14K29J12j469O23J745q53j034L66n2p31N16
917A08O13j205m95P28l45l65P41n73n06O05L30j62j40K09K64J15L33L21l51l1
937A94L08M77K10o48q2J97m0N25k24p40m04p31Q29J408j230j101K0n41P5K154
957F56M16k610l78J269p39J440K690k868k215K282Pm3L054m91l996M91K283o04
975F44Q32J491l293j953K480L67p5J217k386k111J837J213l11N96j124k335J052
992a859K597O2m68o23j907O26L018Q35j001j078j619N06K025J926k56k988j735
1009a939J118J402J065J206k142m205P89L312K4L40P52m601j796M704J303j306
1025B6J404k165l693L382L701j510l50K83l454O93M719m78j978M24k126l72L897
$$ plain form
1042 2403 2577 97 -110 -1337 -2136 1118 2673 -489 -1962 -1718 -2298 -145 2448 662 -2253 -2617
1058 -2617 -2067 329 2521 1772 -336 -2452 -2216 1254 3153 2117 1090 -889 -2898 149 4018 1900
1074 1900 95 380 -2475 -2327 3131 2566 -1624 -579 -1323 -3303 625 2871 -1353 -2234 -588 -2265
1090 -2265 -490 3072 -92 -2511 -26 -237 -56 3349 1427 -2083 -407 714 646 2998 2409 -1928
1106 -1928 -1681 687 574 1616 2337 -1443 -3176 -864 160 1035 1326 -1190 -2862 -1934 -681 1406
1122 1406 1648 -758 -1966 -1327 -662 1331 2976 102 -1646 85 103 355 3429 1522 -2057 239
1138 239 1218 -416 1779 2082 -2115 -1576 1186 -207 -67 1284 -1910 -2940 597 408 -732 923
1154 923 -1177 -3221 202 1598 -146 994 300 -2299 -292 2387 1082 952 1109 -1408 -993 2147
$$ packed form
1042B403J74k480k07j227p99L254J555l162j473K44n80K153K593j786k915l64
1058b617N50K396K192p49k108k116K36L470J899j036j027j979k009L047L869k118
1074A900j805K85k855J48N458n65m190J045p44j980L928K246m224q81J646j677
1090b265J775L562l164k419K485k11J81L405j922l510J676J121o8K352n89m337
1106a928K47K368j13J042P21l780j733K312J024Q75K91k516j672R28J253K087
1122A406K42k406j208O39O65J993J645k874j748J731J8K52L074j907l579K296
1138B39R79j634K195L03m197N39K762j393J40J351l194j030L537j89j140J655
1154I23k100k044L423J396j744J140o94k599K007K679j305j30J57k517M15L140
$$ plain form
1170 2147 1578 505 717 -982 -1589 650 971 384 68 -1569 -1836 -37 68 -308 152 -1228 -2135 -79
1188 -79 678 -501 470 -49 -1612 546 1747 71 574 797 -877 319 2341 652 -122 806 -530
1205 -530 -659 1617 766 -1050 115 -749 -1826 698 783 -1467 -689 -417 -1731 -246 1034 -624 -910
1222 -910 20 -847 -163 1546 297 -376 775 92 151 1490 803 -63 665 248 31 1048 536 -503
1240 -503 118 -201 -663 256 26 -1245 -531 -199 -1203 -177 131 -1210 -485 188 -761 -20 909 -349
1258 -349 -186 1145 185 -63 1348 521 -320 1067 872 -261 883 617 -783 388 552 -768 -132
1275 -132 204 -1004 -695 307 -988 -984 5 -796 -771 378 -573 -898 408 -99 -275 1079 285 -519 679
1294 679 726 266 997 784 -159 187 796 9 534 731 -893 -527 381 -373 -224 235 -994 -1173 -55
$$ packed form
1170B147n69j073K12j699o07K239L21n87l16j637k67J799J05l76M60j380r07K056
1188g9P57j179R71n19j563K158J201j676N03K23j674J196K022j689p74R28j336
1205e30j29K276q51j816J165q64j077K524Q5k250P78K72j314J485J280j658k86
1222i10R30q67O84J709j249o73J151o83N9J339o87q66P28m17k17J017n12j039
1240e03O21l19m62R19k30j271P14L32j004J026L08j341P25O73r49P41R29j258
1258c49J63J331r60k48J411q27q41J387j95j133J144k66j400J171J64j320O36
1275a32L36j208L09J002j295MR89q01K5J149r51l25J306n07j76J354p94q04J198
1294F79M7m60P31k13r43L46O09p87N25J97j624L66R08p54J49M59j229j79J118
$$ plain form
1313 -55 -383 -487 107 -780 -1225 145 343 -206 609 145 -828 388 1175 385 795 655 -491 310 1293
1332 1293 524 414 483 -717 -446 738 277 -311 -178 -1047 -1253 212 3 -554 -365 -1038 -1328 157 529
1351 529 -193 -10 -149 -693 382 1248 626 174 318 -287 489 1603 730 52 83 -528 -28 948 491 -370
1371 -370 -597 -951 -638 402 107 -802 -871 -992 -993 441 663 -558 -747 -414 -412 603 1184 321 -245 -61
1391 -61 142 863 1536 627 -297 37 259 374 1231 514 -679 -641 -434 -45 437 -6 -1023 -1243 -827 -290
1411 -290 257 163 -740 -1188 -413 95 609 613 -122 -455 45 556 1210 1181 186 -342 75 523 1059 1089 93 -658
1433 -658 -441 67 213 609 -159 -1273 -888 -229 -247 127 40 -1124 -1106 -266 286 353 192 -391 -700 190 876
1454 876 722 589 154 -172 446 1069 812 539 -116 -381 -186 592 735 -46 -688 -818 -700 -127 495 -217
$$ packed form
1313e5l28j04N94q87m45J370J98n49Q15m64r73J216P87p90M10j40j146Q01R83
1332A293p69j10O9j200K71J184m61n88J33q69k06J465k09n57J89o73k90J485L72
1351E29p22J83j39n44J075Q66o22m52J44o05P76J114q73o78L1o11N00R76m57q61
1371c70k27l54L13J040k95r09o9j21jJ434K22j221j89L33KJ015N81q63n66J84
1391f1K03P21O73r09r24L34K22J15Q57p17j193L8K07L89M82m43j017k20M16N37
1411b90N47r4r03m48P75N08N14Mp35l33N00N11O54k9r95n28M17M48N36L0r96p51
1433f58K17N08J46L96p68j114L85O59j8L74q7j164J8Q40N52O7j61n83l09Q90O86
1454H76j54j33m35l26O18O23k57k73o55k65J95P78J43p81o42j30J18N73O22p12
$$ plain form
1474 -217 -992 -922 -713 -312 259 469 -531 -823 -178 113 485 945 460 -353 66 641 817 768 594 -96
1494 -96 -187 290 652 308 53 -377 -682 -244 159 -166 -538 -784 -726 -548 -123 149 -529 -749 -461 -50 210
1515 210 641 219 -417 98 527 418 867 961 -189 -343 664 547 397 832 -97 -924 -136 287 -281 56
1535 56 -83 -1241 -834 137 -349 -601 93 -688 -834 131 242 -248 214 143 -178 295 878 390 292 445 430
1556 430 371 661 397 184 94 -21 205 314 -90 -124 -587 -709 13 -9 -457 -347 -613 -919 -152 337 -253
1577 -253 -144 311 -386 -157 812 366 19 822 287 -235 916 824 -132 487 618 -400 118 765 -315
1596 -315 -391 412 -391 -813 123 -430 -955 -84 -78 -592 -178 -93 -633 -160 217 -96 74 243 -45 251 579
1617 579 342 466 429 220 226 545 176 409 277 -332 63 14 -428 -133 -6 -699 -524 -101 -663 -601 55 -457
$$ packed form
1474b17p75P0K09M01N71K10j000k92O45K91L72M60m85q13M19N75J76m9j74o90
1494i6r1M77L62l44k55m30l05M38M03l25l72k46N8J78M25K72o78k20K88M11K60
1515B10M31m22o36N15M29j09M49R4j150j54J007j17j50M35r29q27P88M23n68L37
1535E6j39j158M07R71m86k52O94p81j46R65J11m90M62p1l21M73N83m88r8J53j5
1556D30n9K90k64k13r0j15K26J09m04l4m63j22P22k2m48J10k66l06P67M89n90
1577b53J09M55o97K29R69m46l47Q03n35n22J151r2r56O19J31j018N18O47j080
1596c15p6Q03q03m22R36n53n25Q71On14M14Q5n40M73L77l13J70J69k88K96L28
1617E79k37J24l7k09OL19l69K33j32o09L95m9m42K95J27o93J75M23n62O2O56n12
$$ plain form
1639 -457 -579 329 -236 -708 232 302 -346 695 688 -397 213 711 82 380 1089 68 -273 610 88 -175
1659 -175 666 33 -835 -169 -110 -503 60 -111 -888 -641 -291 -311 -22 -34 -444 -346 69 45 369 410 -41 227
1681 227 349 387 771 616 -3 212 496 243 331 561 -374 -573 268 -69 -282 282 -545 -1144 -183 -185 -431
1702 -431 219 -281 -1117 -189 469 -140 204 496 -425 -260 960 599 283 766 80 -350 798 796 89 422
1722 422 -48 -543 100 456 -220 -285 -377 -887 -407 149 -241 -447 -419 -784 -329 315 -71 -93 18 -415 -28
1743 -28 722 567 229 280 -39 241 988 681 35 298 22 -278 635 507 -327 -189 -414 -587 -58 327 -453
1764 -453 -743 -529 -619 -319 370 -121 -718 -292 -263 -63 730 389 -226 57 133 284 845 783 53 37 288 332
1786 332 467 539 -96 -381 -166 -50 -69 208 -556 -851 -484 -459 -186 75 -268 -713 -339 -64 43 372 253
$$ packed form
1639d57j22R08n65m72R40P0o48J041pj085O10M98o29K98P09j021l41Q83n22k63
1659a75Q41o33q68O66N9l93N63j71p77K47L50k0K89j2m10R8M15k4L24M1m51K68
1681B27J22L8L84j55o19K15K84k53Q8K30r35j99Q41l37k13N64q27n99R61kk46
1702d31O50n00q36R28O58o09L44K92r21J65J220l61l16M83o86m30J148kp07L33
1722D22m70m95O43L56o76o5r2n10M80N56l90k06K8l65M55O44l86k2J11m33L87
1743b8P50j55l38N1l19K80P47l07o46K63k76l00R13j28q34J38k25j73N29L85p80
1764d53k90K14r0L00O89m91n97M26K9K00P93l41o15K83P6J51N61o2p30j6K51M4
1786C32J35P2o35k85K15J16j9K77p64k95L67K5K73K61l43m45L74K75J07L29j19
$$ plain form
1807 253 -303 -17 385 368 755 512 -107 171 458 355 525 439 -282 -368 48 169 139 -41 -399 -751 -308
1828 -308 -131 -410 -76 -372 -745 -277 100 -42 145 -132 -317 -15 397 466 411 336 74 153 539 628 421 375
1850 375 -36 -32 237 144 59 26 -456 -373 -166 -76 -297 -504 -519 -599 -258 20 -138 -190 -285 -321 148 393 197 226
1874 226 185 -66 320 570 526 242 107 166 103 346 376 -12 -71 -205 -256 -38 -57 -394 -399 -287 -517 -292 -196 -347
1898 -347 -367 -212 -130 36 100 124 -42 186 220 194 507 367 150 249 265 374 385 249 101 -44 -74 -9 -67 -70 -361
1923 -361 -257 -275 -293 -195 -297 -397 -260 -245 -228 120 -1 -119 3 242 148 134 462 295 71 304 446 210
1945 210 305 250 -36 109 223 -46 -82 -30 -173 -379 -134 -210 -431 -444 -332 -410 -177 -145 -216 -339 -148 -19 56
1968 56 211 216 -53 30 389 191 451 592 263 75 373 293 118 72 117 -159 -223 38 -88 -329 -171 -330 -468
$$ packed form
1807B53n56K86M02j7L87k43o19K78K87j03J70q6p21q6M16J21l0j80l58l52M43
1828c08J77k79L34k96l73M68L77j42J87k77j85L02M12O9n5p5k62P9L86Q9k07m6
1850C75m11MK69r3q5l3m82Q3K07R0k21k07j5q0L41K78j58n2r5l6M69K45j96K9
1874B26m1k51L86K50m4k84j35N9o3K43L0l88n9j34n1K18j9l37nJ12k30K25R6j51
1898c47k0J55Q2J66O4K4j66K28L4k6L13j40k17R9J6J09J1j36j48j45l0O5n8lk91
1923c61J04j8j8R8j02j00J37J5J7L48j21j18J22K39r4j4L28j67k24K33J42k36
1945B10R5n5k86J45J14k69l6N2j43k06K45p6k21j3J12p8K33L2p1j23J91J29P5
1968E6J55Nk69Q3L59j98K60J41l29j88K98q0j75m6M5k76o4K61j26k41J58j59j38
$$ plain form
1991 -468 -94 -108 -372 -343 -128 -214 -130 125 111 -142 113 181 109 551 365 86 133 353 394 281 322 75 -133
2014 -133 21 214 -94 -75 -96 -345 -565 -126 -139 -282 -334 -299 -455 -209 316 -134 -244 126 -40 -110 541 337
2036 337 116 322 286 8 354 598 171 6 230 69 -159 373 36 -384 28 -85 -328 -237 -89 -527 -469
2057 -469 -100 -28 -363 6 -52 -363 -19 243 173 198 189 81 97 459 497 279 99 410 44 70 411 131 -142
2080 -142 -61 -112 -262 -105 72 -428 -395 -214 -432 -317 58 -176 -499 -65 -118 -128 131 304 -37 -39 517 194
2102 194 126 458 298 41 524 343 99 212 112 -188 -46 143 -70 -357 -147 -218 -562 -278 25 -390 -374
2123 -374 -273 -261 -155 54 58 -182 -128 228 -48 131 573 197 36 334 264 108 434 351 -101 -164 337 -36
2145 -36 -191 256 -164 -338 11 -17 -404 -114 -191 -427 -417 3 -192 -314 201 48 -253 325 230 -65 323 276
$$ packed form
1991d68L74j4k64K9K15q6Q4K55j4k53K55O8p2M42j86k79M7K20M1j13M1k47k08
2014a33J54J93l08J9k1k49k20M39j3j43n2L5j56K46N25m50j10L70j66p0O51k04
2036C37k21K06l6k78L46K44m27j65K24j61k28N32l37m20M12j13k43R1J48m38N8
2057d69L69P2l35L69n8l11L44K62p0K5rj08J6L62L8k18j80L11l66K6L41k80k73
2080a42Q1n1j50J57J77n00L3J81k18J15L75k34l23M34n3j0K59J73l41kN56l23
2102A94o8L32j60k57M83j81k44J13j00l00J42J89k13k87K10p1l44K84L03m15J6
2123c74J01J2J06K09Mk40N4L56k76J79M42l76j61K98p0j56L26q3m52o3N01l73
2145c6j55M47m20j74L49k8l87K90p7k36J0M20j95j22N15j53l01N78r5k95L88m7
$$ plain form
2167 276 30 317 492 237 69 420 165 -62 359 197 -382 -3 148 -361 -199 -73 -264 -265 -272 -278 -251 -174 34
2190 34 -280 -196 74 -39 62 171 83 78 193 323 267 210 425 266 61 292 67 -41 157 -68 -182 -220 -157
2213 -157 -158 -334 -99 -245 -502 -119 -116 -353 -43 -140 -190 -125 -9 66 71 329 170 34 358 400 64 381 265 79
2237 79 190 264 141 67 140 -14 -159 -4 -32 -279 -274 -285 -298 -181 -238 -205 -95 -168 -115 23 -9 50 62 4 205 162
2263 162 227 322 312 217 143 198 299 74 161 45 -80 -116 121 -94 -67 -140 -324 -196 -67 -262 -250 -144 -320 -268
2287 -268 -38 138 -132 7 174 -136 207 356 139 162 296 166 336 422 222 -17 128 77 3 139 41 -153
2309 -153 -222 -273 -272 42 -82 -445 -241 -378 -303 -50 -7 -99 -102 -112 -53 199 355 253 47 274 69 184 396 146
2333 146 82 145 84 128 169 37 -36 40 -199 -175 -134 -125 -274 -299 -144 -334 -56 -69 -354 -145 -12 -141 139 246
$$ packed form
2167B76k46K87J75k55j68L51k55k27M21j62n79L79J51n09J62J26j91jpoK7P7K08
2190C4l14Q4K70j13J01J09q8nJ15J30n6n7K15j59k05K31k25j08J98k25j14l8O3
2213a57jj76K35j46k57L83Lk37L10r7n0O5J16P5NK58j59j36L24M2l36L17j16j86
2237G9J11P4j23p4P3j54j45J55k8k47Nj1j3J17n7L3J10p3N3J38l2N9J2n8K01m3
2263A62O5R5j0r5p4N5J01k25Q7j16j25l6K37k15K7p3j84J28J29j95J2J06j76N2
2287b68K30J76k70J39J67l10L43J49k17K3J34j30J70Q6k00k39J45n1p4J36r8j94
2309a53o9n1JL14j24l63K04j37P5K53M3r2lj0N9K52J56j02k06K27k05J15K12k50
2333A46o4O3o1M4M1j32p3P6k39K4M1Rj49k5J55j90K78j3k85K09J33j29K80J07
$$ plain form
2357 246 71 119 159 204 217 392 302 166 153 246 132 212 158 -196 -5 -205 -145 85 -178 -306 -265 -229 -248 -119
2381 -119 -40 -157 -197 -149 -167 -12 179 23 -85 266 57 92 407 260 57 164 183 187 308 268 -173 93 -35
2404 -35 -191 46 24 -427 -302 -45 -347 -97 -124 -303 -354 -187 -134 -84 71 -4 -178 100 330 228 275 268 14
2427 14 127 226 191 332 167 46 51 -20 115 81 18 -230 -310 -131 -50 -57 -198 -271 -355 -196 -177 -127 79 -120 -235
2452 -235 -26 58 183 190 66 70 103 351 201 394 383 -38 -5 211 58 171 67 -247 -388 -121 -32 -159 -165 -247
2476 -247 -466 -239 96 -50 -170 -124 -205 -193 141 218 90 79 8 160 264 378 223 76 179 38 118 340
2498 340 146 -60 -94 -161 -17 -160 -58 -218 -382 -306 -31 -89 -99 -54 -364 -283 81 140 9 16 -36 -88 124 444
2522 444 95 200 264 8 126 467 267 40 114 65 -77 -28 203 -169 -286 -132 -286 -237 79 -162 -358 -235
$$ packed form
2357B46j75M8M0M5J3J75r0j36j3R3j14Q0n4l54J91k00O0K30k63j28M1L6j9J29
2381a19P9j17m0M8j8J55J91j56j08L51k09L5L15j47k03J07J9MJ21m0m41K66j28
2404c5j56K37k2m51J25K57l02K50k7j79n1J67N3N0J55p5j74K78K30j02M7pk54
2427A4J13R9l5J41j65j21Np1J35l4o3k48q0J79Q1pj41p3q4J59J9N0K06j99j15
2452b35K09Q4J25Pj24ML3K48j50J93j1m21L3K16j53J13j04l14j41K67Q9j27oq2
2476b47k19K27L35j46j20M6q1J2L34P7j28j1p1J52J04J14j55j47J03j41Q0K22
2498C40j94k06l4o7J44j43J02j60j64P6K75n8j0M5l10Q1L64N9j31Pn2n2K12L20
2522D44l49J05O4k56J18L41k00k27P4m9j42M9K31l72j17J54j54M9L16k41j96J23
$$ plain form
2544 -235 -151 -177 -98 140 -187 -145 34 244 7 325 149 52 195 235 294 124 235 45 -15 117 169 -58 72
2567 72 -169 -232 -142 -30 -119 -307 -136 -278 -411 -154 62 -204 -94 86 -100 -7 353 80 -8 117 215 169 292
2590 292 458 112 -77 152 116 -29 297 -94 -262 13 -166 -176 -132 -81 -232 -239 -63 -29 -142 16 -116 -469
2612 -469 11 195 47 129 122 33 86 365 286 79 222 181 -109 35 280 -2 119 9 -71 -101 -64 23 -351 -186
2636 -186 -122 -279 -114 -80 -194 -201 23 -76 -102 135 197 16 -51 288 135 86 279 99 68 228 292 119 179 144
2660 144 -123 -139 -17 42 -141 27 -132 -414 -85 -154 -206 -134 -115 -401 -237 151 -32 -73 33 116 -134 219 405
2683 405 94 124 164 60 124 257 211 41 -26 -103 9 90 89 -104 -97 -79 -194 -188 -55 -241 -284 -176 -36 -85 37
2708 37 44 -149 -152 67 145 148 167 205 4 165 359 332 117 74 39 -55 194 169 -122 -46 -5 -367 -89 -11 -155 -214
$$ packed form
2544b35Q4k6P9K38l27M2J79K10k37L18j76r7J43M0N9j70J11j90o0J32N2k27J30
2567G2k41o3R0J12q9j88J71j42j33K57K16k66J10J80j86R3L60k73q8J25R8m6J23
2590B92J66l46j89K29l6j45L26l91j68K75j79j0M4N1j51pJ76L4j13J58j32l53
2612d69M80J84j48Q2pq9N3K79p9k07J43m1k90J44K45k82J21j10q0l0L7Q7l74J65
2636a86O4j57J65L4j14pK24r9k6K37O2j81o7L39j53m9J93j80l1J60O4j73O0l5
2660A44k67j6J22N9j83J68j59k82L29o9n2P2J9k86J64L88j83m1J06Q3k50L53J86
2683D05l11L0M0j04O4J33m6j70o7p7J12Q1jj93PJ8j15OJ33j86m3J08J40m9J22
2708C7Pj93lK19P8LJ9L8k01J61J94k7k15m3l5r4K49k5k91P6M1l62K78P8j44n9
$$ plain form
2734 -214 -248 -222 -359 15 22 -154 -277 49 -137 2 241 102 15 36 217 206 295 198 68 -36 123 126 131 88 -83
2759 -83 -189 -195 -11 18 -108 -181 -280 -298 -99 137 -113 -156 -98 -180 59 149 173 -40 -74 32 87 318 341 122 58
2784 58 138 57 156 270 53 -102 -165 -149 -58 64 -25 -333 -331 -170 -202 62 -15 -324 -187 -154 -101 74 97 -34 -124
2809 -124 -17 132 230 353 37 -27 44 122 191 292 100 -110 -37 103 68 26 -13 -162 -316 -113 -50 86 -35
2832 -35 -163 -338 -111 39 146 200 -204 -110 10 184 93 277 34 -38 191 235 201 243 13 -65 -42 173 171 77
2856 77 -78 -338 -259 6 -11 -6 -239 -377 -216 -95 63 -140 -15 -233 -156 114 174 133 87 -26 -14 155 270
2879 270 326 240 3 -77 92 178 190 42 -15 -202 -99 137 -65 -88 -213 -270 -205 25 -74 -121 -191 -208 -88 75
2903 75 51 -12 66 11 5 219 315 120 172 64 44 152 127 11 90 25 -128 -11 99 79 -46 -123 -198 -128 12 10
$$ packed form
2734b14l4K6j37L74Pj76j23L26j86J39K39j39q7K1J81j1Q9r7j30j04J59LNm3j71
2759h3j06oJ84K9j26p3r9j8J99K36k50m3N8q2K39R0K4k13l4J06N5K31K3k19o4
2784E8Q0q1R9J14k17j55o3J6R1J22q9l08KJ61l2K64p7l09J37L3N3J75K3j31r0
2809a24J07J49R8J23l16o4P1P8O9J01j92k10P3J40l5m2l9j49j54K03O3J36j21
2832c5j28j75K27J50J07N4m04R4J20J74r1J84k43p2K29M4l4M2k30p8K3K15kr4
2856G7j55k60P9K65j7Nk33j38J61J21J58k03J25k18P7K70O0m1m6j13J2J69J15
2879B70N6q6k37q0J69Q6J2j48n7j87J03K36k02k3j25n7O5K30r9m7p0j7J20J63
2903G5k4o3P8n5oK14R6j95N2j08k0J08k5j16P9o5j53J17J10k0j25p7p5P0J40k
$$ plain form
2929 10 -105 -154 -162 -114 -94 -28 -33 -76 -163 30 171 191 125 101 120 161 117 177 112 68 78 -71 163 196 -95 -51 -122 -158
2957 -158 -153 -148 -84 -79 -205 -192 -106 -65 2 -122 29 15 -36 83 144 89 113 127 83 143 286 230 49 19 75 107 153 126
2985 126 13 -57 -19 -216 -63 -1 -47 -118 -162 -87 -54 -146 -90 -75 -256 -118 31 118 244 239 194 70 97 218 199 111
3011 111 139 121 -33 153 115 129 25 -182 -113 66 17 -80 -112 -238 -237 -195 -55 -109 -85 -171 -177 -13 41 48 86 -32 71
3038 71 93 203 222 126 -49 116 93 97 234 -6 -175 -241 14 79 -19 -137 -332 -244 -118 -109 -61 -92 -189 -275 -40 42
3064 42 76 -12 -11 -29 56 134 248 185 11 13 -67 133 176 170 49 -3 -88 0 190 65 -85 -308 -230 -237 -10 -37 -163
3091 -163 -362 -311 -47 -27 94 24 -205 -145 144 130 115 146 99 -103 53 207 81 179 40 -141 -62 33 179 14
3115 14 0 -217 -220 10 12 79 -182 -347 -188 -39 33 30 -92 -182 -87 34 123 128 12 -30 57 66 285 269 97 -51 -20
$$ packed form
2929A0j15m9qM8K0O6nm3q7J93J41K0o6k4J9M1m4O0o5m4J0j49K34L3k91M4p1l6
2957a58NNO4Nj26J3Q6M1O7j24J51j4n1J19O1n5K4J4m4O0J43n6j81l0N6L2M6k7
2985A26j13p0L8j97J53O2m6p1m4P5L3r2N6J5j81J38J49Q7J26nm5j24K7J21j9q8
3011A11K8j8j54J86l8J4j04k07O9J79m9r7l2j26JM2J40n4K4q6oJ64N4PL8j18J03
3038G1K2J10J9r6j75J65k3MJ37k40j69o6K55O5r8j18j95Q8J26RM8l1r7q6K35Q2
3064D2L4q8Jj8Q5P8J14o3j74Kq0K00M3oj21n2q5Q8J90j25j50k23P8pK27k7j26
3091a63j99N1K64K0J21p0k29O0K89j4j5L1m7k02J56J54j26R8j39j81P9R5J46j65
3115A4j4k17lK30KO7k61j65J59J49P2lj22r0R5J21Q9Nj16m2Q7RK19j6j72j48L1
$$ plain form
3142 -20 218 115 41 -14 -93 -119 -133 72 -53 -170 -211 -398 -94 -85 34 -125 1 -108 -145 186 227 108 49 -157
3166 -157 -11 177 312 234 13 58 -70 210 330 133 -133 -120 -11 44 50 -59 -193 -310 -152 -84 48 -56
3188 -56 -127 -240 -217 14 35 55 9 -46 -124 38 205 262 152 120 28 145 213 312 91 60 -31 28 85 148 -48 -193
3214 -193 -133 -111 -109 -44 -33 -164 -91 -178 95 50 117 -176 -99 111 22 78 133 60 11 124 189 153 169 179 45 19 89
3241 89 152 34 -28 -136 -199 -78 63 -42 -100 -161 -161 -156 -21 -13 -146 3 -125 -67 39 56 67 33 60 154 83 120 252
3268 252 75 51 193 111 130 33 41 -60 -60 -9 -42 -114 -166 -143 -67 -63 11 -92 -136 -50 -151 -14 29 76 25 50 3 68
3296 68 69 189 35 107 127 92 132 156 48 -60 131 25 -45 33 -16 -65 -87 -35 -144 -102 -77 -117 -11 -62 -54 -20 33
3323 33 -74 119 38 -18 11 227 163 96 -24 237 55 66 119 99 44 115 -31 -91 10 -147 -83 -146 -44 -106 -191
$$ packed form
3142b0K38j03p4n5p9k6j4K05j25j17m1j87L04RJ19j59J26j09l7L31M1j19n9k06
3166a57J46J88J35p8k21M5j28K80J20j97k66J3J09N5Oj09j34j17J58O8J32j04
3188e6p1j13K3K31K1K0m6n5p8J62J67N7j10l2r2J17O8R9k21l1r1N9N7O3j96j45
3214a93O0K2KO5J1j31P3q7K73m5O7k93P7K10q9N6N5p3m9J13O5l6J6J0j34k6P0
3241H9O3j18o2j08o3J21J41j05n8o1%NJ35Qj33J49j28N8J06J7J1l4K7R4p1L7J32
3268B52j77k4J42q2J9r7Qj01%N1l3p2n2K3P6MP4j03m4Q6j01J37M3M7n1K5m7O5
3296F8JJ20j54P2K0l5M0K4j08j08J91j06p0P8m9m9k2N2j09M2K5m0J06n1QL4N3
3323C3j07J93q1n6K9K16o4o7j20K61j82J1N3k0n5P1j46o0J01j57O4o3J02o2q5
$$ plain form
3348 -191 -152 -89 -68 -141 -50 46 -47 -5 6 8 49 70 114 74 139 85 136 98 164 124 -31 57 -44 118 83 -52 -22 -125
3376 -125 -115 59 -102 -116 -188 -131 -35 -39 87 -15 -16 -101 -84 114 64 128 18 75 147 232 144 209 85 -6 230 154 184
3403 184 32 -70 -108 -178 17 -23 -42 -127 -159 -168 -83 26 -63 -95 -95 -80 -12 172 61 -9 -76 -18 113 129 137 64 -3 -140
3431 -140 57 195 147 -74 -73 -46 53 -41 5 -64 -128 -210 -98 -27 -17 -23 -128 -132 -100 128 65 48 6 -91 57 189 173
3458 173 119 47 1 45 79 253 134 19 -44 -13 47 61 -25 -115 -168 -73 -76 -40 -11 -107 -209 -142 -36 93 33 -53 -207
3485 -207 -86 65 185 39 120 47 88 111 193 113 -15 106 -21 50 98 76 49 -71 -97 -44 76 -28 -150 -197
3509 -197 -50 60 -14 42 -138 -134 -139 -47 23 85 12 -22 -4 179 113 197 42 -24 21 191 215 207 112 -63 -163 -26 74
3536 74 16 -76 -242 -131 -188 -40 -10 -48 -213 -255 -87 -74 64 49 -100 30 -31 95 107 144 -50 -32 192 147 242
$$ packed form
3348a91L9O3K1p3R1R6r3M2J1KM1K1M4m0O5n4N1l8O6m0j55Q8j01J62l5j35L0j03
3376a25J0J74j61j4p2N7R6mJ26j02jq5J7J98n0O4j10N7P2Q5q8O5j24r1K36p6L0
3403A84j52j02l8p0J95m0j9q5l2rQ5J09q9l2%J5O8J84j11p0o7N8J31J6Qp3o7j37
3431a40J97J38m8k21JK7R9r4M6o9o4q2J12P1J0oj05mL2K28o3j7m2r7J48J32j6
3458A73n4p2m6M4L4J74j19j15o3L1O0J4q6r0n3R5lL6K9r6j02O7J06J29o0q6j54
3485b07J21J51J20j46Q1p3M1K3Q2q0j28J21j27P1M8k2k7j20k6N3J20j04j22m7
3509a97J47J10p4N6j80MnR2P0O2p3l4J8J83o6Q4j55o6M5J70K4qr5j75j00J37J00
3536G4n8r2j66J11n7J48L0l8j65m2J68J3J38j5j49J30o1J26J2L7j94J8K24m5R5
$$ plain form
3561 242 79 45 -143 -56 45 19 43 -45 -224 -222 -11 -29 33 -126 -271 -282 -150 -38 -95 47 18 22 -66 161 81
3586 81 25 89 21 126 134 32 62 25 86 129 28 125 61 -153 -157 -58 -16 -72 52 -138 -232 -76 180 48 -25 -104 -158
3613 -158 -80 57 21 36 159 25 -102 68 156 43 -41 139 -52 94 180 81 2 56 -41 -54 44 28 -92 -146 -82
3638 -82 -120 3 -5 -68 -25 -51 -87 50 50 88 34 -150 56 -4 19 144 100 126 119 59 114 -18 113 -29 -78 109 -39
3665 -39 9 -28 -118 -132 -87 -92 -132 -59 -50 -90 -76 -65 58 -27 11 21 -5 52 69 89 178 95 136 -39 50 165 149 16 16 37
3695 37 71 98 -89 58 -78 -117 -69 -40 -19 -137 -105 -135 -59 16 81 -102 -90 -86 -21 43 137 134 -6 -20 -16 110 85 120
3723 120 14 -168 -54 85 97 22 -5 -138 -178 76 47 76 -86 -189 -197 78 14 -2 63 -184 -228 -51 73 205
3747 205 133 -21 -101 13 175 280 114 -15 50 34 187 95 47 -119 -297 -80 56 100 113 -150 -209 -251 -37
$$ packed form
3561B42j63l4j88Q7J01k6K4q8j79KK11j8O2j59j45j1J32J12n7J42k9Mq8K27q0
3586H1n6O4o8J05Qj02L0l7O1M3j01R7o4k14mR9M2n6J24j90r4J56K56j32p3p9n4
3613a58P8J37l6J5J23j34j27J70Q8j13q4J80j91J46Q6r9p9N4r7j3R8j6j20n4O4
3638h2l8J23qo3M3k6l6J37%L8n4j84K06o0K3J25m4K6po0N5j32J31j42m9J87j48
3665c9M8l7r0j4M5nm0P3Rm0J4J1J23q5L8J0k6N7J7K0Q9q3M1j75Q9J15j6j33%K1
3695C7L4K7j87J47j36l9M8K9K1j18L2l0P6P5O5j83J2MO5O4R4lj40j4MJ26k5L5
3723A20j06j82J14J39J2p5k7j33m0K54k9K9j62j03qK75o4j6O5k47m4J77J24J32
3747B05p2j54q0J14J62J05j66j29O5j6J53r2m8j66j78K17J36M4J3k63n9m2K14
$$ plain form
3770 -37 196 7 -33 -167 -157 24 213 37 21 -68 -56 175 267 222 118 -183 -93 80 268 216 47 -116 -160 62
3794 62 209 96 -108 -138 -263 -14 49 44 -177 -397 -265 23 153 218 43 -157 -190 -32 275 244 128 -80 -151
3817 -151 -46 310 220 106 -87 -130 -56 148 213 -24 -204 -300 -58 24 224 88 -279 -313 -147 53 231 121
3839 121 -152 -122 -128 100 356 147 -77 -263 -196 80 213 236 -59 -117 -32 -49 281 202 -10 -208 -176 -7 80 122
3863 122 -75 -236 -251 -135 175 127 -40 -209 -158 -46 217 240 -47 -173 -226 65 175 249 38 -43 -142 15 178
3886 178 264 119 -200 -207 -63 151 68 3 -199 -393 -167 57 166 63 -111 -181 -117 83 81 86 -72 -137 -33 137
3910 137 268 249 52 -62 -46 19 142 137 65 -252 -164 -52 45 175 -134 -136 -210 -150 11 134 -33 -214 -383 56
3934 56 -9 50 9 -152 -128 102 84 244 161 -72 -48 52 239 75 49 55 -55 -20 88 130 -9 -78 -60 17 -89
$$ packed form
3770c7K33j89m0j34J0J81J89j76j6q9J2K31R2m5j04l01R0J73J88n2j69j63m4K22
3794F2J47j13k04l0j25K49O3nk21k20J32K88J30O5j75k00l3J58L07l1j16k08p1
3817a51J05L56r0j14j93m3P4K04O5k37j80r6K42Q2K00j36l67l4J66K00J78j10
3839A21k73L0oK28K56k09k24j86O7K76J33K3k95n8Q5j7L30p9k12j98L2J69Q7M2
3863A22j97j61j5J16L10m8j67j69N1J12K63K3k87j26n3K91J10P4k11q1r9J57J63
3886A78Q6j45l19pJ44K14q3o5k02j94K26K24J09j03j74p0O4K00kNj58o5J04J70
3910A37J31j9j97j14J6O5J23np2l17Q8J12R7J30l09kp4O0J61J23j67j81j69M39
3934E6o5N9m1j61K4K30j8J60q3k33K4J00J87j64k6Oj10L5J08M2j39o9J8P7j06
$$ plain form
3959 -89 -13 99 -111 -186 -102 -61 94 27 -117 -81 -26 -75 169 20 3 -55 -105 79 115 107 30 50 62 32 43 55 61 -56
3987 -56 -62 -6 10 -16 -89 -83 -112 -28 47 -6 -40 9 -50 62 17 -8 15 -13 -75 -34 64 76 99 2 71 18 -16 111 133 -71
4017 -71 53 -61 -109 -122 1 2 -59 -65 -35 -139 -88 0 -14 18 -7 -76 -89 14 37 43 -15 18 -92 27 153 242 74
$$ packed form
3959h9P6J12k10p5Q4M1J55o7j44L6N5m9K44j49j7n8n0J84L6qp7K0J2l0J1J2Oj17
3987e6oN6J6k6p3Ok9Q4P5n3l4M9n9J12m5k5K3k8o2M1R8J2K3r7O9n3l4J27K2k04
4017g1J24j14m8j3J23Jo1oL0j04N1Q8j4L2k5o9j3J03K3On8L3j10J19J26Q9j68
$$ [...]
8191a5
##END NTUPLES=NMR FID
##END=
