##TITLE=1H_E3d1007-2
 CDCl3
 8 sc, 
 11.7.2023
##JCAMPDX= 6.0         $$ Bruker NMR JCAMP-DX V2.0
##DATA TYPE= NMR FID
##DATA CLASS= NTUPLES
##ORIGIN= UXNMR, Bruker Analytische Messtechnik GmbH
##OWNER= root
$$ XWIN-NMR		Version 3.5
$$ Tue Jul 11 14:07:38 2023 Russian Standard Time (UT+4h)  she@DPX200
##.OBSERVE FREQUENCY= 200.13135
##.OBSERVE NUCLEUS= ^1H
##.DELAY= (6, 6)
##.ACQUISITION MODE= SIMULTANEOUS
##.ACQUISITION SCHEME= undefined
##.AVERAGES= 8
##.DIGITISER RES= 18
##SPECTROMETER/DATA SYSTEM= spect
##.PULSE SEQUENCE= zg30
##.SOLVENT NAME= CDCl3
##.SHIFT REFERENCE= (INTERNAL, CDCl3, 0, 15.7039)
##AUDIT TRAIL= $$ (NUMBER, WHEN, WHO, WHERE, WHAT)
$$ ##TITLE= Audit trail, XWIN-NMR		Version 3.5
$$ ##JCAMPDX= 5.01
$$ ##ORIGIN= Bruker BioSpin GmbH
$$ ##OWNER= she
$$ F:/spectra/data/she/nmr/H-F/1/audita.txt
$$ ##AUDIT TRAIL=  $$ (NUMBER, WHEN, WHO, WHERE, WHAT)
(   1,<2023-07-11 14:06:05.23 +0400>,<she>,<DPX200>,
      <created by zg, POWCHK disabled, PULCHK disabled
       configuration hash MD5:
       00 E9 B6 7A A2 85 ED C7 34 08 36 98 17 FE 4E 26
       data hash MD5: 16K
       94 38 4D BA 4E 49 07 E2 8E 83 46 1E 87 47 4C 9D>)
$$ ##END=
$$ 
$$ hash MD5
$$ 13 3D 15 92 24 1E EA 1B 27 65 6A 8A B6 1F 3F 13
##$RELAX= 
##$RELAX= 
##$RELAX= 
##$RELAX= 
##$RELAX= 
##$RELAX= 
$$ Bruker specific parameters
$$ --------------------------
##$DU= <F:/spectra>
##$EXPNO= 1
##$NAME= <H-F>
##$PROCNO= 1
##$TYPE= <nmr>
##$USER= <she>
##$AMP= (0..31)
100 100 100 100 100 100 100 100 100 100 100 100 100 100 100 100 100 100 
100 100 100 100 100 100 100 100 100 100 100 100 100 100 
##$AQSEQ= 0
##$AQ_mod= 1
##$AUNM= <au_zg>
##$AUTOPOS= <>
##$BF1= 200.13
##$BF2= 200.13
##$BF3= 200.13
##$BF4= 200.13
##$BF5= 200.13
##$BF6= 200.13
##$BF7= 200.13
##$BF8= 200.13
##$BYTORDA= 1
##$CFDGTYP= 0
##$CFRGTYP= 5
##$CHEMSTR= <none>
##$CNST= (0..31)
1 1 145 1 1 1 1 1 1 1 1 1 1 1 1 1 1 1 1 1 1 1 1 1 1 1 1 1 1 1 1 1 
##$CPDPRG= <>
##$CPDPRG1= <>
##$CPDPRG2= <>
##$CPDPRG3= <>
##$CPDPRG4= <mlev>
##$CPDPRG5= <mlev>
##$CPDPRG6= <mlev>
##$CPDPRG7= <mlev>
##$CPDPRG8= <mlev>
##$CPDPRGB= <>
##$CPDPRGT= <>
##$D= (0..31)
0 1.2 0 0 0 0 0 0 0 0.06 0 0.03 0 0 0 0 0.0002 0 0 0 0 0 0 0 0 0 0 0 0 
0 0 0 
##$DATE= 1689069964
##$DBL= (0..7)
120 120 120 120 120 120 120 120 
##$DBP= (0..7)
150 150 150 150 150 150 150 150 
##$DBP07= 0
##$DBPNAM0= <>
##$DBPNAM1= <>
##$DBPNAM2= <>
##$DBPNAM3= <>
##$DBPNAM4= <>
##$DBPNAM5= <>
##$DBPNAM6= <>
##$DBPNAM7= <>
##$DBPOAL= (0..7)
0.5 0.5 0.5 0.5 0.5 0.5 0.5 0.5 
##$DBPOFFS= (0..7)
0 0 0 0 0 0 0 0 
##$DE= 6
##$DECBNUC= <off>
##$DECIM= 32
##$DECNUC= <off>
##$DECSTAT= 4
##$DIGMOD= 1
##$DIGTYP= 9
##$DL= (0..7)
0 120 120 120 120 120 120 120 
##$DP= (0..7)
150 150 150 150 150 150 150 150 
##$DP07= 0
##$DPNAME0= <>
##$DPNAME1= <>
##$DPNAME2= <>
##$DPNAME3= <>
##$DPNAME4= <>
##$DPNAME5= <>
##$DPNAME6= <>
##$DPNAME7= <>
##$DPOAL= (0..7)
0.5 0.5 0.5 0.5 0.5 0.5 0.5 0.5 
##$DPOFFS= (0..7)
0 0 0 0 0 0 0 0 
##$DQDMODE= 0
##$DR= 18
##$DS= 0
##$DSLIST= <SSSSSSSSSSSSSSS>
$$ [...]
##$SUBNAM2= <"">
##$SUBNAM3= <"">
##$SUBNAM4= <"">
##$SUBNAM5= <"">
##$SUBNAM6= <"">
##$SUBNAM7= <"">
##$SUBNAM8= <"">
##$SUBNAM9= <"">
##$SW= 18.05172834244
##$SWIBOX= (0..15)
0 0 2 0 0 0 0 0 0 0 0 0 0 0 0 0 
##$SW_h= 3612.71676300578
##$TD= 16384
##$TD0= 1
##$TE= 0
##$TE2= 300
##$TE3= 300
##$TEG= 300
##$TL= (0..7)
0 120 120 120 120 120 120 120 
##$TP= (0..7)
150 150 150 150 150 150 150 150 
##$TP07= 0
##$TPNAME0= <>
##$TPNAME1= <>
##$TPNAME2= <>
##$TPNAME3= <>
##$TPNAME4= <>
##$TPNAME5= <>
##$TPNAME6= <>
##$TPNAME7= <>
##$TPOAL= (0..7)
0.5 0.5 0.5 0.5 0.5 0.5 0.5 0.5 
##$TPOFFS= (0..7)
0 0 0 0 0 0 0 0 
##$TUNHIN= 0
##$TUNHOUT= 0
##$TUNXOUT= 0
##$USERA1= <user>
##$USERA2= <user>
##$USERA3= <user>
##$USERA4= <user>
##$USERA5= <user>
##$V9= 5
##$VALIST= <valist>
##$VCLIST= <CCCCCCCCCCCCCCC>
##$VD= 0
##$VDLIST= <DDDDDDDDDDDDDDD>
##$VPLIST= <PPPPPPPPPPPPPPP>
##$VTLIST= <TTTTTTTTTTTTTTT>
##$WBST= 1024
##$WBSW= 4
##$XGAIN= (0..3)
0 0 0 0 
##$XL= 0
##$YL= 0
##$YMAX_a= 292513
##$YMIN_a= -220623
##$ZGOPTNS= <>
##$ZL1= 120
##$ZL2= 120
##$ZL3= 120
##$ZL4= 120
##$ABSF1= 10
##$ABSF2= 0
##$ABSG= 5
##$ABSL= 3
##$ALPHA= 0
##$AQORDER= 0
##$ASSFAC= 0
##$ASSFACI= 0
##$ASSFACX= 0
##$ASSWID= 0
##$AUNMP= <proc_1d>
##$AZFE= 0.1
##$AZFW= 0.1
##$BCFW= 1
##$BC_mod= 2
##$BYTORDP= 1
##$COROFFS= 0
##$CY= 11.3945322036743
##$DATMOD= 1
##$DC= 2
##$DFILT= <>
##$DTYPP= 0
##$F1P= 15.7292609196834
##$F2P= 12.9074282941183
##$FCOR= 0.5
##$FTSIZE= 0
##$FT_mod= 4
##$GAMMA= 1
##$GB= 0.15
##$INTBC= 1
##$INTSCL= 1
##$ISEN= 128
##$LB= 0.24
##$LEV0= 0
##$LPBIN= 0
##$MAXI= 10000
##$MC2= 0
##$MEAN= 0
##$ME_mod= 0
##$MI= 1.114404
##$NCOEF= 0
##$NC_proc= 0
##$NLEV= 6
##$NOISF1= 3.799351
##$NOISF2= 2.8
##$NSP= 1
##$NTH_PI= 0
##$NZP= 0
##$OFFSET= 15.70392
##$PC= 1
##$PHC0= -21148.87
##$PHC1= 12.45272
##$PH_mod= 1
##$PKNL= yes
##$PPARMOD= 0
##$PSCAL= 0
##$PSIGN= 0
##$REVERSE= no
##$SF= 200.130013532006
##$SI= 16384
##$SIGF1= 3
##$SIGF2= 2
##$SINO= 400
##$SIOLD= 16384
##$SREGLST= <1H.CDCl3>
##$SSB= 0
##$STSI= 0
##$STSR= 0
##$SW_p= 3612.71676300578
##$SYMM= 0
##$S_DEV= 0
##$TDeff= 0
##$TDoff= 0
##$TI= <>
##$TILT= no
##$TM1= 0
##$TM2= 0
##$TOPLEV= 0
##$USERP1= <user>
##$USERP2= <user>
##$USERP3= <user>
##$USERP4= <user>
##$USERP5= <user>
##$WDW= 1
##$XDIM= 8192
##$YMAX_p= 0
##$YMIN_p= 0
$$ End of Bruker specific parameters
$$ ---------------------------------
##NTUPLES= NMR FID
##VAR_NAME=  TIME,          FID/REAL,        FID/IMAG
##SYMBOL=    X,             R,               I
##VAR_TYPE=  INDEPENDENT,   DEPENDENT,       DEPENDENT
##VAR_FORM=  AFFN,          ASDF,            ASDF
##VAR_DIM=   8192,          8192,            8192
##UNITS=     SECONDS,       ARBITRARY UNITS, ARBITRARY UNITS
##FACTOR=    0.0002768,     1,               1
##FIRST=     0,             0,               0
##LAST=      2.2672688,     0,               0
##MIN=       0,             -220623,         0
##MAX=       2.2672688,     292513,          0
$$ Real data points
##PAGE= N=1
##DATA TABLE= (X++(R..R)), XYDATA
0 0 0 0 0 0 0 0 0 0 0 0 0 0 0 0 0 0 0 0 8 -8 8 -8 8 -12 16 -16 22 -24 28 -32 38 -44 51 -58 67 -75 84 -92 106
39 106 -118 133 -147 165 -184 205 -225 249 -273 305 -335 367 -405 446 -491 541 -596 655 -725
58 -725 802 -886 986 -1098 1229 -1374 1542 -1716 1847 -1699 -45 19316 292513 72049
72 72049 -72634 116701 -120771 -220623 130958 149976 -64587 8395 -42516 -150082 55907
83 55907 140509 -6898 15307 -22947 -131762 24312 108664 -28290 6287 25857 -87551
94 -87551 21090 123237 -37240 -64826 16318 -51075 -790 126828 14445 -80021 -27694
105 -27694 -44550 14730 121518 6863 -77599 -30334 -87300 -18157 175006 58974 -97581
116 -97581 -7303 -47065 -94344 126459 131189 -94854 -42164 11718 -99944 52726 176488
127 176488 -47114 -88596 37106 -61887 -37844 141321 28534 -101188 7154 4429 -41879
138 -41879 66383 40500 -78150 -21172 12179 -22617 51472 41556 -66840 -25739 20746 -13328
150 -13328 38019 38711 -61248 -33545 29537 2443 37733 54023 -52981 -59458 22524 9421
162 9421 22465 55510 -32762 -61115 10486 1586 18903 64884 -32679 -77446 17141 3774
174 3774 -17799 70776 17365 -90031 -4444 38024 -30658 30174 51592 -65887 -32439 50948
186 50948 -13061 -1063 57906 -29821 -51433 39286 13935 -19892 32218 135 -43485 16790
198 16790 21878 -16667 15036 -609 -42895 11301 27420 -19303 4714 10211 -35214 -4485
210 -4485 28993 -4727 -3106 6141 -24259 -4688 27318 -1362 -973 17403 -20056 -15195 28859
223 28859 3469 -8370 18622 -10757 -19214 21807 2075 -15069 20286 -1536 -30644 14296
235 14296 14201 -26652 6199 19293 -25558 -5233 19051 -17960 -4816 22136 -12891 -8884 18706
248 18706 -11800 -11562 25653 3169 -16291 12086 3021 -14635 14558 13813 -11609 1658 371
261 371 -13503 12637 14408 -13774 -3616 2158 -14556 2968 17349 -6300 -12592 -2949 -8057
274 -8057 3459 17329 -3608 -11966 296 -8344 -70 25094 5431 -16742 -3306 -526 1390
287 1390 19099 10431 -11907 -9459 -3980 296 19629 14617 -16424 -16547 -1061 -1736 10875 17206
301 17206 -10191 -22347 -8435 1840 14213 15701 -8685 -21948 -8509 3454 12041 19572 1831
314 1831 -22936 -13806 8827 17191 17091 1195 -18791 -14366 2600 16234 21207 3507 -21628
327 -21628 -20462 2195 17037 15391 2658 -17107 -24766 -5486 16442 19850 4411 -19426 -24487
340 -24487 -4012 16044 20471 8212 -13070 -23230 -9713 16813 27108 9041 -14433 -21492
352 -21492 -7801 15074 24560 13282 -9317 -25765 -14782 13855 26085 9998 -14340 -23279
364 -23279 -14601 5601 24730 16725 -12559 -26544 -17038 6615 25396 15780 -10042 -22142 -16194
377 -16194 2718 25061 24578 -5436 -25735 -13686 5929 21213 24640 -657 -25110 -17425 912
390 912 17650 25660 2138 -27582 -20844 3780 14915 17899 6682 -22445 -28349 -729 17870
403 17870 18117 5850 -20169 -25339 366 18097 18650 9481 -13889 -26438 -4732 22356 22790 5736
417 5736 -13201 -22262 -7120 16880 23293 11700 -12634 -28021 -9638 15566 19806 10228 -11223
430 -11223 -27593 -13801 10100 18878 14838 -5051 -28263 -16356 14458 16588 7779 3644 -18681
443 -18681 -23128 12018 24241 7161 796 -11351 -19853 6941 24728 6633 -4243 -7485 -18972
456 -18972 -1910 26571 10967 -12709 -10348 -13350 -5607 21079 15474 -10340 -14332 -13373 -6886 18446
470 18446 21574 -7154 -17857 -8684 -4016 10808 24335 5722 -16764 -15254 -2067 13080 17300
483 17300 5412 -6442 -14395 -10377 11051 18139 2183 -6719 -10196 -13455 3894 18613 36
496 36 -11277 -1937 -10141 -7174 20075 8992 -18268 -4207 3864 -6323 9718 15095 -11284 -11306
510 -11306 6107 937 6006 15808 -7927 -16343 7281 5526 -428 14398 -604 -22559 -2549
523 -2549 10666 433 6354 4661 -17826 -12518 9076 4942 1158 6790 -8194 -17275 2010 11516
537 11516 3596 1476 40 -6256 -6558 4293 12469 3759 -5160 96 630 -4176 4477 8669 -3856
552 -3856 -4193 4567 -3555 -4586 7248 -2266 -9145 7456 2924 -11587 1134 3539 -10053 1160
566 1160 10742 -4771 -5365 3902 -5347 -2221 12329 1608 -5715 5568 -2287 -7983 10245 8781
580 8781 -5877 1500 3699 -8023 -1573 8231 -222 -2166 3404 -4331 -7531 1806 1402 -1925 2743
595 2743 870 -6492 -6309 762 4481 1051 1171 3456 -5416 -8666 5724 9931 -359 1413 3317
610 3317 -8315 -4592 11105 5505 -2227 3462 -4361 -9449 6325 6940 -4555 1048 85 -10630
624 -10630 -681 8676 -2690 -4654 1944 -4916 -2976 7937 -765 -6641 3243 -212 -3442 9229
638 9229 5017 -9522 -2503 6343 1184 3475 7630 -4380 -9786 1189 6184 4549 4069 -3446 -10125
653 -10125 -4683 3869 6865 3456 -3139 -8612 -8677 412 9487 5516 -3946 -6095 -5194 -2745 6944 11009
669 11009 -381 -8129 -3005 361 4235 10094 2661 -7300 -3502 770 2572 8215 3587 -9157
683 -9157 -7277 2888 3148 2842 3595 -6818 -11215 332 6123 3516 1809 -5876 -10942 -806 8313
698 8313 5558 1822 -2388 -9520 -4663 9854 10687 1140 -3334 -6114 -4635 5712 11024 4288 -4536
713 -4536 -8176 -5370 3620 9834 4374 -5598 -8554 -5570 344 7771 6223 -4358 -10349 -6205 2597
728 2597 7408 5220 -1231 -7460 -6874 1868 9174 7425 -520 -6786 -5395 1793 8478 7466 -391
743 -391 -5907 -6177 -1059 8022 8370 -1801 -7983 -6184 -1257 4854 6984 175 -8654 -8145 -1442 4999
759 4999 7755 1125 -8388 -6976 -307 4161 8245 4883 -5903 -8473 -296 6372 7754 4563 -3337
774 -3337 -7890 -2435 4706 7045 5241 -3392 -9473 -3684 3696 5120 3219 -2588 -8433 -5835 2030
789 2030 5962 3664 -2573 -7770 -4861 2952 5755 4022 -73 -5909 -5115 3107 7225 5209 -116
804 -116 -5399 -3965 2427 5799 4989 787 -5326 -6506 701 6232 3375 -989 -4696 -6558 -1508 4594
820 4594 3696 -159 -4386 -6567 -1702 4689 4351 133 -2754 -4144 -1661 4296 5894 1958 -2178 -4056
836 -4056 -1195 4724 5083 1201 -1017 -3423 -3175 2627 5334 874 -3379 -3894 -2640 457 3470 1206
852 1206 -2864 -4144 -3270 421 3711 1550 -2194 -2885 -1933 1162 3636 2556 -79 -2071 -1704 1276
868 1276 4495 3078 -809 -1381 -355 -420 2345 3306 -779 -3194 -1946 -302 1272 1247 -974 -2574 -2488
885 -2488 -1251 613 1567 -436 -2621 -1677 119 947 1826 880 -1004 -499 478 1268 2365 1560 -572
902 -572 -652 1324 1411 273 1031 572 -1450 -981 1047 285 -1196 -802 -492 -1059 -1023 -160 -714 -1090 -508 -584
922 -584 -375 252 -345 -379 682 832 392 404 866 909 599 1058 1280 463 -136 343 921 712 -436 -473 -201
943 -201 -407 -192 -29 -426 -1493 -2181 -463 835 -588 -1132 -556 -1352 -1123 1738 2082 -655 -788 138
961 138 -396 1834 3618 356 -1201 684 -316 379 3789 1754 -2496 -1461 298 -322 1143 1826
977 1826 -1945 -3030 -1004 -575 863 1347 -2051 -3078 -626 106 460 1732 -193 -2509 -705 1813
993 1813 1945 1691 443 -1608 -339 1987 2442 1867 16 -2026 -1168 997 2481 1695 -1765 -2993 -1361
1010 -1361 -345 1012 2506 -865 -4891 -2420 1048 583 1729 1485 -3603 -3493 1577 1990 1848 2644
1026 2644 -1615 -3609 1344 3277 1474 2125 480 -3369 -656 3364 1656 493 -286 -3223 -1497
1041 -1497 2098 889 -430 -738 -3222 -2552 1874 1926 -1204 -1710 -1705 -1660 1420 3122 699 -1483 -1939 -671
1059 -671 2505 3407 1649 -350 -2402 -1139 2561 3018 1481 226 -2820 -3282 1533 3247 -193 -690
1075 -690 -1439 -4512 -1105 3820 659 -1949 -850 -2845 -1896 3066 2159 -1360 -522 -931 -1575 2910 3579
1092 3579 -835 -922 675 -641 1630 3610 -330 -1982 -173 -386 927 2842 -574 -3303 -1281 -167
1108 -167 -70 1657 325 -3373 -2843 -336 788 1953 419 -2006 -1884 -827 1088 3180 1626 -1258
1124 -1258 -1160 -269 785 3118 2326 -1291 -1106 82 -598 1894 2863 -1778 -2622 324 -632 -378 2068
1141 2068 -832 -3519 -893 84 -649 1168 -19 -2973 -623 1408 -59 1111 1397 -2122 -1063 2457
1157 2457 1364 879 1601 -1030 -1314 1634 1787 559 1071 -954 -2352 397 1664 -50 -184 -947 -2684
1174 -2684 -1000 650 291 -72 -1033 -2158 -289 915 307 575 256 -1451 -191 1836 933 845 1123
1191 1123 -924 -165 2115 848 146 1171 -729 -1320 1366 1057 -935 -294 -528 -1856 107 879 -1169
1208 -1169 -792 -351 -1821 -240 1465 -627 -947 322 -702 -260 1768 884 -382 512 276 49 1667
1225 1667 1178 -363 374 402 -565 904 989 -627 -464 -357 -782 -45 -40 -1094 -695 -574 -1169 -207 408 -953
1245 -953 -793 363 -357 -206 997 -2 -113 1012 403 157 1425 655 -234 1059 834 -317 661 706
1263 706 -747 37 366 -780 -310 110 -1302 -598 313 -1029 -944 168 -743 -887 421 -108 -752 305
1281 305 380 -159 887 628 -242 844 715 13 1197 986 -378 251 806 49 257 476 -680 -623 28
1300 28 -523 -403 248 -1156 -1270 54 -349 -626 259 -642 -1145 134 232 45 664 213 -578 640 1217
1319 1217 473 861 705 -431 116 1332 427 274 232 -771 -439 537 -132 -425 -282 -1157 -1216 203 18
1338 18 -754 -489 -840 -1029 200 522 -106 83 -222 -609 818 1382 355 394 424 -113 571 1490 759 121
1358 121 -127 -472 -14 1012 288 -632 -515 -979 -852 437 117 -1029 -898 -914 -662 294 386 -425 -620 -353
1378 -353 -373 866 1242 214 -363 295 251 915 1541 430 -214 -100 83 599 1009 -17 -835 -612 -399
1397 -399 -315 389 -24 -1253 -1217 -599 -279 197 -145 -872 -867 -326 211 631 635 -130 -510 236 909 1096 845 52
1419 52 -206 127 619 968 718 -431 -846 -344 7 223 235 -566 -1372 -1001 -258 53 101 -438 -1204 -709 128
1440 128 273 454 341 -484 -419 588 945 843 460 -21 -66 585 967 728 388 -44 -492 116 758 282
1460 282 -400 -681 -798 -638 68 124 -549 -1089 -989 -530 73 461 63 -628 -438 27 357 801 761 22 -316
1481 -316 478 947 701 735 350 -408 -88 523 582 262 -223 -730 -585 -59 38 -330 -519 -745 -939 -353 244
1502 244 -126 -580 -541 -334 105 451 597 195 -201 202 728 780 904 399 -36 136 595 485 604 494 -605
1523 -605 -761 185 243 -494 -58 -503 -1266 -538 160 -326 -356 -349 -812 -479 493 160 -103 422 9 -225 711
1544 711 895 260 383 387 281 478 657 373 220 27 -17 108 163 -144 -422 -410 -412 -437 -299 -367 -537 -738 -582
1567 -582 86 206 -269 -152 -10 -389 226 679 179 188 377 42 221 1091 492 -196 523 132 -501 542
1587 542 587 -587 -172 151 -620 -525 148 -562 -730 -161 -429 -772 97 -165 -563 132 172 -268 176 305 42
1608 42 418 649 464 310 415 194 341 660 171 68 104 -164 -151 37 -193 -154 -283 -712 -354 -227 -551
1629 -551 -347 -207 -585 -423 93 -201 -362 188 78 -33 675 304 14 600 530 40 696 791 -161 5 613
1650 613 188 23 359 -336 -761 -55 -49 -389 16 -484 -1115 -313 -143 -436 -165 -112 -608 -349 197 313 325
1671 325 270 -1 177 467 558 732 615 -39 52 408 419 420 112 -344 -214 46 -189 -160 -138 -870 -850 -102 -43
1694 -43 -509 -60 -487 -863 13 243 -87 252 91 -585 342 1092 329 346 611 -213 -236 927 607 106 204
1715 204 -307 -528 407 370 -257 -296 -566 -852 -124 189 -279 -553 -567 -565 -251 369 135 -192 -251 -413 197 1034
1737 1034 510 134 241 -34 344 917 615 39 -16 -130 77 587 411 -335 -439 -376 -579 168 266 -642 -687
1758 -687 -662 -627 26 299 -211 -525 -125 -155 209 784 426 -224 77 240 421 959 592 -74 -85 229 332
1779 332 511 421 -321 -410 -198 -46 139 57 -620 -888 -463 -219 -15 42 -585 -814 -261 -110 173 481 49
1800 49 -303 54 476 645 635 341 -106 59 393 487 708 192 -456 -228 193 11 132 62 -704 -713 -361 -153
1822 -153 -87 -263 -597 -636 -202 39 31 123 -142 -534 54 587 562 442 70 -11 306 451 450 372 221 -215 -122 357
1846 357 417 -67 -185 -449 -555 -97 19 -179 -308 -698 -518 -49 23 -118 -160 -249 -245 117 466 360 144 83
1868 83 -58 445 686 350 377 173 -13 200 500 291 -22 -217 -303 -257 23 56 -316 -388 -410 -490 -74 -34 -493
1891 -493 -291 -268 -233 69 183 107 -33 173 350 466 594 301 174 255 242 189 434 311 -84 -52 18 15 -70 -279
1915 -279 -376 -292 -394 -287 -243 -273 -445 -362 -140 -171 -100 -62 -170 60 106 147 406 302 78 297 563 367 369 351
1939 351 119 17 111 281 -119 -77 -127 -337 -178 -158 -373 -384 -414 -506 -417 -114 -163 -344 -251 3 -120 94 153 65
1963 65 12 167 265 342 404 249 59 287 449 279 68 100 -52 -273 53 13 -311 -387 -372 -423 -422 -104 -76 -362
1987 -362 -205 -401 -310 201 91 -251 -85 176 119 210 536 346 -51 183 382 335 511 316 4 -104 219
2008 219 95 76 32 -396 -437 -238 -17 -361 -345 -222 -555 -542 103 31 -273 -209 -115 -13 259 601 221 144 321
2031 321 -33 143 710 416 -130 186 222 15 253 303 -190 -557 -97 -161 -292 81 -245 -708 -237 -221 -250 -58
2053 -58 -89 -376 -140 247 178 -14 305 190 24 437 665 448 143 208 108 145 466 316 -43 -129 -66 -288
2075 -288 -39 161 -329 -547 -331 -313 -338 -57 -28 -518 -589 1 -146 38 400 -109 -243 278 379 226 591
2096 591 404 -42 91 462 290 116 290 30 -183 261 179 -148 -181 -306 -495 -222 60 -321 -503 -181 -224
2117 -224 -331 82 146 -332 -73 -23 128 255 446 236 7 123 326 341 415 396 -49 -37 270 19 -29 110
2139 110 -164 -485 -305 131 -242 -280 -89 -424 -504 38 -83 -300 77 -83 -366 71 337 21 73 365 197
2160 197 37 523 463 -25 198 237 10 246 316 -97 -99 79 -173 -245 33 -119 -504 -169 -130 -397 -188 -118 -249
2183 -249 -324 30 12 9 115 -24 9 246 355 259 337 283 87 205 382 276 85 113 27 -19 -282 62 -83 -319
2207 -319 -313 -333 -349 -320 -184 -224 -342 -113 -187 -218 102 77 -58 173 258 -19 185 457 205 246 410 133 149 316
2231 316 136 -76 318 114 -298 13 -88 -309 -176 -199 -442 -425 -151 -300 -303 -198 -151 -116 22 -12 -76 15 92
2254 92 99 321 176 314 327 123 187 367 221 158 199 73 -118 109 -6 -266 10 -140 -379 -166 -130 -287 -176
2277 -176 -296 -472 -60 -11 -274 -103 202 -72 -126 283 250 86 313 124 173 443 325 82 240 185 -165 230
2299 230 114 -190 -233 -83 -199 -199 -76 -308 -354 -105 -346 -260 -5 -205 -209 -32 -124 -16 233 250 116 100 141 271
2323 271 393 351 101 159 248 45 199 218 -104 -73 -14 -125 -59 -186 -373 -283 -88 -228 -189 -83 -268 -293 -115
2346 -115 6 -44 227 172 -56 186 172 215 384 305 140 277 212 93 268 257 36 -59 -1 -59 -166 22 -287
2369 -287 -241 -45 -363 -217 -95 -222 -333 -51 -139 -16 148 -1 -90 83 215 5 264 328 13 254 268 202
2391 202 195 298 -19 104 64 6 -35 -13 -96 -339 -132 -227 -334 -130 -226 -300 -204 -201 -188 -37 61 -67 86 8 108
2416 108 163 265 51 82 323 185 194 279 127 93 34 38 -76 58 -129 -112 -138 -138 -162 -56 -225 -254 -243 -187 -238 -66
2442 -66 6 -228 -41 13 -35 125 172 -25 101 279 190 308 287 149 187 129 103 116 94 -92 -176 -94 -181 -98 -162 -126
2468 -126 -430 -226 -138 -206 -167 -135 -249 -228 -68 93 37 162 98 -19 256 262 75 195 216 165 137 309 152 81
2492 81 -128 13 -141 5 -113 -201 -292 -215 -170 -268 -230 -135 -230 -484 -201 -1 -78 15 -34 -126 51 232 149 242 256
2517 256 127 205 185 239 87 218 109 -98 72 13 -58 -171 -45 -289 -217 -157 -74 -275 -196 -286 -269 65 24 -107
2541 -107 -54 17 58 124 196 155 -13 158 242 236 208 296 52 94 68 66 -28 55 30 -223 -114 -94 -140 -324 -100 -209 -281
2568 -281 -150 -47 -189 -129 -86 -93 -49 207 173 88 121 246 22 273 297 112 176 284 141 170 299 30 46 74
2592 74 -40 -120 25 -47 -246 -260 -294 -172 -150 -158 -144 -209 -72 60 16 46 170 23 182 279 156 119 110 103 175 227 198
2619 198 92 98 110 -38 -11 -21 -127 -260 -151 -228 -324 -158 -53 -265 -197 -106 -53 -107 -34 -50 -97 30 73 100 124 139
2645 139 151 113 254 151 183 71 146 134 65 26 17 40 -82 -74 -169 -36 -102 -244 -270 -56 -283 -113 -178 -110 -157 -15
2671 -15 -107 119 135 81 46 137 189 203 228 249 203 60 228 143 31 121 -31 -65 -152 -88 -51 -130 -173 -226 -285 -203 -193 -189
2699 -189 -153 -81 -193 8 -16 65 -4 163 165 73 166 203 29 187 206 175 224 106 46 -89 -15 57 -107 -70 -16 -239
2725 -239 -174 -187 -29 -153 -124 -240 -169 -106 -81 12 24 17 -43 84 259 207 145 98 164 181 168 130 218 100 52 134 16
2752 16 40 -93 -145 -50 -139 -113 -105 -94 -156 -184 -171 -164 -138 -175 -47 28 -32 59 -79 129 56 171 164 165 151 99 243 154 103
2781 103 177 130 149 -27 -110 26 -172 -52 -28 -233 -172 -162 -146 -189 -157 -53 -100 -58 -34 -60 -14 38 79 -36 155 241
2807 241 198 251 134 166 200 94 182 140 75 48 108 10 58 -95 -78 -132 -174 -183 -184 -177 -204 -100 -98 -49 -75 60 23 65 -14
2836 -14 -96 109 60 170 176 174 218 179 142 143 99 172 38 108 -44 -16 -55 -63 -82 -74 -77 -183 -103 -193 -108 -23 -163 -138 76 28
2866 28 10 -31 152 77 118 112 108 142 92 310 165 210 105 111 91 -18 67 89 -86 -93 -167 -129 -193 -302 -234 -151 -140 -143 -24
2895 -24 -31 -147 78 3 21 -15 44 119 113 141 181 222 46 140 188 79 132 96 6 49 -26 -114 -194 -141 -51 -84 -200 -6
2923 -6 -107 -78 -104 -22 -36 -87 14 -24 36 55 89 139 138 147 176 134 195 74 276 170 97 89 127 64 -29 13 -15 -149 -39
2952 -39 -159 -177 -141 -51 -166 -234 -90 -94 -92 -75 53 86 15 40 129 79 162 100 31 140 168 95 48 122 62 24 55 -70
2980 -70 -44 -20 -201 -126 -23 -98 -134 -160 -186 -112 -73 -5 -98 -123 9 -43 50 193 43 56 70 36 255 121 241 223
3006 223 85 175 56 59 136 6 -106 -61 -45 -115 -35 -174 -177 -293 -120 -30 -109 -11 -186 -249 -101 58 104 39 75 10
3032 10 54 151 229 224 200 102 84 84 165 50 -79 -34 -135 25 65 27 -102 -237 -105 -250 -48 -11 -62 -276 -40 -192
3058 -192 -43 134 2 44 9 111 120 201 156 57 46 93 101 125 133 34 -70 53 170 19 -77 -17 -243 -235 -53 -51 -188
3085 -188 -113 -152 -120 -151 90 -86 -18 -170 -111 109 123 251 74 -56 13 156 231 265 3 -47 -23 134 62 109 -19
3110 -19 -316 -271 -41 -79 -86 -88 -196 -287 -65 116 -95 -71 -119 -290 -92 172 172 -28 -50 41 76 284 419 109 30
3135 30 11 18 154 184 165 -99 -97 -48 -38 68 74 -212 -369 -107 -94 -114 -28 -68 -310 -314 142 48 174 147 -55 -17 230
3162 230 258 116 134 72 -37 32 293 267 100 -107 -151 -203 257 175 -89 -281 -295 -202 -85 -14 -146 -195 -209 -69
3186 -69 -1 178 64 -78 -121 -58 170 221 295 154 11 69 165 305 172 192 -101 -11 90 187 15 -97 -192 -265
3210 -265 -91 0 -79 -170 -131 -249 -190 114 108 -144 -150 -137 -18 190 241 54 78 15 73 266 268 50 18 18 119 221
3236 221 139 106 -67 -272 -148 -20 0 5 -74 -256 -39 -183 -109 -36 -42 -258 -280 17 144 15 -75 -35 -29 149 269
3261 269 99 74 19 16 212 225 104 45 -81 -16 4 -9 74 -121 -254 -209 -248 -135 -5 -88 -207 -193 -104 68 50
3286 50 33 -3 5 108 37 120 228 70 49 44 46 235 213 55 94 -61 -60 -5 1 -32 -166 -152 -152 -116 -83 -13 -204 -108 -64
3315 -64 -82 -97 -169 -44 -2 37 109 98 72 102 129 73 25 145 162 23 136 30 -5 69 -16 16 -106 -171 -106 -77 -37
3342 -37 63 -143 -208 -130 -155 24 81 44 47 -89 13 125 160 123 66 35 74 111 204 254 86 58 35 52 202 106 27
3369 27 -45 -151 -139 4 -76 -174 -199 -201 -135 -45 -1 -91 -107 -64 -86 192 160 75 -18 -27 -90 195 288 27 -34 -58 -33 153
3397 153 218 64 -93 -136 -152 9 105 -84 -231 -218 -296 -53 22 -92 -239 -166 -221 62 159 95 -113 -73 -63 137
3421 137 313 257 -44 -151 164 259 296 331 -49 -104 -150 -35 143 267 -215 -258 -225 -82 54 -15 -166 -446 -300
3444 -300 -42 123 107 15 -194 -140 15 131 282 136 -1 -170 98 221 322 120 22 -166 -71 190 321 98
3466 98 -161 -336 -199 -20 119 -35 -250 -279 -224 15 191 143 -165 -255 -113 73 313 321 78 -117 -128 284 240
3489 240 213 157 -189 6 152 210 282 9 -228 -297 -54 136 37 -44 -215 -400 -242 152 22 -107 -338 -264 -59
3512 -59 149 177 42 -85 -181 19 286 430 139 -116 -128 13 308 188 56 -49 -149 -64 178 114 84 -298
3534 -298 -384 -133 89 143 -98 -180 -228 -276 59 182 55 -96 -39 -103 124 351 198 -63 -30 5 93 412 208
3557 208 76 -143 -62 -80 112 293 -140 -323 -205 -37 127 31 -98 -306 -223 -25 35 123 30 -110 -167 24 153
3580 153 109 125 -116 -109 17 277 323 102 48 -6 -72 131 289 69 -84 -122 -171 9 145 -88 -203 -135 -51 -143
3604 -143 -76 38 -246 -197 -61 -47 65 179 22 -81 -4 119 70 202 153 -49 19 225 43 106 162 -123 -77
3627 -77 7 48 -105 -45 -154 -232 -235 -43 -106 -134 -148 -177 -86 62 52 19 -58 37 83 -35 235 137 168 25 146 55 22
3654 22 234 46 17 22 2 -12 62 83 -166 -134 -10 -168 -89 -5 -102 -115 -77 -113 -43 28 154 -101 80 135 -15 170
3680 170 228 122 62 127 78 116 129 49 -160 -53 68 12 187 -54 -79 -185 -117 -140 67 -63 -116 -248 -176 38
3704 38 91 -17 -107 -104 -7 88 257 198 48 -83 -69 38 246 327 -66 58 -126 -27 235 233 -116 -161 -309 -147 -3
3729 -3 33 -13 -316 -333 -153 -79 111 -16 -119 -268 -129 93 368 158 1 -173 -17 314 353 237 -97 -115 -47
3752 -47 191 286 278 -50 -232 -223 -21 215 18 -185 -261 -325 -232 174 179 -142 -373 -359 -95 271 180 -16 -164 -228 47
3777 47 285 416 140 -225 -3 219 270 410 199 -191 -331 -114 250 251 -23 -219 -353 -281 71 247 69 -338
3799 -338 -525 -266 103 479 126 -225 -349 -105 227 517 200 -111 -326 -96 320 555 236 -49 -324 -256
3819 -256 25 302 201 -270 -480 -325 -33 199 174 -174 -402 -433 89 235 135 -166 -336 -393 35 354 352 48
3841 48 -231 -314 76 495 443 19 -254 -154 -34 271 453 40 -263 -468 -132 262 272 -14 -320 -502 -227
3862 -227 56 229 19 -302 -421 -180 262 262 197 -55 -211 -169 161 491 386 0 -263 -44 278 212 220 -42
3884 -42 -412 -291 9 324 197 -223 -501 -279 -183 121 328 -115 -439 -336 -111 293 177 -6 -194 -148 43
3905 43 292 291 173 -131 -194 13 273 370 43 -117 -234 -58 69 228 143 -200 -295 -230 78 116 97 -234 -401
3928 -401 -337 25 197 7 -196 -164 46 142 322 156 10 -170 -82 209 327 222 22 -110 -55 65 83 195
3950 195 -66 -309 -189 -30 -8 48 -65 -276 -235 -165 6 35 -16 -220 -176 45 193 20 149 25 -13 21 143
3973 143 205 142 45 145 107 66 126 73 54 -125 -10 90 66 -84 -209 -149 -182 -130 -72 -31 -65 -79 -61 15 -55 24 18
4000 18 26 30 39 159 122 111 -1 147 242 71 -77 140 167 -65 -50 -15 -8 -90 -51 53 -132 -214 -98 -47 -30 -121 -189
4027 -189 -57 -11 -51 128 72 89 -86 -48 204 142 157 82 -53 -40 116 115 269 133 -50 -68 -7 142 -10 -63 -21
4052 -21 -314 -194 48 10 -21 -245 -249 -156 -45 114 103 -106 -140 -158 60 318 253 -59 -37 -159 190 241 240 79 -179
4077 -179 -139 166 254 78 -21 -233 -267 -99 8 98 -27 -257 -292 -32 146 130 -88 -78 -278 -77 296 315 53
4100 53 -84 -224 78 347 338 57 -31 -193 -80 175 411 111 -278 -313 -287 85 218 130 -238 -453 -157 83
4122 83 213 94 -119 -386 -159 104 284 300 24 -228 -130 212 391 198 86 -189 -208 77 320 315 -60 -161
4144 -161 -294 -74 184 118 -117 -295 -307 -173 173 199 -105 -388 -264 -22 225 167 79 -185 -302 -56 324 346
4166 346 248 -155 -200 6 256 384 243 -111 -320 -125 182 361 -57 -160 -351 -270 37 110 38 -219 -429 -211
4188 -211 188 288 176 -184 -237 -108 107 348 328 -110 -242 1 290 431 232 -38 -140 -207 135 317 166
4209 166 -102 -284 -217 -55 12 132 -104 -281 -372 -23 190 158 -27 -288 -196 -48 178 252 103 -10 -138 -6
4231 -6 295 284 160 -107 -128 -78 114 373 172 -139 -237 -33 61 171 37 -240 -302 -220 4 229 -29 -180 -238
4254 -238 -4 150 121 213 -74 -176 -46 163 210 224 -23 -89 29 163 175 160 -23 -125 -175 -14 260 75 -116
4277 -116 -155 -184 -41 -59 39 -103 -305 -259 -137 158 79 -113 -75 -35 41 229 140 155 -122 42 218 237 155 102 -92
4302 -92 -37 32 144 30 -35 -104 -157 -139 -17 20 -39 -87 -266 -113 -40 -51 -117 -61 -110 -10 11 17 172 75 40 86 97
4329 97 216 30 16 84 96 37 71 38 6 -159 -151 23 -15 -86 -128 -9 -194 -153 -146 -79 -81 -94 43 -77 -68 -48 25 109
4357 109 5 29 48 138 104 139 221 128 -13 -115 64 69 -41 -113 -45 -19 -54 -64 -39 -96 -60 -107 -86 -64 -162 -111 -132 -58
4385 -58 -124 89 57 64 -109 120 63 184 173 118 45 -3 95 89 66 13 -99 -88 -127 -94 35 -54 -162 -274 -108 -30 -106
4412 -106 -30 -172 -191 -102 -89 26 38 -21 -138 -13 106 206 195 68 -38 69 270 135 187 67 -182 -38 63
4435 63 100 -46 -58 -191 -148 -115 61 84 -36 -275 -55 60 40 49 12 -57 -169 101 167 153 20 -117 -34 174 171
4460 171 115 82 61 -72 -3 196 159 27 -42 -225 -14 6 62 -99 -116 -294 -217 -13 87 -12 -123 -85 -67 39
4484 39 268 160 -89 -123 -49 165 292 175 12 -33 -162 121 247 148 -94 -203 -73 81 73 -20 -69 -344 -254
4507 -254 -118 128 107 -135 -158 -140 -18 179 127 8 -164 -198 167 248 235 115 -30 42 123 282 238 77 -170
4530 -170 -132 -29 113 314 19 -232 -204 -192 -75 99 -124 -298 -313 -68 75 119 19 40 -183 -91 198 330
4552 330 206 -39 -115 67 61 251 93 57 -163 -118 78 141 135 -220 -330 -160 -45 72 62 -195 -277 -214 -7 197
4576 197 65 -132 -117 -90 63 185 212 118 -115 -65 131 272 135 118 -81 -147 -5 179 128 -29 -180 -177 -35
4599 -35 67 -48 -99 -118 -197 -119 43 184 -82 -254 -249 -50 63 75 102 -180 -4 17 154 307 60 -37 -55 128
4623 128 144 236 43 16 -49 27 105 -41 -63 -144 -171 -134 -108 -52 -39 -124 -232 -144 -113 78 28 -102 -6 -135 -61 82
4649 82 47 16 66 -24 144 202 112 34 85 -124 28 111 83 -57 -83 -137 -149 -20 -89 -55 -93 -159 -3 34 -30 -4 -117
4676 -117 -5 -22 24 21 35 35 90 122 10 170 94 162 103 -25 -113 -27 -9 15 -53 -105 -159 -128 -61 -145 -119 -201 -200 -73 30
4705 30 -39 37 16 -132 41 68 58 77 105 -46 111 80 143 82 246 -44 21 138 132 54 -44 -58 -80 -74 -70 13 -89 -156
4733 -156 -146 -99 -38 -50 -149 -35 -144 -82 -1 135 62 70 -114 64 136 112 222 0 -24 5 63 97 167 3 -151 -104
4759 -104 -49 146 53 -79 -105 -256 -127 34 56 -35 -104 -123 -22 -27 232 39 -115 -86 28 207 290 122 -3 -99
4783 -99 96 174 190 239 -18 -49 -58 90 182 32 -53 -103 -117 -86 137 4 -264 -281 -208 86 74 189 -28 -184 -183 123
4809 123 287 245 -52 -16 53 171 203 292 66 -182 -223 4 150 122 -90 -185 -289 -139 49 72 -13 -256 -172 -66
4833 -66 52 158 -35 -192 -240 14 158 286 -3 -173 -163 -52 245 298 79 77 -120 -71 171 199 58 -168 -94
4856 -94 -162 -21 104 8 -184 -336 -239 67 141 46 -217 -215 -167 -9 167 163 28 -179 -145 74 250 312 54 -139
4880 -139 -59 -68 215 197 122 -142 -133 34 142 92 -38 -314 -160 -128 75 136 -51 -178 -300 26 -34 190 24 -73
4904 -73 -142 -65 90 168 53 -73 -4 96 259 192 229 66 -157 -131 44 145 31 -136 -272 -83 -65 40 -25
4927 -25 -179 -235 -79 20 60 1 67 -186 -96 64 141 115 101 -23 -31 283 127 191 113 34 -75 58 131 169 -6 -335
4953 -335 -35 52 71 -115 9 -165 -229 -98 151 171 -125 -39 -136 -11 8 126 25 16 16 -25 130 92 112 83 48
4978 48 108 147 97 140 -106 -143 -38 29 50 -56 -79 -187 -32 -90 -56 78 -174 -102 -87 64 103 -3 43 -34 -55 3
5004 3 87 160 62 112 91 11 92 21 84 49 3 -39 -15 -99 -22 12 14 -100 9 -98 -170 -35 -67 31 -52 -106 -99 38 30 37
5034 37 -154 55 2 22 101 48 133 -2 -51 30 70 -34 59 80 130 1 -68 -55 -108 -83 -91 46 -37 -115 -94 -67 -26 -59
5062 -59 -8 102 -41 -56 4 118 53 50 29 47 127 72 82 211 55 -122 -56 -84 16 -32 12 -128 -157 -66 128 -66
5088 -66 -100 -100 -171 -43 -122 -16 48 -84 -75 9 73 72 102 -75 16 14 145 222 74 76 2 22 218 189 16 -147 -108 -64
5116 -64 -140 80 68 -223 -233 -39 29 8 -118 -112 -36 -176 -8 167 31 61 -51 10 123 83 101 125 45 14 187
5141 187 107 80 -28 -60 -31 -32 18 -60 -71 -241 -95 -33 150 5 -167 -174 -89 -48 -42 50 16 -149 -90 114 142 108 -59
5168 -59 -6 25 77 120 187 -7 -58 -42 128 74 64 87 -119 -172 -79 6 -109 -7 -254 -186 -137 12 -6 35 -156 -133
5194 -133 -127 4 151 47 -39 -85 120 196 138 113 -63 -133 -24 133 73 135 -125 -78 -31 37 91 30 -125 -248 -146
5219 -146 -7 79 87 -95 -144 -7 29 107 1 -17 -98 -8 122 171 34 121 27 47 -43 156 26 -140 -50 -49 10 17 -45
5246 -45 -57 -139 -187 -90 -33 118 -88 -199 -135 -74 1 42 -36 -13 20 -57 110 115 46 104 62 82 149 100 22 30 -96 -12 148
5275 148 87 -5 -84 -20 -182 62 82 82 -179 -176 44 51 -45 -76 -17 9 -84 27 46 52 -62 25 -13 184 86 78 92 53 98
5304 98 1 91 1 -140 -158 -59 49 -56 -96 49 -75 -85 -94 53 -7 -25 -20 -29 7 -87 60 -32 63 59 40 117 99 71 85
5333 85 66 88 125 114 85 -86 -40 -35 -26 -12 -90 -56 -75 -89 -109 40 -52 -230 -155 11 23 33 -42 135 35 9 145 121
5361 121 60 12 52 82 74 -2 54 -34 -9 15 8 81 -73 -11 -45 -52 4 -122 -17 5 -57 4 -9 -102 -57 -68 5 58 40 66
5391 66 18 79 97 95 160 125 -25 119 84 159 -17 30 35 20 -40 41 -60 -141 -140 -68 -66 -138 -69 -131 -30 -90 -143 -47 -71 120
5421 120 -97 41 132 -31 102 -40 46 22 153 120 192 3 -19 38 41 67 -70 54 -133 -130 -64 -19 54 -77 -152
5446 -152 -12 -26 -33 -3 -127 -170 -21 -18 207 147 28 -19 78 -19 52 61 54 30 9 33 22 67 -12 -202 -46 -73 -62 1
5474 1 -36 -124 -154 -86 11 91 -43 -125 -104 -12 107 173 43 -61 -51 128 241 157 124 15 -30 -2 39 105 -15 -70 -115
5501 -115 15 -46 134 101 110 -139 -244 -38 105 -30 -150 -211 -142 -15 25 62 21 -43 -63 119 130 54 -83 116
5525 116 -51 45 154 186 -18 -119 -96 63 51 27 -16 -57 -48 -63 48 229 -210 -217 -206 -24 58 -10 -9 -82 -104 -60 182
5552 182 85 138 -64 -100 30 89 117 46 -105 -24 -59 127 119 4 -194 -155 -50 15 125 28 -100 -237 -173 66 80
5577 80 65 -86 -176 -145 23 55 86 -1 -194 52 169 61 60 8 32 -34 8 233 150 -78 -93 -82 -46 -7 -23 -59 -29
5604 -29 -190 -48 35 30 -58 -192 -33 30 -5 79 31 -91 -104 58 170 95 125 -32 -72 37 113 89 106 -44 -144
5629 -144 -135 74 -33 -33 -126 -166 -75 -77 15 3 -85 -160 -91 -5 23 86 -79 -26 84 49 131 146 -55 -109 -46 191 116 118 126
5658 126 26 15 -15 99 25 48 -131 -28 2 -14 -58 -49 -63 -139 -162 39 8 -109 -119 -44 82 71 40 36 30 -24 41 136
5686 136 100 95 99 43 -23 4 156 24 -50 -159 -4 -77 -54 -86 -70 -75 -47 -72 24 -45 -22 -72 -12 28 -18 83 68 40 16
5715 16 143 140 15 120 117 83 -82 -49 86 3 -75 -61 41 63 -80 -10 17 -57 -88 -118 -129 -130 -113 -88 21 15 1 -119
5743 -119 -9 73 100 37 14 58 85 22 233 86 -19 -59 187 113 59 -26 -80 -87 -42 45 -11 44 -92 -42 -54 -8 30
5770 30 -2 -32 -130 -118 48 95 -15 82 -73 50 150 143 7 123 51 21 60 232 110 21 -47 -10 -73 -51 -9 -116
5796 -116 -205 -90 98 -124 -33 -40 -114 -106 -76 108 66 -87 -54 -73 28 169 2 52 2 -94 70 126 169 -103 -2
5821 -2 -30 -21 123 79 -7 -69 -90 -113 31 61 -51 -161 10 -92 -132 30 7 -108 -97 -36 79 139 20 40 -93 52
5847 52 81 46 185 -63 -16 -81 115 4 22 -89 -15 -87 0 90 40 -98 -110 -111 -59 41 -12 27 -53 -52 -7 -57 86
5874 86 7 -82 34 8 86 100 83 -60 61 72 65 12 -74 0 55 -72 -81 75 28 -94 -206 71 -29 -79 -168 -92 -40
5901 -40 -126 -12 38 69 -32 -12 64 138 5 36 25 81 -46 42 161 61 50 -85 77 14 -89 -99 -134 -68 -146 15
5927 15 -52 22 -152 -155 19 1 -133 13 1 61 -13 -37 75 -71 -5 46 21 112 -12 15 23 -84 -44 27 117 5 -34
5954 -34 -23 -58 -19 30 27 -66 -95 -145 -50 -15 -36 2 -14 -42 -106 -40 69 106 10 -36 106 33 78 -2 74 101 70 69 129 -16
5984 -16 41 -122 -3 -62 -53 -199 -148 -21 -69 -5 93 -34 -42 -29 -74 -26 -4 85 17 -60 11 160 92 60 -87 119 20
6011 20 61 17 -42 22 -35 -67 -4 -109 -42 6 -49 -64 -58 28 73 -119 -93 -95 -59 24 -50 -3 -51 41 58 74 106 14 -40 65
6041 65 77 99 34 -40 -51 79 9 110 55 -31 17 -141 -67 37 -106 -50 -76 -98 -22 41 -13 -110 1 -48 10 -80 69
6068 69 -78 76 -10 58 96 -5 -129 48 80 52 16 152 -136 -70 -58 17 83 -148 -61 -75 -43 -140 -51 26 -7 -127
6094 -127 -104 -15 47 47 88 8 -70 -114 86 100 90 16 41 -23 93 -72 33 88 -2 -25 -101 99 42 -150 -20 6 -53
6121 -53 -134 -39 -6 19 -90 2 103 -110 17 54 -2 39 -41 46 5 65 5 20 97 56 72 -39 44 47 -44 153 64 -62
6149 -62 -27 -38 60 -99 46 -40 -104 11 -117 -101 2 -41 -23 79 -34 70 40 156 19 -35 27 -6 67 204 90
6174 90 109 91 27 145 85 32 -97 51 47 -28 39 -32 -121 -59 -121 -119 -36 -67 -28 -13 93 -27 109 89 26 3 90 159
6202 159 46 15 9 7 -40 19 80 67 -64 -49 -14 -21 -75 -3 -55 -151 -31 -71 -80 -57 -107 -6 -17 20 74 101 168 48 1
6231 1 -23 76 72 37 54 100 75 -30 121 112 170 -99 -28 0 -6 12 0 -104 -111 -113 -91 -69 -105 -144 -56 -14 28 32 -151 -20 36
6262 36 45 116 18 13 -23 28 92 93 47 57 41 -22 38 -20 82 5 -93 24 -57 -65 -16 -93 -39 -153 -23 -1 45 -42 -11 -13 -96
6293 -96 39 3 120 103 -33 101 77 18 96 112 82 27 71 37 -36 -32 -96 -47 -22 -64 -21 23 -168 -108 -140 72 52 -151
6321 -151 -7 42 2 -12 50 96 -29 55 39 158 34 104 -25 -72 137 -9 32 153 -125 -68 -37 -75 -62 85 -11
6346 -11 63 -51 140 -5 6 -91 15 -95 42 -33 31 -26 -25 -1 64 112 127 -23 41 47 88 65 67 29 1 64 -44 -65
6374 -65 -7 -14 -65 -80 -106 -81 -38 -112 -140 91 -11 24 88 -152 -17 -22 -37 30 29 32 85 54 72 -48 55 84 7 -23 35
6403 35 -26 3 -32 -26 -7 -42 -86 -59 7 -171 -87 -126 -131 -9 -19 -143 -11 22 -4 58 49 54 68 42 38 21 -30 31 76 66 73
6434 73 90 62 49 -35 -22 51 -61 -10 -12 38 102 97 -26 5 21 -34 25 -110 -23 -19 19 86 38 37 57 46 91 -7 50 71 53
6465 53 -55 -71 62 -37 -111 -46 -67 5 -138 -81 71 -43 -67 -66 45 -51 -102 90 -81 -23 7 34 128 64 37 9 93
6492 93 129 78 111 65 69 -27 110 118 -22 -120 -36 -10 83 104 -101 -122 -87 -18 61 -84 29 -96 5 -24 -53 53 -89
6519 -89 36 53 91 -11 166 75 74 -8 140 14 139 193 -101 -22 20 90 -18 48 -1 -105 -121 -11 -88 -7 -64 -81
6545 -81 -59 -51 41 49 60 -22 -76 103 -22 113 150 56 65 56 42 39 76 7 -6 -110 79 36 -22 28 -107 -9 5 18 103 -38
6575 -38 -19 -54 17 2 -70 -28 -75 -58 -45 -5 37 -57 63 -26 170 104 46 0 -42 87 -15 71 -9 -68 -91 39 18 -19
6603 -19 68 18 -115 -179 -85 -141 11 7 14 -31 -102 29 -27 -65 -10 42 2 149 14 -10 80 -57 74 -87 -21 -29 77
6630 77 28 7 -172 14 14 -137 -149 -26 -13 -77 -47 -182 -37 -17 -63 54 99 -60 109 104 84 64 25 11 -84 122
6656 122 -83 -42 96 9 92 28 -35 73 55 -43 -87 9 56 76 53 -139 -136 -88 -31 -52 -66 -61 95 -75 21 67 45 -6
6684 -6 8 63 59 25 -50 69 18 51 30 -15 -31 19 1 -1 5 -2 -159 -14 -91 22 -37 -49 -28 -76 -53 95 115 -2 43 10
6714 10 139 -87 39 96 5 -22 113 -14 121 30 33 38 -27 -38 49 84 -23 -58 -60 -46 -121 -9 -86 -3 -126 -44 -88
6741 -88 -36 -80 22 31 -25 -28 71 -68 73 34 -22 44 78 13 49 0 -114 -56 6 63 8 -83 -78 3 27 -42 -88 94 -150
6770 -150 -73 -55 -64 -83 44 -103 65 26 18 10 7 14 -27 89 8 45 26 -18 -16 -92 57 -5 42 -45 -23 -11 -13 -23 -58 -64 -110
6801 -110 -43 113 -29 -70 -26 -114 -53 127 -70 80 -29 5 -56 68 134 96 57 -25 -53 -106 59 3 19 -94 51
6826 51 30 131 -143 -23 15 -113 -149 -36 0 6 -187 -28 -110 22 19 -29 -31 -79 -114 11 102 40 -49 -37 182 -20
6852 -20 163 96 -37 -28 30 -35 51 -106 -76 -115 -67 10 -11 23 -107 -74 -61 -59 -18 14 -74 111 -185 -62 101 54 26
6879 26 -100 86 138 110 10 -54 40 39 -85 84 86 33 -17 -3 5 -102 -58 14 -60 -16 3 -12 43 70 -43 -46 -92 41
6907 41 19 92 5 -42 84 90 100 44 100 -56 46 -13 104 0 -60 -52 -47 86 -86 -38 -86 -66 -87 -123 72 -7 64 -8
6935 -8 -63 35 -49 -37 -34 31 22 20 9 1 78 45 58 79 47 76 106 43 84 47 -70 36 -154 2 -85 -98 -15 17 87 -18
6965 -18 -111 -77 -84 -74 -69 30 11 119 -61 70 149 25 53 57 82 35 -11 67 34 24 46 6 -53 37 61 -68 -42 5 -61
6994 -61 -62 -56 -76 -73 5 9 -60 58 -45 -8 -17 101 17 22 -6 94 3 73 94 -19 -39 8 33 45 0 36 -105 -30 -146 -79
7024 -79 -31 12 -86 -24 33 -30 104 -115 -47 44 16 -67 -66 131 69 88 54 62 76 24 -78 9 88 -122 131 -44 120
7051 120 4 -50 -14 82 -37 -74 -48 3 -76 -65 -90 12 2 -119 -29 -79 0 68 -7 16 61 2 114 -2 4 -57 -37
7078 -37 117 43 85 -54 -117 -63 49 16 21 -32 -51 -17 -183 15 -26 -48 -2 -67 -140 -40 -91 -96 -66 -59 -7 -19 41 4 50
7107 50 35 33 -15 33 160 12 29 -9 -85 43 -100 23 -22 -17 -109 -77 -31 -89 -121 -173 19 28 51 34 21 -44 -94 51
7135 51 -39 28 -36 13 19 87 34 65 36 -71 118 34 52 65 -45 -24 -91 -8 -129 62 -34 -83 -70 -32 19 -79 26 2
7163 2 -13 -14 10 91 19 -28 22 8 60 131 63 -25 73 -115 121 93 -7 -78 -100 -79 79 29 -13 -89 -132 -74 -92 -3 -125
7192 -125 11 -106 -152 16 33 46 107 -14 -34 47 121 68 3 34 44 133 87 131 -17 -60 -53 -113 59 8 -99 -97 -138
7219 -138 -18 9 87 19 -50 -40 -97 -74 41 46 62 8 -57 -6 67 217 46 -7 -71 96 5 -47 -39 2 -94 56 121 43
7247 43 -30 6 -4 -62 -43 81 -10 -141 3 -143 66 1 -86 -37 -57 89 60 51 87 95 -3 97 129 102 84 -101 -25
7274 -25 -27 99 18 58 90 -133 -20 -14 -56 30 -47 -224 -88 -61 32 -58 -96 -9 0 -19 20 -6 50 85 -2 87 -28 -26 -79
7303 -79 39 -101 69 24 47 43 18 -50 4 33 -59 129 7 -84 -89 -37 97 -72 -95 -76 -152 122 -50 -27 -4 -69 -29
7330 -29 -65 102 84 60 61 88 -20 101 -44 15 -74 27 99 60 0 6 -31 -27 38 -18 -16 10 -70 -18 44 22 -29 -61 14 25
7360 25 120 -78 41 59 -3 -38 55 49 87 118 1 -57 108 56 43 21 10 -19 -54 32 -77 -4 -72 7 -76 -7 -4 -6 -46
7389 -46 -23 -43 -67 0 62 -2 -29 47 62 87 101 39 -57 40 5 47 -35 -73 -27 -50 -2 -12 -28 -53 -18 -41 -113 -3 -24 15
7419 15 -21 44 29 -17 127 46 -36 -73 -21 143 107 16 60 -48 -34 84 93 60 -48 7 4 -57 44 -18 15 -3 -77 -40
7447 -40 29 -29 -115 -30 -4 -26 17 -52 27 -123 -37 3 97 34 6 83 113 -11 29 51 23 -39 -36 36 14 37 45 -80 -87 -35
7477 -35 20 -4 54 -40 -44 37 11 -2 11 15 -74 72 10 -9 25 5 97 -111 -33 0 47 160 -41 -16 -70 22 68 3 69
7506 69 -39 -137 33 73 49 -89 107 -69 10 28 -75 -11 -1 -5 -43 117 8 28 59 -8 -34 7 -2 27 51 -50 17
7533 17 40 73 -109 -80 3 -30 -28 77 -41 -47 55 -112 -50 -59 -45 30 8 -33 44 109 13 -5 -99 -57 95 149 -58 29
7561 29 87 51 7 113 78 -8 -79 23 22 98 62 -39 2 7 -37 51 -85 -1 28 -114 -31 -88 -34 -31 -43 -148 7 25
7589 25 112 37 -11 -26 14 99 109 19 -48 17 51 39 81 -58 -76 -101 -90 63 -41 -40 -46 -120 21 13 -25 -121 -129 -29 -43 -3
7619 -3 -15 127 34 -72 8 25 -48 76 -36 -50 13 4 89 53 41 19 22 20 37 -68 -3 -56 -100 -140 -50 -3 -60 32 15 -15
7649 -15 72 18 -34 -48 -12 42 60 55 69 -1 57 128 75 141 88 15 -45 20 -1 -12 -6 -96 -17 -78 -62 14 85 -7 -38 -2 -3 56
7681 56 -33 45 -6 2 52 12 24 59 -8 72 32 45 85 23 48 -28 66 7 46 39 29 -53 -167 62 -70 48 34 -91 -83
7710 -83 18 -22 35 19 -29 34 -35 108 38 121 -39 26 44 128 61 1 4 -38 -43 67 13 -5 -42 -48 -41 -66 57 8 -49 -72
7740 -72 -17 89 21 81 -90 6 45 12 70 -34 59 38 -25 -26 29 15 35 0 8 24 23 62 -15 -18 13 -146 -60 34 101 -36
7770 -36 -16 24 -67 -30 79 -22 -57 30 -120 -15 -43 -81 -24 25 -62 27 75 12 14 68 50 29 -6 -44 12 84 24 -99
7798 -99 -5 -52 23 -30 -98 31 136 -59 -124 27 18 -45 -67 -13 12 -18 70 4 11 85 -42 65 68 -16 -62 28 2 9 -29
7827 -29 56 15 91 63 -34 -28 51 -28 -24 -69 -58 -95 -82 -71 41 27 44 -36 -173 52 29 44 104 -19 43 -33 31 -25 -12
7856 -12 3 -57 -57 34 13 21 -63 -126 -49 -77 -15 -67 10 -56 -13 -101 134 53 115 -69 -138 -33 66 64 -1 -66 -102 -12 -20 86
7886 86 70 20 36 29 32 3 -16 25 -66 -99 41 -19 -15 -81 24 -67 42 16 43 -56 -165 14 -32 101 3 -49 -9 9 91
7915 91 72 93 -29 -16 22 20 -2 85 19 -48 -91 83 113 22 -37 -161 -37 -115 -41 3 -135 -204 -68 -50 72 -95 5
7942 5 -87 1 68 129 -27 -1 -43 -37 76 57 85 -18 -25 -35 -56 45 20 73 -137 -37 -73 90 156 46 -89 -43 -52 66
7970 66 -9 84 -37 -138 -60 88 110 84 1 -41 50 68 84 87 39 -25 -5 56 12 37 -21 -12 76 -25 -67 50 -72 -51
7998 -51 -67 -26 -42 -27 -69 -129 43 28 44 46 -3 -85 -10 113 70 -7 -65 -27 -35 -2 106 25 3 -11 11 -68 74 25 8
8027 8 6 -86 -67 34 66 66 58 -56 79 23 6 -57 -87 -90 72 96 31 -47 103 12 62 -42 95 116 2 120 14 104
8055 104 -20 -21 41 -93 16 19 -11 -36 -12 -181 -21 -19 -50 -12 5 25 62 0 53 50 44 -27 -7 -14 48 63 -9 -20 -23 25 -34
8086 -34 20 156 -92 69 -39 81 5 -175 -11 -53 27 4 56 60 -6 -22 29 38 -3 38 39 21 -29 -11 -21 53 -26 8
8114 8 -15 9 -56 23 -80 -15 89 49 -62 -113 -25 -47 -18 -138 -95 59 93 -13 54 33 -114 -17 -62 14 -66 25 64
8141 64 45 -4 -26 14 -20 15 16 68 -46 32 -25 23 -100 125 79 -35 -65 30 9 -1 -126 52 9 -8 101 4 12 26
8169 26 53 40 -8 -15 -77 76 15 -39 18 19 51 -56 64 -111 -92 -47 130 -21 -1 17 -103 35
8191C5
$$ Imaginary data points
##PAGE= N=2
##DATA TABLE= (X++(I..I)), XYDATA
0 0 0 0 0 0 0 0 0 0 0 0 -8 8 -8 8 -16 16 -23 24 -32 40 -44 56 -64 72 -88 104 -120 136 -155 179 -208 233
32 233 -265 299 -339 383 -427 481 -537 600 -666 739 -820 908 -1004 1109 -1223 1350 -1487
49 -1487 1637 -1805 1989 -2192 2418 -2673 2960 -3286 3663 -4100 4615 -5236 5997 -6957 8216
64 8216 -9934 12437 -16429 23800 -41892 178749 143260 -216351 36332 -55810 -178599 134790
76 134790 210856 -113127 -71923 7 -88927 55943 168948 -40670 -72852 -20620 -91118
87 -91118 18870 136710 -29088 -53587 29753 -51698 -4591 116451 -34714 -102305 32049
98 32049 13868 -981 106414 8878 -114801 -20527 22944 25464 96451 -5495 -118627 -24770
110 -24770 -942 11756 149216 43781 -157623 -49582 20050 -48591 96515 123628 -125535
121 -125535 -102889 53773 -29976 28071 156462 -54480 -148727 42394 14661 -33381 120485
132 120485 40241 -129968 -9431 57184 -25102 39207 46528 -81377 -33438 50712 -1325
143 -1325 22239 34561 -70215 -41082 45791 3222 6928 26179 -58967 -42165 50863 20932
155 20932 4550 26550 -53294 -64485 43433 41965 4226 29276 -29572 -64595 27561 39972
167 39972 7548 37301 -27511 -80532 26941 47962 -15565 37309 17355 -91681 -16229 67517
179 67517 -15351 -5497 42131 -57087 -49865 62202 9654 -28452 38353 -18090 -60891 38711
191 38711 36584 -29766 13275 12112 -40293 12370 38734 -16727 -1392 11077 -30786 8329
203 8329 40877 -16089 -12242 15264 -24099 -8853 34417 -2817 -19999 3506 -14894 -8348 27514
216 27514 784 -17915 8288 -12291 -19188 27287 11276 -19719 9834 -362 -19930 20554
228 20554 14756 -17780 12299 9513 -26125 10095 26253 -20653 -3568 25234 -18150 -14361 23574
241 23574 -8664 -14668 20615 -7228 -19737 15094 -3927 -18181 19031 6378 -24127 4069
253 4069 9854 -14331 7652 16756 -13737 -5121 8802 -6503 9490 17990 -12793 -8226 10219
266 10219 -4454 2468 18278 -5459 -16785 1246 1809 2668 12846 -5881 -19230 -473 334
279 334 -1794 16777 905 -25097 -6188 8076 2847 11709 5036 -17400 -10289 6160 8031 15459
293 15459 9882 -18471 -16045 10168 10638 9088 11812 -11879 -22039 1358 13465 12374 6707 -15002
307 -15002 -23370 -2061 12829 10637 6873 -8492 -26085 -10368 16858 16954 4525 -9421 -20928
320 -20928 -8216 13948 19423 12313 -6055 -22716 -11588 15514 23687 9802 -7072 -18117 -14826
333 -14826 7634 24189 14240 -7675 -23611 -18140 7507 22005 12567 -6579 -22130 -20279 501
346 501 21504 19729 -5475 -24526 -17861 3949 22150 20052 -185 -18610 -20945 -1177 24690
359 24690 25091 -226 -21325 -18130 1353 18480 23758 6433 -21830 -25239 -3494 17898 23112
372 23112 3859 -22478 -24204 -5595 13240 22604 10649 -18765 -29872 -5844 17968 20644 11172
385 11172 -12369 -28267 -8577 16751 22484 16244 -7183 -28606 -11757 19108 22505 9677 -4785
398 -4785 -23317 -20179 12188 26138 10152 -7992 -23512 -19699 10050 23587 9060 -6904 -20958
411 -20958 -22010 4346 26964 15478 -9344 -20616 -15872 4554 24598 19214 -1739 -19184 -21314
424 -21314 3203 26744 18579 -1788 -17166 -21510 -939 22234 19311 2395 -14954 -26001 -8153
437 -8153 22225 17888 -4849 -9909 -17256 -16545 16244 26043 -3069 -13734 -11191 -11617 10864 25988
451 25988 1293 -15218 -7195 -6486 5466 27483 9000 -20625 -11122 378 4044 20601 12083
464 12083 -18321 -17887 -2800 3736 17612 14517 -16172 -24405 -3232 6620 10800 14927 -4835 -24655
478 -24655 -12832 7621 16418 12490 -3675 -13292 -10333 -559 16199 18326 -2859 -12949 -6351
491 -6351 -2591 9163 19029 -893 -16488 -2226 388 -2890 15991 7852 -22442 -9065 10172
504 10172 -2426 2174 10231 -13423 -15815 8622 6480 53 8017 -7524 -17497 9138 13844 -2388
518 -2388 6118 719 -19295 756 20252 3531 -849 2518 -13409 -9096 15033 9975 -4224
531 -4224 -176 -7195 -14867 4673 14631 96 -6403 -4410 -6479 -4327 5186 9957 -145 -9760
545 -9760 -2460 3230 -1411 3452 8332 -3070 -5780 5707 1859 -3715 7247 2875 -7839 5595
559 5595 6751 -10265 -1239 7647 -6559 -1853 10119 -4832 -10477 3000 -1337 -4390 8798 1094
573 1094 -11117 1030 1261 -7463 7535 9861 -8041 -3267 5601 -4274 -999 10679 2427 -4158
587 -4158 2858 -612 -5125 4407 5817 -1536 566 553 -6096 -4642 2985 4999 -397 -3309 -983 -5406
603 -5406 -7748 5137 9462 -3598 -5424 950 -5450 -3853 11619 6893 -6271 -236 -334 -5968 7567
618 7567 10787 -4442 -2202 3113 -5678 272 10924 -926 -7407 2009 -1011 -3810 6018 40
632 40 -9442 911 2378 -4740 3816 3155 -11059 -4429 8442 2150 -1060 3522 -4057 -8529 4488
647 4488 10396 3480 140 -3639 -6940 765 9202 7634 627 -5812 -7214 -3315 4887 9838 2221
662 2221 -8598 -8186 -2477 1109 6008 6403 -5224 -12020 -2803 4095 3931 5617 -817 -9540 -2914
677 -2914 5336 4731 5352 1591 -8346 -4716 7829 7247 1197 751 -5110 -7852 4347 9842 1546 -2999
693 -2999 -6221 -8222 1898 9815 2433 -5120 -6127 -7594 -2073 10217 8179 -5303 -8290 -4534
707 -4534 -413 7637 9761 -135 -7931 -6086 722 8188 10028 1812 -7912 -6728 700 5772 8177
722 8177 3162 -7159 -9767 -1861 6474 7080 496 -6403 -8742 -4440 4361 8200 2359 -6274 -8822
737 -8822 -3142 4901 8260 3866 -4464 -7123 -2316 4010 9345 6511 -4356 -8172 -1703 4746 7217
752 7217 5295 -2400 -8885 -4904 3823 7063 4545 -3151 -10380 -5920 3391 5453 3869 -805 -9216
767 -9216 -8408 2567 8267 4877 -970 -6274 -6731 1288 8261 6675 1331 -4938 -7216 877 8704
782 8704 6199 630 -4037 -6432 -1669 5962 6462 452 -5706 -7359 -2325 4934 5153 -494 -4465 -6822
798 -6822 -3856 4395 6470 805 -4434 -6106 -2044 4983 6496 2382 -2131 -4799 -3038 4512 8335
813 8335 2654 -3068 -3881 -2811 2206 6830 3116 -2883 -5105 -4460 871 5617 2413 -3508 -5269 -3757
829 -3757 -266 3866 3665 -1932 -5109 -3654 464 5204 4062 -1457 -2850 -1877 -235 4616 5881 11
845 11 -3920 -1940 1090 3230 3976 660 -3583 -3349 -526 2036 3479 -266 -4504 -3491 -1108 1216
861 1216 2349 -109 -3078 -3386 -1590 1537 3464 1220 -2714 -2057 903 1502 2718 3097 -828 -2693
877 -2693 344 2559 2663 1566 -714 -1884 -782 774 1629 1041 -1126 -3091 -1695 514 436 78 -959
894 -959 -2556 -1708 144 437 732 151 -1631 -984 1278 1656 419 596 1100 -373 112 2443 1557 -219
912 -219 134 780 286 -37 561 -4 -822 -405 -346 -785 -406 -1010 -1313 -419 -231 -1021 -1034 -384 -186 -274 147
933 147 541 -125 -180 637 1290 1111 180 428 1062 942 920 939 409 -355 -687 506 1561 -401 -1661 -570
953 -570 -739 -967 822 696 -2103 -2579 -555 -603 490 1880 -1251 -2864 267 789 418 2877 1332
970 1332 -2726 -912 2436 1691 1547 1931 -1103 -2075 1096 1682 1193 1085 -2001 -2975 269 991 -45
987 -45 19 -1449 -3348 -1144 1620 716 -719 -1444 -2108 -476 2232 1770 250 -851 -1638 218 2738
1004 2738 2979 1189 -1586 -1815 922 2263 2009 1996 -945 -4107 -1139 2963 1370 -202 -421 -3788
1020 -3788 -3638 2028 2252 -555 -415 -2785 -3987 1211 3683 273 -442 -448 -2724 41 4545 2173 -682
1037 -682 -231 -1252 185 3768 1964 -935 -651 -1375 -796 2757 2258 -2101 -2615 -1078 -817 1056 1941
1054 1941 -1470 -3464 -2182 -156 2065 1968 -883 -2273 -2254 -294 3261 3108 146 -1026 -1780 -1030 3390
1071 3390 4750 -2 -1578 -370 -1589 447 4836 1047 -3408 -1418 -1176 -1222 2611 1552 -3276 -2487
1087 -2487 -608 -1387 1379 2401 -2451 -2889 624 188 786 2798 -772 -2479 833 1656 1486 2616
1103 2616 0 -2673 168 2365 1257 1571 279 -3085 -1976 1353 1524 827 -887 -3209 -2147 -228
1119 -228 872 1594 -365 -3154 -2163 123 858 2007 1157 -2250 -1711 1165 1019 1888 2836 -1211 -2300
1136 -2300 1819 1813 359 1990 122 -2934 44 1833 -190 120 -103 -3011 -1177 1763 -528 -1022
1152 -1022 -71 -2483 -1988 1972 973 -1021 38 -1118 -1483 1973 2324 -7 269 -84 -1143 1541 3131
1169 3131 529 -319 -65 -1104 294 2103 672 -585 -1195 -1829 -281 1120 -259 -828 -873 -2047 -949
1186 -949 1108 200 -929 -72 -1133 -674 1908 897 -702 738 280 -633 1863 1995 -383 27 974
1203 974 -209 762 1791 -593 -835 233 -754 -169 1386 -850 -1934 -336 -674 -1025 764 -83 -1667
1220 -1667 -657 -13 -362 797 788 -827 3 851 160 962 1502 -159 -47 990 571 655 760 -42 -179
1239 -179 403 -362 32 401 -879 -1225 85 -473 -990 128 -577 -1272 71 -146 -781 394 110 -926
1257 -926 510 1053 -215 468 1288 2 430 1356 380 276 1027 -55 -7 1149 -134 -708 531 -138
1275 -138 -969 137 -241 -1317 -425 -110 -870 -333 -134 -1225 -251 418 -652 164 682 -454 -2 1171
1293 1171 531 392 942 225 106 1010 689 264 789 -170 -633 654 455 -666 -199 -441 -1219 -263 98
1312 98 -654 -491 -693 -1288 -275 551 -328 -343 133 -683 -78 1337 674 -39 486 78 312 1515 938 141
1332 141 420 -99 -257 979 756 -577 -602 -377 -774 -51 310 -904 -1009 -830 -1020 -4 411 -661 -944
1351 -944 -252 -258 204 1017 383 -479 126 421 746 1441 822 -281 154 357 359 1300 743 -663 -673 -154 -159 364
1373 364 103 -1018 -1157 -509 -466 -31 312 -1093 -1407 -232 -75 363 723 -86 -738 -11 756 903 1179
1392 1179 338 -449 234 979 779 999 527 -683 -523 388 442 245 -279 -1060 -1039 -242 143 -87 -470 -1060
1412 -1060 -1181 -92 485 266 -149 -620 -605 326 825 876 683 -136 -435 576 1146 922 637 -15 -408 23
1432 23 758 642 234 -458 -1145 -632 288 -1 -441 -555 -1195 -927 -9 209 -309 -477 -485 -364 401 692 261
1453 261 25 24 38 701 1279 786 71 -47 316 616 807 575 -195 -789 -399 77 240 70 -548 -1086 -899
1474 -899 -212 -12 -59 -365 -947 -1059 -55 534 317 169 19 -405 324 952 956 393 109 20 294 837 835 281
1496 281 -195 -159 -257 122 354 -222 -772 -684 -404 -301 -330 -270 -660 -940 -331 97 176 8 -217 -504 103 716
1518 716 506 425 470 -153 6 975 967 149 278 194 -329 243 758 16 -391 -260 -745 -667 249 -53 -806 -530
1540 -530 -506 -870 -163 346 -411 -502 75 -7 221 566 313 175 313 361 544 554 486 220 349 410 405 258 5
1563 5 -153 -299 -208 126 9 -780 -557 -416 -662 -359 110 -406 -713 -275 -190 -185 478 368 -309 370 603 -113
1585 -113 621 1139 -92 107 839 159 14 721 152 -330 219 148 -582 72 68 -730 -288 -35 -815 -540 -138
1606 -138 -572 -358 152 -226 -262 53 82 232 595 411 67 397 340 425 648 430 393 234 50 265 425 -130
1628 -130 -127 124 -267 -468 -6 -268 -735 -267 -201 -736 -194 -263 -838 -94 208 -378 58 558 -269 -26 862
1649 862 532 217 759 315 -129 657 758 72 515 86 -616 45 424 -298 -315 -167 -826 -677 2 -115
1669 -115 -498 -506 -674 -602 1 -5 -34 97 -193 15 482 478 368 510 -25 149 705 462 355 392 -41 -274 486
1692 486 424 -149 -211 -266 -843 -86 197 -539 -550 -447 -1008 -315 510 -282 -502 -37 -268 -273 826 667 -272 149
1714 149 358 103 920 968 156 2 256 -49 498 619 -10 -541 -251 -302 -168 92 -191 -749 -667 -522 -157
1735 -157 177 -308 -637 -377 -218 54 534 330 -360 -134 260 420 881 629 -111 -33 458 393 694 670 -247
1756 -247 -547 -36 35 201 241 -660 -838 -443 -325 -110 158 -443 -1166 -505 55 -52 221 140 -427 -178 432
1777 432 545 680 439 -180 63 578 624 573 484 -28 -503 82 519 283 46 -495 -794 -239 -5 -215 -84
1798 -84 -611 -890 -453 102 63 -126 -275 -457 -90 470 474 396 262 -180 185 847 716 474 265 -181 -87 441
1820 441 462 212 -114 -509 -542 -3 137 -232 -418 -458 -741 -264 213 -83 -340 -480 -562 -86 375 131 167 45
1842 45 -148 206 777 828 225 201 129 178 587 595 45 -51 -285 -279 139 145 -335 -444 -422 -464 -173 -30 -271 -568 -517
1867 -517 -274 39 266 -33 -149 88 -45 367 638 417 130 202 331 363 435 468 33 -16 52 4 191 97 -420
1890 -420 -429 -200 -254 -199 -211 -340 -589 -370 -215 -20 -119 -208 -252 43 124 146 308 217 166 190 491 407 389 247 224
1915 224 251 156 266 188 -7 -221 -331 -104 -49 -145 -384 -414 -390 -308 -380 -206 -64 -413 -292 138 64 133 120 229
1939 229 209 257 381 284 263 437 107 281 520 178 219 192 -77 -93 53 -19 -237 -465 -206 -298 -257 -197 -353 -478
1963 -478 -160 -182 -103 -120 -6 -144 71 435 260 65 299 266 129 465 559 161 147 197 49 109 278 23 -275
1986 -275 -96 -248 -388 -52 -121 -590 -454 -210 -312 -263 -59 -79 -429 -35 316 183 166 203 97 262 527 482
2008 482 396 316 161 143 295 542 177 -249 -46 -106 -221 53 -70 -444 -423 -325 -267 -82 83 -436 -602 -186
2030 -186 -40 11 394 127 -243 26 468 239 431 590 181 -175 387 481 285 411 40 -471 183 257 -179
2051 -179 -137 -146 -558 -537 -45 -21 -479 -403 -248 -463 -126 185 -93 -260 39 56 168 445 395 -37 13 349 353 419
2075 419 658 151 -128 153 295 71 49 71 -397 -433 43 -21 -296 23 -536 -704 -84 31 -283 -6 37 -345
2097 -345 -158 435 270 41 274 152 67 508 618 153 216 314 48 245 472 -108 -231 -37 -78 -388 -6
2118 -6 131 -489 -513 -196 -161 -304 -29 -151 -413 -184 93 104 43 152 -80 -102 562 490 248 358 289 -92 162
2141 162 481 212 -73 138 70 -252 219 39 -393 -248 -249 -394 -205 -24 -439 -548 -19 -134 -240 123 139
2162 139 -189 49 252 56 219 274 117 26 435 285 105 344 319 -246 97 325 -199 -57 41 -327 -349 -201
2184 -201 -119 -283 -258 -299 -335 -262 -52 -44 4 65 -155 -32 149 240 21 243 371 212 141 384 302 46 146 186
2208 186 -41 -24 84 -75 -218 -160 -171 -425 -103 -118 -394 -121 -59 -370 -191 -25 -117 -187 50 81 -13 120 347
2231 347 48 340 321 -23 302 435 101 109 275 150 -83 235 11 -127 -46 -104 -282 -198 -324 -377 -202 -243 -266
2254 -266 -40 -61 -158 -28 -15 1 275 59 59 185 217 93 376 423 101 93 151 32 178 273 -91 30 -17 -254
2278 -254 -54 30 -303 -279 -129 -204 -212 -26 -44 -335 -166 -66 -157 194 203 -92 152 235 112 301 453 131 168 346
2302 346 271 242 289 132 -100 -23 64 -93 35 -209 -438 -166 -213 -174 -117 -213 -278 -203 -178 -101 195 69 -192 23
2326 23 192 121 314 342 43 117 351 378 247 285 24 -7 173 6 -33 5 -65 -440 -112 -113 -359 -325 -168 -452
2350 -452 -180 -4 -183 61 -3 -203 -13 183 29 241 304 105 138 307 306 300 307 45 -79 151 203 -50 34 -126
2374 -126 -242 -105 -163 -286 -135 -285 -301 -252 -52 -193 -88 -22 -202 -35 45 -97 60 344 97 135 239 190
2396 190 181 274 139 150 272 128 -30 163 111 -193 -54 -20 -300 -134 -103 -320 -140 -208 -229 -225 -182 -179 -208 122 20
2421 20 32 57 112 66 40 207 220 311 218 169 263 196 234 183 -38 -132 -76 61 -45 -68 -191 -257 -187 -153 -296 -163 -226
2448 -226 -353 -253 -49 -60 140 97 -3 94 162 228 203 205 111 171 289 356 113 137 137 -19 -6 162 -132 -58 -86 -234
2474 -234 -178 -168 -210 -277 -215 -268 -228 -73 -67 -134 -11 35 -22 83 88 118 133 54 147 266 261 273 148 26 11 170 67
2501 67 -72 -64 -85 -172 -59 11 -117 -170 -60 -299 -165 -121 -162 -194 -51 6 -115 122 204 2 105 230 59 217
2525 217 357 96 40 271 172 117 158 107 -79 14 -144 -19 -43 -177 -274 -316 -169 -188 -176 -120 -111 -244 -209 -16 39
2550 39 27 202 10 138 215 223 183 264 246 77 35 302 265 -95 201 -73 -13 8 69 -264 -222 -114 -194 -262 -184 -159
2576 -159 -346 -219 -44 -173 -135 120 -46 -33 151 66 201 244 240 106 242 276 97 229 227 11 29 262 61
2599 61 -80 7 -128 -211 -29 -110 -232 -164 -266 -298 -185 -37 -26 -126 -19 -19 -31 85 100 11 54 236 200 168 230
2624 230 264 -27 166 42 47 156 17 -169 -139 -88 -88 -124 -117 -200 -204 -130 -148 -63 -52 -154 -174 -136 3 193 7 58 125
2651 125 97 134 327 204 207 122 235 103 186 233 -22 -21 -5 -93 -146 -9 -106 -323 -222 -138 -211 -45 -61 -216 -145 -135
2677 -135 -41 -69 -18 -4 20 143 109 131 170 255 85 92 218 117 142 94 -42 123 59 79 -79 -147 -142 -102 -157 -164 -222 -106
2705 -106 -78 -191 -204 -12 -2 15 -159 67 83 -22 105 168 158 195 266 203 196 171 21 34 140 8 56 71 -83
2730 -83 -192 -147 -174 -129 -153 -167 -286 -219 -132 -99 -109 -87 30 13 -26 98 76 74 188 198 106 176 199 122 147 94 236 79
2758 79 138 62 -88 -54 -69 -20 -123 -230 -205 -118 -164 -97 -176 -176 -119 -71 -179 -41 -28 28 -15 30 102 170 181 222 261 182
2786 182 100 216 210 141 14 61 12 9 -12 -78 -121 -148 -163 -243 -111 -160 -169 -200 -213 -169 -193 -141 -108 -26 -10 80 189 149 144 114
2816 114 146 208 185 102 86 24 10 157 72 -4 -91 -63 -118 -101 -103 -31 -121 -167 -191 -244 -104 -134 -111 -13 -16 33 178 87 214
2845 214 159 222 175 254 244 44 169 141 79 -10 84 166 -20 68 -51 -134 -192 -124 -247 -234 -97 -65 -124 -187 -93 -45 -74
2872 -74 44 53 17 45 21 136 152 221 161 131 157 190 251 151 160 144 33 -25 10 -89 -71 -102 -277 -88 -172 -70 -181
2899 -181 -140 -157 -87 -124 -122 30 -122 42 105 -21 36 178 48 120 253 176 96 182 29 -23 150 146 20 58 29 19
2925 19 -127 -114 -102 -173 -118 -147 -217 -137 -12 -79 -127 -30 -145 0 -12 13 -11 64 85 119 192 130 155 131 22 58 150 20
2953 20 66 15 3 -21 -76 -117 -99 -148 -23 -227 -51 -148 -172 -117 -61 -144 -90 -11 83 121 -1 64 170 80 265 163 171
2980 171 191 111 248 114 92 72 2 -19 -60 -57 -40 -114 -142 -161 -69 -115 -122 -8 -115 -110 -142 -50 103 123 88 -112 129 161
3008 161 177 72 136 133 82 167 226 178 89 -99 26 25 35 -11 -37 -123 -258 -168 15 -74 -218 -129 -189 -50 4 -34 -3
3035 -3 -118 -63 41 106 219 104 9 141 226 116 158 186 188 -53 -40 -2 1 42 -200 -264 -162 -18 -51 -6 -217 -395
3061 -395 -146 -123 27 -35 -36 -84 -220 75 98 94 31 83 57 188 245 54 118 73 57 42 311 155 -84 -178 -73 -100
3087 -100 38 39 -104 -184 -236 -148 -26 -112 -182 -211 -344 -143 36 86 89 -76 -122 82 316 209 172 145 -87 -34 261
3112 261 326 160 20 -68 -100 131 115 28 -179 -183 -284 -178 -37 -50 -164 -204 -203 -133 152 155 -63 -109 -15 70 178 383
3138 383 137 -122 -87 185 211 279 201 -142 -80 84 193 53 130 -64 -178 -96 55 15 -266 -158 -277 -264 152
3161 152 49 -104 -73 -69 -163 98 289 122 -36 53 31 163 238 289 181 -18 -43 193 243 183 1 -212 -273 51
3185 51 -76 -17 -193 -382 -294 -178 -2 -57 -74 -129 -257 -154 93 109 72 -22 -70 -32 254 223 218 62 73 43 107 231
3211 231 144 -41 -59 -4 42 257 -79 -266 -82 -199 -97 38 -14 -256 -253 -97 -24 44 213 -7 -108 -3 92
3234 92 147 330 133 38 -85 132 311 153 86 -90 -52 33 94 162 13 -158 -222 -177 -152 -15 -175 -242 -176 -278
3258 -278 -23 96 -10 -94 -79 28 82 110 259 41 39 100 252 155 189 -23 13 89 38 140 111 -65 -141 -98 -54
3283 -54 -35 -69 -151 -292 -214 -41 -6 -17 -25 -97 -147 11 19 164 89 -4 25 139 159 196 55 106 87 30 222 32 59
3310 59 57 -42 61 -188 -145 105 -202 -181 -113 -206 -140 -138 -66 -165 -168 69 -99 62 104 125 21 135 89 89 157 127 97 43
3338 43 69 73 112 71 41 -11 -138 -46 -77 63 -115 -241 -120 -126 -20 73 -199 -111 -127 -158 -78 44 36 -29 -39 39 259
3365 259 108 153 28 3 60 125 163 50 -33 -83 -63 -95 120 82 -128 -286 -187 -39 23 68 -112 -303 -169 31
3389 31 89 66 -122 -159 4 -52 172 232 31 3 -84 140 218 237 106 11 -78 104 154 244 -15 -263 -384 -111 31
3414 31 142 -135 -271 -329 -97 155 157 27 -236 -206 32 101 226 173 -101 -114 62 192 210 152 3 -98 -44 261
3438 261 240 205 -11 -185 -213 5 180 -60 -89 -349 -137 0 87 57 -126 -300 -217 -37 279 208 -30 -120 -49
3461 -49 194 267 306 146 -108 -182 35 389 167 -1 -245 -181 -37 40 77 18 -238 -327 -143 167 -53 -116 -217
3484 -217 -359 -148 93 102 -14 -125 -266 -25 331 271 125 79 -89 6 195 471 152 -97 -46 -43 116 308 59
3507 59 -183 -278 -201 -50 58 50 -243 -311 -154 -178 64 223 -96 -328 -86 145 252 243 40 -73 -27 82 431
3530 431 335 41 -34 -63 86 364 136 22 -94 -204 -90 69 130 -162 -277 -191 -230 36 138 -35 -245 -29
3552 -29 -183 28 240 216 -75 -140 94 135 326 264 -71 -165 102 167 192 243 -11 -151 17 151 194 82 32 -270
3576 -270 -378 54 61 -88 -46 -253 -247 -4 195 125 -27 -158 -80 -7 262 174 58 -22 67 123 181 190 71 -128 -14
3601 -14 134 54 -22 27 -295 -201 58 -129 -80 -19 -170 -297 -36 -18 4 76 -46 -194 -55 264 156 44 115 -49
3625 -49 -25 94 266 160 -65 104 48 117 155 35 -18 -18 -162 -155 -48 120 0 -286 -63 -142 -38 10 45 -148
3649 -148 -123 119 -91 99 156 29 40 16 20 67 83 220 4 97 116 34 -75 38 -55 -59 -66 -64 -8 -6 -1 -126 -186 31
3677 31 -197 -8 -37 -182 -108 62 103 89 64 -4 97 -26 174 173 97 214 114 33 109 180 55 54 -66 -169 -107
3702 -107 57 25 -123 -194 -249 -155 -8 62 -68 -85 -264 -68 177 91 128 -24 19 92 -7 416 306 -12 -140 -47
3726 -47 105 197 92 -4 -190 -156 -17 139 130 -24 -394 -285 35 63 92 -194 -290 -294 -184 276 189 48 -67 -291
3750 -291 -4 308 282 123 -62 -188 -27 228 278 211 -164 -260 -119 140 295 -19 -241 -467 13 103 199 25
3772 25 -234 -421 -243 99 207 159 -268 -294 -210 248 394 205 35 -213 -168 231 490 438 77 -367 -178 235
3794 235 489 362 -16 -251 -394 65 290 219 -89 -461 -392 -47 212 230 -35 -350 -366 -44 363 385 -2 -209
3816 -209 -258 -150 378 512 155 -213 -422 -67 340 351 110 -173 -363 -240 222 371 158 -355 -430 -347 114
3837 114 169 0 -309 -536 -303 188 479 226 -79 -336 -118 176 450 307 -118 -273 -120 59 447 280
3857 280 -56 -333 -259 105 355 215 -20 -338 -423 -11 207 94 -149 -308 -478 -206 240 391 -36 -315 -316
3878 -316 55 234 251 60 -133 -252 -96 455 410 161 -223 -142 13 300 350 214 -337 -439 -189 18 264
3899 264 -23 -303 -310 -219 35 245 151 -44 -454 -222 94 249 186 -76 -38 -182 122 383 308 52 -191 -129 24
3922 24 449 249 44 -259 -222 -82 99 170 -141 -303 -266 6 -4 82 -75 -268 -247 -4 141 220 -63 -144 -85
3945 -85 -86 126 289 108 71 -213 -76 254 265 104 -60 -126 -111 63 -17 2 -66 -203 -201 -47 155 -57 -103 -99 -157
3970 -157 -92 -27 45 89 -98 -31 77 107 129 172 -8 174 127 64 242 -66 -55 -52 72 34 -107 69 -47 -114 -67
3995 -67 48 -143 -186 -92 -160 -79 -98 -24 -129 51 11 -206 -44 45 123 125 102 38 -5 85 182 167 -31 67 -11 -102 83
4022 83 93 41 20 -230 -65 -45 24 -173 -44 -186 -243 -177 79 30 -124 60 -80 4 100 228 169 160 25 52 134
4047 134 330 47 -16 55 -109 -57 143 186 -21 -121 -181 -87 -29 -35 -152 -245 -202 -226 61 158 -75 -340 -210 3
4071 3 186 283 126 -33 -209 7 225 332 75 18 -110 -2 177 280 172 -115 -263 -147 116 206 39 -128
4093 -128 -224 -327 66 182 54 -184 -337 -122 66 227 139 4 -300 -42 53 317 377 142 -167 -183 183 300
4115 300 366 100 -245 -367 27 237 240 -65 -312 -359 -70 146 102 65 -281 -515 -279 120 339 -14 -231 -133
4137 -133 -171 164 379 166 -179 -182 73 265 446 134 -117 -212 -59 162 267 353 -312 -468 -207 -10 156 136
4159 136 -206 -423 -364 -84 293 163 -129 -316 -265 89 401 256 15 -210 -225 166 368 297 19 -119 -107 48
4181 48 283 284 -80 -289 -302 -14 216 198 -57 -298 -281 -111 92 227 106 -366 -358 -58 164 287 87 -176 -210
4204 -210 -52 330 387 187 -62 -234 82 317 273 122 36 -245 -294 161 257 176 -268 -313 -182 71 244 62
4226 62 -169 -239 -327 44 321 65 -103 -290 -85 18 175 359 193 -286 -72 148 318 363 -7 -172 -126 71
4248 71 84 155 20 -240 -310 -46 153 -96 -128 -161 -216 -126 73 54 -11 -135 -132 91 222 147 104 -73 -91 41 87
4273 87 221 1 -131 -121 147 119 37 44 -222 -190 -130 102 102 -31 -196 -159 -207 -100 -35 27 4 -170 -198 -20 186
4298 186 47 108 -6 35 18 244 186 17 21 65 219 54 113 -50 -129 -39 2 -15 27 -73 -164 -205 -13 -37 -110 -60
4324 -60 -56 -129 -72 2 -22 34 -124 -12 22 69 -19 119 118 57 -46 149 89 95 115 -12 21 12 -56 14 -37 -207 -59 -23
4352 -23 -101 -76 -196 -34 -103 -225 -16 -7 -73 13 22 -39 140 17 123 128 75 -27 147 230 84 116 143 -3 -116 0
4378 0 57 63 -79 -39 22 -21 -65 -7 -44 -93 -205 -54 -31 1 81 -58 -72 -14 -29 83 148 120 -70 29 168 65 105
4405 105 149 41 -109 6 267 90 -122 -170 -145 -83 13 -20 -27 -107 -174 -91 47 40 -85 -125 14 -3 94 198 -39
4430 -39 -56 -11 -7 221 167 120 154 -69 29 169 168 118 27 -189 -7 32 -3 -34 -140 -248 -278 -69 -55 -92 -99 -272 -83
4457 -83 181 52 40 143 -75 -117 200 313 197 -40 -58 37 110 215 154 -2 -16 -44 -30 184 90 -36 -333 -176
4481 -176 31 -40 131 -99 -314 -187 11 208 92 -130 -53 -54 -20 217 221 194 -1 -112 60 263 323 -6 18
4504 18 -128 -85 134 262 137 -254 -150 -60 114 188 47 -139 -147 -235 3 207 210 -171 -208 118 25 237 158 -51
4528 -51 -163 -4 177 235 241 20 -163 8 79 115 181 -8 -165 -177 60 54 36 -149 -209 -244 -73 162 97 11 -385
4553 -385 -152 -66 217 92 -23 -24 -105 12 211 359 84 -52 -61 67 231 63 156 -50 -329 40 82 141 -67
4576 -67 -242 -223 -106 66 -6 38 -139 -260 -186 112 174 -8 -110 -142 128 141 100 122 -40 -91 4 92 332 204
4600 204 -22 -19 -6 31 189 100 -167 -86 -76 -32 127 -102 -115 -233 -300 -59 -26 103 17 -141 -118 96 197 53
4624 53 127 67 63 87 223 283 -54 36 -73 94 108 86 80 -103 -66 -38 31 11 -172 -121 -71 -138 -108 -16 -19 -122 -53 -85
4652 -85 119 2 15 57 29 94 -12 149 138 -85 -100 68 58 67 -6 122 33 -137 9 -37 -23 9 -68 -127 -18 -131
4678 -131 -24 -85 15 -28 -34 -12 99 69 46 100 4 -22 32 151 -22 -61 61 23 89 133 104 22 75 -10 -42 -81 -93
4705 -93 -30 -103 -137 -176 -54 -18 -67 -135 -15 -4 -54 -12 75 -19 -12 -168 -16 161 140 50 24 -24 272 56 141 78 -100
4732 -100 15 10 -23 87 -37 -171 -262 -88 -36 60 -2 -67 -226 -158 92 114 14 -88 -156 -47 53 249 137 -39
4756 -39 -13 45 101 156 100 43 -38 -198 93 108 137 -42 -132 -126 -38 -54 77 -166 -201 -158 -119 105 113 -117 -134 -55 72
4783 72 161 136 11 -9 -65 97 183 165 153 -88 24 23 22 197 118 -85 -137 -46 112 130 -25 -181 -229 -174 -61 240
4809 240 -67 -253 -241 -67 170 130 124 -83 -87 -125 93 381 122 -17 -119 -25 122 168 122 -37 -219 -40 172
4832 172 225 35 -125 -161 -83 -76 135 113 -161 -304 -138 -84 107 177 -43 -210 -277 49 257 221 122 -213 -33 78
4856 78 320 280 153 -42 -172 35 213 183 -104 -220 -132 -123 62 -15 -51 -281 -312 -71 95 101 35 -99 -320 -4
4880 -4 224 213 160 -12 -127 70 135 236 104 12 -67 -14 80 235 132 -53 -241 -217 217 89 12 -163 -205 -220
4904 -220 -55 15 122 -109 -218 -97 0 154 38 -75 0 -73 145 178 267 6 -126 -91 -1 142 138 77 -24 -132
4928 -132 3 115 89 -121 -231 -220 -135 -31 10 -39 -128 -181 -74 165 171 15 39 -142 -85 135 221 184 42 -33 59
4953 59 99 166 94 -41 -68 -78 131 113 2 -74 -194 -81 11 -24 30 -101 -194 -78 -107 85 -3 -19 -98 -5 38 68
4979 68 109 51 33 36 170 180 155 9 41 -60 72 0 120 68 -125 -120 -28 -90 -54 -188 -157 -60 -81 -93 28 35 -60 -11
5007 -11 43 135 -60 25 76 137 164 115 216 183 -8 68 95 -47 4 12 27 -31 -40 91 -66 -88 -97 -52 -59 -23 -135 -62 -2
5036 -2 -113 2 19 134 -4 29 71 60 38 -45 -18 48 47 78 75 36 7 10 98 -14 66 -87 -103 -36 -3 -4 -5 -72 -180 31
5066 31 51 -25 -177 -131 -133 -5 -95 42 168 -11 2 2 185 175 98 81 6 20 141 269 210 -73 -107 -118 -54 -10 -43
5093 -43 23 -88 -167 -2 70 23 -218 -68 17 64 58 38 -116 -39 -2 52 188 138 35 35 5 55 242 117 39 -155
5119 -155 -12 102 31 12 -128 -105 -183 -64 -6 -16 -68 -143 -110 -58 -21 70 -113 -155 -243 -52 167 162 64 -66 -36 161
5145 161 302 163 167 11 -29 -51 172 230 -72 -169 -120 69 -11 -71 -67 -101 -226 -163 61 5 -103 -38 -83 -76 73 118
5171 118 67 51 -32 -77 88 258 73 -25 29 44 -18 70 98 -4 -165 -193 76 -64 -45 -39 -192 -80 -15 -90 -35 -56
5197 -56 -159 -104 -16 -42 96 -35 -126 -35 72 209 39 128 -126 -48 236 254 77 85 83 -68 21 73 114 -110 -74 -183
5223 -183 -17 -48 -62 -9 -173 -174 -93 97 27 76 23 -41 2 -32 104 22 82 -26 130 265 162 108 5 7 -31 62
5249 62 189 -59 -13 -59 -12 77 -87 4 -24 -117 -28 -14 45 2 -135 -156 21 45 71 71 104 -10 -6 118 266 151 105
5276 105 -50 54 161 44 215 -20 -52 -70 -137 -1 36 -117 -111 -96 92 -86 55 -82 -214 -143 -7 62 -1
5299 -1 65 25 -13 -43 91 176 -6 -11 4 190 38 117 -77 91 -8 41 -16 75 -29 23 -98 10 -88 -129 80 -164
5325 -164 -88 -132 -82 120 -57 56 58 63 111 96 52 138 91 -62 162 228 78 70 -49 48 34 11 215 83 28 -48 -66
5352 -66 -8 -245 -105 -93 -15 -120 108 -71 -143 -57 4 -4 95 -12 88 67 38 106 6 103 52 31 181 59 8 -105
5378 -105 68 54 -75 -74 -5 26 -36 -113 -12 6 -68 -130 -13 3 -24 -127 71 -1 93 -11 6 -21 59 27 19 40 13
5405 13 49 56 -98 41 178 82 46 -36 -17 -1 -36 -43 -108 -29 -65 -146 -80 43 -50 -119 7 -145 3 32 28 128 -45
5432 -45 53 127 94 -16 158 -46 76 34 25 62 13 -141 4 14 -101 65 -157 -26 -146 -127 52 -61 -71 -158
5456 -158 -252 -40 38 18 1 -40 -107 -11 48 59 24 -121 -18 -52 12 100 147 81 -97 -43 49 86 13 47 -53 -75 -77 -23
5484 -23 68 -3 -174 -26 -5 75 69 -52 -55 -196 15 79 123 -23 -93 61 160 158 -40 60 4 57 64 134 127 89 -80 -203
5512 -203 -69 1 28 -46 -147 -113 -193 -92 157 58 -88 -172 -16 115 228 77 34 -61 18 110 205 -48 55 8
5536 8 -16 15 193 113 32 -60 -209 37 38 -29 -211 -250 -143 -49 81 122 -23 -177 -23 80 -26 146 -37 29 -61
5561 -61 17 221 117 132 -20 -22 124 89 213 35 -126 -176 -80 105 83 -47 -129 -240 -137 54 47 6 -112 -227
5585 -227 -74 124 141 -30 -42 -124 4 134 187 236 -52 -52 64 124 134 44 -63 -133 -119 58 41 135 -120 -144 -80
5610 -80 -5 111 141 -102 -122 -116 -100 12 77 11 -46 -38 -39 21 55 137 -36 14 66 267 79 5 -101 19 30 84 98 118
5638 118 -151 -25 -51 -31 -48 -77 -71 -25 -102 -78 46 -127 -152 -18 99 52 30 -25 94 16 58 91 261 152 17
5663 17 102 -10 72 105 16 -49 -86 -79 -96 62 -14 -21 -163 69 9 -118 -47 -127 -148 -69 -84 -6 35 -114 3 67 73 78 81
5692 81 54 -67 20 158 63 117 88 72 -49 58 -94 -25 1 -166 -56 -68 2 -40 -158 -9 -110 -102 -65 16 -22 -131
5718 -131 7 56 -20 -22 26 77 18 115 70 35 -32 -56 119 90 82 -59 -26 22 25 24 26 51 -126 8 -69 -37 -35 7 -106 -76
5748 -76 -45 36 43 -12 -141 -70 105 153 62 114 -60 87 73 117 124 -9 54 -48 115 61 52 60 -56 -166 -131 45 100
5775 100 -93 -86 -101 -130 120 38 -60 -80 -91 -87 146 86 53 24 89 73 50 93 165 -36 -9 5 46 55 4 27 -86 -112 27
5804 27 -66 -84 -56 -209 -86 -36 -68 -87 -99 47 30 16 192 70 103 -102 -11 160 133 222 71 -43 -20 -1 82 160
5830 160 -31 -31 21 76 11 13 26 -251 -194 -41 67 -55 -6 -183 -41 -58 12 34 15 -68 17 1 92 107 -27 42 42
5857 42 129 91 76 -18 -115 46 -27 98 50 -23 -53 -88 -90 -27 -28 9 -138 -225 4 -20 -36 -27 34 -108 2 108 143 -7
5885 -7 20 -59 82 2 105 147 -67 -15 49 201 58 -1 -1 1 -40 30 -142 -47 25 -67 -184 -69 29 -16 73 -48 -63
5912 -63 95 71 164 48 -87 -2 11 137 45 100 115 -50 -1 114 -27 -30 -82 -87 -44 41 70 -61 3 -132 -19 11
5938 11 53 -112 -95 -174 -102 -52 16 -71 -11 -26 -48 69 36 116 -32 3 8 -47 9 77 105 -30 24 -9 98 -38 -82 -36
5966 -36 -40 -110 -56 -67 43 -112 -42 28 -82 135 -9 -96 19 -89 42 66 145 36 270 119 27 54 49 12 6 44
5992 44 60 59 54 -60 36 -65 -107 10 1 -72 18 -107 -36 15 -120 -79 37 57 42 106 117 93 -25 85 146 51 14 85
6020 85 -10 17 57 -25 10 -63 -64 11 42 -13 -99 -136 -25 -77 -67 -38 -16 6 -20 -16 -93 -29 -79 76 49 -26 103 197 130 -108
6050 -108 98 44 92 144 -88 -50 44 -159 13 42 -14 -118 -47 -73 12 -67 -43 -67 -42 6 -94 -113 74 -48 48 167
6076 167 -7 -103 82 -52 -11 -32 -27 96 16 67 5 11 68 -66 -35 -15 -11 57 -59 69 2 -57 -18 -60 -73 22 8 -60
6104 -60 -159 -68 -36 -84 1 104 33 63 -5 43 73 244 2 -15 -5 46 -5 -44 44 -126 43 -32 -53 -157 -71 -93 58
6131 58 -87 -155 -20 90 -165 -49 7 13 57 -45 29 -60 38 111 140 35 49 72 91 73 42 82 -93 -61 -40 -49 -2
6158 -2 -25 -44 -29 -7 -92 -61 16 -71 -4 -113 16 -6 -58 -14 -85 24 36 75 23 10 -34 52 139 -50 -178 90 126 -26
6186 -26 -48 44 78 -77 10 -41 -56 -31 -80 -7 -16 -84 -123 -67 6 -67 -58 -65 -94 -24 54 78 -8 -70 -1 -21 188 104 -22 -60
6216 -60 -47 54 -6 73 76 -119 -147 8 -161 8 -119 -56 -61 -59 -28 131 5 -95 -25 -74 -70 -31 130 -23 51 -39 70
6243 70 105 90 27 -58 59 50 44 -86 -62 31 -90 92 -1 35 -10 -134 -70 -60 25 53 52 -143 -69 -88 29 27 98 -22
6271 -22 90 158 63 39 99 48 107 39 -28 57 101 4 -50 -59 -93 4 -18 -124 -23 -39 -80 -20 -7 3 -138 -39 -26 29 -52
6300 -52 -50 -93 18 52 24 147 28 -13 31 68 69 48 36 -36 43 -9 26 92 1 -122 -82 88 -137 42 5 -116 -49
6327 -49 -87 44 4 10 -42 66 -92 21 105 64 91 62 12 22 148 92 63 107 -5 35 -54 88 -51 0 -42 -6 30
6354 30 -29 -146 -53 -48 -78 -46 -67 2 -45 21 -88 57 86 68 30 160 89 88 226 67 -33 -58 28 -30 -64 55 24
6381 24 4 -29 -107 29 -16 -15 -44 -60 -31 19 12 -31 -11 -64 3 -98 -11 113 -3 -8 139 -7 66 -80 5 101 23 46
6409 46 43 7 -11 -36 34 47 3 66 -1 -20 -76 -93 -50 -41 3 -136 23 52 -39 -37 -14 25 -2 19 -11 0 57 22 64 72 26
6440 26 -5 54 54 5 -36 31 -28 81 -167 6 59 -41 -56 -7 1 1 -24 0 -69 -8 25 56 47 -66 -48 121 217 89 -20
6469 -20 124 -14 61 48 99 114 -29 -68 -15 74 103 -137 123 -47 5 -65 -84 16 -70 -113 -55 -125 -6 -10 -53 -33 -80
6496 -80 153 109 84 47 -13 90 -28 79 132 2 -44 -57 1 -3 10 102 -142 -12 -12 4 -4 -209 -29 -69 -45 -57 -209
6523 -209 -89 -47 -50 -23 23 6 50 -29 -69 -116 88 -14 48 89 -32 -29 65 51 -90 5 -118 -53 -14 -69 21 -35 -76 -17
6551 -17 -12 24 -38 8 -128 21 -106 29 83 -19 35 -34 91 103 75 40 76 -49 25 108 80 47 23 -34 29 57 -37
6578 -37 -99 -91 -67 -69 -127 4 -60 -147 -141 -56 12 -22 -100 -122 68 -37 122 -3 52 2 96 132 136 151 108 -36 -17 -72 73
6607 73 114 -57 -52 -17 57 -26 -27 -50 39 -119 -107 -2 -8 119 48 21 1 -69 35 17 101 -99 -16 77 141 -85 -20 53
6635 53 26 173 80 43 44 -16 74 -51 -105 -75 -2 45 18 -31 -37 -86 -141 39 -70 17 -5 106 -10 93 -2 31 -31 20
6663 20 51 34 52 -37 8 140 -20 -12 -69 84 53 -93 -107 -117 39 -44 -32 -20 -154 -37 -102 104 90 44 56 11 13
6690 13 5 106 135 -12 -51 5 96 45 87 -66 -44 40 -34 -36 64 -68 -87 69 97 38 -48 117 -105 -64 -106 17 15
6717 15 -24 -16 -89 -48 -1 66 19 37 20 -50 66 -75 71 18 22 -101 -69 79 -27 5 -28 23 27 -76 -18 -36 -63 -51
6745 -51 -67 102 -56 -61 -205 -51 105 39 106 92 65 -27 -30 55 131 116 43 27 136 43 24 -9 -3 7 -40 135 -32 -15
6773 -15 -132 -16 -16 -47 103 -37 -58 -57 -11 59 -21 -85 21 50 78 57 82 96 -33 -3 61 108 82 82 -21 43 -37 -69
6801 -69 -5 113 -4 -78 35 76 49 -26 -64 -42 -108 -47 86 -31 44 -87 -12 17 -28 160 103 100 122 69 143 84 -50
6828 -50 31 -99 -7 -13 -15 64 -7 -54 -89 2 6 -37 -35 -107 -114 -74 31 -58 -29 -110 2 171 10 -37 83 5 -29 -7 123
6857 123 145 106 18 90 73 81 102 87 -89 8 34 13 -48 23 -40 -61 -54 -15 31 -32 34 -47 134 18 -10 49 1 -78 2
6886 2 -12 105 95 37 29 18 16 128 73 5 -41 -17 38 20 -22 78 -15 -45 32 41 -62 45 -58 -39 -104 45 14 2 52
6915 52 -74 65 12 -33 -25 -70 -60 52 27 83 9 -18 25 64 66 -29 -59 26 -76 -36 -132 -41 -22 -20 -54 -123 -54 -46 51 96
6945 96 -145 10 -39 71 31 49 66 31 109 8 25 -64 87 48 36 -62 48 59 -61 -143 109 -8 118 4 -103
6970 -103 -35 -42 -46 -88 -33 -93 -35 -3 86 96 -7 5 32 68 19 132 82 64 45 46 -4 -22 52 84 37 -2 -11 -8 138 36
7000 36 0 37 -85 8 5 27 -37 -190 6 -11 92 26 -30 17 80 -23 -68 32 44 42 -46 5 134 64 -37 -156 0
7027 0 -2 96 109 -57 -113 -6 63 -101 -18 -123 -56 -74 -66 70 -96 -1 -8 -12 -22 114 46 -35 7 -23 -30 -28 73 2 25 -95
7057 -95 -32 23 3 -11 57 -139 -100 14 -8 39 -67 18 -9 -40 89 102 -36 56 50 80 45 32 111 55 49 12 61 53 -39
7086 -39 -10 114 0 68 -20 8 21 -37 -46 -44 45 -43 -23 29 -80 -13 -25 -68 71 -52 62 9 27 -36 41 25 -118 -40
7114 -40 59 89 68 72 -89 -17 106 10 47 38 -129 -65 82 21 21 -5 -79 -89 -36 -80 15 -53 -79 -17 -7 51 39 64 -39
7143 -39 -63 45 -35 65 139 83 41 -49 -62 72 23 13 2 -3 36 83 41 -44 -50 -74 39 0 69 5 -89 -79 -111 85 -38
7172 -38 106 -101 -99 -48 20 169 37 -98 79 35 42 165 65 69 36 3 19 -52 59 -39 -55 -82 17 158 32 1
7198 1 -56 -8 101 57 20 -7 -3 -50 -7 74 149 20 30 49 -86 59 -61 -49 -13 8 -27 -34 120 33 -25 -139 4 -70
7226 -70 -17 -78 -99 25 -29 79 24 -22 -60 -14 -46 10 126 93 -34 50 -33 83 114 70 13 110 18 20 -22 125 92 -24
7254 -24 -19 -60 70 41 -43 37 -81 -21 -4 -5 -16 -57 34 -5 2 -53 -120 -59 17 75 91 -6 -21 -57 31 -15 46 12 32 6 -60
7285 -60 -3 41 66 -4 -15 -138 -126 23 -92 62 -20 -60 -51 29 30 -54 -50 88 17 30 80 74 9 28 -46 2 -19 77 59 -39
7315 -39 45 101 66 50 -62 19 -62 -44 100 -27 -26 -30 12 59 145 -18 44 2 -21 36 129 73 15 -91 31 -53 55 75
7343 75 69 -69 34 106 -19 -70 66 35 -211 35 24 11 11 -22 -76 -139 26 -56 -51 -22 -41 -57 -21 21 -33 -80 83 38
7371 38 51 36 88 36 4 78 50 48 106 -49 -31 -16 -74 7 -89 -19 -126 19 -60 -14 -120 -79 -13 2 -44 -14 3 -7 -99
7400 -99 -37 -33 76 33 16 -54 -27 -74 -8 -73 91 78 1 4 0 -16 -36 5 -111 -10 -69 -136 -1 -83 -34 -77 -43 34 55
7429 55 -44 42 109 9 51 -44 46 47 120 171 83 47 20 -1 -5 18 30 95 -51 -111 6 49 -82 -21 -4 -141 -38 -22
7457 -22 1 3 18 -80 -81 -53 -58 -59 7 114 40 -38 -41 79 14 47 -19 14 -102 -34 69 76 58 -110 50 32 -39 -99 -149 -45
7487 -45 -82 -172 64 14 -50 21 -11 -51 5 29 0 -1 -2 36 58 103 22 -41 65 -2 37 113 67 -59 -62 -70 1 -5 -18 -20 -23 -80
7519 -80 83 -53 -21 33 -70 -78 -92 49 137 6 59 8 -130 86 128 14 48 -12 -34 -23 110 -10 53 24 49 115
7545 115 3 -3 -31 -31 7 -46 -22 -35 -146 -65 -87 64 79 -1 -58 101 17 56 2 -8 -14 -44 -23 17 117 18 3 -78 -66
7574 -66 -35 -5 4 -64 -55 12 -94 -18 -11 -10 -68 -45 -33 -9 140 -91 -42 -53 -61 62 32 84 -22 -51 79 103 -21 52 -73
7603 -73 -13 53 189 3 48 -20 -61 -60 -16 11 -32 -54 -79 -72 108 -28 -80 -87 21 -38 83 81 -35 -19 16 -83 18 -13
7631 -13 -31 -54 -79 45 55 123 71 -43 -90 -70 25 71 97 96 -5 -27 -99 64 2 9 -44 -152 16 -66 24 -57 6 1 15
7660 15 120 22 43 -85 -53 38 41 18 92 37 -23 172 -23 38 83 -43 -27 -62 62 -29 -31 -53 -63 -50 -60 -72 -55 -63 46
7689 46 -118 73 72 63 130 52 101 47 3 42 -28 41 85 -3 117 -85 144 -55 88 -80 42 -34 -48 -43 10 8 -42 -6
7717 -6 -2 -90 35 33 81 -21 -52 8 58 10 173 38 -107 18 -14 -3 17 -38 -23 11 28 -10 11 55 -50 -24 33 -34
7745 -34 -56 54 35 -81 64 -15 36 37 -149 -43 -21 -1 96 -57 -12 56 -72 98 -30 -104 65 -16 101 9 -29
7770 -29 106 111 -78 -6 -32 1 -42 -57 -43 9 -4 -3 -89 2 28 -62 0 -50 72 -16 52 36 113 25 23 108 7 -57 -18 64
7800 64 -126 -21 84 -13 -55 -4 -40 -96 -34 -20 -5 -97 -74 -102 -94 -35 81 -18 3 -75 41 71 2 35 58 -17 106 66
7828 66 68 154 -91 -17 -138 58 113 50 -12 19 -59 52 62 -8 -96 -56 16 -11 55 -26 -140 -77 -11 5 -15 67 25 -33
7856 -33 110 74 70 163 11 4 -21 -62 71 36 -35 35 53 46 -19 27 2 -89 -54 -47 -60 40 29 -20 -1 -7 8 149 54 -77
7886 -77 -112 -47 91 69 5 -66 -130 -111 84 57 22 -88 -142 -27 48 128 76 17 -18 -75 -22 30 -15 102 -111 -62 -17
7913 -17 117 -114 18 62 21 -62 127 128 3 60 42 -12 82 115 32 58 -89 -47 99 94 33 36 -138 13 -15 17 -17
7940 -17 -65 -41 -169 -50 42 -78 -103 17 15 18 92 57 -12 4 25 27 39 125 -50 -22 -50 -47 -35 -60 108 45 -61 -12 39
7969 39 52 -29 -74 -43 -52 52 -38 8 -113 32 -22 50 -68 -75 55 -25 -26 -9 101 14 -74 -100 60 40 95 93 -15 -24 36
7998 36 15 115 66 -47 27 -10 -117 -60 50 -90 -29 21 -67 17 -55 -15 -30 15 67 -3 92 172 -99 -19 71 41 51
8025 51 43 39 21 85 23 -74 -82 29 -1 -26 -30 -6 -74 -107 -80 -56 -74 41 -38 -79 29 -55 18 -5 66 -16 19 106 65 25 15
8056 15 65 -5 42 30 125 82 -50 -52 -51 39 41 -31 102 -117 -16 19 -26 -24 20 51 19 5 10 -45 -39 103 -60 -25 60 22
8086 22 86 74 -15 26 -51 4 -37 -74 -35 9 -56 18 -37 18 20 11 101 -64 57 -92 -147 -37 -3 -37 -1 -66 2 -27 42
8115 42 32 -51 -8 33 -15 -10 38 -33 -51 20 -27 -33 -86 33 -118 78 56 16 109 70 41 -66 -37 -43 16 51 12 0 -29 -58
8145 -58 64 121 57 45 48 24 82 -49 17 52 11 -33 44 78 -28 53 -59 -31 28 -3 -15 -98 16 -85 15 -51 -2
8172 -2 31 -18 -4 140 -15 -57 65 37 8 52 35 31 13 28 52 113 -95 -47 67
8191F7
##END NTUPLES=NMR FID
##END=
